##TITLE=1H_LR-755-R3-P3
 CCl4
 8 sc, 
 17.1.2023
##JCAMPDX= 6.0         $$ Bruker NMR JCAMP-DX V2.0
##DATA TYPE= NMR FID
##DATA CLASS= NTUPLES
##ORIGIN= UXNMR, Bruker Analytische Messtechnik GmbH
##OWNER= root
$$ XWIN-NMR		Version 3.5
$$ Tue Jan 17 14:30:08 2023 Russian Standard Time (UT+4h)  she@DPX200
##.OBSERVE FREQUENCY= 200.13135
##.OBSERVE NUCLEUS= ^1H
##.DELAY= (6, 6)
##.ACQUISITION MODE= SIMULTANEOUS
##.ACQUISITION SCHEME= undefined
##.AVERAGES= 8
##.DIGITISER RES= 18
##SPECTROMETER/DATA SYSTEM= spect
##.PULSE SEQUENCE= zg30
##.SOLVENT NAME= CDCl3
##.SHIFT REFERENCE= (INTERNAL, CDCl3, 0, 15.7039)
##AUDIT TRAIL= $$ (NUMBER, WHEN, WHO, WHERE, WHAT)
$$ ##TITLE= Audit trail, XWIN-NMR		Version 3.5
$$ ##JCAMPDX= 5.01
$$ ##ORIGIN= Bruker BioSpin GmbH
$$ ##OWNER= she
$$ F:/spectra/data/she/nmr/H-F/1/audita.txt
$$ ##AUDIT TRAIL=  $$ (NUMBER, WHEN, WHO, WHERE, WHAT)
(   1,<2023-01-17 14:29:10.98 +0400>,<she>,<DPX200>,
      <created by zg, POWCHK disabled, PULCHK disabled
       configuration hash MD5:
       00 E9 B6 7A A2 85 ED C7 34 08 36 98 17 FE 4E 26
       data hash MD5: 16K
       75 5B 15 59 F0 19 21 4E 24 13 37 47 8E EA 73 58>)
$$ ##END=
$$ 
$$ hash MD5
$$ 95 F1 6D 5D EF 87 54 E7 A9 EC 5B 5D F8 5F 9F 34
##$RELAX= 
##$RELAX= 
##$RELAX= 
##$RELAX= 
##$RELAX= 
##$RELAX= 
$$ Bruker specific parameters
$$ --------------------------
##$DU= <F:/spectra>
##$EXPNO= 1
##$NAME= <H-F>
##$PROCNO= 1
##$TYPE= <nmr>
##$USER= <she>
##$AMP= (0..31)
100 100 100 100 100 100 100 100 100 100 100 100 100 100 100 100 100 100 
100 100 100 100 100 100 100 100 100 100 100 100 100 100 
##$AQSEQ= 0
##$AQ_mod= 1
##$AUNM= <au_zg>
##$AUTOPOS= <>
##$BF1= 200.13
##$BF2= 200.13
##$BF3= 200.13
##$BF4= 200.13
##$BF5= 200.13
##$BF6= 200.13
##$BF7= 200.13
##$BF8= 200.13
##$BYTORDA= 1
##$CFDGTYP= 0
##$CFRGTYP= 5
##$CHEMSTR= <none>
##$CNST= (0..31)
1 1 145 1 1 1 1 1 1 1 1 1 1 1 1 1 1 1 1 1 1 1 1 1 1 1 1 1 1 1 1 1 
##$CPDPRG= <>
##$CPDPRG1= <>
##$CPDPRG2= <>
##$CPDPRG3= <>
##$CPDPRG4= <mlev>
##$CPDPRG5= <mlev>
##$CPDPRG6= <mlev>
##$CPDPRG7= <mlev>
##$CPDPRG8= <mlev>
##$CPDPRGB= <>
##$CPDPRGT= <>
##$D= (0..31)
0 1.2 0 0 0 0 0 0 0 0.06 0 0.03 0 0 0 0 0.0002 0 0 0 0 0 0 0 0 0 0 0 0 
0 0 0 
##$DATE= 1673951350
##$DBL= (0..7)
120 120 120 120 120 120 120 120 
##$DBP= (0..7)
150 150 150 150 150 150 150 150 
##$DBP07= 0
##$DBPNAM0= <>
##$DBPNAM1= <>
##$DBPNAM2= <>
##$DBPNAM3= <>
##$DBPNAM4= <>
##$DBPNAM5= <>
##$DBPNAM6= <>
##$DBPNAM7= <>
##$DBPOAL= (0..7)
0.5 0.5 0.5 0.5 0.5 0.5 0.5 0.5 
##$DBPOFFS= (0..7)
0 0 0 0 0 0 0 0 
##$DE= 6
##$DECBNUC= <off>
##$DECIM= 32
##$DECNUC= <off>
##$DECSTAT= 4
##$DIGMOD= 1
##$DIGTYP= 9
##$DL= (0..7)
0 120 120 120 120 120 120 120 
##$DP= (0..7)
150 150 150 150 150 150 150 150 
##$DP07= 0
##$DPNAME0= <>
##$DPNAME1= <>
##$DPNAME2= <>
##$DPNAME3= <>
##$DPNAME4= <>
##$DPNAME5= <>
##$DPNAME6= <>
##$DPNAME7= <>
##$DPOAL= (0..7)
0.5 0.5 0.5 0.5 0.5 0.5 0.5 0.5 
##$DPOFFS= (0..7)
0 0 0 0 0 0 0 0 
##$DQDMODE= 0
##$DR= 18
##$DS= 0
##$DSLIST= <SSSSSSSSSSSSSSS>
$$ [...]
##$SUBNAM2= <"">
##$SUBNAM3= <"">
##$SUBNAM4= <"">
##$SUBNAM5= <"">
##$SUBNAM6= <"">
##$SUBNAM7= <"">
##$SUBNAM8= <"">
##$SUBNAM9= <"">
##$SW= 18.05172834244
##$SWIBOX= (0..15)
0 0 2 0 0 0 0 0 0 0 0 0 0 0 0 0 
##$SW_h= 3612.71676300578
##$TD= 16384
##$TD0= 1
##$TE= 0
##$TE2= 300
##$TE3= 300
##$TEG= 300
##$TL= (0..7)
0 120 120 120 120 120 120 120 
##$TP= (0..7)
150 150 150 150 150 150 150 150 
##$TP07= 0
##$TPNAME0= <>
##$TPNAME1= <>
##$TPNAME2= <>
##$TPNAME3= <>
##$TPNAME4= <>
##$TPNAME5= <>
##$TPNAME6= <>
##$TPNAME7= <>
##$TPOAL= (0..7)
0.5 0.5 0.5 0.5 0.5 0.5 0.5 0.5 
##$TPOFFS= (0..7)
0 0 0 0 0 0 0 0 
##$TUNHIN= 0
##$TUNHOUT= 0
##$TUNXOUT= 0
##$USERA1= <user>
##$USERA2= <user>
##$USERA3= <user>
##$USERA4= <user>
##$USERA5= <user>
##$V9= 5
##$VALIST= <valist>
##$VCLIST= <CCCCCCCCCCCCCCC>
##$VD= 0
##$VDLIST= <DDDDDDDDDDDDDDD>
##$VPLIST= <PPPPPPPPPPPPPPP>
##$VTLIST= <TTTTTTTTTTTTTTT>
##$WBST= 1024
##$WBSW= 4
##$XGAIN= (0..3)
0 0 0 0 
##$XL= 0
##$YL= 0
##$YMAX_a= 398192
##$YMIN_a= -497110
##$ZGOPTNS= <>
##$ZL1= 120
##$ZL2= 120
##$ZL3= 120
##$ZL4= 120
##$ABSF1= 10
##$ABSF2= 0
##$ABSG= 5
##$ABSL= 3
##$ALPHA= 0
##$AQORDER= 0
##$ASSFAC= 0
##$ASSFACI= 0
##$ASSFACX= 0
##$ASSWID= 0
##$AUNMP= <proc_1d>
##$AZFE= 0.1
##$AZFW= 0.1
##$BCFW= 1
##$BC_mod= 2
##$BYTORDP= 1
##$COROFFS= 0
##$CY= 11.3945322036743
##$DATMOD= 1
##$DC= 2
##$DFILT= <>
##$DTYPP= 0
##$F1P= 2.36226072786647
##$F2P= -0.459571619588291
##$FCOR= 0.5
##$FTSIZE= 0
##$FT_mod= 4
##$GAMMA= 1
##$GB= 0.15
##$INTBC= 1
##$INTSCL= 1
##$ISEN= 128
##$LB= 0.24
##$LEV0= 0
##$LPBIN= 0
##$MAXI= 10000
##$MC2= 0
##$MEAN= 0
##$ME_mod= 0
##$MI= 1.114404
##$NCOEF= 0
##$NC_proc= 0
##$NLEV= 6
##$NOISF1= 3.799351
##$NOISF2= 2.8
##$NSP= 1
##$NTH_PI= 0
##$NZP= 0
##$OFFSET= 15.70392
##$PC= 1
##$PHC0= -19111.31
##$PHC1= 12.20073
##$PH_mod= 1
##$PKNL= yes
##$PPARMOD= 0
##$PSCAL= 0
##$PSIGN= 0
##$REVERSE= no
##$SF= 200.130013532006
##$SI= 16384
##$SIGF1= 3
##$SIGF2= 2
##$SINO= 400
##$SIOLD= 16384
##$SREGLST= <1H.CDCl3>
##$SSB= 0
##$STSI= 0
##$STSR= 0
##$SW_p= 3612.71676300578
##$SYMM= 0
##$S_DEV= 0
##$TDeff= 0
##$TDoff= 0
##$TI= <>
##$TILT= no
##$TM1= 0
##$TM2= 0
##$TOPLEV= 0
##$USERP1= <user>
##$USERP2= <user>
##$USERP3= <user>
##$USERP4= <user>
##$USERP5= <user>
##$WDW= 1
##$XDIM= 8192
##$YMAX_p= 0
##$YMIN_p= 0
$$ End of Bruker specific parameters
$$ ---------------------------------
##NTUPLES= NMR FID
##VAR_NAME=  TIME,          FID/REAL,        FID/IMAG
##SYMBOL=    X,             R,               I
##VAR_TYPE=  INDEPENDENT,   DEPENDENT,       DEPENDENT
##VAR_FORM=  AFFN,          ASDF,            ASDF
##VAR_DIM=   8192,          8192,            8192
##UNITS=     SECONDS,       ARBITRARY UNITS, ARBITRARY UNITS
##FACTOR=    0.0002768,     1,               1
##FIRST=     0,             0,               0
##LAST=      2.2672688,     0,               0
##MIN=       0,             -497110,         0
##MAX=       2.2672688,     398192,          0
$$ Real data points
##PAGE= N=1
##DATA TABLE= (X++(R..R)), XYDATA
0@%%%%%%%%qJ6j6K4l2M0n6P2q8J07j31J61k00K42k90L46m06M78n61O52p53Q69
$$ 0 0 0 0 0 0 0 0 0 -8 8 -8 16 -16 24 -32 40 -48 59 -72 89 -111 131 -159 187 -219 259 -302 350 -403 466
30D66j001J145j307J486j684J904k144K408k701L023l372L754m172M627n125N670
$$ 466 -535 610 -697 789 -895 1009 -1135 1273 -1428 1595 -1777 1977 -2195 2432 -2693 2977
46B977o265O912p618Q397r250J0184j1213J2350j3614J5028j6617J8412k0464
$$ 2977 -3288 3624 -3994 4403 -4847 5337 -5876 6474 -7140 7888 -8729 9683 -10781
59a0781K2836k5611K8908l2899L7852m4188N2628o4524Q2844j16454K74110n80357
$$ -10781 12055 -13556 15352 -17547 20305 -23883 28745 -35779 47065 -69389 204721 -375636
71c75636M41325J2544k22159N08384q61568P74121k54296j22896K27928l84907
$$ -375636 65689 78233 -143926 364458 -497110 277011 22715 -100181 127747 -257160
81b57160N07638k77702o0218Q6326j9727K20287l95046J90189M5769N6722j49476
$$ -257160 250478 -27224 -87442 -1116 -20843 199444 -195602 -5413 40356 97078 -52398
92e2398j01678L17181j56037l5214m4818J00377O1625j24950k3068L0646J69483
$$ -52398 -154076 163105 7068 -28146 -72964 27413 89038 -35912 -58980 -28334 141149
103A41149k17392Q3384r1424J57965Q1037m53274M68429j98182O1211J3239l24863
$$ 141149 -76243 7141 -84283 73682 154719 -298555 169874 -28308 32903 46142 -278721
114b78721O36254n24077J46593R8853k60820N01522n85684L21738O406j58393
$$ -278721 357533 -166544 -19951 78902 -181918 319604 -266080 55658 62064 -96329
124i6329L10390n21101M82973j43204j11552J48011k54563M57560m07901P8186
$$ -96329 214061 -307040 175933 32729 -78823 69188 -185375 272185 -135716 -57530
134e7530J52884j83256K56412l63158K51961J8199j58687J69421k20624K23297
$$ -57530 95354 -87902 168510 -194648 57313 75512 -83175 86246 -134378 88919
144H8919m0943j32286R1337m069N5502q4972l7567R2588O1681j83299R0213L5950
$$ 88919 47976 -84310 7027 2958 58460 -26512 -64079 28509 90190 -93109 -2896 33054
156C3054n0240R2659k16982K28699o6542q1729J43743k26271K87866j74362l8265
$$ 33054 -17186 75473 -141509 87190 20648 -61081 82662 -143609 144257 -30105 -68370
167f8370J41068j60143K38201k86654J44433P6409j69435J80762k41123K63696
$$ -68370 72698 -87445 150756 -135898 8535 84944 -84491 96271 -144852 118844
177A18844j23091p7990J88825k40542K80351k20059L3691J36475k07386K46254
$$ 118844 -4247 -82237 106588 -133954 146397 -73662 -39971 96504 -110882 135372
187A35372k54422J32820P7169j94322J79666j52979J35124m0004r6803J40366
$$ 135372 -119050 13770 90939 -103383 76283 -76696 58428 18424 -78379 61987
197F1987q8625N2146m6555J2302K6733j5206l214k9037O4202n1061L7666n5643
$$ 61987 -26638 25508 -21047 -8745 17988 2782 -432 -29469 34733 -16328 21338 -34305
209c4305L6423M8686j09690R2939o3385O1134k9682n1882J11794j11341R3894
$$ -34305 2118 50804 -58886 34053 -29332 31802 2120 -49762 62032 -49309 44585
220D4585p6526K3769N7441j13405J32214j35200J02460r119r7519J50891j54575
$$ 44585 -31941 -8172 49269 -64136 68078 -67122 35338 26219 -71300 79591 -74984
231g4984J37338q0002l0390J35471j70447J43855r3530K3253O2616j23579J30845
$$ -74984 62354 -17648 -48038 87433 -83014 60841 -32689 -9436 53180 -70399 60446
242F0446j01990N8660k223n4058Q1669p9440P1331n8011K2185K5281n4166O1628
$$ 60446 -41544 17116 14893 -39165 42504 -36936 34395 -23616 -1431 23850 -30316 31312
254C1312o5777O2996l6214o149L8954n5628O3347n8853L6815p076j8419L9971
$$ 31312 -34465 28531 -7683 -13832 25122 -30506 32841 -26012 10803 3727 -14692 25279
266B5279n7851O1761m7082K4224M47l0744O1259p4833O3200l4776m90L8191o9282
$$ 25279 -32572 29189 -17893 6331 6778 -23966 37293 -37540 25660 -9116 -9606 28585 -40697
279d0697P9396o3971L1324P869m4411O8041p0837N4237k5556p992L8871n8104
$$ -40697 38699 -25272 6052 13921 -30490 37551 -33286 20951 -4605 -12597 26274 -31830
291c1830O0190m7125K3958M310l0887M8589n2707M3218k3583r19K3982l9767M4621
$$ -31830 28360 -18765 5193 9503 -21384 27205 -25502 17716 -5867 -6786 17196 -22571 22050
304B2050l8186K3061l385j6311L1212l8081L5390k3715O269J2099k6583L3827
$$ 22050 -16136 6925 3540 -12771 18441 -19640 15750 -7965 -1696 10403 -16180 17647
316A7647l2044K1601n745j0708K2828k7522K4735j5905M047P426j6318K0172j8389
$$ 17647 -14397 7204 1459 -9249 13579 -13943 10792 -5113 -1066 6360 -9958 10214 -8175
329h175J2974n441k506R648j4981J6655j3703O690K101r746J4331j5242J1992
$$ -8175 4799 -642 -3148 6500 -8481 8174 -5529 1161 3262 -6484 7847 -7395 4597
342D597m473n423J3300j4923J0751m009l026R387j3410J2088n019m051J0986j3147
$$ 4597 124 -5299 8001 -6922 3829 -180 -3206 6181 -7229 4859 -160 -4211 6775 -6372
356f372J0088m193j938P981j3734J5814r791j240Q910j1696J4213j6490J1563
$$ -6372 3716 -477 -2415 5566 -8168 7646 -2145 -3385 5525 -6171 8042 -8448 3115
369C115J451j4136K0480k1055J6431o101o636J7615k5216K6021j4276o086J9650
$$ 3115 4566 -9570 10910 -10145 6286 185 -6451 11164 -14052 11969 -2307 -8393 11257
382A1257j9277J5234j3994O380R819j8024R238J852k150k408N392r405J2257n767
$$ 11257 -8020 7214 -6780 -400 9419 -8605 633 2485 335 -2073 3319 -6086 6171 404
396D04p362J6543k3769L2037k5584m992L5636m0652L1740k9029J9187J4497m8719
$$ 404 -6958 9585 -14184 17853 -7731 -12723 22913 -17739 14001 -15028 4159 18656 -30063
409c0063N3532l8915K6202q229k3576M9548n6125N3770m1227J858M9507p1809
$$ -30063 23469 -15446 10756 2527 -21049 28499 -27626 26144 -15083 -13225 36282 -35527
421c5527O3071n4133L7781J6264q1652R7401o2366K5586L288m6821Q4463p4763
$$ -35527 27544 -26589 11192 27456 -54196 43205 -19161 6425 9713 -37108 47355 -27408
433b7408L1475M126l0682N6496n4341J6222J0836l806L892k7034K4636J3338k2335
$$ -27408 4067 8193 -22489 34007 -20334 -4112 6724 2918 6810 -20224 4412 17750 -4585
446d585j6914L6895j0117p481n308o61L4918m4898K3920j5010J1318K4080o1798
$$ -4585 -21499 15396 5279 -2202 -7510 -8171 26747 -18151 5769 -9241 2077 26157 -35641
459c5641N3406l2006M0419k9667m5827J14145r9698N1543l2052m410R5372j59315
$$ -35641 17765 -14241 26178 -3489 -49316 64829 -34869 16674 -15378 -19788 75584 -83731
471h3731J25712m7663j4690Q3407j53936J52448p1707m616N2499j15641J59939
$$ -83731 41981 -5682 -20372 63035 -90901 61547 -10160 -14776 37723 -77918 82021
482H2021j04482o396N4568m8570P6896j11534O3234K5531m8568K7608m4703O8988
$$ 82021 -22461 -28857 25711 -22859 54037 -57497 5737 31268 -17300 10308 -34395 34593
494C4593l4619j1943J0903j1745N0257n3997m608K9445J3474k4518k3369K4382
$$ 34593 -26 -11969 -1066 -12811 37446 -16551 -21159 8286 21760 -2758 -26127 -1745
506a745L6786l5184n1605R3469m9551J6234j0341m8977J36761j40309O4846Q93
$$ -1745 35041 -143 -51748 41721 -7830 8404 -1937 -50914 85847 -54462 10384 11277
518A1277o4458J62695k06938J14854J7160p6371J15143j87299J88359n2679q7600
$$ 11277 -53181 109514 -97424 17430 34590 -41781 73362 -113937 74422 21743 -65857
529f5857J18881j15419J44351j23723J3460P8338r4567J09782j36741Q9052J6770
$$ -65857 53024 -62395 81956 -41767 -28307 50031 -44536 65246 -71495 17557 34327
540C4327o6327O6186j07740J44465o5313o3364R2840n4025O5410q4306J0581Q1241
$$ 34327 -32000 34186 -73554 70911 5598 -57766 35074 -18951 46459 -37847 -27266 53975
552E3975o7524K363O728K438K7575k4934m9314Q7386l4374j1285J1127n8659J46699
$$ 53975 -13549 -11186 -4458 -2020 25555 621 -48693 38693 4319 -6966 4161 -54498 92201
565I2201j31268J186Q5423q4763J06556j51581R9649L5771j14745J18648j34068
$$ 92201 -39067 -37881 47542 -37221 69335 -82246 17403 53174 -61571 57077 -76991
576g6991J38323n3199o2073J08183j24664J67191j51366J8181J12101j37600J34898
$$ -76991 61332 8133 -53940 54243 -70421 96770 -54596 -36415 75686 -61914 72984
587G2984j61850J18676L6151j60791J59942j17674R3993k3994r2194J38604r1640
$$ 72984 -88866 29810 65961 -94830 65112 -52562 41431 17437 -74757 63847 -27793
598b7793N0052l1580k7799Q7776n4793j7357J1805L2351j1889k5403j3436O0683
$$ -27793 22259 -9321 -37120 50656 -4137 -21494 -9689 22662 10773 -14630 -28066 32617
610C2617j4064o0670O0096l0776M4660m5768j7343O9806o0212N5552p9681N1677
$$ 32617 18553 -42117 17979 -12797 31863 -13905 -31248 38558 -21654 33898 -45783 5894
622E894L6506q2934O9808q4297J17647o5128n9045J28705j22699J19711j08738
$$ 5894 42400 -40534 29274 -55023 62624 -2504 -61549 67156 -55543 64168 -44570
633d4570J7155J11962j67879J48084j13698M9032O8495j58341J49216r5885N8557
$$ -44570 -27415 84547 -83332 64752 -48946 86 68581 -89760 59456 -36429 22128
644B2128L342j02231J44698q9073K5409j0697j3690P0180q4373L5869k344R244
$$ 22128 25470 -76761 67937 -21136 4273 -6424 -20114 50066 -34307 1562 -782 8462
656H462P74l2464L0328l848J0489l2512J5067J3970n56j8470j2538N1180l8796
$$ 8462 9236 -23228 7100 3252 13741 -18771 -3704 10266 9710 -8760 -21298 29882 -8914
669h914J2907k2900K6028K1792p1001P0995n1694M0975n524o1666J02144r0325
$$ -8914 3993 -18907 7121 28913 -42088 28907 -22787 18188 12664 -49002 53142 -37183
681c7183O3910l2464l2988J07573j24328Q2571l8028j002O2819j19330J13385
$$ -37183 26727 -5737 -38725 68848 -55480 27091 -10937 -11939 50880 -68450 44935
692D4935n8388R911K6658p2004J01457q1813L6940k958k9210O8280q2323N5245
$$ 44935 -13453 -3542 23116 -48888 52569 -29244 7696 4738 -24472 43808 -38515 16730
704A6730k1574L228K1921n7106O5059l6345R612j668j2021L4206l6979J9483j0611
$$ 16730 -4844 -1616 20305 -36801 28258 -8087 1525 -143 -12164 22042 -14937 4546 -6065
717f065J3729p404o502J1012j4075L0096m3176L2324q716r051K8615n5567O6319
$$ -6065 7664 260 -6242 4770 -9305 20791 -22385 9939 1223 -7828 20787 -34780 31539
730C1539m3534N846K4336m9103O9694o8051L7456K231l4200N9130p2740O1459
$$ 31539 -11995 -6149 18187 -30916 38778 -29273 8183 10414 -23786 35344 -37396 24063
742B4063k8428o926L5660n9970P1439n6772K2874J0625l7187N8654o5735M8640
$$ 24063 -4365 -11291 24369 -35601 35838 -20934 1940 12565 -24622 34032 -31703 16937
754A6937j6812j3017L5727n1221N2819l7242J3890P305k4941L8190m1051L2162
$$ 16937 125 -12892 22835 -28386 24433 -12809 1081 8386 -16555 21635 -19416 12746
766A2746j8750M611J1719k7960L6633l4829K6869j4484l521K2877l5450L8291
$$ 12746 -6004 -1393 10326 -17634 18999 -15830 11039 -3445 -6966 15911 -19539 18752
778A8752l3106K0785j691j9495L4827m1116L8253k5551M455J8686l6113M4157
$$ 18752 -14354 6431 4740 -14755 20072 -21044 17209 -8342 -3887 14799 -21314 22843
790B2843m1233K6658l587k0098L6712m2853L8028k3376K504J7988l2370L7602
$$ 22843 -18390 8268 4681 -15417 21295 -21558 16470 -6906 -4402 13586 -18784 18818
802A8818l3486K1977n725j1642K6022l4133L3996k4907R380Q038k3333L2778l3636
$$ 18818 -14668 7309 1584 -10058 15964 -18169 15827 -9080 300 8338 -14995 17783 -15853
815a5853K5351r912p654K1613k8975K8824k2123J0632L395j5860K3419k5082K2057
$$ -15853 9498 -414 -8068 13545 -15430 13394 -8729 1903 5298 -10562 12857 -12225 9832
828I832j4810L272J0121k1421K7060k5084J6263l763r356K0608k6707K4331j4240
$$ 9832 -4978 -1706 8415 -13006 14054 -11030 5233 1470 -7886 12722 -13985 10346 -3894
841c894J043J0433j7684K0752j9598J3574l537o902J4244j7156J6897j4325Q186
$$ -3894 -2851 7582 -10102 10650 -8948 4626 1089 -5813 8431 -8725 8172 -6153 2033
854B033J916j3047J9681j9004J3596o194k766J2655j9894J9353j1107M76P423
$$ 2033 3949 -9098 10583 -8421 5175 -1019 -3785 8870 -11024 8329 -2778 -2302 5121
867E121j1630J3306j2236P600p8o808R185o816L554l077L525q20l514M516k063
$$ 5121 -6509 6797 -5439 2161 2083 -4725 4460 -2356 1198 -1879 1646 826 -2688 1828 -235
882b35J700n357P246k946l353O222o100N677n379M076n04n896J1182j0123L974
$$ -235 1465 -3892 3354 408 -2945 3277 -2823 2854 -2525 1551 1047 -4849 6333 -3790 184
897A84j47L70K776j1302J5818q999j932O727q212J2351j4665Q337M221j5291K0112
$$ 184 37 407 3183 -8119 7699 -1300 -3232 3495 -4717 7634 -7031 1306 5527 -9764 10348
912A0348j6521M509Q514j4866J6897j8125J1675P754k6240K5626j0973l63O709
$$ 10348 -6173 -1664 6850 -8016 8881 -9244 2431 10185 -16055 9571 -1402 -1765 4944
925D944j6803K5688j9908K365J3157k0970K2070j5064J829P832j2216J9041k4134
$$ 4944 -11859 13829 -6079 -3714 9443 -11527 10543 -4521 -2692 5140 -7076 11965 -12169
938a2169J3406Q692j9084J3820j2598J8387j0976j2000K6594k2144J2285m072
$$ -12169 1237 9929 -9155 4665 -7933 10454 -522 -12522 14072 -8072 4213 141
950A41q549K1507k2440J4071m946r628K8291k9359N262J7058j7676J3801j8940
$$ 141 -8408 13099 -9341 4730 -216 -9844 18447 -10912 -5650 11408 -6268 7533 -11407
963a1407J2680J6424l8766K9293o343q321K0694l4011L1949j1723q163K2268l8108
$$ -11407 1273 17697 -21069 8224 1881 -6440 14254 -19757 12192 469 -7694 14574 -23534
976b3534M2967j8932j4372K5359k4177L6081m3284J5880K5709m1656L6810l6971
$$ -23534 19433 501 -13871 11488 -12689 23392 -19892 -4012 21697 -19959 16851 -20120
988b0120L2047j390l5924N1419m9604L9405r367l4199N5476m4875L1060k0019
$$ -20120 11927 10537 -25387 26032 -23572 15833 6466 -27733 27743 -17132 13928 -6091
1000f091j3037N5435n8466K0881P746j2196K2038l6930K4900Q204k4322J8592
$$ -6091 -19128 36307 -22159 -1278 6468 -5728 16310 -20620 4280 12484 -11838 6754
1012F754j3410N625J6447k8939J2036O250m360Q640l2570L6870k059k7869K4331
$$ 6754 -6656 -1031 15416 -13523 -1487 4763 403 9043 -23527 13343 11284 -16585 7746
1025G746k0711L6136l4309k635L7395m5914M8172m6983J6933L1480n8392O1436
$$ 7746 -12965 23171 -11138 -13773 23622 -22292 25880 -21103 -4170 27310 -31082 30354
1037C0354o1894M3449J5567p5565Q3687n5926L4878q396m5768Q8629p5230K9867
$$ 30354 -31540 11909 27476 -48089 35598 -20328 14550 6154 -39614 49015 -26215 3652
1049C652K304k6107N4837o2030L3531l162r204K5156m4362L3552N34j1899k46
$$ 3652 5956 -20151 34686 -27344 6187 3025 -6179 18977 -25385 8167 8701 -3198 -3444
1062c444n886K6966j9026j2089J8262M78m661l654o513K3205j4303q344J8314
$$ -3444 -9330 17636 -1390 -13479 4783 5261 600 -3054 -9567 13638 -665 -9009 9305
1075I305k5895M1010l3907q550M5496m9382M5934m6274J6850M5565q5114P2324
$$ 9305 -16590 24420 -9487 -18037 27459 -21923 24011 -22263 -5413 40152 -44962 27362
1087B7362m1656J5076K5639p4141Q8054n8814K0396J4264n4415Q0803o4738K5621
$$ 27362 -14294 782 26421 -47720 40334 -18480 1916 16180 -38235 42568 -22170 3451
1099C451k79j9940N3726p2148M5989m963j2620K1411m3636N3925k8908m574J8547
$$ 3451 3172 -16768 36958 -35190 10799 5836 -6784 14627 -29009 24916 -3992 -8566 9981
1112I981k5516L5026k7018l5J5623j2094J2003j4673j257K3423j7106j0407K1573
$$ 9981 -15535 19491 -7527 -7562 8061 -4033 7970 -6703 -7960 15463 -1643 -12050 9523
1125I523j5380J6704j7840n679L8729m6727L1279j3633q134L9752n9022M7358
$$ 9523 -5857 10847 -6993 -12672 26057 -20670 10609 -3024 -11158 28594 -30428 16930
1137A6930k2078P5K8388o0719O6460l7637M347J6891m0417O5113o2422K7709Q905
$$ 16930 -5148 -5073 23315 -37404 29056 -8581 -4234 12657 -27760 37353 -25069 2640 11545
1150A1545l2047N1412o2496M6703j0612k0223L9906n4513N2429k3584j1899K9363
$$ 11545 -20502 30910 -31586 15117 4505 -15718 24188 -30325 22104 -1480 -13379 15984
1162A5984l4508L8966l0725K838K2037k4166J6377j3770Q122N131j0614K175M394
$$ 15984 -18524 20442 -10283 -7445 14592 -9574 6803 -6967 1155 6286 -4328 -2153 2241
1175B241j686m41J048r928K1217j7872K579P814j3754K5048l2612K1251J747j8096
$$ 2241 555 114 1162 -8766 12451 -5421 -2842 4972 -8782 16266 -16346 4905 6652 -11444
1189a1444K6763l5341L6019j8947o377K5640l7979M4877l7055J1525J6643l5189
$$ -11444 15319 -20022 15997 -2950 -9327 16313 -21666 23211 -13844 -2319 14324 -20865
1201b0865M6198m8223L1277J404k9684M3001m5803L8772j6547j3725L4182l8954
$$ -20865 25333 -22890 8387 9791 -19893 23108 -22695 16077 -470 -14195 19987 -18967
1213a8967L4969k4125M449J5777k5530K5459k2390J5549k953q377J2045j2760
$$ -18967 16002 -8123 -3674 12103 -13427 12032 -10358 5191 2238 -6139 5906 -6854
1225f854J5612j5723R123j692j920O208j3740J8297j5773J0870n966k947J4676
$$ -6854 8758 -6965 2158 466 -1454 4754 -8986 9311 -6462 4408 -1558 -4505 10171
1238A0171k2325K2947j9075J1518K322j8793K8864l0066K4897j2686o136K4616
$$ 10171 -12154 10793 -8282 3236 5558 -13235 15629 -14437 10460 -2226 -8362 16254
1250A6254l4367L3592k5073R557J0757k8135L5675l2557K1892n634j3504K8209
$$ 16254 -18113 15479 -9594 -37 10720 -17415 18260 -14297 7595 1961 -11543 16666
1262A6666l3125K9250j8784L124J3778k5406K8395k4585J5932l240j0248J9092
$$ 16666 -16459 12791 -5993 -2869 10909 -14497 13898 -10687 5245 2005 -8243 10849
1274A0849k1742K0266j5291P004K848j1609J7626k0654J9440j3110L112P686j7499
$$ 10849 -10893 9373 -5918 1086 3934 -7675 9951 -10703 8737 -4373 -1261 6425 -11074
1287a1074K4000k3756J6144m135q043J7924k3612K3192j6088M974O369j5514K0811
$$ -11074 12926 -10830 5314 1179 -6864 11060 -12552 10640 -5448 -474 5895 -9619 11192
1300A1192k1487J7513r314j753J2927k1411K4232k0339J1100J355j4184K3751
$$ 11192 -10295 7218 -2096 -3849 9078 -12333 11899 -8440 2660 4015 -10169 13582
1312A3582k5922J9662q295m111J4587k0783K1457j6353P353K417j0248J4918j6749
$$ 13582 -12340 7322 -973 -5084 9503 -11280 10177 -6176 1177 3594 -6654 8264 -8485
1325h485J5865j1604L790N786j3934J8395j8328J3900n535n285J5209k0610J9071
$$ -8485 7380 -4224 -434 5352 -8582 9813 -8515 5385 -150 -5435 9774 -10836 8235
1338H235j2058K996N498j2358J6454j6063J1102l700k972P817j1699J4534j4170
$$ 8235 -3823 -827 4671 -7687 8767 -7296 3806 106 -2866 4951 -6748 7786 -6384
1351f384R007m77p724J3159j5738J5368j0784J568Q987j5988J6790j3021P063
$$ -6384 2623 2146 -5578 7581 -8157 7211 -3573 -2005 6982 -9006 7784 -5237 1826
1364A826o7p232J3469j5227J1378m866r42N104q606J1773j2197P600j48n446Q224
$$ 1826 1759 -5473 7996 -7231 4147 -719 -1661 3443 -5163 6610 -5587 2013 1865 -3581 4643
1379D643j0093J0851q505J976N859j0279R961p065M130j511k529O923q454N724
$$ 4643 -5450 5401 -3104 -1128 4731 -5548 4413 -2652 1478 -33 -2562 4361 -4093 1631
1393A631j963J253k018M91L904p424P045n216M195k463k359Q992j2869J1221m608
$$ 1631 -332 921 -1097 -606 3298 -4126 2919 -2297 1898 -565 -2924 6068 -6801 4420 -188
1408a88l115Q150j0791J2391j1091M180O416j3502J2800q204M854j475n038J1771
$$ -188 -3303 4847 -5944 6447 -4644 -464 5952 -7550 5250 -2954 1900 425 -4613 7158
1422G158j3172Q439j717l176O437q915J0458r094K320P189j2411J0372m864R07
$$ 7158 -6014 2425 708 -2468 3969 -4946 5512 -3582 -1262 5927 -6484 3888 -976 -69
1436f9K097p981J2724q753j893R726r930N740j291l084P371r337P256m27r024
$$ -69 2028 -5953 6771 -1982 -3875 5851 -4079 1661 370 -2714 4657 -4680 2576 2149 -6875
1451f875J4063r627K4N726p145R473j1325O483M894j3335J2661p081K556J348
$$ -6875 7188 -2439 -2415 3311 -3834 5639 -5686 797 5691 -7644 5017 -2064 492 1840
1465A840o567J1326j2704Q639P3q972J2706j0899Q016m931k743J4670k0376J3077
$$ 1840 -4727 6599 -6105 2534 2607 -6365 6341 -4558 3458 -1473 -4216 10454 -9922 3155
1479C155K11r603J4266j7135J5475m995j0502K1529k2516J3459J543j4366J9779
$$ 3155 3366 -6237 8029 -9106 6369 1374 -9128 12401 -10115 3344 4887 -9479 10300
1492A0300j9058J3941k881j3654K5478k2473Q941K850r636J5912k0090J5660k761
$$ 10300 -8758 5183 2302 -11352 14126 -8347 594 3444 -6192 9720 -10370 5290 2529
1505B529j0472J7253j7328J2363m197l843J0818j7164J8175q601o249J4957j4620
$$ 2529 -7943 9310 -8018 4345 148 -3695 7123 -10041 8134 -467 -6716 8241 -6379
1518f379J1758q473o08J4403k1548J5105j635r944J6967j8052J1571K67j2477
$$ -6379 5379 -3094 -3702 10701 -10847 4258 2623 -7321 9646 -8406 3165 3432 -9045
1531i045K1782k3188J1895P465k2312K4546j8769J0376L044k0470L1143k6065
$$ -9045 12737 -10451 1444 8909 -13403 11143 -7626 2750 5794 -14676 16467 -9598
1543i598R924O018j7924K5844k6417J7847l018j3314K6584l0541K1475n827p657
$$ -9598 326 6344 -11580 14264 -12153 5694 2676 -10638 15946 -14595 6880 1053 -6604
1556f604J8731k8597L0044j6009o276K1815k6085K3923j5994N87J6668k5584K2853
$$ -6604 12127 -16470 13574 -2435 -8711 13104 -12981 10942 -5052 -4465 12203 -13381 9472
1569I472j1770l500J6518j9920J3356l840m845J3794j8676J1619M374j5969J6291
$$ 9472 -2298 -5798 10720 -9200 4156 316 -4529 9265 -9411 2208 6582 -9387 6904
1582F904j1524N739M666j7146K2261j6791N417P665j9814K5548k0950R860K687
$$ 6904 -4620 1119 5785 -11361 10900 -5891 -474 7191 -12623 12925 -8025 1835 4522
1595D522j6659K9645l1572J8175J151j6215K6784l3509K8810r254j4566L0070
$$ 4522 -12137 17508 -14064 4111 5262 -10953 15831 -17678 11132 1878 -12688 17382
1607A7382l4674K9512j3786q142K5363l1876K9172j7172l336K1763k7144K1097
$$ 17382 -17292 12220 -1566 -9708 15655 -16221 12951 -4221 -7557 14206 -12938 8159
1619H159j2111J672J1642k0945J8132o926k319P501j0910J0421l860m111P906
$$ 8159 -3952 -2280 9362 -11583 6549 -377 -2696 4805 -6105 4316 456 -3655 4251
1632D251q326O199L22r389J3107q946K669L007j1045J8951j7805O203P107j6280
$$ 4251 -4075 2124 2446 -6943 6164 -2782 -113 2894 -8151 10800 -7005 -802 6305 -9975
1646i975K2432k3173J3662L355j8833K7384k7996J9298j503j7640K8510k9449
$$ -9975 12457 -10716 2946 6301 -12532 14852 -13144 6154 4651 -12989 15521 -13928
1658a3928K3050q663j1534K7126l0043K2767j1306l156J8421k6575K3440j3161
$$ -13928 9122 459 -11075 16051 -13992 8775 -2531 -5687 12734 -13841 9599 -3562
1670c562J430J0067j8944K0022j3187M264L459j0582J4378j1226L717K004m471
$$ -3562 -2132 7935 -11009 9013 -4174 90 3549 -7033 7345 -3881 -164 1840 -2631
1683b631O072n960J859L313m234J062K123m382O436n587k60P460j1612J2078r363
$$ -2631 3441 -2519 -660 2653 -1581 -519 1604 -2778 3658 -1929 -2189 5271 -6341 5737 -3626
1698c626K383Q441j7104J8363j3940O235M890j6789K2891k0078J1399m8j2340
$$ -3626 -1243 7198 -9906 8457 -5483 752 5642 -11147 11744 -8334 3065 3017 -9323
1711i323K2235k4100J7215o042o050J7083k3483K1344j1866P2J0704j8311K0564
$$ -9323 12912 -11188 6027 -15 -6065 11018 -12465 8879 -2987 -2915 7789 -10522 10042
1724A0042j5718N973L521j0663J4746j4266R211k271l169O405q484Q474n964L040
$$ 10042 -5676 297 3818 -6845 7901 -6365 2846 575 -2594 3811 -4673 3801 -2163 877
1738H77j221m50L146n106N629o219O308m243L1M285p285R594j0402P609j652m712
$$ 877 -344 -794 2352 -2754 2875 -3344 2964 -1279 -1248 3037 -4248 5346 -5056 2553 901 -3811
1754c811R674j3176J3978r930K258O141j3268J7249j6309R784o6r371J6101j8176
$$ -3811 5863 -7313 6665 -3265 -1007 5134 -8134 9115 -7194 2590 2524 -6847 9254 -8922
1768h922J4826o646l204J1071j5291J5624j1741M433L282r263J2376j2670R956
$$ -8922 5904 -742 -3946 7125 -8166 7458 -4283 150 3432 -5831 6545 -6125 3831
1781C831m835r61O335j0497J2115j0152N662l01m736Q802j0845R651n949J647
$$ 3831 -1004 -1965 4370 -6127 5988 -4164 1498 1197 -3539 5263 -5582 4069 -1880 -233
1795b33K501o002Q490r500Q592n519O44M644q958J1376j1295Q144j956n557J1201
$$ -233 2268 -3734 4756 -4744 3848 -1671 -1027 3617 -5341 6035 -5260 2884 928 -4629 6572
1810F572j2939J1193o821O79N714j0375J1899r794N272m95l935P497r851J0274
$$ 6572 -6367 4826 -1995 -1316 4398 -5977 5922 -3872 1400 905 -3030 4467 -5384 4890
1824D890p777K802K593p138J0516j1519R232l687l213Q800j1137J0057o899K242
$$ 4890 -2887 -85 2508 -4630 5886 -5633 3599 -88 -3301 5499 -5638 4419 -2480 -238
1838b38L137p682R513q183N070j789q44L485o281P949p207M582j155k272N868
$$ -238 2899 -4783 4730 -3453 1617 -172 -1016 2469 -3812 4137 -3070 1512 357 -1915 3953
1853C953r220R882o875J159M653q038R012q331N759j197m070P701p937O010m088
$$ 3953 -5267 4615 -2260 -1101 3552 -4486 4526 -3805 1954 757 -3313 4388 -3549 2461 -1627
1868a627K151P74m493P389p600N484k893l2M120q078R802p974K679K874o347P971
$$ -1627 524 1298 -3195 4194 -3406 2078 -815 -847 3273 -4805 4997 -2977 -298 2576 -3771 4200
1884D200q186O440j817m007P591p199M634k420R63J110l976N362m363K374j038
$$ 4200 -3986 2454 637 -3370 4221 -2978 1656 -764 199 1309 -2667 2695 -1668 706 -332
1899c32P26L59l109N501n101K425j11r22K035m299N748m115N21J853k246K488
$$ -332 394 753 -2356 3145 -1956 469 358 -564 1471 -2828 2920 -1195 -674 1179 -1067 1421
1915A421l913N186m205J279K017m280N279n963O137l433k739Q737j0344P509l230
$$ 1421 -2492 2694 -1511 -232 1785 -2495 2784 -3179 2958 -475 -3214 5523 -4821 2688 -542
1930e42r41N719j0101J0896o453n69O057q053P282n349K605J192n609P784n485
$$ -542 -1483 4236 -5865 5031 -1422 -1991 4066 -3987 3295 -2054 551 1743 -3866 3918 -1567
1945a567J240R83j223K170m253M589j552k151L244j991J104r01m2J713k869K160
$$ -1567 -327 656 -567 1603 -2650 1939 387 -1764 1480 -511 593 -308 -350 1363 -1506 654
1961F54J090m546M338q84k403L508m440N759l904k276Q601j0097O423j104l835
$$ 654 1744 -2802 1536 652 -1751 1757 -2683 3076 -828 -3104 5497 -4600 1823 719 -3116
1976c116P960r909Q615l905l458J0030j1728P898k163k062N422r231J0594o033
$$ -3116 4844 -5065 3550 -355 -3813 6217 -5511 2387 224 -1838 3584 -5647 4947 -1086
1990a086j647O433p319P235o365K765L148p996R730p692K046M253p670P830p005
$$ -1086 -2733 3700 -3619 3616 -2749 16 3164 -4832 4898 -2794 -748 3505 -4165 3665 -3340
2005c340M326K638j0251J1506o041k50M611q341J0441p600N05O615j0562R817
$$ -3340 986 3624 -6627 4879 -1162 -1412 3199 -5142 5299 -2301 -1796 4819 -5743 4074
2019D074m770k074P099q566P957n679l87Q348j1378P769k390j441N016r056R724
$$ 4074 -696 -2770 4329 -4237 3720 -1959 -2346 6002 -5376 2393 3 -1438 3578 -5478 4246
2034D246m961j539O473r409R196m978q85N673r249J1285q308n63Q920j1341R875
$$ 4246 -715 -2254 4219 -5190 4006 -972 -1857 3816 -5433 5852 -2456 -3019 5901 -5440 4435
2049D435p169J533P253j3831J3398p343n08Q330j3918J3524p518J52P106j3420
$$ 4435 -2734 -1201 6052 -7779 5619 -1724 -2232 6098 -7820 5704 -1814 -1662 5444 -7976
2063g976J4608q186j420P624j0320J1690r580J949P034j1006J0086p363K449M522
$$ -7976 6632 -1554 -2974 4650 -5670 6020 -3560 -1611 5423 -5583 4503 -2860 -411 4111
2077D111r425R664p270L085L515r390R733n220P20K838p703J0798o896j022O815
$$ 4111 -5314 4350 -2920 165 3680 -5710 4023 -1197 -477 2361 -5342 5456 -1440 -2462 4353
2092D353r081R138o059j224Q567j1153R760n732j942J0550j3765J0332m454j339
$$ 4353 -4728 4410 -1649 -2873 5694 -5459 4301 -1431 -3373 7177 -6588 3744 -710 -2049
2106b049Q503j4882J4065o045k636Q313j2591J3820q741m41P942j1882J3470j0628
$$ -2049 6454 -8428 5637 -408 -3044 5269 -7322 6498 -2243 -2684 5258 -6624 6846 -3782
2120c782K205O575j0692J1560j0639N313M016j1019J1537q429M649J395q479J0817
$$ -3782 -1577 4998 -5694 5866 -4773 540 4556 -6463 5074 -3355 1294 2689 -5790 5027
2134E027p503K698J885o512R096o254J86L805n659O861n315n31O483p622N403
$$ 5027 -2476 222 2107 -4405 4691 -1563 -1377 2428 -3231 3630 -1685 -2216 4267 -3355 2048
2149B048k776j218O950r966O953j640k802P383j0933R386k833l680P876j0849
$$ 2048 -728 -1946 5004 -4962 1991 351 -2451 4932 -6001 3385 552 -3128 4748 -6101
2163f101J1277o271k089Q194j0590J1216q651J155P237j1570J1685r308L780M344
$$ -6101 5176 -1095 -3184 5010 -5580 5636 -3015 -1860 5377 -6193 5492 -3816 -36 4308
2177D308j0366J1230q699M688J278p752J0301p734L725m5m258P764p186L153K05
$$ 4308 -6058 5172 -3527 1161 2439 -5313 4988 -2746 979 934 -3324 4440 -2746 407 612
2192F12k029L967m579J991J460k691J960j263K20K396l991K290P38k741M207n265
$$ 612 -1417 2550 -2029 -38 1422 -1269 691 -572 -352 2044 -1947 343 1081 -1660 2547 -2718
2208b718L715L97m403O502p009O043j924m195Q316r119P711m225j733P627j0208
$$ -2718 997 1394 -3009 3493 -3516 2527 603 -3592 4724 -4395 3316 -909 -2642 4985 -5223
2223e223R069n783J004M898r187R680p228L422J372o417R051p732M650j493k290
$$ -5223 3846 -1937 -933 3965 -5222 4458 -2770 652 2024 -4393 4658 -3074 1576 83 -2207
2238b207N909p195N550k606J08K259m340M539k739J193n80n83J669j382Q89j489
$$ -2207 3702 -3493 2057 -549 -441 1818 -2522 2017 -722 471 -109 -692 977 -405 484 -1005
2254a005K409k418J406k05j440L395m845M511k543J90K948n695O273m916K343
$$ -1005 1404 -1014 392 187 -1253 2142 -2703 1808 -735 -545 2403 -3292 2981 -1935 408
2269D08O34l815O467p065N299k344j024M470o863P333n688K630J346n447P871
$$ 408 1042 -2773 3694 -3371 1928 -416 -1440 3030 -3833 3500 -2188 442 1788 -3659 4212
2284D212p349M770j406k409N800p092N647k889R9K221l925M501l730K520j077
$$ 4212 -3137 1633 227 -2182 3618 -3474 2173 -716 -617 1604 -2321 2180 -1550 970 -107
2299a07n94J741k751L824m033L203j088j509L260m533N044l920J396J537l930
$$ -107 -701 1040 -1711 2113 -1920 1283 195 -1314 1946 -2587 2457 -1463 -67 1470 -2460
2314b460N041m775L552j668o95K943m474M933l754J932j61k082M309n592N081
$$ -2460 2581 -2194 1358 -310 -1005 1938 -2536 2397 -1357 575 414 -1668 2641 -2951 2130
2329B130k813j49K810m686N624n016K692M46l335M724m423L437k088J70K033l741
$$ 2130 -683 -832 1978 -2708 2916 -2100 592 1038 -2297 2427 -1996 1441 -647 -477 1556 -2185
2345b185M194l330K052r13p79K988m651M656k793N62J224k694L731m249L245p58
$$ -2185 2009 -1321 731 -182 -961 2027 -2624 2032 -761 -199 1025 -1669 2062 -2187 1058 300
2361C00j675K857k873L027l065J959J99k139L022l218L104k750J372J277l953
$$ 300 -1375 1482 -1391 1636 -1429 530 729 -1410 1612 -1606 1498 -1252 120 1397 -2556
2376b556M998m077K240m72j715M047n102M193j494j013K267k892L460l573K176
$$ -2556 2442 -1635 605 133 -1582 2465 -2637 1556 62 -951 1316 -1576 1884 -1689 487
2391D87Q9k004L049k903K536k293J052J278l661M322k953J346j56j425L331m057
$$ 487 576 -1428 1621 -1282 1254 -1039 13 1291 -2370 1952 -1001 345 189 -1236 2095 -1962
2407a962K861m27j424J740j751J702j335Q31l2o82O66j83O51k163L029j783l47
$$ -1962 899 472 -952 788 -963 739 -596 235 203 -479 187 4 655 -1508 1521 -262 -609
2424f09J580k222L141l683K288M92l114M405m028K599q69o91K455m238M732l059
$$ -609 971 -1251 1890 -1793 495 987 -2127 2278 -1750 849 -20 -711 1744 -2494 2238 -821
2440h21K28J608k501M009n180L832j75l084M479m974M500j811j613L954n208M706
$$ -821 -593 1015 -1486 2523 -2657 1175 1000 -2084 2395 -2579 1921 110 -1503 2451 -2757 1949
2456A949k005j579L510l024K273j930J49K625l241J033R49q85M77p72K68R78j554
$$ 1949 -56 -1635 1875 -1149 1124 -806 -657 1968 -1273 -240 709 -176 301 -471 -203 775 -779
2473g79J308o93n23K510l135J615k39k5J061l701M790k304j151K798l547M996
$$ -779 529 -164 -687 1823 -1312 303 64 39 1100 -2601 2189 -115 -1266 1532 -2015 2981
2489B981m968J516K536n029O480o332K885K025m959N933o327M663O11n835P008
$$ 2981 -1987 -471 2065 -2964 3516 -2816 69 2094 -2865 3068 -3259 1404 2015 -3820 3188
2504C188m963K897q37l061O392n981K972j01k318M835n147K441nj344L526n244
$$ 3188 -1775 1122 285 -2776 3616 -2365 607 506 -1812 3023 -2124 317 312 -1032 2494 -2750
2520b750L210J291l431K632k738L363n54l772N000l455J700M91l897O103m433
$$ -2750 460 1751 -1680 952 -1786 1577 1023 -2749 2251 -1204 496 987 -2910 3193 -1240
2535a240J161J061l825O990o660J676L154m725N652o717M205J948o411O847n395
$$ -1240 -79 982 -2843 4147 -2513 -837 2317 -2408 3244 -3473 732 2680 -3731 3116 -2279
2550b279L394Q71n803P506n735L109j60m725P977o135K170L67k681O323p621L870
$$ -2279 1115 1986 -3817 3689 -2046 1063 903 -3822 4155 -1980 190 557 -2124 4199 -3422 448
2566D48J185l755M988o598N093K85m484N442n495M975j006m786O834m992L327
$$ 448 1633 -2122 2866 -3732 1361 1646 -2838 2604 -2891 2084 1078 -3708 3126 -1866 1461
2581A461j300l495P770o866K606O03k940N947p175L794J370l969N256o312M289
$$ 1461 161 -3334 4436 -2430 176 779 -2161 3786 -3389 405 1775 -2194 3062 -3250 1039
2596A039J331n550N607m833L922j74n351P397m693J902p2l484P127o442K097J293
$$ 1039 2370 -3180 2427 -2406 1516 1342 -4009 3388 -1305 597 525 -2959 4168 -2274 -177 1116
2612A116l411O347p429L615J670m341N588o827N194O41n809O455n595M822j287
$$ 1116 -2295 4052 -3377 238 1908 -2433 3155 -3672 1522 2163 -3646 2809 -2786 2036 749
2627G49m561P649o042L556j249k872P069p125L251P2k055N172p365M571N72l204
$$ 749 -3812 3837 -2205 1351 102 -2770 4299 -2826 425 497 -1558 3614 -3751 820 1392 -1812
2643a812M160n494N072n79l871M532l754L620j571l042N438l917J786o91k072
$$ -1812 2348 -3146 1926 1347 -2524 2008 -1746 1874 303 -2739 2699 -1218 568 -123 -2195
2658b195N511n294J733J133k234M082n726L097J880m072M330m656L640N76n031
$$ -2195 3316 -1978 -245 888 -1346 2736 -2990 107 1987 -2085 2245 -2411 1229 1805 -3226
2673c226N622m168K917m61l989O907n483K402j73k515N847o516L609j29j911M316
$$ -3226 2396 -1772 1145 684 -3305 3602 -1881 521 348 -2167 3680 -2836 773 644 -1267 3049
2689C049o366M765o06k423L345m462M857j897j939L393l461L444k437n27L333
$$ 3049 -3317 1448 842 -1581 1764 -2698 2159 262 -1677 1716 -1745 1699 -738 -1265 2068
2704B068l266J964j319M3K141l035J304O68r40J361k249J400J060k581K116j383
$$ 2068 -1198 766 -553 -510 1631 -1404 -100 568 -372 989 -1260 140 1200 -1381 735 -648
2720f48R79R93l430L581k076Q49N34l158M914l673R59R88k498M650n286K854L64
$$ -648 331 1324 -2106 1475 -601 248 782 -2376 2538 -1135 -176 812 -1686 2964 -2322 532 896
2737H96k426L886m829L917j052j815L341m104L953k252n55K487k842K940k623
$$ 896 -1530 2356 -2473 1444 392 -1423 1918 -2186 1767 -485 -1040 1447 -1395 1545 -1078
2752a078J078Q84j719J709j676J387m07o92R03p52Q99r22K96L4M43o87q1P58p01
$$ -1078 0 884 -835 874 -802 585 178 -514 389 -363 536 -386 -90 -56 387 -300 -381 377 -324
2771c24J171j759J605l37j159J857k437K611j691j21J679k688L364k978J161J273
$$ -324 847 -912 693 356 -803 1054 -1383 1228 -463 -584 1095 -1593 1771 -1207 -46 1227
2787A227k744L256l386K463m67j591K664k923K818j762K9J099j986K605k418J435
$$ 1227 -1517 1739 -1647 816 349 -1242 1422 -1501 1317 -445 -416 683 -1303 1302 -1116 319
2803C19j03q67J701k184K179j513K39Q66j402J587j561J221o50j89R97j324J363
$$ 319 216 -651 1050 -1134 1045 -468 -229 637 -765 822 -739 482 -168 -357 640 -684 679
2820F79j166J115q22N1J034k015K040j540Q70R7j456K436k636J775l52p79J643
$$ 679 -487 628 -194 -143 891 -1124 916 -624 246 343 -1113 1323 -1313 462 110 -669 974
2837I74j975K028j861O95O79j294J511j668J638j040m5J376k133K197j736Q76
$$ 974 -1001 1027 -834 -139 540 -754 757 -911 727 -313 -358 1018 -1115 1082 -654 222
2853B22J09j358K395k601J797m20n17J093j699J877j431N35L98r59R69j074J265
$$ 222 331 -1027 1368 -1233 564 144 -373 720 -979 898 -533 2 400 -559 410 -664 601
2870F01j195O32M21j106J513j678J427j097K5J576k203J928j386N92K50j138J955
$$ 601 -594 38 459 -647 866 -812 615 -482 -457 1119 -1084 844 -542 50 300 -838 1117
2887A117k076J338k84m03O55j143J784k006J242J53j178J700j820J914j589P2
$$ 1117 -959 379 95 -308 347 -796 988 -1018 224 377 -801 899 -921 993 -596 -524
2903e24J777k455J926j163L56O49j283J916j974J076J66r39P06q95J346j375O88
$$ -524 1253 -1202 724 -439 -83 566 -717 1199 -775 301 467 -472 234 -661 685 -690 -2
2920bN77j004Q26j112J190o82J23O00j133P56m88N42n06M19J69p88P95o86J078
$$ -2 575 -429 397 -715 475 -207 -84 516 -617 139 -349 193 -313 106 275 -513 282 -404 674
2939F74j350P61P99k106K311j871J089j4j553K740k886J864N5j900K752k489K091
$$ 674 -676 85 884 -1222 1089 -782 307 293 -1260 1480 -1406 458 513 -1387 1365 -1124 967
2956I67j447j41K277l033J999j089O44L29j924K780k219J158q5j050J878j572
$$ 967 -480 -621 1656 -1377 622 -467 177 506 -1418 1362 -857 301 216 -834 1044 -528
2972e28P81n15k34J477j733O24P44o82K28o09M65P65j603P20N36j009J624j864
$$ -528 253 -262 -496 981 -752 -128 616 -66 162 -447 18 783 -820 -100 436 -573 1051 -813
2990h13Q62Q58j827J995k372K008L55k808L121k257J709r35j201L487l622K281
$$ -813 49 907 -920 1075 -1297 711 1066 -1742 1379 -878 831 -104 -1305 2182 -1440 841
3006H41j129n08K799m027L169j567L01J700l960L930j816k1J123k578M084l091
$$ 841 -288 -796 2003 -2024 1145 -422 -121 1579 -2381 1549 -267 -288 835 -1743 2341 -750
3022g50Q4J643j869K412k659P53J812k259J494j497P61J503k736J571j42PO62
$$ -750 -666 977 -892 1520 -1139 -386 1426 -833 661 -836 -75 1428 -1308 263 121 128 790
3039G90k777K817j03j793J781j851K550j429j586L090k593K426j873j050M029
$$ 790 -1987 830 727 -1066 715 -1136 1414 -15 -1601 1489 -1104 1322 -551 -1601 2428
3054B428l888J929j119J05K874m963L635r93l47J765m111M627j909j161K115k732
$$ 2428 -1460 469 -650 -545 2329 -2634 1001 8 -339 1426 -2685 1942 33 -1128 987 -1745
3070a745M060l012o22K855k794L166l375O87L085l870K291j673J019J761m194
$$ -1745 2315 -697 -1319 1536 -1258 1908 -1467 -780 2305 -1565 726 -947 72 1833 -2361
3085b361L315r49j88J073l123L815j238j329J715k120L449k459j233L194k283
$$ -2361 954 5 -183 890 -2233 1582 344 -985 730 -1390 2059 -400 -1633 1561 -722
3100g22J761k203K08L262l861K188j102M56J985m906L962o94n21J338l623M635
$$ -722 1039 -1164 -956 2306 -1555 633 -469 -13 1972 -2934 1028 334 -187 1151 -2472 2163
3116B163j968j598K678k647L841l268r54L924l334K567k767O81L174m621K774
$$ 2163 195 -1403 1275 -1372 2469 -799 -1753 2171 -1163 1404 -1363 -682 2492 -2129 645
3131F45j177O82J329m093L993j245m84J055k792M191k137j111J943k015L314l097
$$ 645 -532 150 1479 -2614 1379 134 -350 705 -2087 2104 -33 -1144 799 -1216 2098 -999
3147i99K2K570k623K163k241R91K138l979K592j123P20R49l615L677j093o16J131
$$ -999 -977 1593 -1030 1133 -1108 -117 2021 -1958 634 -489 231 1180 -2435 1242 149 -467 664
3164F64k346L577k038j134K436k050K431k611J86K845l198J871j503P30J983l645
$$ 664 -1682 1895 -143 -1277 1159 -891 1540 -1071 -885 1960 -1238 633 -870 -140 1843 -1802
3180a802K472p26L19Q64l197L516j379p20J316k246L306k118n78J968k015K522
$$ -1802 670 -56 263 1127 -2070 1446 67 -653 663 -1583 1723 -395 -973 995 -1020 1502
3196A502k541N45K128k863K108j679Q56J223k993K635j354O68K61j941K857j682
$$ 1502 -1039 -494 1634 -1229 879 -800 56 1279 -1714 921 -433 235 496 -1445 1412 -270
3212b70n5P81j307K204j891K8J214j184J286j516M75J266j961J203m43J55R34
$$ -270 -325 456 -851 1353 -538 -510 704 -480 806 -710 -235 1031 -930 273 -170 -15 919
3229I19k066J475j58n47J062j909K258r68p04J369j785K242j610l75J968j949
$$ 919 -1147 328 170 -377 685 -1224 1034 66 -638 731 -1054 1188 -422 -797 1171 -778
3245g78J590j434L35J430k209K008j508N38Q69k020K177j409P07J10j258K090
$$ -778 812 -622 -287 1143 -1066 942 -566 -28 841 -1179 998 -411 296 406 -852 1238
3261A238j862O66J71m82J040j397P85J04l84M66o67M56l1k76J10K8N4L05p43N24
$$ 1238 -624 42 213 -269 771 -626 159 263 -121 345 -322 134 103 -173 -63 -35 19 324 -419 105
3281A05L62j053J041p98N59Q0q82J231j099N26J15p96J514j606J220n44l11J213
$$ 105 467 -586 455 -343 216 296 -586 645 -454 72 187 -609 905 -701 519 -25 -336 877
3299H77j670J231o87L24L81j267J630j284O59j59m29J076j366J058m85k77R49
$$ 877 -793 438 -249 75 456 -811 819 -465 194 35 -394 682 -684 374 -111 -388 561
3316E61j128P80m56L76n8k38N29n97K63k33N57l79k39N63o47P10n00J95K57n94
$$ 561 -567 213 -243 133 75 -163 366 -231 32 -201 356 -23 -262 301 -346 364 -136 59 316 -278
3336b78P16p17M30j44k3L10q26J178r68K88K24n55P23r65J098o51J22N84j216
$$ -278 438 -279 151 7 -16 294 -532 646 -322 -34 190 -365 358 -607 491 -160 -38 546 -670
3355f70J117q68L61L61p54J124q91L24k02j75N78p29Q40n87j9L85m06M93q36J013
$$ -670 447 -421 -60 301 -453 671 -220 104 -98 -273 305 -424 416 -171 -190 195 -211 282 -554 459
3375D59n72k20O80q61Q72o46L09J0l22O94n35K85j35J70p1m04O13p42N99l34N0
$$ 459 -113 -333 347 -514 358 -288 21 31 -291 403 -132 153 18 188 117 -287 326 -416 183 -151 -101
3396a01K28n96J005q71K54M99q30P95r56R10l33k13O74j026J010o01L67k45n20
$$ -101 127 -469 536 -335 -81 418 -412 383 -573 337 4 -209 465 -561 449 -152 215 -30 -550
3415e50J336j275O31m33P3O57j247J454r99J71O29j033P84m70M01J51n56O47l02
$$ -550 786 -489 142 -291 -218 439 -808 646 -353 -182 447 -586 198 -272 129 280 -276 371 69
3434F9j57L04j95J9j54P0lJ24m28N52l34O8K40p52J081n86K14j22l44J041j465
$$ 69 -88 216 21 40 -114 -44 -47 77 -351 201 -133 -65 175 -577 504 -82 132 10 -334 707 -758
3455g58J155m39J2N33j265J524j100M67L61j367J827j628Q89J6p74J666j974J104
$$ -758 397 -42 -30 503 -762 762 -338 129 490 -877 950 -678 211 227 -547 1119 -855 249
3473B49l4o74J279j672J498n57n76J114j327J332p37k01M96n75Q41q62K08N93
$$ 249 215 -459 820 -852 646 89 -487 627 -700 632 -105 -306 190 -385 456 -406 -198 395
3491C95n88J53J26n5L44q91M72O41j022P16n91K61P67j618J496q21K79O24j901
$$ 395 -193 -40 86 31 375 -516 -44 597 -425 291 -300 -39 728 -890 606 -215 64 688 -1213
3510a213K158j174L52K44j493K688k360O47O63j372K170k740J710K37j171J646
$$ -1213 945 -229 123 367 -1126 1562 -798 -151 512 -860 1310 -1430 280 517 -654 992
3526I92k306K053m07j358J924j760J715j075p56J862j451R95p53k42J762j845
$$ 992 -1314 739 332 -1026 898 -862 853 -222 -978 884 -567 428 -325 -567 1195 -650
3542f50P89q1k74J160j898J006N18r97R13j264J205K22j882J784q10Q22l59j645
$$ -650 139 58 -216 944 -954 52 570 -427 486 -778 427 649 -1233 551 -259 563 204 -1441
3560a441K766j895N11N0r80K661k676R12O15j231K042k873K032M95k215K097k099
$$ -1441 1325 -570 -59 -9 -989 1672 -1004 -92 523 -708 1334 -1539 493 988 -1227 870 -1229
3577a229K263o42j872K714j829J462r57j071K789k422R56m72p8J865k642J287
$$ -1229 1034 392 -1480 1234 -595 867 -90 -1161 1628 -794 162 -310 -388 1477 -1165 122
3593A22L26p75R80k060K063k7j468J263j359J760o22j538K475j385O04l96j064
$$ 122 448 -327 653 -1407 656 629 -839 424 -935 825 203 -1335 1140 -245 359 -37 -1101
3610a101K706k248M96M60r76K281k778J043Q71j396J622k467K034L60k183K113
$$ -1101 1605 -643 -147 313 -663 1618 -1160 -117 754 -642 980 -1487 547 907 -1276 837
3626H37j648J682p26j635K762j982J261q48p08K796k728J072j97k45J600k797
$$ 837 -811 871 145 -1490 1272 -710 551 -297 -1005 1791 -937 135 -62 -307 1293 -1504
3642a504J942O9q40J302k436K311l72j600J874j499J716j011j402K590j546P22
$$ -1504 438 507 -333 969 -1467 844 472 -1128 746 -753 963 -48 -1450 1140 -406 316
3658C16n38n96K295k364P72N32o90J304k324J524N68j430Q86j267J651k93j446
$$ 316 -222 -818 1477 -887 -115 417 -273 1031 -1293 231 799 -631 255 -1012 639 346 -1100
3675a100J911j481J307q79p44K271j826P47k66m40J898k416J179R6p13J376k168
$$ -1100 811 -670 637 -242 -986 1285 -541 206 -60 -500 1398 -1018 161 257 -456 920 -1248
3692a248J875j35j250J316j401J562m71j177J767j194P40m57p95J969j660Q06
$$ -1248 627 492 -758 558 -843 719 248 -929 838 -356 384 -73 -868 1101 -559 247
3708B47k47k81J313j916J084j4n25J038j789J550j92r48J141r13J180n00r59J360
$$ 247 0 -281 1032 -884 200 186 -339 699 -1090 460 268 -680 461 -452 728 228 -731 629
3726F29r32O56m22n18J359r82L06j57j14R30j528J096p8o74P58j064J157j23r42
$$ 629 -303 353 -69 -587 772 -210 96 -61 -175 755 -773 323 245 -429 329 -735 422 299 -643
3745f43R01n76O61j22p28J046r22P52k67m50J135j372O79j69j27Q28j414J141
$$ -643 258 -318 343 221 -507 539 -383 369 102 -348 787 -585 94 -75 -202 626 -788 353
3763C53k67m03Q95j275J256n29k11M99o53N85j58k46O60p03M12k93j8O57q21L02
$$ 353 86 -317 578 -697 559 30 -181 318 -335 250 92 -154 506 -197 215 -78 -96 561 -260 42
3783D2n3O0n8j78Q2K48k69J95q9J16N8n46O78k75R6j13l49O64m46k1L58m47P48
$$ 42 -11 49 -9 -187 -105 143 -126 69 -20 96 154 -392 286 11 107 -6 -355 309 -137 -158 200 -247 501
3806E01q51M41O8n80P97q47N98n2l18O18o18M95l86q8L73j95J13k60K99J0k89
$$ 501 -350 91 159 -421 376 -471 127 75 -243 375 -243 252 -134 -222 151 -44 69 -191 108 118 -171
3827a71L25l68M02l65K5K86n10L21j19K22k0m8j00L5J40j1P5k55P4J31j71J77
$$ -171 154 -214 188 -177 -152 134 -376 -55 -174 48 28 -20 -120 -85 55 44 119 -136 -62 69 -102 75
3849G5k60J17J08k43M18n26N37k02n5L69m88L64l71K97j52j79L98m57L19o6q2
$$ 75 -185 -68 40 -203 215 -311 226 24 -31 338 -150 214 -157 140 -12 -191 207 -250 69 3 -79
3870g9M72o91N84m49J53K56m63M65m17J80J68l78L59k44J66j04l1P2j17K80j64
$$ -79 393 -298 286 -163 -10 246 -217 248 -169 11 179 -199 160 -84 82 -22 -53 19 -98 182 18
3891A8K02k31P8l4k11L70k24Q5q5K05m9m08N25l56J08k4o4m0n6N13m63M9K07j07
$$ 18 220 -11 67 33 -178 192 -32 53 -32 173 124 -284 241 -115 -7 -31 -95 -135 -191 322 -141 -92 115 8
3915HK51o71N42j56j46O24p72N04q7j67M48p45O84k61k96M80n79Q28p99K88K69
$$ 8 259 -412 130 -26 -172 452 -320 184 97 -70 378 -367 317 56 -240 240 -339 489 -310 -22 247
3936B47l70L85m32L77k53r8K92k97L43l67J09K36l00K33l17K50J76k37j46L99
$$ 247 -123 262 -170 207 -46 -144 148 -149 194 -173 -64 172 -128 105 -212 38 214 -23 -169 230
3956B30l52K93P4n04O28n73P3L43m63O61p54K46M11o44P74q69Q78j75p87J045
$$ 230 -122 171 245 -259 369 -204 -131 212 -251 410 -344 -98 313 -331 443 -426 452 277 -510 535
3976E35q87P91n68Q1O50j128J066q32Q3P03j068R55q17P02M6q46J042p53M25j41
$$ 535 -352 439 -129 -48 602 -526 540 -292 -209 494 -574 381 -436 266 312 -534 508 -245 180 39
3996C9m92R89p50K29J45l52O35o02o8M48m20L75l65q2P85r23M53J39m33Q70j180
$$ 39 -453 536 -214 15 160 -192 443 -159 -227 221 -199 176 -189 -271 514 -409 44 183 -250 620 -560
4017e60P72L1n56Q00j324J353l41p68J257j289J357r44k37J504j738J173q96K68
$$ -560 212 243 -313 487 -837 516 175 -593 664 -625 732 -212 -449 1055 -683 490 -406 -138
4035a38J039j827J455q50M70M33j682J649p79J84L07r35J697j179L6K57n82J216
$$ -138 901 -926 529 -321 149 582 -1100 549 -230 -46 261 -674 1023 -156 -120 137 -445 771
4053G71j354L84Q55r78O39q01L11P35j269P29k7j60Q14j494J480l49o86Q50j143
$$ 771 -583 -199 656 -322 317 -484 -173 562 -707 22 -5 -165 649 -845 635 286 -400 450 -693
4072f93J473p77q29J637j300J166r87k75J793k149J399p65K57R38k080J793r54
$$ -693 780 3 -826 811 -489 677 -310 -585 1208 -941 458 -307 -50 888 -1192 601 -353
4089c53J99P45j852K332j327l2M33r38K050j770nJ212j234J237j389N61R74j555
$$ -353 -154 591 -1261 1071 -256 -288 145 -793 1257 -513 -518 694 -540 697 -692 -131 843 -712
4107g12J091o54K93P13j653J302l79m6K86j219J793p92m29Q99j032J425j227k80
$$ -712 379 -275 18 731 -922 380 1 -45 241 -978 815 23 -406 493 -539 886 -341 -621
4125f21J466j534J264j083J95J386j998J422q23K58R61k104J976p84o0O48j577
$$ -621 845 -689 575 -508 -313 1073 -925 497 -326 -68 893 -1211 765 -19 -79 569 -1008
4142a008K186j491j30J011j304J714j479J14J155j359J286j369O08R09j659J316
$$ -1008 1178 -313 -443 568 -736 978 -501 -387 768 -591 695 -674 -66 843 -816 500
4158E00q63L43N05j533J711o18j89L01r01J502j034j07R04j121J520j427K79J046
$$ 500 -363 -20 485 -1048 663 45 -144 157 -744 758 -276 -383 521 -600 920 -507 -228 818
4176H18j559J333j040M64P71j666J429o22j1O27j515J907r66k77P28j241J768
$$ 818 -741 592 -448 16 787 -879 550 -72 -83 544 -971 936 -30 -307 421 -820 948
4193I48j182j22Q83j047J314j410L64J082j466J077r03O10M14j276J146o47L62
$$ 948 -234 -356 527 -520 794 -616 -252 830 -636 441 -462 148 562 -714 432 -215 147
4210A47J03q91J279q74M1M95q45J281j082J55N58q41J038j076N37M97j121J069
$$ 147 250 -641 638 -236 -195 300 -545 736 -346 -191 367 -474 564 -512 25 522 -599 470
4228D70p66L36M04j014J052m23j3K25o76Q51o48J23L17n68R39q97J03N55r15J105
$$ 470 -296 40 444 -570 482 59 46 271 -405 446 -202 -79 238 -330 609 -288 -185 370 -545 560
4248E60p05mN77q33R59q09K54M22q86Q94o52J53L16q18J082o82J54L18o36Q43
$$ 560 -145 -149 428 -405 554 -255 -1 421 -465 429 -223 -70 246 -572 510 -172 -18 300 -336 507
4268E07r05M71L72o57N73o35L00L26q38O54m76L37O3l52N75l20J1J62m26O21m83
$$ 507 -398 73 445 -212 361 -274 26 352 -486 168 -308 29 92 -260 315 -5 6 168 -258 363 -120
4289a20J56J47m27N03n09J79K15k93K20q8NJ93n56O63l03j67L99k71L06k76j44
$$ -120 36 183 -244 259 -250 -71 144 -149 71 -17 -12 181 -375 288 -15 -182 217 -54 252 -24 -168
4310a68L80m05L97k47r2L11q6O7l79K68J91o29O18m68L00p0k15M96n47N30j58
$$ -168 212 -193 204 -43 -135 176 90 157 -222 46 237 -392 226 -242 58 -12 -227 269 -278 252 94
4331I4l42O01n99J94r2O7K29k77N6K47k54K08k09R5M3k6p9N6j03J95k02N6R2j67
$$ 94 -248 353 -246 -52 -144 -77 152 -125 -69 178 -76 132 -77 18 61 35 -44 12 -91 104 -98 -42 50 -117
4355a17L30m01K98Mj10J44j18o6P0j45K04l68M19j40j13L31l78K12m9qK55l74
$$ -117 213 -188 110 114 4 148 30 -36 34 -111 93 -275 144 4 -109 222 -156 56 7 -1 254 -120
4377a20K38j38kJ67k51K03j15K28m2m01M85l92P3J06l8N0l57L08n2P4N9j68J55
$$ -120 118 -20 -22 145 -106 97 -18 210 168 -233 252 -140 -67 39 1 51 -306 2 -50 24 83 -85 70
4400G0j32J13j5q8j0K09j88O5K7L5j16mj35K43j73O3L9L6N4j65L29l41P1po7J55
$$ 70 -62 51 36 -52 -62 147 -41 24 51 86 -30 -34 -169 74 -99 -36 3 39 93 -72 257 -84 -13 -20 -87 68
4426F8m56O07l78P3J71l08M68l41k0K43l36L51l48K02J97l58N65n72K49Pl79M40
$$ 68 -388 219 -159 -86 85 -223 245 -96 -116 127 -209 142 -206 -4 193 -165 400 -172 77 84 -295 145
4448A45l77K46P2j09J80n17M36q7j22J17o7K01j72J65j34N6J76q1l03L82q8l58
$$ 145 -232 14 86 -23 157 -360 76 -11 -133 -16 -83 118 -54 111 -23 33 209 128 -175 207 119 -239
4470b39L75m91N60k65j9K50m36O15k54j04K32m33N74o95L64R4n35P35n58M02j15
$$ -239 136 -355 205 -60 -79 171 -265 350 96 -8 224 -209 365 -330 34 128 -407 328 -230 172 57
4491E7n26R51o86L83j60k90P61q66M49k30J6O64r05N22j25j87L66o70Q52l73k78
$$ 57 -469 482 -204 179 19 -271 490 -376 73 -157 -141 523 -382 140 15 -172 194 -476 376 3 -275
4512b75O35n03J66j43J69K53o41L57J79n40O75n84K23K23n78P48p43L76K91p58
$$ -275 360 -143 23 -120 49 302 -339 18 197 -343 332 -252 -29 194 -384 364 -379 -3 288 -470
4532d70J027q03M07L4q42J226j026P22j9p46J384j339N96O8o71J157j342Q21n1
$$ -470 557 -246 161 195 -647 579 -447 275 256 -490 894 -445 151 219 -452 705 -637 184 133
4551A33n60P86r64R80j44q05J047r03P45l65l65Q97q13N60k14l25Q04q43L23k7
$$ 133 -427 359 -605 375 231 -574 473 -430 315 -50 -415 482 -331 229 15 -310 494 -349 -26 -53
4571e3j74P02q81M14K00n46P89j076Q13L2p79J088q24N95j86p40J407j279P69
$$ -53 -227 475 -406 8 208 -338 451 -625 188 220 -559 529 -295 300 114 -626 781 -498 271
4590B71j25q50J376j286O81J66o76J320j643J044m0p51J200j291J002j60o86R47
$$ 271 146 -704 672 -614 67 233 -443 877 -766 278 238 -513 687 -604 398 238 -448 499
4608D99r79P62k93l94R71r82O45k49m24J107j134O85R1n01P19j081Q50j17n94
$$ 499 -480 282 -11 -405 566 -416 229 -20 -444 663 -471 214 305 -196 523 -558 292 175 -419
4627d19Q63r16P85j50q27J304r14N03l1p42J300j087N12j08n90J255j387Q43K02
$$ -419 444 -472 313 163 -664 640 -274 229 198 -544 756 -331 181 73 -517 738 -649 194 396
4646C96r24J115j275J021j76n72R69j242J140l19p04J155r82P77m79m31J257j418
$$ 396 -528 587 -688 333 157 -415 554 -688 452 133 -571 584 -398 379 -100 -531 726 -692
4664f92Q51j29l69R27j280R39j02m64P86r76Q30l31m39Q94p85O77k39n33Q86q81
$$ -692 159 30 -339 588 -692 247 145 -319 467 -509 321 -10 -449 445 -340 337 98 -435 451 -430
4684d30N34j70m63J190j095O11o6l90R12j199Q05j17m35P55r64Q45k03p05J158
$$ -430 104 -66 -529 661 -434 177 111 -279 633 -566 239 122 -313 442 -522 323 120 -585 573
4703E73r93P99l40n21J212j172P17k13m69J161j260O90p4l55R69j176O53k4n38
$$ 573 -420 379 39 -482 730 -442 275 62 -407 754 -506 184 110 -245 724 -452 201 177 -361
4722c61P53p32O28l09m07P47n54M05k19k44O15o65L77rj82M90q32N71l2j38L67
$$ -361 392 -340 288 -21 -428 319 -235 170 -49 -293 322 -343 34 25 -157 333 -499 72 40 -98 269
4743B69o18P03l46m11O78k87K84j59m70O78o56N92l29k27P34o83M03l0k90M20
$$ 269 -349 354 8 -403 275 -12 272 113 -357 321 -335 257 -72 -299 435 -248 155 125 -165 255
4763B55l85K45J62o79P19o44N15k07l45N49n12P02l88k41O29o46L67q3k29O98
$$ 255 -130 115 277 -402 317 -327 188 -19 -364 185 -327 375 -13 -254 375 -271 96 13 -216 482
4783D82q41N23j33k50L74m38L68M6k63L58k08m2J95m05M19q7p8j0k65L73k62Q6
$$ 482 -359 164 31 -219 155 -283 85 131 -132 226 18 -24 171 -234 185 98 20 10 -255 118 -144 -58
4805e8L8n2K11k53L06pk38J10k00L22j71k29N25n37K40l9j09N23n17J15M2p6K37
$$ -58 -20 -72 139 -114 192 185 -53 57 -143 179 8 -221 304 -233 7 -32 -141 382 -135 -20 22 -54 183
4828A83l34K33m8k54M65l48J55o0j01J77n0n2J5J3m1j03K66j97Q4L6p4QM8m1J44
$$ 183 -151 82 34 -220 245 -103 52 -8 -109 68 18 -34 -19 -6 -47 -150 116 -81 3 39 -35 -27 21 -20 124
4853A24k18L4%J7K67k73J73j86J5J31p6J52j07j67Q3j7Q6Q7l34L44j46j79K40
$$ 124 -94 -60 -60 -43 224 -49 124 -62 -47 84 8 160 53 -114 -31 -48 38 125 -209 135 -11 -190 50
4876E0j41J53k51J47jj46L17j67m3L32k66J60k69J10K18k88M5M3J56k90n8L53
$$ 50 -91 62 -189 -42 -43 -189 128 -39 -82 250 -16 144 -125 -15 203 -85 -40 3 159 -131 -189 164
4898A64l51J21R9K1P8k40N3mJ02l5j15O5J0p5J58j53K3L3J80P0l58J86lj32J77
$$ 164 -187 -66 33 54 132 -108 -55 -59 43 8 -107 -42 -32 -107 51 -102 -79 -46 134 204 -154 32 29 -103 74
4923G4K1L0l4j04R9P9j25J37k65K84m24K07K58k87K40l01L88k33l10N17l53K10
$$ 74 95 125 91 -13 86 165 40 177 -88 196 -228 -21 237 -50 190 -111 277 44 -266 251 -102 108
4945A08j44m4K24m50N14j53m0K56n18L60j49k6R0k24O34m30j66K20k07K23k02
$$ 108 -36 -80 144 -306 208 55 15 271 -247 113 -36 -62 28 -196 438 8 -158 62 -145 78 -124
4966a24Q7J23k70K81j76J16J3j63P8m3O1J38k53J85j32k55M23l58M52p4k38L22
$$ -124 -37 86 -184 97 -79 37 50 -113 -35 -78 -17 121 -132 53 -79 -334 89 -269 183 109 -129 193
4988A93n26L31K6k56N65p54N24j13r6O02r83O46l19p5O10p74P43k92j90M20p52
$$ 193 -333 -2 24 -232 333 -421 103 -10 -106 496 -487 159 -160 -235 375 -399 344 52 -138 282 -470
5009d70O69j60j35K93m21L33j93n9M56o03N24k31j31K58n30O09k33p2L05m60N72
$$ -470 199 39 -96 197 -224 109 -84 -143 313 -290 234 3 -128 130 -400 209 -24 -96 209 -251 321
5030C21l30k29L88n70N59k81q2P89q91N37l64n0P09r52O35l83N2N05p45O60m69
$$ 321 -9 -238 150 -420 139 -142 -224 565 -326 211 -153 -203 506 -446 189 -194 -142 363 -382 278 -191
5051a91R8N77r03O99k96j34N09p77P44n54qN48q79J023q12M65L07q42R50p51J74
$$ -191 -93 484 -419 280 -16 -150 359 -418 326 -228 -236 312 -567 456 -356 109 416 -426 524 -227 -53
5072e3M74r70R71o40J81J57n13N90m14J30M21o06P36n91n4N53q71P38n01R2P15
$$ -53 421 -549 422 -218 -37 120 -393 197 -217 -87 334 -272 464 -127 -181 372 -499 239 -262 -170 545
5093E45j131J007n01j73Q01j152J086n80k83Q35j083J001o45K43L92r77J193q90
$$ 545 -586 421 -80 -253 548 -604 482 -98 -381 454 -629 372 -273 -30 362 -615 578 -312
5111c12L15L94j026J121p96J91N54j094J105o90K17M68j047J223p11Q2M35q76
$$ -312 3 397 -629 492 -304 -113 441 -653 452 -238 -21 447 -600 623 -88 -6 429 -447
5129d47J128q76J35L12o33P49n11J46M21q40P60l92l5M99p72O58o45K31N76r38
$$ -447 681 -195 -60 252 -381 368 -143 3 424 -416 344 -48 -83 416 -356 302 -343 -112 464 -474
5149d74J040p21%N06q96J098o32j40N52j015J147q70K99L71q89J122p25N9N51
$$ -474 566 -155 -155 351 -545 553 -79 -219 333 -682 465 -405 -106 265 -624 498 -227 -168 383
5168C83r67J179o63LM13q30Q82p45M08K76q23Q59o32M19J47p31Q39o49J46L87
$$ 383 -584 595 -68 -65 348 -482 400 -345 63 339 -484 375 -257 162 309 -422 417 -232 -86 301
5188C01p49O93n35K07M89q33P64m53K05J07n76O48n19j43Q48r31Q72o56J7M71
$$ 301 -448 245 -290 -83 406 -427 337 -116 89 196 -380 268 -251 -394 454 -477 395 -261 -244 227
5208B27o92Q11m76j03M32o69R37m95nL10o87Q43p60K71K86m64O61q10M00J52o14
$$ 227 -465 346 -130 -233 199 -470 467 -28 -33 277 -410 433 -327 -56 230 -234 427 -383 17 169 -445
5229d45R57o82N9K81o67Q16l32L1J90o01O47n15L9M11n44N88k49q5O36q69M28
$$ -445 512 -170 -111 170 -497 319 -13 18 208 -393 254 -261 -222 189 -355 233 -16 -101 535 -334 94
5250I4k03l7M87n89M56l27L1K29m46N74m59K5L12m62N95m34J25L32o45O59m34
$$ 94 -109 -146 341 -248 208 -119 -88 141 -305 269 -190 -165 147 -315 280 -154 -29 303 -342 317 -117
5271a17N1K02m73O86m96K21K42o36M85l54J01K43m21L27j67R8J06k32L37j80n7
$$ -117 -66 136 -337 349 -147 74 316 -320 165 -189 -88 155 -266 61 -106 -8 98 -134 203 23 -34
5292c4J07j97K35k63J72J67m82N16k80P4J95m28L51k47K19l2j20K54j18r9N3o1
$$ -34 73 -124 111 -152 20 187 -295 221 -59 15 210 -218 133 -114 105 73 -47 207 89 -10 43 -18
5314a8K77k39q1K22l11K63l38J09K58n04L98k51K50K21l30k3J53PP1j79M8J1q9
$$ -18 259 20 -61 161 -150 113 -225 -116 142 -362 36 -215 35 256 -74 -97 56 63 134 -45 3 14 -75
5337g5K71k02J86j95n9K11j79J67K1j49p7J7pj1K14j02k31L77q5l7n8j01J39M
$$ -75 196 -6 180 -15 -74 137 -42 125 146 -3 -80 -63 -70 -81 133 31 -200 177 92 55 -3 -104 35 39
5361C9J70j07k57K55j70k7K07Pj22J16j24J5l0J82j88R0K3n9O8N2j11j1k45L33
$$ 39 209 102 -155 100 -70 -97 110 117 -5 111 -13 2 -28 154 -34 56 79 20 88 140 29 18 -227 106
5385A06J16l64J03J69j79k5j29L56k00K08l04R4J71l46L55k57k4L08j43Nm8L0
$$ 106 222 -142 -39 130 -49 -74 -203 153 -47 161 -143 -49 122 -224 131 -126 -150 158 15 20 -28 2
5407BK67m26K58j58J61o2k90K82m7j19K27k27J65j29K1L9k9J33m3p4J05k9J8j24
$$ 2 269 -157 101 -57 104 42 -248 34 -13 -132 95 -132 33 -96 -75 -36 -65 68 25 -49 56 27 45 -79
5431g9J20j24J7O9o8l7M1Q0KK2J15M4m19J49M6R3L1k88K24j13K76j23k84M45m10
$$ -79 41 -83 -66 3 -65 -102 -61 19 21 43 158 202 -217 -68 -22 71 102 -186 38 -75 201 78 -206 239 -171
5456a71Q0K04j62J30k01K46K4k39K84l51K20q4j32K23p8K01p6k52K17m18M54o0
$$ -171 -91 113 -49 81 -120 126 150 -89 195 -156 64 -20 -152 71 -7 194 118 -134 83 -335 119 59
5478E9k68K74p0m6O1j36L04n8p6K06l75J11j23L6K89k60J97j01j54J35k43M65
$$ 59 -209 65 -5 -51 10 -126 178 120 44 250 -125 -14 -137 -101 188 -72 125 24 -130 5 -238 227
5500B27k25j41K19k83N40m70J40O4l01M06k83J27K7l49N80o63M72N4k66M38p12
$$ 227 2 -139 80 -203 337 -133 7 71 -230 176 -107 20 47 -302 278 -385 87 141 -125 313 -399
5521c99N97q5m03M74l65K71k7k29M36m84J79o7J2K34l68L67L5l97N27m75J94K04
$$ -399 198 113 -290 184 -181 90 63 -166 270 -214 -35 -102 -90 144 -224 143 178 -219 308 -167 27 231
5543B31m53L80k01M1J65m72P49m72rJ10m02N67m35M66o6m53N68o36N01Ro36P46
$$ 231 -222 158 -43 -2 163 -309 440 -32 -41 69 -333 234 -201 265 199 -254 314 -322 179 188 -448 298
5565B98n81J15L24o62Q75p86M73Q9n39R56q03L15M1o41J018p53J75Q2k26N81o74
$$ 298 -283 -168 156 -506 369 -417 56 145 -394 562 -241 74 115 -526 492 -261 -86 -4 -230 351 -323
5586c23L65K30m03L74m92M09K2o41O76o89O66pp01Q58o85L22N3l78P58o21J18
$$ -323 42 272 -131 243 -249 160 182 -459 217 -472 194 187 -514 344 -341 -19 34 -344 414 -207 -89
5607h9K10l98Q02p71L24K07p04J013j028N36J2n01P87o53M26K7q89J303q46L44
$$ -89 121 -277 525 -246 78 285 -419 594 -434 102 114 -387 400 -253 173 200 -689 614 -232 112
5627A12r2m46J167j109L37K62n12P90q72L66K60o57R14q52N38p9o41R76p95N10
$$ 112 20 -426 741 -368 -31 231 -281 509 -363 3 263 -394 520 -332 206 127 -514 462 -333 177
5647A77jo10P98o50K68J35n81Q58o53L26O8n76P89p41N25J75o80Q42p84N52L8
$$ 177 176 -434 364 -286 -18 117 -464 394 -259 67 135 -441 348 -393 132 307 -373 469 -315 237 275
5668B75o16N86m60L51J8n05P78p93N71n9m19Q35j036N92K54q17Q89j073P89k6
$$ 275 -341 245 -215 136 154 -351 427 -366 205 146 -273 562 -474 118 372 -445 444 -629 160 134
5688A34m27N43o58M32K74n49O09n91L81j4l36N03o23L59J90m53O63n48P9J44m52
$$ 134 -293 250 -408 24 298 -251 358 -233 148 134 -202 301 -322 37 227 -226 437 -111 -32 112 -340
5709c40Q35p09K96J76n52O55o06L48L1m50O88o18L03J83p18Q98n64K09J39m97
$$ -340 495 -214 82 258 -294 361 -245 103 134 -316 372 -246 57 240 -478 420 -144 65 204 -293
5729b93Q21q07L88K3m01N74p26O01l1l19M92n50N01r9l89N39m08J34P7n00P10
$$ -293 528 -279 109 132 -269 305 -421 180 149 -170 322 -228 273 174 -215 324 -84 50 127 -373 337
5750C37n44M26k78r0M53o14L86m2j70N06p04L97J18l41L83m57J19L61l85K58m04
$$ 337 -207 219 -59 -149 304 -310 76 34 -136 370 -334 63 181 -160 223 -234 -115 246 -139 119 -285
5771b85N14k26k65M82l77K08k03p5N46n67L62p8j43L09l82K53J42k80K00l35K52
$$ -285 229 3 -262 220 -157 51 -152 -227 319 -248 114 36 -107 202 -180 73 215 -65 135 -200 52
5792E2m5l15M94m16L20q5j27M73p03M46nm28N66m98K60J8j46L11l78J76J71l73
$$ 52 7 -308 186 -230 90 5 -122 351 -352 94 89 -339 227 -271 -11 7 -139 172 -206 -30 141 -232
5814b32K00N2k03J42q1K01k29J59m9j41J60o0J0L56l42K18j99o8J33j16K08k46
$$ -232 -32 20 -183 -41 -122 79 -150 9 -40 -181 -21 -81 -71 285 -57 161 -38 -106 27 -89 119 -127
5836a27J00L4j76L11k71J42Q1k37J66k79M03l6l53L24j24K31p7k10K62k04L0R5
$$ -127 -27 7 -169 142 -129 13 94 -143 23 -256 147 111 -242 82 -42 189 112 -98 164 -40 -10 85
5858H5k6j23l3P7K44l04J28j7m8Pp5J26r7J35q8k0O7k35N3J40m6NJ41K2j32k7
$$ 85 59 -64 -97 -20 224 -80 48 31 -17 -10 -85 41 -56 79 -9 -29 38 -197 -144 -4 -50 -45 96 118 -14 -41
5884d1R3j06J87Pk70J97j74J13J83l23J91O4M7J0j90K22k00p6m9J05J19k03J14
$$ -41 52 -54 133 140 -130 67 -107 6 189 -134 57 121 168 178 -12 210 10 -66 -115 -10 109 -94 20
5907B0R6K8Rk14j7J01j3K40l18N2Lo2J99k67J08j16N5J68k60J63J57k69K27k56
$$ 20 116 144 153 -61 -78 23 10 250 -68 -16 -13 -75 124 -143 -35 -151 -96 72 -188 -25 132 -137 90 -166
5931a66M5N9R6J16l01J45Q3j60R7j27K60k32j1J11j8M1l0j99J69p0J32l9K7J52
$$ -166 -121 -62 34 150 -151 -6 77 -83 14 -113 147 -85 -96 15 -3 38 8 -191 -22 -92 40 1 28 180
5955A80j23p0N2j36J25k50K35P9l05N40l29M0l9j67K49j74R3K1q7J1l9K20qk72
$$ 180 57 -13 39 -97 28 -222 13 92 -213 327 -2 38 -1 -168 81 -93 0 21 -66 -55 -94 126 118 -154
5979a54K38j75J24P3j73J41l05L53j15j01J19j96K92r4k30L19k80J98J00l75L81
$$ -154 84 -91 33 106 -67 74 -231 122 7 -94 25 -171 121 27 -203 116 -164 34 134 -241 140
6000A40j32l7j8kK68l27J21k5j59N29o60L36J0j98M04n10M54p3j39K06k52K75
$$ 140 8 -29 -47 -49 219 -108 13 -12 -171 358 -302 34 44 -154 250 -260 194 121 -18 188 -64 211
6022B11k60q3K97l54J38j59J77J02m61L90J31j99J18l63N11j59k82O01m77M76
$$ 211 -49 -132 165 -189 -51 -210 -33 69 -392 -2 129 -70 48 -315 196 37 -245 356 -121 355
6042C55l72j02K88m35L20o1j48N31n31J24J58l22N85o55K09Q8j73L57n17L97M5
$$ 355 -17 -119 169 -266 54 -7 -155 376 -155 -31 127 -195 390 -265 -56 32 -141 216 -301 96 141
6063A41l03M74n35L30j58l1M56m90K89k74j81O58p81P21l69n4L99p08N98k05p2
$$ 141 -162 312 -223 107 -51 -82 374 -116 173 -101 -282 376 -405 316 -53 -107 292 -416 182 -23 -95
6084i5K66m66N06p3j37K82p29O36k22k66O61m73K94k32j65N27p44O37l37r9M88
$$ -95 171 -295 211 138 1 283 -446 190 -32 -298 363 -110 184 -48 -213 314 -430 207 -130 -229 259
6105B59p38N36r8k4J79o54O95l37p6M35n54P99n53J3M48o02L68j9k30O06q76O48
$$ 259 -479 57 -41 -65 114 -540 155 -182 -258 177 -377 422 -131 -118 330 -272 96 77 -153 453 -423 225
6127B25l49j30Q08j009P62k43j33M14o68O36j92l84L56l53P47o41J2N19n94N74
$$ 225 -124 -254 554 -455 307 64 -69 345 -323 313 121 -263 93 -260 487 -154 -142 377 -217 357
6147C57m13j04N06o36M76k51QN63j003P10l04J46L5l43O23l62j98L64m79N40k05
$$ 357 -56 -160 346 -290 186 -65 -57 506 -497 213 -91 55 90 -253 370 8 -190 174 -305 235 30
6168C0k92N95n63M26j15j58M14o21O51n33J41L73p92O17j19k73K84m10P31m46
$$ 30 -262 333 -230 196 81 -77 337 -284 367 -166 -25 348 -444 173 54 -219 65 -345 386 -60
6188f0j87M61m77O95m97k85N53m84N39l33j69O67p81N90l27MM49q44P94l13j51
$$ -60 -247 214 -263 432 -65 -350 203 -281 258 -75 -244 423 -358 232 -95 -91 358 -486 308 -5 -156
6209a56M70o35M68k26q9L08k86K98k84L4K52k88K87j69j61M87n13L50j84o9L07
$$ -156 314 -321 147 -79 -168 140 -146 152 -132 -98 154 -134 153 -16 -177 310 -203 147 -37 -106 201
6230B01o19N83n9j47K88l37L26l60n6L41m77N30k30j13M75n72M91l31R3K84o15
$$ 201 -418 165 106 -41 247 -90 236 -124 -180 161 -316 214 -16 -129 346 -226 265 -66 27 311 -304
6251c04M60k27K8J94n49N38k1k94K14k76L44j02j32L86n24L01k64J06L10l93K27
$$ -304 156 -71 -43 151 -398 140 119 -175 39 -237 107 5 -127 259 -265 36 -228 -122 188 -205 22
6272B2j76K53l7j19R0j1o9K79k66K21j26r5K04l05K49K6k18K65m06L07q3j52L49
$$ 22 -154 99 62 -57 33 22 -47 232 -34 187 61 -34 170 -135 114 140 -78 187 -219 88 5 -147 202
6295B02l96J58J16m10N63k72J03N5o8l7r0L40l66lK65j51J25n9j50J49j86K25
$$ 202 -194 -36 80 -330 233 -39 64 119 51 14 -76 264 -102 -105 160 9 134 75 -75 74 -112 113
6317A13n8PM8k09L47l87nK39l00K45R9p7o3j80J47K05m43M29j67K2m6r5L90l07
$$ 113 55 62 110 -99 248 -139 -144 95 -205 40 139 62 -1 -181 -34 171 -272 157 -10 12 -34 -129 261 -46
6341d6O4M7k37L14j53J64j05j29L49m20J17k4N0J88k78K29l1k95K82L0n6J1M7
$$ -46 18 65 -172 142 -11 153 48 -81 268 -152 -35 -59 -9 179 -99 130 99 -196 86 116 60 71 118
6364A18j20n4J43j76J21J24j38K8p2J04N1j32J02j70J3J96j37L8l1j8J63k26M8
$$ 118 -2 -56 87 -89 32 156 18 46 -26 78 129 -3 99 -71 -58 138 1 39 8 -10 153 -73 -25
6387b5n2n4K30k52L13k7r5Kk3m5n7N4J70k17R4PPO2l03Q6J76j21Q1JJ48k59J3
$$ -25 -77 -131 99 -153 160 133 38 40 17 -28 -85 -31 139 -78 16 23 30 92 -211 -125 51 -70 11 12 160 -99 -86
6414h6K46k19j3Q7j83J64k68J36J76k48J82J4J37r4r0J06k2J38j49k81L19o7R5
$$ -86 160 -59 -72 15 -168 -4 -272 -136 40 -208 -26 -12 125 31 -59 47 25 163 14 -267 52 -15 80
6437H0p5kL8J9P3j28N8J29m10K71p3o3K01p9J3L4r5J44j50M4J6m0L3j35J30n6
$$ 80 5 3 41 60 133 5 63 192 -218 53 -20 -83 118 39 52 86 -9 135 -15 29 45 5 38 -97 33 -23
6463b3o5K07j99L16k75q0L10l31J24n8l6J82k33J04K29n8L9j75J60j98R2j42j3
$$ -23 -88 119 -80 236 -39 -119 191 -140 -16 -74 -110 72 -161 -57 172 114 153 -22 138 -60 32 -110 -123
6486a23K10j94J70o5ML1J8q8M9p8K88l47J55j0j67K26k44L08q3j37J00J36k97
$$ -123 87 -107 63 -2 2 33 51 -37 12 -66 222 -125 30 20 -147 79 -165 143 60 -77 23 159 -138
6509a38L58m22L24j49l7J18k78K43j13J53K52m26L13k76P3K62m97L86j54j5O8
$$ -138 220 -202 122 -27 -64 54 -224 19 -94 59 311 -115 198 -78 -5 257 -240 146 -8 -23 45
6530D5k66L00m6L6M7j84L42l48J7J95k40J93j98J25Ok92L23o3O2J23m24K85j61
$$ 45 -221 79 33 69 116 -68 274 -74 -57 138 -102 91 -107 18 24 -268 55 -8 54 177 -247 38 -123
6553a23J38n0j03M22k94l3K35l74L43k50P5J79l81N59l93R9J79n49M80k16O1K26
$$ -123 15 -35 -138 284 -10 -43 192 -182 161 -89 -14 165 -216 343 -50 49 228 -321 159 -57 4 230
6575B30n24M53p8o0Q9l51O89m87N1J76k91K96k65L6J35l40L97l41K53K36m12L20
$$ 230 -294 159 81 21 110 -241 448 -39 12 188 -103 193 -72 -36 99 -241 156 -185 68 304 -108 212
6597B12l67K38Q9l92N45m86K64J28o99Q00l09L2J7n46O74m16J20L46m37N35o40
$$ 212 -155 83 172 -220 325 -161 103 231 -468 332 23 55 72 -474 200 -216 -96 250 -187 348 -292
6618b92K24L00n74O04n70M23Q5m06N54m38J76J19m85N52l73J24Pk77N87m79K6
$$ -292 -68 232 -342 262 -308 115 200 -206 348 -90 86 205 -280 272 -101 23 30 -247 340 -139 -113
6639a13L10l04L40m65K74N8l95L98l06J31L29o00M66k50K00J40l84N35l65P4o1
$$ -113 197 -107 233 -232 42 100 -295 103 -203 -72 257 -343 123 -127 73 213 -171 364 -1 73 12
6660A2l81O30m11J0L49k59K96n19L21Q6l72O19m25J65Lm42M96j24J4j07l18P61
$$ 12 -369 261 -150 -140 209 -50 246 -273 48 134 -238 381 -44 121 124 -318 178 54 68 -39 -357 404
6682D04m90K0K9k22N02o14M38K67m91L47m61M56J34n41L49q4J24O0m07L41j91
$$ 404 -86 -66 -37 -259 243 -371 67 334 -157 190 -271 185 319 -222 127 43 167 227 -180 161 -30
6703c0O2j33j25N16m64k3K91k17M96o55K66K81m04L01l72L02n4l07M61l59K05
$$ -30 32 -101 -226 290 -174 -197 94 -123 373 -282 -16 265 -139 162 -210 92 38 -269 192 -167 38
6724C8P1k39K72k79K55j89p6M47n85K78K47n72N20m07J86K43l28K04j59R6P1k78
$$ 38 109 -130 142 -137 118 -71 -147 300 -285 -7 240 -332 188 -219 -33 210 -118 86 -73 23 94 -184
6746a84L41k53J68j59j14M02k53O0q5l5K72j21oL5j12K93n39L34J18m27M78m15
$$ -184 157 -96 72 -87 -201 201 -52 8 -77 -112 160 39 33 68 -44 249 -290 44 162 -265 213 -202
6768b02K43L1k37M38l25P3M7k14K89r5j39P0J8J3l6J31J8k31K30l15L10j05r0
$$ -202 41 72 -165 273 -52 21 68 -146 143 48 -91 -21 -3 10 -26 105 123 -108 122 -193 117 12 -78
6791g8K62j95P6L7j36O9q2L8O4j15K82k44k05K42j59M16l76K25L5j79J72m02L97
$$ -78 184 -11 65 102 -34 35 -47 -9 55 -60 222 -22 -227 15 -144 272 -104 121 156 -23 149 -253 144
6814A44k4p3O0j84k4J30p9K70l9j47J97k73J34p3k81M14l15K10j5O7qj32R6j3
$$ 144 120 47 107 -77 -101 29 -50 220 181 34 231 -42 92 19 -262 152 -163 47 32 99 91 -41 55 42
6838D2l4J77k09K00q9j07M0r2J11on2q5mM22l30L7l4m5K2J53j33k7Mk5P7Lj8j86
$$ 42 8 185 -24 176 87 -20 20 -72 39 33 -19 -104 -108 314 -16 21 -13 -58 -36 117 -16 -43 -39 -64 13 16 -2 -188
6866a88L77l10nJ68o1M7M6k20R2J81Km9j64L87m16J13p8J63K2j44R6j5O9j54%
$$ -188 189 -121 -126 42 -19 28 74 -146 -54 127 129 80 -84 303 -113 0 -78 85 107 -37 59 44 113 -41 -41
6891d1O7r7J23p7q4K56l23J20J48k15K1K7J42o2q1K34j91r1J81j37J63j20K0J34
$$ -41 26 -71 52 -25 -109 147 -176 -56 92 -123 -102 -75 67 5 -76 158 -33 -124 57 -80 83 -37 -17 117
6915A17j40R3q8j13K05k46K09j01q8J58L2J26r2j6r8J0P5j67J76o6j70K08l4l8
$$ 117 -23 70 -18 -131 74 -172 37 -64 -152 6 38 164 72 56 -42 -32 43 -124 52 -14 -184 24 -10 -48
6939d8J37p4Q8j15r0J83r8kj42K34J21j99q9j4L9K14l14K09j46K18M2k00K25l44
$$ -48 89 15 103 -12 -102 81 -17 -19 -161 73 194 -5 -94 -108 -69 145 -169 40 -106 112 154 -46 179 -165
6963a65J91j30N6M2J20k05K32l10L44k56l2K29k41J89j89J81M2l67M20k09M1J91
$$ -165 26 -104 -48 -6 114 -91 141 -169 175 -81 -113 116 -125 64 -125 56 98 -269 151 -58 -17 174
6985A74q3j5j34q9K01o4P1j29O6o4J14Q1j91K3J16j0M1O8k29M7o2O3j02J20n2
$$ 174 91 76 -58 -147 54 -10 61 -68 -2 -66 48 129 -62 -39 77 67 108 176 -53 -6 -68 -5 -107 13 -39
7010c9l8J91k95K20M5j31K55l00J22r5k3J90j13J95k15r6J43k0p9J42q7O4p5l6
$$ -39 -77 114 -181 39 84 -47 208 -92 30 -65 -88 102 -11 184 -31 -127 16 -4 -83 59 -28 36 -39 -75
7034g5N7j22L89k53J24P1l74L51j48Q5j6k13L31k32J39n8l20L65k07P7J74j58
$$ -75 -18 -140 249 -4 120 191 -183 168 20 105 89 -124 207 -25 114 56 -264 101 -106 -29 145 -13
7056a3M9j93K16j19j02J48J46Q8j43j52J36p9L9k7j18K59k85L31j75j40L54l30
$$ -13 36 -157 59 -60 -162 -14 132 220 77 -75 61 -18 21 -6 -124 135 -150 181 6 -134 220 -110
7078a10K73q6o9K10l89K78j09r9L18l59K97m1k76L45m71N06j85k10L54l40L80
$$ -110 163 77 8 218 -171 107 -2 -101 217 -142 155 114 -162 183 -288 218 33 -177 177 -163 217
7099B17j23j19O0OJ00j46o4M66n10J66J55l82J87p3J61k8k11K23j92K59O2k85
$$ 217 94 -25 35 41 141 -5 -69 397 -113 53 208 -174 13 -60 101 73 -138 85 -107 152 214 -71
7121g1K19k87J00P7j35K85k47J67j74p5M23n02K51on0j2o6K36k7k37L51l47J31
$$ -71 148 -139 -39 38 -97 188 -59 108 -66 -141 282 -220 31 25 -25 -37 -103 133 106 -131 220 -127 4
7144DM0k18L76l12K35k68j6M48m11K78j37jL54n33K9J83j29K49m76L64N4j56L43
$$ 4 44 -174 202 -110 125 -143 -159 289 -122 156 19 18 372 -161 -132 51 -78 171 -305 59 113 -43 300
7167C00m35M51m57L3J76k12L15l15j44N89l55J35j69o8M70o39M53o0j31L45m99
$$ 300 -135 316 -141 -108 68 -144 171 -144 -288 301 -54 81 -88 -156 314 -325 128 68 -63 282 -217
7188b17K76R2k31L57m03K01L7j73K12k70R6j51O9K91m58M00J7j49K52l93K26j07
$$ -217 59 151 -80 277 -126 75 112 -61 151 -119 -23 -174 -105 186 -272 128 145 -4 248 -145 81 -26
7210b6l4K01l24L38j21j59L44k71K33j72j95L70l88K98J6l73N05m47K85K20m29
$$ -26 -60 141 -183 155 34 -125 219 -52 181 9 -186 184 -204 94 110 -263 242 -205 80 300 -129
7231a29K53k34K84j44m0L3k36L33nk27K00r7K28k46j46L09j17no7O6J8j43K06
$$ -129 124 -110 174 30 -10 23 -213 120 115 -112 88 -9 219 -27 -173 136 19 14 -53 13 31 -112 94
7254I4j8j63J94l73M01N0j25R0l05J15j2p0J98k01K43m4j54L28k99M3j3j68L62
$$ 94 76 -87 107 -266 135 185 60 150 -155 -40 -52 -122 76 -125 118 74 -80 248 -51 -8 -21 -189 173
7277A73l57K21Jj0o7p0J41P1k39K20k23J16K7L7O4k41J6mK1K18j76O4j01J7L10
$$ 173 -184 37 38 28 -39 -109 32 103 -136 84 -139 -23 4 41 105 -136 -120 -124 -103 115 -61 3 -98 -81 229
7302B29m47K52J72p9k1k61J03J46rJ72l01R0q1j19K07L9j36N6k26M34l01J36N5
$$ 229 -218 34 206 127 106 -155 -52 94 85 257 -44 46 -35 -154 53 92 -44 12 -214 220 -81 55 110
7325A10k09K14j80J27N4j12qj68P9om1J72j37K44k15mJ22j22K08mj79K45j65j89
$$ 110 -99 115 -65 62 116 4 -4 -172 -93 -99 -140 32 -105 139 -76 -80 42 -80 128 124 -55 190 25 -164
7349a64J30M2J65k53J21J75j53j93N6K3O1p6K3J50rm8k39J32K4j03K28m8o1N5
$$ -164 -34 8 173 -80 41 216 63 -130 -74 -51 10 -66 -43 107 98 50 -189 -57 -33 -136 92 44 -17 38
7373C8j39R2J61k17J16q9J34j68j6J31O5k20P2J81j40J69l53J65M8l8n9J50j4
$$ 38 -101 -9 152 -65 51 -38 96 -72 -88 43 108 -112 -40 141 1 170 -183 -18 30 -8 -67 83 69
7396F9lj02jK03q8n4k13K83n5j19J37o3qj14J22k6l0P9k0M8ol4P3j74J07j31J23
$$ 69 66 -36 -37 166 78 24 -189 94 39 -80 57 -6 -14 -128 -6 -32 -62 17 -3 45 39 5 78 -96 11 -120 3
7423Cj00N8k8J4J54j65L4j3O7k1K01l83J80Km5nM1n3J38l8j7J83l84L05j93Q2
$$ 3 -97 -39 -67 -53 101 -64 -30 -43 24 3 204 -179 1 3 -42 -47 -6 -59 79 41 24 207 -177 128 -65 17
7449A7%r6J17J15q8j23JR7kq7L0j3J95j95P0J30m9j72J84L9k52n8J76j49M2J23
$$ 17 17 -79 38 153 65 -58 -57 40 38 -49 -19 -32 163 -32 38 168 119 -53 131 170 -82 -140 36 -113 -71 52
7475E2q8Q1J0j63J62j13L6k4J09k45J63N5l5J8l8%J26rR0j48k5j80J90J01j65
$$ 52 -36 45 55 -108 54 -59 -23 -47 62 -183 -20 35 0 18 -20 -20 106 97 187 39 14 -166 24 125 -40
7500d0K9p9J59R6j87N1j00j0Q8M2J1l1p2k2L1K8Lr1J8KL9L3k9J17R1k95J30j68
$$ -40 -11 -90 69 165 -22 29 -71 -81 7 49 60 29 -43 -65 -34 -6 -3 -94 -76 -74 -35 -2 -31 86 177 -118 12 -156
7528a56J67Rp7K09k22J96r3J89Ml06J44K2j68Q2j75K29r8J06J62o8j19lj54J67
$$ -156 11 20 -57 152 -70 126 33 222 226 -80 64 86 -82 0 -175 54 -44 62 224 156 37 34 -120 47
7552D7j50J49nj5Jj07L07j19n8j21j23K03j30P6P1j13PO5J1J57l63L67p2j73Q0
$$ 47 -103 46 41 26 27 -80 227 108 50 -71 -194 9 -121 -45 26 -87 -80 -15 -4 153 -210 157 85 -88 -8
7577ho3R8P3j53J1j36K34n2P0j52j10K56j64k7J04j51K19j15j3K51p4R1l47K00
$$ -8 -71 27 100 -53 -42 -178 56 4 74 -78 -188 68 -96 -123 -19 -170 49 -66 -79 172 98 189 -158 42
7601D2K30l83J58l6N7M9l94M10q2k4L9k24K42j17oR4m2J92j55q0K44l10K18j76
$$ 42 272 -111 47 11 68 117 -277 133 51 27 66 -158 84 -33 -39 55 13 205 50 -30 214 -96 122 -54
7625e4O2L3r2J26k03L23j17l30L78l36L19N2l41K91LPp3j6K1o5j40O8O4L07k27
$$ -54 8 41 -51 75 -128 195 78 -252 126 -210 109 161 -180 111 114 121 48 32 53 -12 -152 -84 -20 287 60
7650F0K3O8l85M15l37J78mo6J13o2m6R9k7R6k40J05J32p9O5l04K45R8k10J80k21
$$ 60 83 151 -234 181 -156 22 18 -48 65 3 -43 56 29 125 -115 -10 122 43 108 -196 49 147 -63 117 -104
7675a04K01mk07J63r0J01n2j15L38k64m5J78k60K10q0q2J33K8j02N0l2P7r5R9
$$ -104 97 93 -114 49 -41 60 8 -107 231 -33 -78 100 -160 50 -30 -112 21 49 -53 -3 -35 42 -53 46
7699D6Mq6K9j11J26k56J96J05q4K8k19J05J85j12K19k92J16K52l87L10k47P8J60
$$ 46 50 -36 -7 -118 8 -248 -52 53 -31 -3 -222 -117 68 -44 175 -117 -1 251 -136 174 -73 5 165
7722A65k59K46l82J97L5pJ50l82K79l3j56L68k00J23j76N9J45j32J7Q0k49L22
$$ 165 -94 152 -230 -33 2 -5 145 -237 42 9 -147 221 21 144 -32 27 172 40 57 137 -112 210
7744B10j68j00J09j74P8p0J23N7k05K58k79J85L2j30O3m3N6J63j49m4K2o8Jj87
$$ 210 42 -58 51 -123 -45 -115 8 65 -140 118 -161 24 56 -74 -11 -54 2 165 16 -28 -6 -74 -73 -260
7768b60L28j64J64J12k60L77j91j46l6K1J59k01J94j24j79J95p1n1J87p4K31j91
$$ -260 68 -96 68 180 -80 297 106 -40 -76 -55 104 -97 97 -27 -206 -11 -82 -133 54 -20 211 20
7790B0Q8r9l02M60k30o8R0M1J26k37j9K30o4j85J40M2j46MJ86j99J46m9j15K22
$$ 20 108 9 -293 167 -63 -131 -41 0 126 -111 -130 100 36 -149 -9 33 -113 -109 77 -122 24 -25 -140 82
7814H2j38J46j75L2J15j10n2M7J16P9j55J8K1j5O6n6m0N0j42P6j51L27k11J2n
$$ 82 -56 90 -85 -53 62 -48 -100 -53 63 142 -13 5 26 11 77 21 -19 31 -111 -35 -186 141 -70 -58 -63
7839f3J3n6R2r7L6n0R9O3j19K01k64P3K52r0m7ro7J17q2Kr1o8J94k0J2Rr2j0R3
$$ -63 -50 -106 -14 -111 -75 -125 -26 37 -82 119 -145 -72 180 90 43 34 -33 84 2 4 -87 -155 39 19 31 40 -52 -62 31
7868C1Q4m7q9j31M1k9J55L0K00k86j5j40Q1K34l9j57jJ60j08J71j59P4N5q8j84
$$ 31 115 68 -21 -152 -111 -140 15 45 245 -41 -56 -196 -115 119 80 -77 -78 82 -26 145 -14 60 115 27 -157
7893a57L59k33J55k50L5K01M8l30K15p6L2p6p1J96P5j27j71J18MJ95l20Q1J91
$$ -157 202 -31 124 -126 -91 110 158 -172 43 -33 -1 -77 -148 48 123 -4 -175 -57 -53 142 -178 -97 94
7916I4j98J61j37j16R4P4J19o4L6m9K1j24K0K30k21J57nj5k5o6R6J0J6j08n8J18
$$ 94 -104 57 -80 -196 -102 -28 91 27 63 14 35 -89 -69 161 -60 97 92 77 52 -14 82 92 108 0 -58 60
7942F0k66K58k8j38K26k42J8O9J19L5O5k89J85j04R0j71J80M7j34J3N4j26K7J55
$$ 60 -206 52 24 -114 112 -130 -112 -43 76 111 176 -113 72 -32 58 -113 67 114 -20 -7 47 -79 -52 103
7966A03o5O0j83J96O0j57n8J18j41j4J66l00K77m4k42L60k69J51j37Q9O2k4J5
$$ 103 38 98 -85 111 171 14 -44 74 -67 -81 85 -215 62 18 -224 136 -133 18 -119 -30 32 8 23
7989B3K0m2K1q4J19p3K4J00l80M79j42k4K0m2K6K5r9L3j01J44q1m8K00r8J10o
$$ 23 43 1 22 -62 57 -16 8 108 -272 207 65 41 61 19 45 70 -29 4 -97 47 -34 -82 118 20 130 124
8015A24k65J32j33J76j32J54R1j99J01k4l6j00N7N6O2n9qP6L2j49J42j15L8M8
$$ 124 -141 -9 -142 34 -98 56 147 -52 49 25 -11 -111 -54 2 64 5 -3 73 105 -44 98 -17 21 69
8039F9j06MQ0j80J53Nj23R7q8J74L9m0j29JJ4j70J93l2N3m2L1m4R4OJ38j73q1
$$ 69 -37 -33 47 -133 20 25 -98 -1 -89 85 124 84 -45 -44 -30 -200 -7 -39 14 -28 3 -41 53 59 197 24 -57
8066e7O3r2L47l93K33Jk54J80k8j22K91j87K51m77M18j65N5l4n3J84j73K4l0J24
$$ -57 6 -86 261 -132 101 102 -152 28 0 -122 169 -18 233 -244 174 9 64 30 -23 161 -12 12 -18 106
8090A06q1K3j3J30k94K46k72K17K9q1j65K15j08n2R1o0J02m4K42k37P9j87J9K58
$$ 106 25 48 35 165 -129 117 -155 62 91 10 -155 60 -48 -100 -9 -69 33 -11 231 -6 73 -114 -95 163
8114A63k36K7J52k10J12p5L20k69l2J62l14K28J7j75J93k4l5o1q9J44N0j05J47
$$ 163 -73 -46 106 -104 8 -67 253 -16 -48 114 -200 28 45 -130 63 39 4 -57 -146 -2 48 -57 90
8137I0l0j12j84L32J36m18K18k10K69p5j27R4k36L42j2j86L83k87K9J5l6J52j44
$$ 90 60 -52 -236 96 232 -186 32 -178 91 16 -111 -17 -253 89 77 -109 274 -13 16 31 -5 147 3
8160CK4pK7l5J4O7N7j85J41k90J94Q5k5j6j88J73r5P3l6q1M4o8J75m5m2r3jM8
$$ 3 27 20 47 12 26 93 150 -35 106 -184 10 95 70 54 -134 39 -56 17 -19 -100 -56 -124 51 6 -36 -129 -130 -82
8188h2R3q2J41
$$ -82 11 -71 70
8191G0
$$ Imaginary data points
##PAGE= N=2
##DATA TABLE= (X++(I..I)), XYDATA
0@%%%%%%%%Qj6J6j6K4l2L9m7N6p2Q8j04J20j40J64j92K24k56K93l37L85m41N01
$$ 0 0 0 0 0 0 0 0 0 8 -8 8 -8 16 -16 23 -24 32 -40 48 -56 64 -76 88 -104 120 -136 157 -180 205 -236 265
31B65n65O37p15Q03q99J004j118J242j376J522j684J860k051K259k488K737l008
$$ 265 -300 337 -378 425 -474 530 -588 654 -722 800 -884 976 -1075 1184 -1304 1433 -1575
48a575L309l640M001m402M854n362N933o585P336q211R243j0478J1990j3880J6303
$$ -1575 1734 -1906 2095 -2307 2547 -2815 3118 -3467 3869 -4342 4901 -5577 6413 -7467 8836
63H836j9520K3976l0503M0842n9333J00813l16489j8606O68176p01039O11345
$$ 8836 -10684 13292 -17211 23631 -35702 65111 -251378 -269984 398192 -302847 308498
74C08498n70906K06963M09835o79466N07233l44719K45594O6941l90808L38425
$$ 308498 -262408 -55445 354390 -325076 182157 -162562 83032 149973 -240835 97590
84I7590j41209J98051k66178L531K55964j41109l284j73506L07683o5183j80188
$$ 97590 -43619 154432 -111746 -108215 147749 6640 3356 -170150 137533 72350 -107838
95a07838R3183J2311J12673j68345P832L3489J30586j38929o1263J25885p0202
$$ -107838 -14655 -2344 110329 -58016 -50184 -16695 113891 -25038 -86301 39584 -30618
106c0618K18179m21276K45408J72095l43991L06250l92216M41143j09203l66665
$$ -30618 187561 -233715 11693 183788 -160203 146047 -246169 194974 85771 -280894
116b80894N28818m45903L89274k36477j51027M69933m70310L67324l17822J06852
$$ -280894 247924 -197979 191295 -45182 -196209 273724 -196586 170738 -147084 -40232
126d0232K84386m73909L48141k42303K47979o8992k91600M41960l01017J79825
$$ -40232 244154 -229755 118386 -123917 124062 55070 -236530 205430 -95587 84238
136H4238j41710l5269K91114l36110J93996j02519L6855J31953k46009J32556
$$ 84238 -57472 -92741 198373 -137737 56259 -46260 -9405 122548 -123461 9095
146I095J7835L636m3909m9115Q7679N4255j36080p170J56703j34559Q9608j16845
$$ 9095 26930 30566 -13343 -62458 25221 79476 -56604 -63774 92929 -41630 47978 -68867
158f8867N5307J37973k54105K10670j48852R1774P2352k62352K79935j70155J12874
$$ -68867 -13560 124413 -129692 80978 -67874 23900 96252 -166100 113835 -56320 56554
169E6554o2937j12752K94114k84004J57347q9269K7686J37370k92630K86049j80838
$$ 56554 -6383 -119135 174979 -109025 48322 -40947 -13261 124109 -168521 117528 -63310
180f3310Q3927M5438k20493L06750k40034J28946l0371j16350K68536k73830J33966
$$ -63310 20617 66055 -154438 152312 -87722 41224 10853 -105497 163039 -110791 23175
191B3175j2512m1301J14686j90619J56964l7715l2360L3906m7136O8511m4077
$$ 23175 10663 -30638 84048 -106571 50393 12678 -19682 14224 -32912 35599 -8478
202h478J1666k9418N0171j8053j9100J8902l6293R5117j11917M5131K3842m1715
$$ -8478 3188 -26230 23941 5888 -13212 5690 -30603 64514 -47403 -2272 21570 -20145
214b0145O2427j10862J19845o0005o788M5485q7266J30775j27411P4891j4754
$$ -20145 42282 -68580 51265 -8740 -15528 29957 -57309 73466 -53945 20946 6192
225F192m8653J27066j76451J46128o3919j3836Q5521j59122J86875j28498K4667
$$ 6192 -42461 84605 -91846 54282 -9637 -23473 62048 -97074 89801 -38697 -14030
236a4030O0697j16201J48782j37895P4909L260o0711R6661j10583Q9099m2666
$$ -14030 46667 -69534 79248 -58647 16262 19522 -41189 55472 -55111 33988 -8678
247h678K673K4762n5540Q1635p7614M8317k0377k992L5538o7353P3793n5607L0803
$$ -8678 -6005 18757 -36783 44852 -32762 15555 -4822 -7814 27724 -39629 34164 -21443 9360
260I360l790k7369N2093n9697N4517m2809K0509J1435l9144N4306o1111N8943
$$ 9360 5570 -21799 30294 -29403 25114 -17695 2814 14249 -24895 29411 -31700 27243
272B7243l8098n00L9556o4675P4016o6238L7750M845m4982O9797p4942N9987k8183
$$ 27243 -10855 -11355 28201 -36474 37542 -28696 9054 13899 -31083 38714 -36228 23759 -4424
285d424j0240M2595o2011O5539n1619K4133P884l5039N2000n6264M6235k4047
$$ -4424 -14664 27931 -34080 31459 -20160 3973 11857 -23182 28818 -27446 18789 -5258
297e258l181K7661m3827M8420m0782K3201r29k0040L5064m0806L6242k3453N574
$$ -5258 -8439 19222 -24605 23815 -16967 6234 5305 -14735 20329 -20477 15765 -7688 -2114
310b114J3438k8819L6216l3865K3033o764j0864K4906l1309K8755j8455M265R398
$$ -2114 11324 -17495 18721 -15144 7889 1125 -9739 15167 -16142 12613 -5842 -1577 7821
323G821j9408K3619k1464J4320m370n437J2787j6489J6545j3323O978J351r679
$$ 7821 -11587 12032 -9432 4888 518 -4919 7868 -8621 7924 -5399 1579 2930 -6749
336f749J5153j5917J2360n777k311J0120j5547J5575q920q03Q664j2406J2115
$$ -6749 8404 -7513 4847 -930 -3241 6879 -8668 6907 -2013 -2816 5848 -6558 5557
349E557q690J800O777j2812J3200p838l66P582j1128J1847j0287N085M626j4444
$$ 5557 -3133 -1333 5444 -7368 5832 -2006 -2372 5210 -5918 5929 -4358 727 5353 -9091
363i091J6645j1686O375k021o254J7267k2125J7116o888m183J5107k2501K2566
$$ -9091 7554 -4132 2243 222 -6032 11235 -10890 6226 -662 -4845 10262 -12239 10327
376A0327j6057N021J0755k6108K7984j5049J762M073j0381J9666j8776L808Q536
$$ 10327 -5730 -709 10046 -16062 11922 -3127 -1365 2708 -7673 11993 -6783 -2975 5561
389E561n964j610L440k627N10P488j7726J9334j3585O871P877l3603M7562l0875
$$ 5561 -403 -2013 1427 -1200 -690 6798 -10928 8406 -5179 1692 9569 -24034 23528 -7347
403g347K391J2342k2744M3841n4882L2947L419k5389L7253n1055N2221l0172J591
$$ -7347 -4956 7386 -15358 28483 -26399 6548 9967 -15422 21831 -29224 22997 -7175 -5584
416e584K3627n4091P7821o3640J9316J5322l7277P1049r5301O3707O907n4349
$$ -5584 18043 -36048 41773 -21867 -2551 12771 -24506 46543 -48758 14949 21856 -32493
428c2493O5679p2204O7796k3965l5961O3756o0034M9556k3328k1484M3245k4249
$$ -32493 33186 -39018 28778 4813 -31148 32608 -27426 22130 -1198 -22682 20563 -3686
440c686R210k0291J4432J9480k3485j5639K9581O313k9629J3605r137L0481k7013
$$ -3686 5524 -14767 -335 19145 -4340 -19979 9602 15915 -13714 -109 -9246 21235 -5778
453e778q537K7343k6202M2087n6010K4906J8625k5391L2674p9806J02509l9977
$$ -5778 -14315 13028 -13174 28913 -27097 -2191 16434 -8957 23717 -56089 46420 6443
465F443m2870O9433p8784J14383j10542J7425Q7838j27779J29471j18093N0998
$$ 6443 -36427 33006 -45778 68605 -41937 -24512 63326 -64453 65018 -53075 -2077
476b077O2051j29738J26289j11007Q2659J1257j19019J31218p1015M5073m2058
$$ -2077 59974 -69764 56525 -54482 28177 39434 -79585 51633 -19382 25691 -16367
487a6367j9825R8924r2886L3648j9022K6739J3048n8557M5890k1737L4706k6558
$$ -16367 -36192 62732 -30154 3494 -15528 11211 24259 -34298 11592 -10145 24561 -1997
499a997l0561M9862l55j8966k4567L0274K1907j8232n7011P2412N760o0800N6472
$$ -1997 -32558 17304 16949 -2017 -26584 3690 25597 7365 -49646 22766 28526 -32274 24198
512B4198p3765J04015n1127o3175J26276j32134J36163r2858m6191J73133j75839
$$ 24198 -49567 54448 3321 -59854 66422 -65712 70451 -22407 -68598 104535 -71304
523g1304J21402r6053L2218J14994k12906J63156o9590L1794J6582j17944J68955
$$ -71304 50098 -45955 -13737 101257 -111649 51507 -18083 13711 30293 -87651 81304
534H1304j17732N7681l0679l4037J25616j37441P8525n3439M1821M8302j50852
$$ 81304 -36428 21253 -9426 -43463 82153 -55288 23237 -30202 11619 59921 -90931
545i0931J29442l2655Q48o202n2997J13237o2792k8683L7852m895J1795q794m5757
$$ -90931 38511 5856 6704 502 -52495 60742 -2050 -30733 7119 2224 14019 5225 -40532
558d0532N8196J8060p4618N7399n5817Q2904k4219j12671J65337r8130M4733l4172
$$ -40532 17664 35724 -38894 18505 -37312 45592 21373 -91298 74039 -24091 20642 -13530
570a3530l8656J55636j77346R8029l4979m250R0299j71948J54078q5073M7240
$$ -13530 -52186 103450 -73896 24133 -10846 -15096 75203 -96745 57333 -27740 19500
581A9500J1957j36530K12002j51871N6055j3362n0663J71817k18631J20576J225
$$ 19500 31457 -105073 106929 -44942 11113 -2249 -52912 118905 -99726 20850 22075
592B2075n4755R9716j56671J34285k7101m7189N6628p5507R2106l3179m6325L5512
$$ 22075 -32680 67036 -89635 44650 17549 -29640 26988 -48519 43587 10408 -35917 -405
604d05J9741p090l2623M263L3184J5530q0054N3889Q257j5704J4615o2354R0537
$$ -405 19336 12246 -20377 -16114 17070 32600 -47454 6435 14692 -1012 13603 -48751 41786
617D1786m6481K400P70l1643J00491j11756N0937j3907R465N1053j47108J55879
$$ 41786 -4695 -2295 -1525 -33168 67323 -44433 6504 -7403 2062 53115 -93993 61886
629F1886p1671J860L8642j13265J83618j53079M5425M2554j02778J63953j71305
$$ 61886 -9785 -7925 30717 -82548 101070 -52009 -6584 35970 -66808 97145 -74160
640g4160Q0854K9001p9665J07168j40774J14519r403p2276P2322o0541P6631n7895
$$ -74160 6694 35695 -43970 63198 -77576 36943 27540 -44736 27586 -32955 43676 -14219
652a4219j1307N0052l1576K2274l9168K8147O654p683j1892m092L2605j9240l393
$$ -14219 -25526 24526 -7050 15224 -23944 4203 10857 3174 -8718 -12810 19795 555 -2838
665b838j9093M5623j7889k2928K1243j5253M8252p1934L7719J3172l6852N8944
$$ -2838 -21931 23692 5803 -17125 4118 -11135 37117 -34817 2902 16074 -20778 38166
677C8166r1029Q5023k6216l2680O5565r7498J16157p3744j2200P1008q8901J02213
$$ 38166 -52863 32160 5944 -26736 38829 -58669 57488 -16256 -28456 42552 -46349 55864
689E5864r9231M1361M2468q7129Q9616q5295O6315j1145m8937P3020p3036P0695
$$ 55864 -43367 -2006 40462 -46667 42949 -42346 23969 12824 -36113 36907 -36129 34566
701C4566m7625m238M5879n3522N3034n6883L6964Q974l8981L7091l2817L6665
$$ 34566 -13059 -17297 28582 -24940 28094 -28789 8175 17149 -21832 15259 -17558 19107
713A9107k4385l513J6461j1407J3415k3687K3324j6330J8033j6531n949L3323
$$ 19107 -5278 -8791 7670 -3737 9678 -14009 9315 -7015 11018 -5513 -11462 21861
725B1861m3090M1975m0455K4011J5937n3611O4743n7005M1674j1783l1598O4300
$$ 21861 -21229 20746 -19709 4302 20239 -33372 31371 -25634 16040 4257 -27341 36959
737C6959o9933N7948l6055K27M0407o4643O6184n4669L2502M388m3337O3581o2317
$$ 36959 -32974 24974 -11081 -10854 29553 -35090 31094 -23575 8927 13315 -30022 33559 -28758
750b8758M9702k6476r198M3294n8624N4963m1122J8646J0532l4931M4598m2514
$$ -28758 20944 -5532 -14730 28564 -30060 24903 -16219 2427 12959 -21972 22626 -19888
762a9888L4324j8429l032K0793l0477L4974l4846K5463q058r376K3052l3588L8401
$$ -19888 14436 -3993 -7025 13768 -16709 18265 -16581 8882 824 -8552 14500 -19088 19313
775A9313l2270J6355K370j9710L3865m0817L6499k2201K814J7527l5037M3944
$$ 19313 -12957 3398 5768 -13942 19923 -20894 15605 -6596 -3782 13745 -21292 22652
787B2652m0110K5412m402j8373L7424m5643L9989k3715K354J8823l5037M1296
$$ 22652 -17458 7954 3552 -14821 22603 -23040 16949 -6766 -4412 14411 -20626 20670
799B0670l5783K1550l128j4928K8386l4956L3398k3672Q076R766k4930L3651l3755
$$ 20670 -15113 6437 3309 -11619 16767 -18189 15209 -8463 -387 9379 -15551 18100 -15655
812a5655K5276j0480p325K3192l2296L1918k3021R245N539j8060K6149k7706K2108
$$ -15655 9621 -859 -8184 15008 -17288 14630 -8391 854 6393 -11667 14482 -13224 8884
825H884j1552m97J1560k0504K5555k4624J6596l382j0593K1187k6060K4593j6824
$$ 8884 -2668 -3165 8395 -12109 13446 -11178 5418 2036 -8557 12630 -13430 11163 -5661
838e661L713J0792k1431K4422k0328J2458l022p109J6038k0362J8475j1981M023
$$ -5661 -1948 8844 -12587 11835 -8493 3965 943 -6166 9872 -10490 7985 -3996 27
851B7L480j0600J7153k0009J6272o508m606J2574j7082J8489j5366O027O666j5630
$$ 27 3507 -7093 10060 -9949 6323 -185 -4791 7783 -9299 9190 -6176 -149 6517 -9113
865i113J7174j3305P535j273n361J1008j2620R217k891k014K576j871L816o496
$$ -9113 8061 -5244 2291 1018 -4343 6665 -5955 3262 371 -1643 933 -938 2878 -3618
879c618N344j063m22j927J753L555q479Q045m096P63J054l279O502r423R099l478
$$ -3618 1726 663 241 -1686 67 3622 -4857 3188 -908 -145 909 -2370 4132 -5291 3808 330
895C30m693Q399o432O129r282P524L179j3308J3822q866N978k635o249J5902j8369
$$ 330 -4363 4036 -2396 3733 -5549 1975 5154 -8154 5668 -3198 2780 145 -6104 9798 -8571
910h571J2212m17j2607K0114j7355Q469p87q282K1619k7270J3447R059j9726J8187
$$ -8571 3641 3224 -9383 10731 -6624 1845 1058 -7224 14395 -12875 572 9631 -10095 8092
924H092j6632J3615N0j8568K6535k0607Q960M311j6500K0570j6049J1368o835
$$ 8092 -8540 5075 5125 -13443 13092 -7515 1445 5756 -10744 9826 -6223 5145 -1690
937a690p245K4714k5371R440Q34l87P944k4686K7427r630q691J5890j9936K1450
$$ -1690 -8935 15779 -9592 -152 682 295 8239 -16447 10980 1350 -7341 8549 -11387 10063
951A0063j1443n050J5395k0660K3633j2076j5248L1106j9504K645P16p642K7726
$$ 10063 -1380 -6430 8965 -11695 11938 -138 -15386 15720 -3784 -1139 -423 -8065 19661
964A9661l3361P934K2069l0134K5776k0771N731J9363l4179L2034k5342J1825
$$ 19661 -13700 -5766 16303 -13831 11945 -8826 -3095 16268 -17911 14123 -11219 606
976F06J7947m4088L9501j8802J1177n021k4045N3896m7610J7664J254j3292L7603
$$ 606 18553 -25535 13966 -4836 6341 1320 -22725 31171 -16439 1225 2479 -10813 26790
989B6790n6516M4501j3991j2586L8490o0916N3607j5911j5488K7662m3559N7634
$$ 26790 -29726 14775 784 -11802 26688 -34228 19379 3468 -12020 15642 -27917 29717
1001B9717l3795j8766M4905l2574K0962j9323L18L0069l4100J1641M631j0991
$$ 29717 -4078 -22844 22061 -10513 10449 -8874 -8556 21513 -12587 -946 3685 -7306
1013g306K1484k1461k753K2999j6657R242j7735J1016K4872m6007K6358m168N001
$$ -7306 14178 -7283 -10036 12963 -3694 5548 -12187 -1171 23701 -22306 4052 -116 4885
1026D885L615l7444N6469l8289J1815P244l6290O6873o3863L0389m1k8793P0994
$$ 4885 8500 -28944 27525 -10764 1051 8295 -27995 38878 -24985 5404 5363 -23430 47564
1039D7564r3031N6892N395m0012N4021p4768P5680k5403l8143O2675n7569N1427
$$ 47564 -45467 11425 16820 -23192 30829 -43939 31741 6338 -31805 30870 -26699 24728
1051B4728l1201j1865M2720m1166L3300l0274P741K7283l2535J0311n506J8246
$$ 24728 -6473 -18338 24382 -16784 16516 -13758 -6017 21266 -11269 -958 -6464 11782
1063A1782p009k2187K2218M074j1809j75k289J2471O86k3934K5937j5828J1152
$$ 11782 4773 -17414 4804 8878 -2931 -3106 -5395 7076 7762 -16172 9765 -6063 5089
1076E089O000m3227O0656l6235M001J3370l9444P6360p6311K4023L0717n5016
$$ 5089 11089 -32138 28518 -7717 -3716 9654 -29790 46570 -29741 -5718 24999 -30017
1088c0017O8740p6377M8882R685n5002O9676p1457N7091j1582l9120N7327n3429
$$ -30017 38723 -37654 11228 20913 -34089 35587 -35870 21221 9639 -29481 27846 -25583
1100b5583N3229m0426m783M8491n2541L7300l3431K3361J2123m3431M2238k6666
$$ -25583 27646 -12780 -17563 30928 -21613 15687 -17744 5617 17740 -25691 16547 -10119
1112a0119J7224j172k4101L1350j5299L439j927r008K1604p675k0483K4095n137
$$ -10119 7105 5933 -18168 13182 -2117 1322 -605 -9613 11991 4316 -16167 7928 2791
1125B791n206P828k4383M0978k7420o544K9960m0245M7942l9567N192L0716m6365
$$ 2791 -2415 5413 -18970 22008 -5412 -11956 18004 -22241 25701 -13866 -8674 22042 -24323
1138b4323N1472n1427K7865J8035n1172N4695m8732M1274j3497l1655O0374n8654
$$ -24323 27149 -24278 3587 21622 -29550 25145 -23587 17687 4190 -27465 32909 -25745
1150b5745M4849k6301o907M4111n9340N0590l3857R604K5808n1793M8152k8532
$$ -25745 19104 -7197 -14104 30007 -29333 21257 -12600 -2996 22812 -28981 19171 -9361
1162i361J2830M660k9121M0786k6444N131L536p252J4632j4547K326N215Kn012
$$ -9361 3469 8129 -20992 19794 -6650 -1519 2017 -5235 9397 -5150 -2824 2391 2393 -2619
1176b619M855p908J0983j184j6256K2881j8451J5431j0296q201K9855l5338K6591
$$ -2619 2236 -5672 5311 4127 -12129 10752 -7699 7732 -2564 -10765 19090 -16248 10343
1189A0343j6671L921J8418l8698M1835l1249J6324M989l1851M8282m4867K9638
$$ 10343 -6328 -2407 16011 -22687 19148 -12101 4223 9212 -22639 25643 -19224 10414
1201A0414r715j7071M4323n3683M0477j8180m269K7902m6362M6016k7403N382
$$ 10414 699 -16372 27951 -25732 14745 -3435 -7704 20198 -26164 19852 -7551 -2169
1213b169J2692k8350L6169k9729J4558j276q686J8464k3015J7904r983N965j617
$$ -2169 10523 -17827 18342 -11387 3171 1895 -6791 11673 -11342 6562 -3421 2544 927
1226I27p129J3781j3844J2621j3158J0199j310p784J3112j7227K0751j7926P441
$$ 927 -6202 7579 -6265 6356 -6802 3397 2087 -5697 7415 -9812 10939 -6987 454
1239D54M349j4371K3678k8920K4151j0549m869J8942l0888L5193k6637Q911R355
$$ 454 4803 -9568 14110 -14810 9341 -1208 -6077 12865 -18023 17170 -9467 -556 8799
1252H799k4329L4792l5578K4056n472j2748K6879l4841L2716k0158K878J3370
$$ 8799 -15530 19262 -16316 7740 2268 -10480 16399 -18442 14274 -5884 -3006 10364
1264A0364k5745L1827k8477J6381j432j1573K1452k6218K3450j4333L496O106
$$ 10364 -15381 16446 -12031 4350 2918 -8655 12797 -13421 10029 -4304 -808 5298
1276E298j4300J9707k0338J6415r860J311Q790j7724K2088k0758J5007n091p919
$$ 5298 -9002 10705 -9633 6782 -3078 -1767 7023 -10701 11387 -9371 5636 545 -7374
1289g374J9115k4400K2943j6035N284P275j7501K2609k1834J5992o917l721J3600
$$ -7374 11741 -12659 10284 -5751 -467 6808 -10693 11916 -9918 6074 -843 -4564 9036
1302I036k0638K2839j9288J0537J381j3341K2126k5291K1471j0805l395J5832
$$ 9036 -11602 11237 -8051 2486 3867 -9474 12652 -12639 8832 -1973 -5368 10464
1314A0464k2717K3091j7580P825L416j3039J8677j8989J4599q009Q30O665j3608
$$ 10464 -12253 10838 -6742 1083 4499 -8540 10137 -8852 5747 -2262 -1432 5233 -8375
1327h375J8123j7939J2616m166n089J3384j9222K0202j4592M014P089j4769J7756
$$ -8375 9748 -8191 4425 259 -4830 8554 -10668 9534 -5058 -1044 6045 -8724 9032
1340I032j6618J1981m291m574J1589j4706J3801j0707O830j011o815J3764j6603
$$ 9032 -7586 4395 104 -4470 7119 -7587 6214 -4493 2337 1326 -5489 8275 -8328
1353h328J4231q622J562O641j4264J8317j6096Q035J568q835J3152j4819J3159
$$ -8328 5903 -2719 -1157 5484 -8780 9537 -6559 1476 3044 -5791 7361 -7458 5701
1366E701p343j261Q496j1714J1421r370O656k309m633J0908j2523J0083o341K289
$$ 5701 -1642 -2903 5593 -6121 5300 -4070 2586 277 -4356 6552 -5971 4112 -2229 60
1380F0K914q806J2666j1373N471P24m633O407p642Q090n606N08L713m226K809
$$ 60 2974 -5832 6834 -4539 932 1656 -2977 3430 -4212 3878 -1728 -1220 2493 -1733 1076
1395A076l386O082o614K958J597l967N056p530R903p843P08P638j2520J2165q188
$$ 1076 -2310 3772 -2842 116 1713 -2254 2802 -4728 5175 -2668 -1960 5678 -6842 5323 -2865
1410b865L812J269q397J4766j4758O887K204o829Q687j0847J1545o795k094R067
$$ -2865 947 2216 -6181 8585 -6173 714 2918 -3911 4776 -6071 5474 -1321 -3415 5652
1424E652j0815R132o512L158J496p745J2980j1796L763M744p887P822q415O985
$$ 5652 -5163 3969 -2543 615 2111 -5634 7346 -4450 -687 4057 -3830 3992 -4423 2562
1438B562L36r942J2916o855j622O294p573P298m608j063P878j2159R808n05r303
$$ 2562 2898 -7044 5872 -983 -2605 3689 -3884 3414 -1194 -2257 5621 -6538 3270 2765 -6538
1453f538J2147q207M160j666m479J3168j4890O674L299q128R006r544Q741m248
$$ -6538 5609 -2598 1562 -104 -4583 8585 -6305 369 3668 -4460 4546 -4998 3743 -505
1467e05l508J1248j4578J1057k990l927P480j1534J5675j1726k031J5281j8503
$$ -505 -4013 7235 -7343 3714 724 -3203 4277 -7257 8418 -3308 -5339 9942 -8561
1480h561J3449o834p18J1635k0991K0486r256o402J9147k2771J6192m814n977
$$ -8561 4888 -1946 -2664 8971 -12020 8466 -790 -7192 11955 -10816 5376 562 -5415
1493e415J5564k3113K1777p194j1074J9826j8300J4092q669j886J4740k1161J7570
$$ -5415 10149 -12964 8813 1619 -9455 10371 -7929 6163 -2506 -4392 10348 -10813 6757
1506F757p812l101J1346j5117J4925j1815M621P784j8932J8939q930o32O325j2603
$$ 6757 -1055 -4156 7190 -7927 6998 -4817 -196 7588 -11344 7595 -1335 -1967 4358 -8245
1520h245J8092j4423K31J4146j9380J5439o324n067J5380j9870J6695o259r614
$$ -8245 9847 -4576 -4345 9801 -9579 5860 -464 -5531 9849 -10021 6674 415 -9199
1533i199K4159k6845J4820J523j3172K1143k6298K1627l526j7027K7244k6330
$$ -9199 14960 -11885 2935 4458 -8714 12429 -13869 7758 4232 -12795 14449 -11881
1545a1881J9189p288q276K2073k8564K6095j4512l967K0566k6838K4762j9042
$$ -11881 7308 20 -8256 13817 -14747 11348 -3164 -7131 13435 -13403 11359 -7683
1557g683P299J2113k9247L1358j9565M520Q951k1259K7662k1980O415J0085k0941
$$ -7683 -384 11729 -17518 13840 -5725 -1205 7746 -13513 14149 -7831 -1416 8669 -12272
1570a2272K2855j4290mJ1206j5040J4443r513k893J6646j9454R465K483r937J5279
$$ -12272 10583 -3707 -3711 7495 -7545 6898 -2615 -5508 11138 -8316 1149 3632 -6305 8974
1584H974j8131J2691J278j5104K2030k1791J4430k63j4301K2785k5273K2261r931
$$ 8974 -9157 3534 4812 -10292 11738 -10053 4377 4114 -10187 12598 -12675 9586 -345
$$ [...]
8191D1
##END NTUPLES=NMR FID
##END=
