##TITLE=1H_LR-755-R3-P2
 CCl4
 8 sc, 
 17.1.2023
##JCAMPDX= 6.0         $$ Bruker NMR JCAMP-DX V2.0
##DATA TYPE= NMR FID
##DATA CLASS= NTUPLES
##ORIGIN= UXNMR, Bruker Analytische Messtechnik GmbH
##OWNER= root
$$ XWIN-NMR		Version 3.5
$$ Tue Jan 17 14:21:43 2023 Russian Standard Time (UT+4h)  she@DPX200
##.OBSERVE FREQUENCY= 200.13135
##.OBSERVE NUCLEUS= ^1H
##.DELAY= (6, 6)
##.ACQUISITION MODE= SIMULTANEOUS
##.ACQUISITION SCHEME= undefined
##.AVERAGES= 8
##.DIGITISER RES= 18
##SPECTROMETER/DATA SYSTEM= spect
##.PULSE SEQUENCE= zg30
##.SOLVENT NAME= CDCl3
##.SHIFT REFERENCE= (INTERNAL, CDCl3, 0, 15.7039)
##AUDIT TRAIL= $$ (NUMBER, WHEN, WHO, WHERE, WHAT)
$$ ##TITLE= Audit trail, XWIN-NMR		Version 3.5
$$ ##JCAMPDX= 5.01
$$ ##ORIGIN= Bruker BioSpin GmbH
$$ ##OWNER= she
$$ F:/spectra/data/she/nmr/H-F/1/audita.txt
$$ ##AUDIT TRAIL=  $$ (NUMBER, WHEN, WHO, WHERE, WHAT)
(   1,<2023-01-17 14:20:39.76 +0400>,<she>,<DPX200>,
      <created by zg, POWCHK disabled, PULCHK disabled
       configuration hash MD5:
       00 E9 B6 7A A2 85 ED C7 34 08 36 98 17 FE 4E 26
       data hash MD5: 16K
       FD 85 FF 1A 36 C1 51 ED 94 27 24 B1 0E 75 B5 15>)
$$ ##END=
$$ 
$$ hash MD5
$$ 97 33 1C B8 54 97 B3 77 2A D6 98 0E 59 BB EE 8C
##$RELAX= 
##$RELAX= 
##$RELAX= 
##$RELAX= 
##$RELAX= 
##$RELAX= 
$$ Bruker specific parameters
$$ --------------------------
##$DU= <F:/spectra>
##$EXPNO= 1
##$NAME= <H-F>
##$PROCNO= 1
##$TYPE= <nmr>
##$USER= <she>
##$AMP= (0..31)
100 100 100 100 100 100 100 100 100 100 100 100 100 100 100 100 100 100 
100 100 100 100 100 100 100 100 100 100 100 100 100 100 
##$AQSEQ= 0
##$AQ_mod= 1
##$AUNM= <au_zg>
##$AUTOPOS= <>
##$BF1= 200.13
##$BF2= 200.13
##$BF3= 200.13
##$BF4= 200.13
##$BF5= 200.13
##$BF6= 200.13
##$BF7= 200.13
##$BF8= 200.13
##$BYTORDA= 1
##$CFDGTYP= 0
##$CFRGTYP= 5
##$CHEMSTR= <none>
##$CNST= (0..31)
1 1 145 1 1 1 1 1 1 1 1 1 1 1 1 1 1 1 1 1 1 1 1 1 1 1 1 1 1 1 1 1 
##$CPDPRG= <>
##$CPDPRG1= <>
##$CPDPRG2= <>
##$CPDPRG3= <>
##$CPDPRG4= <mlev>
##$CPDPRG5= <mlev>
##$CPDPRG6= <mlev>
##$CPDPRG7= <mlev>
##$CPDPRG8= <mlev>
##$CPDPRGB= <>
##$CPDPRGT= <>
##$D= (0..31)
0 1.2 0 0 0 0 0 0 0 0.06 0 0.03 0 0 0 0 0.0002 0 0 0 0 0 0 0 0 0 0 0 0 
0 0 0 
##$DATE= 1673950839
##$DBL= (0..7)
120 120 120 120 120 120 120 120 
##$DBP= (0..7)
150 150 150 150 150 150 150 150 
##$DBP07= 0
##$DBPNAM0= <>
##$DBPNAM1= <>
##$DBPNAM2= <>
##$DBPNAM3= <>
##$DBPNAM4= <>
##$DBPNAM5= <>
##$DBPNAM6= <>
##$DBPNAM7= <>
##$DBPOAL= (0..7)
0.5 0.5 0.5 0.5 0.5 0.5 0.5 0.5 
##$DBPOFFS= (0..7)
0 0 0 0 0 0 0 0 
##$DE= 6
##$DECBNUC= <off>
##$DECIM= 32
##$DECNUC= <off>
##$DECSTAT= 4
##$DIGMOD= 1
##$DIGTYP= 9
##$DL= (0..7)
0 120 120 120 120 120 120 120 
##$DP= (0..7)
150 150 150 150 150 150 150 150 
##$DP07= 0
##$DPNAME0= <>
##$DPNAME1= <>
##$DPNAME2= <>
##$DPNAME3= <>
##$DPNAME4= <>
##$DPNAME5= <>
##$DPNAME6= <>
##$DPNAME7= <>
##$DPOAL= (0..7)
0.5 0.5 0.5 0.5 0.5 0.5 0.5 0.5 
##$DPOFFS= (0..7)
0 0 0 0 0 0 0 0 
##$DQDMODE= 0
##$DR= 18
##$DS= 0
##$DSLIST= <SSSSSSSSSSSSSSS>
$$ [...]
##$SUBNAM2= <"">
##$SUBNAM3= <"">
##$SUBNAM4= <"">
##$SUBNAM5= <"">
##$SUBNAM6= <"">
##$SUBNAM7= <"">
##$SUBNAM8= <"">
##$SUBNAM9= <"">
##$SW= 18.05172834244
##$SWIBOX= (0..15)
0 0 2 0 0 0 0 0 0 0 0 0 0 0 0 0 
##$SW_h= 3612.71676300578
##$TD= 16384
##$TD0= 1
##$TE= 0
##$TE2= 300
##$TE3= 300
##$TEG= 300
##$TL= (0..7)
0 120 120 120 120 120 120 120 
##$TP= (0..7)
150 150 150 150 150 150 150 150 
##$TP07= 0
##$TPNAME0= <>
##$TPNAME1= <>
##$TPNAME2= <>
##$TPNAME3= <>
##$TPNAME4= <>
##$TPNAME5= <>
##$TPNAME6= <>
##$TPNAME7= <>
##$TPOAL= (0..7)
0.5 0.5 0.5 0.5 0.5 0.5 0.5 0.5 
##$TPOFFS= (0..7)
0 0 0 0 0 0 0 0 
##$TUNHIN= 0
##$TUNHOUT= 0
##$TUNXOUT= 0
##$USERA1= <user>
##$USERA2= <user>
##$USERA3= <user>
##$USERA4= <user>
##$USERA5= <user>
##$V9= 5
##$VALIST= <valist>
##$VCLIST= <CCCCCCCCCCCCCCC>
##$VD= 0
##$VDLIST= <DDDDDDDDDDDDDDD>
##$VPLIST= <PPPPPPPPPPPPPPP>
##$VTLIST= <TTTTTTTTTTTTTTT>
##$WBST= 1024
##$WBSW= 4
##$XGAIN= (0..3)
0 0 0 0 
##$XL= 0
##$YL= 0
##$YMAX_a= 493691
##$YMIN_a= -613818
##$ZGOPTNS= <>
##$ZL1= 120
##$ZL2= 120
##$ZL3= 120
##$ZL4= 120
##$ABSF1= 10
##$ABSF2= 0
##$ABSG= 5
##$ABSL= 3
##$ALPHA= 0
##$AQORDER= 0
##$ASSFAC= 0
##$ASSFACI= 0
##$ASSFACX= 0
##$ASSWID= 0
##$AUNMP= <proc_1d>
##$AZFE= 0.1
##$AZFW= 0.1
##$BCFW= 1
##$BC_mod= 2
##$BYTORDP= 1
##$COROFFS= 0
##$CY= 11.3945322036743
##$DATMOD= 1
##$DC= 2
##$DFILT= <>
##$DTYPP= 0
##$F1P= 2.36226072786647
##$F2P= -0.459571619588291
##$FCOR= 0.5
##$FTSIZE= 0
##$FT_mod= 4
##$GAMMA= 1
##$GB= 0.15
##$INTBC= 1
##$INTSCL= 1
##$ISEN= 128
##$LB= 0.24
##$LEV0= 0
##$LPBIN= 0
##$MAXI= 10000
##$MC2= 0
##$MEAN= 0
##$ME_mod= 0
##$MI= 1.114404
##$NCOEF= 0
##$NC_proc= 0
##$NLEV= 6
##$NOISF1= 3.799351
##$NOISF2= 2.8
##$NSP= 1
##$NTH_PI= 0
##$NZP= 0
##$OFFSET= 15.70392
##$PC= 1
##$PHC0= -19110.06
##$PHC1= 10.40073
##$PH_mod= 1
##$PKNL= yes
##$PPARMOD= 0
##$PSCAL= 0
##$PSIGN= 0
##$REVERSE= no
##$SF= 200.130013532006
##$SI= 16384
##$SIGF1= 3
##$SIGF2= 2
##$SINO= 400
##$SIOLD= 16384
##$SREGLST= <1H.CDCl3>
##$SSB= 0
##$STSI= 0
##$STSR= 0
##$SW_p= 3612.71676300578
##$SYMM= 0
##$S_DEV= 0
##$TDeff= 0
##$TDoff= 0
##$TI= <>
##$TILT= no
##$TM1= 0
##$TM2= 0
##$TOPLEV= 0
##$USERP1= <user>
##$USERP2= <user>
##$USERP3= <user>
##$USERP4= <user>
##$USERP5= <user>
##$WDW= 1
##$XDIM= 8192
##$YMAX_p= 0
##$YMIN_p= 0
$$ End of Bruker specific parameters
$$ ---------------------------------
##NTUPLES= NMR FID
##VAR_NAME=  TIME,          FID/REAL,        FID/IMAG
##SYMBOL=    X,             R,               I
##VAR_TYPE=  INDEPENDENT,   DEPENDENT,       DEPENDENT
##VAR_FORM=  AFFN,          ASDF,            ASDF
##VAR_DIM=   8192,          8192,            8192
##UNITS=     SECONDS,       ARBITRARY UNITS, ARBITRARY UNITS
##FACTOR=    0.0002768,     1,               1
##FIRST=     0,             0,               0
##LAST=      2.2672688,     0,               0
##MIN=       0,             -613818,         0
##MAX=       2.2672688,     493691,          0
$$ Real data points
##PAGE= N=1
##DATA TABLE= (X++(R..R)), XYDATA
$$ plain form
0 0 0 0 0 0 0 0 0 0 -8 8 -16 16 -24 32 -40 48 -58 72 -92 112 -136 162 -194 232 -273 319 -373 431 -500 574
30 574 -662 755 -859 975 -1103 1246 -1401 1573 -1763 1969 -2195 2441 -2711 3004 -3325 3676
46 3676 -4058 4475 -4934 5435 -5984 6588 -7254 7995 -8816 9736 -10776 11957 -13314
59 -13314 14889 -16743 18965 -21683 25095 -29528 35551 -44283 58311 -86115 253872 -461524
71 -461524 71783 102874 -177853 449565 -613818 338110 34579 -129307 163547 -324073
81 -324073 310572 -26217 -119078 8845 -36900 255453 -237922 -24249 68207 110756 -63109
92 -63109 -188760 195141 19586 -43542 -86933 32071 111051 -43020 -76817 -30825 168418
103 168418 -85381 2764 -106205 98680 185338 -364215 203358 -30130 42115 50598 -339388
$$ packed form
0@%%%%%%%%qJ6k4L2m0N6p2Q8j06J30j64K04k48K98l56M26n05N92o92Q04r31J074
30E74j236J417j614J834k078K349k647K974l336L732m164M636n152N715o329P001
46C676p734Q533r409J0369j1419J2572j3842J5249j6811J8552k0512K2733k5271
59a3314K8203l1632L5708m0648M6778n4623O5079p9834J02594j44426L39987p15396
71d61524N33307L1091k80727O27418j063383R51928l03531j63886K92854m87620
81c24073O34645l36789r2861J27923m5745K92353m93375K13673R2456M2549j73865
92f3109j25651L83901j75555o3128m3391J19004P8980j54071l3797M5992J99243
103A68418k53799Q8145j08969K04885Q6658n49553N67573k33488P2245Q483l89986
$$ plain form
114 -339388 439712 -204628 -26241 98289 -225703 396151 -328889 66559 80495 -124073
124 -124073 270856 -383486 215232 48234 -104835 89063 -231097 337146 -167140 -72786
134 -72786 120216 -111008 212210 -245737 75504 90708 -105170 115374 -177444 117107
144 117107 58174 -107206 14024 -4658 80608 -35937 -81534 39224 108660 -113579 -4492
155 -4492 41064 -22680 96591 -178460 108898 26624 -78690 108850 -186245 183348 -35281
166 -35281 -90030 95414 -113120 191542 -171370 10358 107087 -107055 122157 -183555
176 -183555 152417 -10273 -97663 132029 -171726 190969 -99988 -43429 116469 -138713
186 -138713 174673 -157345 25870 107143 -125905 94610 -98998 80199 13420 -88803
$$ packed form
114c39388P79100o44340J78387J24530l23992O21854p25040L95448J3936k04568
124a24073L94929o54342N98718j66998j53069J93898l20160N68243n04286R4354
134g2786J93002k31224L23218m57947L21241J5204j95878K20544k92818K94551
144A17107n8933j65380J21230j8682Q5266j16545m5597J20758O9436k22239J09087
155d492M5556o3744J19271k75051K87358q2274j05314J87540k95095L69593k18629
166c5281n4749J85444k08534L04662l62912J81728R6729k14142K29212l05712
176a83555L35972j62690q7390K29692l03755L62695k90957N6559J59898k55182
186a38713L13386l32018J83215Q1273k33048K20515j93608J79197o6779j02223
$$ plain form
196 -88803 71564 -32885 36577 -33842 -2287 13999 9454 -1213 -41253 50100 -26732 32734
208 32734 -47610 5466 63746 -76668 47449 -42380 45979 -3349 -58480 77670 -66777
219 -66777 64126 -49508 -3107 57678 -79639 89186 -92399 53969 24659 -84688 98373
230 98373 -95877 83769 -31830 -49366 100759 -100535 78950 -49063 -535 54768 -79726
241 -79726 73251 -56230 30707 8447 -40895 47761 -43889 44354 -35246 6025 22483 -32411
253 -32411 35538 -41606 37499 -15487 -8789 23371 -32614 38988 -34520 18885 -3149 -10121
265 -10121 26012 -39093 38699 -26618 12900 2476 -23446 42237 -46356 35434 -17010 -5269
277 -5269 28802 -45002 46479 -34829 14933 9033 -31404 43314 -40887 28733 -11079 -9297 27532
$$ packed form
196h8803J60367j04449O9462p0419L1555J6286m545j0667m0040R1353p6832N9466
208C2734q0344N3076N8280j40414J24117q9829Q8359m9328n5131J36150j44447
219f6777J30903j13634M6401O0785j37317J68825j81585J46368k9310j09347J83061
230I8373j94250J79646j15599j7536J50125k01294J79485j28013M8528N5303j34494
241g9726J52977j29481Q6937k2260m9342Q8656r1650Q8243p9600M1271J6458n4894
253c2411O7949p7144P9105n2986O698L2160n5985P1602p3508N3405k2034o972
265a0121L6133o5105P7792o5317L9518j0424k5922O5683q8593Q1790n2444J1741
277e269L4071p3804R1481q1308M9762n900m0437P4718q4201O9620l9812J782L6829
$$ plain form
290 27532 -36944 35157 -24491 9008 7530 -21374 29266 -29649 22655 -10306 -4262 16728
302 16728 -23367 24417 -20494 11999 -66 -11978 20360 -22822 19272 -11789 1375 9394
314 9394 -17869 20800 -17304 9436 -34 -8242 13903 -15933 13659 -7764 221 6097 -9902
327 -9902 11004 -10042 7349 -2496 -2865 7574 -9606 9438 -6858 2733 2493 -6979 9180 -8700
341 -8700 5459 -490 -4889 8118 -8147 5541 -1312 -3230 7046 -7881 5508 -852 -3525
354 -3525 7116 -7771 5358 -1439 -2621 6412 -9694 9123 -3675 -2870 5945 -7612 10306
367 10306 -10335 4348 4649 -10410 12620 -13082 9155 -1074 -7721 13457 -16788 14935 -4429
380 -4429 -8274 13045 -10871 10444 -9179 316 11009 -10950 2048 1901 958 -1956 1990 -5705
$$ packed form
290B7532o4476P2101n9648L3499j478k8904N0640n8915N2304l2961O044K0990
302A6728m0095M7784m4911L2493j2065j1912L2338m3182M2094l1061J3164Q019
314I394k7263L8669l8104K6740r470q208K2145k9836K9592k1423P985N876j5999
327i902K0906k1046J7391r845l69J0439j7180J9044j6296R591k40r472J6159j7880
341h700J4159n949m399J3007j6265J3688o853j918J0276j4927J3389o360k673
354c525J0641j4887J3129o797j182R033j6106J8817j2798Q05Q815j3557J7918
367A0306k0641J4683L01j5059K3030k5702K2237j0229o647K1178l0245L1723j9364
380d429l845K1319k3916K1315j9623R495J0693k1959J2998j47r43k914L946p695
$$ plain form
394 -5705 8043 -1448 -6885 11338 -16877 21584 -11857 -11901 25799 -22457 19466 -21362 8443
407 8443 20223 -36289 29937 -21044 17178 -2039 -22500 35943 -35962 34652 -23206 -8810
419 -8810 39460 -44310 38744 -38627 21421 26011 -63093 56412 -31164 17130 3025 -40650
431 -40650 60844 -41439 11878 4805 -22289 39205 -29404 1647 4555 4693 5815 -22428 6316
444 6316 19447 -5158 -26788 22092 3781 -1696 -11496 -6788 33913 -28092 10688 -12911 7525
457 7525 24906 -43098 28014 -24389 38429 -14120 -50692 78573 -51334 33126 -33492 -8557
469 -8557 84889 -109210 66845 -22920 -8537 61866 -108502 89988 -32803 -3011 33820
480 33820 -86018 102033 -43293 -17243 19095 -19004 61129 -75752 19939 27553 -14530
$$ packed form
394e705J3748r491n437J8223k8215L8461l3441m4L7700m8256M1923m0828K9805
407H443J1780n6512O6226n0981L8222j9217k0461N8443p1905P0614n7858J4396
419h810M8270q3770Q3054p7371O0048M590q9104J19505q7576M8294j4105m3675
431d0650J01494j02283N3317p073k7094O1494o8609L1051K908J38J122k8243K8744
444F316J3131k4605k1630M8880j8311n477r800M708M0701o2005L8780k3599K0436
457G525J7381o8004P1112n2403O2818n2549l6572J29265j29907Q4460o6618K4935
469h557R3446j94099J76055q9765J4383P0403j70368J98490j22791K9792L6831
480C3820j19838J88051j45326K6050L6338l8099Q0133j36881R5691P614m2083
$$ plain form
491 -14530 4598 -36937 48120 -10824 -10218 -2662 -9183 39779 -23141 -19893 11255 23464 -6743
504 -6743 -25986 -4855 48120 -9953 -59139 58283 -19955 20717 -18623 -45166 104076 -84237
516 -84237 33890 -4861 -45027 119729 -127542 49193 13784 -29655 74227 -137309 110773
527 110773 -3405 -56679 48876 -66125 105702 -75001 -9116 46894 -45345 71904 -92361
538 -92361 43293 20658 -29758 36077 -85646 94069 -11559 -57217 39659 -21504 56809
549 56809 -55426 -22200 67150 -24483 -12588 -2134 -1445 33318 -13831 -46088 51469 -10683
561 -10683 5915 -10007 -49799 109467 -66125 -19701 37275 -28364 75698 -111997 50191
572 50191 38252 -58940 57596 -90613 92499 -22546 -40870 52785 -77859 120542 -89789
$$ packed form
491a4530J9128m1535Q5057n8944O06P556o521M8962o2920L248L1148J2209l0207
504f743j9243K1131N2975n8073m9186J17422p8238M0672l9340k6543J49242j88313
516h4237J18127l8751m0166J64756k47271J76735l5409m3439J03882k11536K48082
527A10773j14178n3274J05555j15001J71827j80703O5885N6010r2239J17249j64265
538i2361J35654k2635n0416O5835j21723J79715j05628m5658R6876o1163P8313
549E6809j12235L3226Q9350r1633J1895J0454O89L4763m7149l2257R7557o2152
561a0683J6598j5922l9792J59266j75592M6424N6976o5639J04062j87695J62188
572E0191j1939r7192J16536j48209J83112j15045j8324R3655j30644J98401k10331
$$ plain form
583 -89789 -11476 69077 -65171 87529 -122164 66819 51732 -103955 79983 -71288 70050
594 70050 -6332 -76024 83750 -45715 35594 -22527 -33565 63840 -18967 -17497 -10547 25845
606 25845 15676 -27585 -25433 44568 10755 -44958 17029 -6607 36559 -29853 -21715 39323
618 39323 -21090 33760 -57947 25175 31228 -37157 27518 -64347 89201 -29886 -51391 69474
630 69474 -63552 86557 -81789 314 83495 -100382 87787 -79342 31462 56433 -103358
641 -103358 84031 -61695 48012 7884 -81251 88813 -39997 18390 -22712 -9958 58319
652 58319 -52336 12395 -6440 18640 2181 -29661 18661 -1486 16913 -25084 -1762 16546
664 16546 6592 -12983 -19224 33869 -9773 1970 -25750 22330 21319 -47085 36539 -32160 35564
$$ packed form
583h9789P8313Q0553j34248J52700k09693J88983j5087j55687J83938j51271J41338
594G0050p6382o9692J59774j29465Q1309n8121j1038R7405q2807J470O950L6392
606B5845j0169m3261K152P0001l3813n5713O1987k3636M3166o6412Q138O1038
618C9323o0413N4850r1707Q3122O053o8385O4675r1865J53548j19087k1505J20865
630F9474j33026J50109j68346Q2103Q3181j83877J88169j67129J10804K4971j59791
641a03358J87389j45726J09707m0128q9135J70064j28810N8387m1102J2754O8277
652E8319j10655O4731j8835K5080j6459l1842M8322k0147J8399m1997K3322J8308
664A6546r954j9575o241N3093m3642J1743k7720M8080j011o8404Q3624o8699O7724
$$ plain form
677 35564 -6212 -44142 64269 -54301 46669 -27898 -24889 73749 -73538 47627 -33003
688 -33003 9255 43068 -80588 67353 -33914 15720 6628 -46099 67412 -50962 26640
699 26640 -11427 -13595 46495 -53495 34059 -19129 11053 13500 -41973 41112 -18285 8594
711 8594 -8078 -6521 24648 -21393 7988 -8333 13535 -6338 -3108 3092 -6883 22472 -30177
724 -30177 19701 -7074 50 15444 -37901 43594 -26084 5696 8597 -26316 44418 -44477
736 -44477 25480 -3651 -14596 33906 -46091 40120 -21101 2154 16686 -36661 46386 -36264
748 -36264 16357 1433 -18211 35240 -41418 30640 -12375 -3652 17684 -29524 32067 -23455
760 -23455 11324 113 -12506 22587 -24568 19571 -13191 6042 5004 -16084 20927 -20187
$$ packed form
677C5564m1776l7930J08411j18570J00970p4567L009R8638j47287J21165q0630
688c3003M2258L3813j23656J47941j01267M9634r092n2727J13511j18374P7602
699B6640l8067k168O0090r9990Q7554n3188L0182K447n5473Q3085n9397K6879
711H594j6672J557L1169m6041K9381j6321K1868j9873L230O200r975K9355n2649
724c0177M9878k6775P124J5394n3345Q1495o9678L1780K901l4913P0734q8895
736d4477O9957k9131j0945M8502p9997Q6211o1221K3255J4532n3347Q3047q2650
748c6264N2621j4924j9644N3451p6658P2058m3015Q723K1336m7208O1591n5522
760b3455L4779j1211j2619L5093m7155M4139l2762J9233j038k1088L7011m1114
$$ plain form
772 -20187 16803 -10959 326 11416 -19289 22134 -20887 14775 -3672 -8964 18539 -24151
784 -24151 24739 -17821 4711 9308 -20086 25601 -25197 17398 -3992 -10102 20120 -24360
796 -24360 22732 -15212 3807 7971 -17022 21760 -20838 14862 -5377 -4919 14141 -20227 21055
809 21055 -16081 6790 3917 -13051 18954 -19973 15513 -6730 -3393 11675 -16396 16946
821 16946 -13826 7595 675 -8296 13344 -15124 13743 -9637 2923 5370 -12764 16273 -14904
834 -14904 9896 -2748 -5025 12109 -15722 14720 -8712 1388 5131 -9657 12329 -12277
846 -12277 8858 -2532 -3515 7677 -9843 10555 -9517 5673 1073 -7752 11523 -11215 8941
859 8941 -5004 -534 7946 -12643 11704 -6787 1098 3481 -6673 8918 -8422 4652 746
$$ packed form
772b0187L6990k7762J1285J1090l0705M1423m3021L5662j8447n292K7503m2690
784b4151M8890m2560K2532M597k9394M5687n0798M2595k1390o110L0222m4480
796b4360M7092l7944J9019M164k4993L8782m2598L5700k0239M58J9060l4368M1282
809B1055l7136K2871k873j6968L2005l8927L5486k2243L337J5068k8071L3342
821A6946l0772K1421o920q971K1640k8468K8867k3380J2560K447j8134K9037l1177
834a4904K4800j2644k277J7134k7831L0442k3432J0100L743j4788K1986k4606
846a2277K1135j1390r83J1192j7520K0398k0072J5190m600q825J9275k2738K0156
859H941j3945M470Q480k0589K4347j8491P885K383j0154J5591j7340J3074l906
$$ plain form
872 746 -4422 5121 -3427 2229 -2812 2233 432 -2880 1798 174 1326 -4514 4537 -909 -2185
887 -2185 2654 -2553 3796 -4398 2985 -34 -3724 6064 -4810 2067 -1846 2598 1461 -8405 9806
902 9806 -4201 -501 1031 -3385 9341 -11646 5690 3024 -9200 12020 -10667 4028 3671
915 3671 -8222 11823 -14150 8037 6859 -17347 13964 -6130 3361 741 -12104 19153 -12889
928 -12889 656 7059 -10744 13514 -11089 3775 1759 -5839 13312 -17396 8232 4894 -6945
941 -6945 4554 -11227 18277 -8532 -9833 15714 -10885 9325 -8009 -2527 14185 -15315 9999
954 9999 -4495 -6153 19345 -16978 431 8761 -6191 9667 -18450 8983 16123 -26307 14014
967 14014 -3126 186 9859 -24253 23164 -8510 -2772 11742 -25248 28521 -11880 -5432 6759
$$ packed form
872G46n168R543q548N656n041N045j801l312M678j624J152n840R051n446j276
887b185M839n207O349q194P383l019l690R788j0874O877l913M444j137r866J8211
902I806j4007L700J532m416J2726k0987J7336k666j2224K1220k2687J4695l57
915C671j1893K0045k5973K2187j178k4206L1311k0094R491k620j2845L1257l2042
928a2889J3545O403j7803K4258k4603J4864k016p598J9151l0708K5628l338j1839
941f945J1499j5781K9504k6809j301K5547k6599K0210j7334N482J6712k9500K5314
954I999j4494j658K5498l6323J7409Q330j4952J5858k8117K7433P140m2430M0321
967A4014j7140L312R673l4112M7417l1674N738J4514l6990N3769m0401O448J2191
$$ plain form
980 6759 -11640 30009 -34223 9432 14985 -17705 18462 -30923 30277 -3561 -22307 29545
992 29545 -31358 30319 -10613 -19126 30639 -25859 25666 -20244 -9625 38635 -31579 6521
1004 6521 -303 1733 14582 -29534 14059 11139 -14406 7284 -9290 5703 12068 -19063 5840
1017 5840 561 4680 5923 -28415 24974 2513 -12489 3392 -12530 34802 -29196 -2482 20495
1030 20495 -21642 31475 -39130 18059 15637 -31018 37430 -47392 36195 8808 -44772 43378
1042 43378 -34136 35402 -16686 -30711 57890 -40759 16688 -9017 -6815 35006 -40525 18856
1054 18856 -4232 789 14636 -30434 18497 3629 -1290 -6930 -8754 24959 -7963 -15335 8350
1067 8350 6127 1936 -10389 -6736 22569 -11271 -4699 6592 -14696 32167 -26849 -3835 23291
$$ packed form
980F759j8399M1649o4232M3655N553l2690L6167m9385O1200l3838j8746N1852
992B9545o0903O1677m0932q513M9765n6498N1525m5910J0619M8260p0214L8100
1004F521o824K036J2849m4116M3593k920k5545K1690j6574J4993O365l1131K4903
1017E840n279M119J243l4338N3389k2461j5002J5881j5922M7332o3998K6714K2977
1030B0495m2137N3117p0605N7189k422m6655O8448q4822Q3587k7387n3580Q8150
1042D3378p7514O9538n2088j4025Q8601r8649N7447k5705K202M1821p5531N9381
1054A8856k3088N021J3847m5070M8931j4868m919n640j824L3713l2922p372K3685
1067H350k223m191j2325L653K9305l3840O572J1291k1288M6863n9016K3014K7126
$$ plain form
1080 23291 -23986 32956 -42474 16879 30987 -50519 38894 -30895 24188 8265 -48642 55671
1092 55671 -35616 18931 -1351 -29990 50984 -39751 19386 -10711 -5475 36556 -47680 25600
1104 25600 -5058 3514 6643 -32730 39580 -16579 -2495 4955 -12708 26377 -20683 -266
1116 -266 8384 -5471 10534 -13558 -2990 18813 -8906 -8803 8676 -5363 16076 -19328 -3425
1129 -3425 27792 -28113 18559 -14538 2276 23747 -38759 31122 -18352 7792 13555 -39271
1141 -39271 42435 -24752 10670 -502 -21746 45403 -43018 19931 -2263 -10067 29762 -44866
1153 -44866 36083 -12424 -5584 20304 -35794 38121 -19462 -1756 11564 -19720 29123 -23754
1165 -23754 2750 11115 -9370 7827 -11857 8187 3107 -5751 -2158 5222 -771 -281 -3 -7622
$$ packed form
1080B3291m7277N6942p5430N9353J4108q1506Q9413o9789N5083j5923n6907J04313
1092E5671r1287N4547k0282k8639Q0974r0735N9137l0097N236M2031q4236P3280
1104B5600l0658Q572L129l9373P2310n6159J4084P450j7663L9085m7060K0417
1116b66Q650j3855J6005k4092J0568K1803k7719J03J7479j4039K1439l5404J5903
1129c425L1217n5905M6672l3097J6814K1471o2506O9881m9474K6144N763n2826
1141c9271Q1706o7187L5422j1172k1244O7149q8421O2949k2194p804L9829p4628
1153d4866Q0949m8507O840K5888n6098P3915n7583J7706J3320l1284M8843n2877
1165b3754K6504Q365k0485J7197j9684K0044n080q858L593P380n993M90K78p619
$$ plain form
1179 -7622 15616 -12595 3198 995 -5817 17655 -24726 16198 -2374 -4917 12200 -24200 29127
1192 29127 -18253 2010 9893 -21146 31500 -30193 15231 2521 -16351 28768 -35587 26546
1204 26546 -6345 -10983 21520 -29330 30429 -17618 -2207 15021 -20142 22716 -20408 9115
1216 9115 3800 -11073 13512 -15245 13122 -5798 -911 3051 -5551 10149 -11086 6728 -3813
1229 -3813 3416 -334 -6619 10644 -10363 9725 -8944 3504 5246 -12024 14834 -15673 12987
1242 12987 -4293 -6960 14693 -18610 19735 -14612 2952 9796 -17951 20672 -19939 13358
1254 13358 -774 -11719 19185 -21441 18777 -10414 -1630 12244 -18580 19897 -16282 7469
1266 7469 3267 -11321 15058 -15834 12911 -6461 -1646 7520 -10669 11944 -11578 8045 -2761
$$ packed form
1179g622K3238k8211J5793k203o812K3472m2381M0924j8572k543J7117l6400N3327
1192B9127m7380K0263P883l1039N2646o1693M5424j2710j8872M5119o4355O2133
1204B6546l2891m638L2503n0850N9759m8047J5411J7228l5163M2858m3124K9523
1216I115n315j4873K4585k8757K8367j8920M887L962q602J5700k1235J7814j0541
1229c813P229l750o285J7263k1007K0088j8669J2448J742j7270K6858l0507K8660
1242A2987j7280k667K1653l3303L8345l4347J7564O844k7747L8623m0611L3297
1254A3358j4132j0945L0904m0626M0218k9191Q784J3874l0824L8477l6179K3751
1266G469m202j4588K6379l0892K8745j9372M815R166j8189K2613k3522J9623j0806
$$ plain form
1279 -2761 -2898 7772 -11600 12967 -10854 5863 367 -7234 12973 -14473 11795 -6331 -39
1292 -39 6557 -11882 14136 -11964 7023 -954 -4798 9726 -13147 13070 -9765 3459 4135
1305 4135 -10728 14338 -14330 10675 -3722 -5293 12176 -15048 13201 -8195 1809 4958
1317 4958 -10058 12698 -11288 6936 -1754 -2756 6390 -9570 10958 -9376 5166 700 -6050
1330 -6050 9545 -11392 10806 -6927 -135 7093 -11083 11178 -9020 5239 -272 -5554 9254
1343 9254 -10206 7758 -4407 1418 2042 -5697 9187 -9853 7073 -2607 -1603 5541 -9113
1356 -9113 10921 -9163 3541 3340 -7563 9179 -9134 7447 -3197 -2521 7373 -8937 7580
1369 7580 -4822 2532 118 -4111 7800 -8364 5614 -2156 -554 2912 -6162 8658 -7411
$$ packed form
1279b761j37J0670j9372K4567k3821J6717n496p601K0207k7446K6268j8126O292
1292c9O596j8439K6018k6100J8987p977l844J4524k2873K6217k2835J3224O76
1305D135j4863K5066k8668K5005j4397j571J7469k7224K8249k1396J0004L149
1317D958j5016K2756k3986J8224q690j002R146j5960K0528k0334J4542m466o750
1330f050J5595k0937K2198j7733O792P228j8176K2261k0198J4259n511n282J4808
1343I254j9460J7964j2165N825O24p739J4884j9040J6926r680J004P144j4654
1356i113K0034k0084J2704k01j0903J6742j8313J6581j0644O76R894j6310J6517
1369G580j2402P354k414m229J1911j6164J3978p770J602L466r074J4820j6069
$$ plain form
1382 -7411 2775 2237 -4890 5366 -5279 4992 -2712 -845 4370 -4566 2437 -1040 2113 -2942
1396 -2942 971 2174 -3473 2738 -3293 5077 -4513 -107 5254 -7838 7202 -4524 1643 1625 -5337
1411 -5337 8872 -8999 4369 1974 -5428 5435 -5623 6844 -4852 -1077 6657 -7524 5499
1424 5499 -3980 2523 872 -5283 8641 -8140 3423 2615 -6090 5804 -5387 4966 -1180 -5856
1438 -5856 9782 -6495 -532 4225 -4244 4358 -4426 1063 4130 -7582 6365 -1494 -4325 7171
1452 7171 -5331 2697 -926 -977 5907 -9648 6130 1626 -5339 4658 -4377 5862 -4406 -1042
1466 -1042 6738 -8465 6854 -3101 -1126 4432 -6574 9130 -8590 1740 8442 -12957 9310
1479 9310 -4083 583 4657 -12334 14762 -7817 -3347 11148 -13395 11313 -5662 -2183 9170
$$ packed form
1382g411J0186n38p127J0256j0645J0271p704J867N215q936P003l477L153n055
1396b942L913J203n647O211o031Q370r590M406N361j3092J5040j1726O167j8o962
1411e337J4209j7871J3368k395p402J0863j1058J2467j1696L775P734j4181J3023
1424E499r479O503j651o155J3924j6781J1563q08q705J1894j1191J0353o146m676
1438e856J5638j6277N963M757q469Q602q784N489L067j1712J3947p859k831J1496
1452G171j2502Q028l623n1O884j5555J5778m504o965R997r035J0239j0268L364
1466a042P780j5203J5319r955J975N558j1006J5704j7720J0330O702k1399K2267
1479I310j3393M666M074j6991K7096k2579M470J4495k4543K4708j6975L479J1353
$$ plain form
1492 9170 -13280 13711 -7309 -4275 12580 -12390 8070 -5407 1750 6863 -14365 12956 -5314
1505 -5314 -1401 5104 -8716 10891 -9215 3550 3512 -10549 13219 -8830 1013 4109 -6863
1518 -6863 10542 -11965 4719 7659 -13693 10491 -4985 82 6053 -12462 12811 -5851 -3950
1531 -3950 11781 -15413 11783 -2054 -7150 11320 -13725 14016 -6688 -7334 16945 -16107 10444
1544 10444 -5582 -1300 11374 -18477 16598 -8999 -405 9874 -16996 17675 -12048 4927
1556 4927 4799 -16548 22207 -15934 3398 5810 -11849 17519 -18216 8262 6152 -14584 15049
1569 15049 -11675 4904 4644 -11449 11578 -7704 2365 5787 -12306 10336 -1519 -4745 6288
1582 6288 -8051 9481 -4181 -6556 12811 -11326 7535 -3006 -4544 12745 -15387 12190
$$ packed form
1492I170k2450K6991k1020L034J6855k4970K0460j3477P157N113k1228K7321j8270
1505e314L913O505j3820J9607k0106J2765l8j4061K3768k2049R843L096j0972
1518f863J7405k2507J6684K940k1352K4184j5476N067N971j8515K5273j8662J901
1531c950J5731k7194K7196j3837n096J8470k5045K7741k0704o46K4279l3052K6551
1544A0444j6026M282J2674k9851L5075k5597Q594J0279k6870L4671k9723J6975
1556D927j28k1347L8755l8141J9332K412j7659K9368l5735K6478k110k0736K9633
1569A5049k6724J6579k60j6093K3027j9282J0069L422j8093K2642j1855l226J1033
1582F288j4339J7532j3662k375J9367k4137J8861j0541j538J7289k8132K7577
$$ plain form
1594 12190 -6474 -2767 14005 -20144 16821 -8331 41 9991 -21560 24325 -14400 -294
1606 -294 10869 -18384 22848 -18593 5132 9039 -17556 20733 -17600 6888 6277 -13799 15012
1619 15012 -13508 8921 1627 -11073 12155 -7205 3922 -1297 -4464 8685 -6449 761 2180
1632 2180 -3633 5121 -3801 -1649 6050 -6072 4962 -3385 -2668 10725 -13056 8145 -1752 -3875
1646 -3875 11051 -17262 15256 -5184 -5694 13305 -18452 18756 -10179 -2927 13073 -18609 19734
1659 19734 -14321 1802 10779 -16875 17300 -15203 7748 4606 -14029 15959 -13352 8810
1671 8810 -1527 -7759 12774 -11823 8104 -3655 -2241 7862 -8819 5581 -2315 30 3075
1684 3075 -4814 2564 1303 -2134 714 382 -1293 4085 -5695 2715 2438 -5944 8086 -8679 6242
$$ packed form
1594A2190j8664L707J6772l4149L6965k5152Q372R950l1551M5885l8725J4106
1606b94J1163k9253M1232m1441K3725L907k6595L8289l8333K4488o11k0076K8811
1619A5012k8520K2429p294j2700K3228j9360J1127n219l167J3149j5134P210J419
1632B180n813Q754q922K152P699j2122J1034q347P17J3393k3781K1201r897k123
1646c875J4926k8313L2518k0440n10J8999l1757L7208k8935P252J6000l1682L8343
1659A9734l4055J6123Q977k7654L4175l2503K2951l142j8635K9988k9311K2162
1671H810j0337o232K0533k4597J9927j1759J414J0103j6681J4400p896K345L045
1684C075p889P378j261l437K848l32j675N378r780Q410k77q382J4030j6765J4921
$$ plain form
1699 6242 557 -7600 11229 -12003 9853 -3546 -5566 12224 -14244 12425 -7961 -433 9701
1712 9701 -15322 14680 -10410 4109 4501 -12441 15174 -12569 7112 -54 -7252 12089 -12284
1725 -12284 8292 -3469 -1783 6861 -9164 7846 -4379 1891 708 -3555 5238 -4364 3074
1738 3074 -2301 1667 203 -1631 2702 -3554 4292 -4118 2405 -448 -1737 4420 -6903 6982
1752 6982 -4690 1786 1957 -5915 9614 -9718 6249 -1225 -4019 8933 -11456 9926 -5391
1765 -5391 -396 6337 -10420 11312 -8062 3288 1719 -6195 9326 -9705 6683 -2486 -1765
1778 -1765 4867 -7505 8012 -6372 3130 1055 -4408 6692 -6942 5607 -3225 173 3237
1791 3237 -5472 5882 -4960 3426 -1575 -996 3512 -5424 5972 -5219 3199 -640 -2910 6028
$$ packed form
1699F242n685q157J8829k3232K1856j3399k020J7790k6468K6669k0386P528J0134
1712I701k5023L0002k5090J4519L92j6942K7615k7743J9681p166p198J9341k4373
1725a2284K0576j1761J686Q644j6025J7010j2225O270j183m263Q793r602P438
1738C074n375L968j464j834M333o256P846q410O523k853j289O157j1323J3885
1752F982j1672O476J71p872J5529j9332J5967p474k794J2952k0389K1382j5317
1765e391M995O733j6757K1732j9374J1350j569p914J5521j9031J6388r169P21
1778a765O632j2372J5517j4384R502k075n463J1100j3634J2549q832L398L064
1791C237q709J1354j0842Q386n001N79M508q936J1396j1191Q418l839k270Q938
$$ plain form
1805 6028 -7626 7218 -4214 -317 3941 -6473 7589 -6759 3755 535 -4193 6210 -6435
1818 -6435 5274 -3519 911 2229 -5391 6631 -6187 4187 -1729 -1557 4943 -7658 7526 -4743
1832 -4743 472 2784 -5219 6606 -6407 4214 -407 -3216 4795 -4749 4100 -3442 2122 450
1846 450 -3144 4675 -4837 4292 -3404 1581 1797 -5602 6930 -5597 2906 -152 -2545 5115 -6642
1861 -6642 5748 -2445 -900 2945 -3667 4051 -4352 3819 -1268 -1855 3596 -4110 4395 -4580 3349
1876 3349 372 -4407 6595 -5911 4036 -1531 -1349 4350 -6636 6231 -3034 -788 2952 -3140
1890 -3140 3332 -3750 3020 -446 -2170 2554 -1937 2118 -2809 2657 -625 -1923 3323 -3123 2206
1905 2206 -1977 1325 643 -3115 3988 -2430 713 -581 1078 196 -2837 4106 -3175 1783 -1174
$$ packed form
1805F028j3654J4844j1432L897M258j0414J4062j4348J0514l220m728J0403j2645
1818f435J1709q793M430J318p620J2022j2818J0374n916J72O500j2601J5184j2269
1832d743N215K312q003J1825j3013J0621m621k809Q011r544Q849p542N564j672
1846D50l594P819r512R129p696M985K16p399J2532j2527Q503l058k393P660j1757
1861f642J2390q193J545L845o612P718q403Q171n087n87N451p706Q505q975P929
1876C349k977m779J1002j2506R947n567J82N699j0986J2867r265K246L740o092
1890c140O472p082O770l466j724M724m491M055m927N466l282j298N246o446N329
1905B206m183L302o82l758P103o418L143j294J659q82l033O943p281M958k957
$$ plain form
1920 -1174 16 2372 -5353 6432 -4576 137 3510 -5062 5680 -5684 3929 914 -6183 7794
1934 7794 -5338 1874 252 -2171 4495 -5724 4323 -1146 -2279 3548 -3096 2144 -2238 1705
1948 1705 763 -3811 3784 -1225 -578 239 -570 2031 -2805 782 2165 -3266 1634 799 -2560 2704
1964 2704 -1806 956 246 -3091 5878 -5129 144 4442 -5415 4840 -4005 2269 2449 -6836 8065
1979 8065 -5217 876 3115 -5425 5788 -5344 3341 216 -5242 7691 -5696 1834 246 -1769
1993 -1769 4998 -7397 5842 -672 -3456 5707 -6052 4571 -1841 -2046 5336 -7383 6317 -1007
2007 -1007 -4720 6752 -5292 3846 -1778 -2812 7715 -7753 3544 1588 -4615 6104 -5902
2020 -5902 3191 1021 -4426 6766 -6564 2823 2473 -5321 5021 -4477 4025 -83 -5116 7576
$$ packed form
1920a174J190K356p725J1785j1008M713L373q572J0742j1364R613l015p097J3977
1934G794j3132P212j622k423O666j0219J0047n469j133N827o644N240m382L943
1948A705r42m574P595n009O47Q17q09K601m836L587J383n431M900q35l359N264
1964B704m510K762p10l337Q969j1007N273M298r857J0255q845O274J80r285J4901
1979H065j3282O093K239q540J1213j1132Q685l125n458J2933j3387P530j588k015
1993a769O767j2395J3239o514k784R163j1759J0623o412k05P382j2719J3700p324
2007a007l713J1472j2044R138n624j034J0527j5468J1297j956o203J0719j2006
2020e902R093k170n447J1192j3330R387l50p794J0342r498Q502m108n033J2692
$$ plain form
2034 7576 -5611 2346 423 -3556 6541 -6824 4146 -158 -4311 8099 -8243 3657 992
2047 992 -4300 6940 -9217 6672 587 -7288 8812 -7549 5344 -400 -5918 9765 -8770
2060 -8770 5205 -56 -6149 9717 -8094 3882 -537 -3236 8017 -9903 5337 636 -4014
2073 -4014 5501 -7372 6435 -1858 -3556 5996 -6689 5698 -1891 -3583 6056 -5512 4646
2086 4646 -2593 -2772 7862 -7332 2732 354 -2771 6387 -7908 4036 2139 -5713 7059 -7238
2100 -7238 4023 2193 -7087 7480 -6582 4831 672 -7678 10051 -7179 3631 -297 -5057
2113 -5057 10099 -9911 4912 -83 -3778 8049 -10248 6839 -1096 -3117 6379 -9602 8494
2126 8494 -2556 -3261 5629 -6841 7463 -4546 -2201 6425 -6361 4973 -3246 -773 5426 -6135
$$ packed form
2034G576j3187P957j923l979J0097j3365J0970m304m153J2410j6342J1900k665
2047I92n292J1240j6157J5889o085p875J6100j6361J2893n744n518J5683j8535
2060h770J3975n261o093J5866j7811J1976m419k699J1253j7920J5240m701m650
2073d014R515j2873J3807q293j698R552j2685J2387p589j692R639j1568J0158
2086D646p239j79J0634j5194J0064k378l125R158j4295J1944j897p852J2772j4297
2100g238J1261j830r280J4567j4062J1413m159q350J7729j7230J0810l928m760
2113e057J5156k0010J4823m995l695J1827j8297J7087p935k021R496j5981J8096
2126H494j1050p05Q890j2470J4304j2009K345Q626j2786J1334q219K473O199j1561
$$ plain form
2140 -6135 3081 -765 -1044 4286 -5654 2703 1698 -3508 3414 -4248 3060 1752 -5598 5442 -3824
2155 -3824 2365 1125 -5777 7891 -5500 2083 707 -4816 8781 -8120 3521 824 -4043 7782
2169 7782 -9532 6319 -214 -4092 6622 -8724 7833 -2762 -3180 6060 -6999 7281 -4497
2182 -4497 -1091 5140 -5613 5163 -4205 1024 3059 -4685 3571 -2231 1330 999 -3076 2658 -358
2197 -358 -489 511 -1376 1874 545 -2539 2264 -946 266 1380 -3551 4801 -2441 -206 2052
2212 2052 -4271 5792 -4851 1073 2428 -4449 6080 -6232 3462 1081 -4533 5885 -6441
2225 -6441 5225 -1522 -2726 5272 -6057 5648 -3690 -339 3814 -5128 4987 -4357 2021 1639
2239 1639 -3854 4173 -3624 2621 -701 -1694 2628 -2249 1719 -1331 446 482 -482 59 -757 1643
$$ packed form
2140f135R216l846k79N330r940Q357j005n206O922p662P308j308p350J1040r266
2155c824O189j240o902J3668j3391P583j376n523J3597j6901J1641k697m867J1825
2169G782j7314J5851o533l878J0714j5346J6557j0595m18R240j3059J4280j1778
2182d497L406O231j0753J0776r368N229K035p744Q256n802L561l31m075N734l016
2197c58j31J000j887L250j329l084M803l210J212J114m931Q352p242K235K258
2212B052o323J0063j0643N924J355o877J0529j2312R694k381n614J0418j2326
2225f441J1666o747j204P998j1329J1705r338L351M153q942J0115r344O378l82
2239A639n493Q027p797O245l322r93M322m877L968l050J777L6r64N41q16K400
$$ plain form
2255 1643 -1665 1364 -1467 830 897 -2548 3015 -2898 2024 -625 -1569 3269 -3697 3381 -2644 591
2271 591 1982 -3697 4213 -3991 2834 -439 -2614 4524 -4954 4154 -2212 -544 3352 -4786 4820
2286 4820 -3348 1023 1696 -3378 3909 -3385 2280 -628 -1234 2472 -2337 2301 -2047 1373 -200
2301 -200 -802 2279 -2715 2754 -2077 877 491 -2042 3308 -3391 2234 -332 -738 2024 -2798 3183
2317 3183 -2362 1149 333 -1448 2343 -2743 3031 -1950 456 1438 -3019 3472 -3172 2113 -636
2332 -636 -1580 3552 -4001 2981 -1429 86 1463 -2704 3232 -3086 1536 100 -1321 1857 -2431
2347 -2431 2734 -2442 717 894 -2196 2846 -2643 2398 -1118 -681 2512 -3148 2533 -1655 664
2362 664 220 -1261 2249 -2764 1873 -771 120 446 -1540 2865 -3189 2293 -280 -1057 2177 -2983
$$ packed form
2255A643l308L029k831K297O7l445N563n913M922k649r44M838o966P078o025L235
2271E91J391n679P910q204O825l273k175P138r478R108o366J668L896q138R606
2286D820q168M371O73n074P287p294N665k908o06L706m809M638m348L420j573
2301b00o02L081m994N469m831K954l86k533N350o699N625k566m06K762m822N981
2317C183n545L511q16j781L791n086N774m981K406R82m457O491o644N285k749
2332f36r44N132p553O982m410J515J377m167N936o318M622j436j421L178m288
2347b431N165n176L159J77l090N042n489N041l516M37L193n660N681m188K319
2362F64m44j481L510n013M637k644Q91L26j986M405o054N482k573p77L234n160
$$ plain form
2378 -2983 3213 -2294 753 1904 -2996 2926 -2148 1377 -622 -821 2343 -2832 2019 -1024 571
2393 571 226 -1379 2696 -3034 2178 -326 -1277 2106 -2541 2834 -2418 571 1812 -2749 2238 -1151
2409 -1151 721 -331 -813 1499 -1266 641 -11 503 -846 589 346 -1728 1903 -1315 990 -950
2425 -950 -108 2108 -3394 2318 -464 -290 781 -1950 2962 -2804 1351 229 -1657 2444 -2630 2428
2441 2428 -1994 687 2224 -4269 3805 -1923 549 494 -2676 4533 -3748 1167 1323 -2641 3196 -2793
2457 -2793 1030 246 -1421 2413 -2663 1141 1366 -1414 239 -109 785 -281 -1256 1204 398 -1283
2473 -1283 791 -401 407 52 -967 1364 -1644 2021 -982 -1950 3223 -2297 1630 -1805 246 3387
2489 3387 -5104 3556 -1100 -503 2622 -4763 4711 -2278 -180 2752 -5112 5513 -2402 -948 2250
$$ packed form
2378b983O196n507L047J151m900N922n074L525j999j99L164n175M851l043J595
2393E71l45j605M075n730N212k504r51L383m647N375n252K989J241m561M987l389
2409a151J872j052m82K312k765J907o52N14j349J435k43k074L631l218K305j940
2425i50Q42K216n502N712k782J74J071k731M912n766M155j122j886M101n074N058
2441B428m422K681J537o493Q074n728K472n5l170P209q281M915J56l964N837n989
2457b793L823p84j667L834n076L804K25k780J653l48Q94j066r75K460q06j681
2473a283K074j192Q08l55j019K331l008L665l003r68N173n520L927l435K051L141
2489C387q491Q660m656N97L125p385R474o989K098K932p864J0625p915J454L198
$$ plain form
2504 2250 -3001 4428 -4415 569 3287 -3617 2491 -2545 1806 1222 -3602 3228 -2109 1236 885
2519 885 -3406 3353 -1176 227 -15 -2365 4381 -2772 -1075 2484 -2000 2891 -3150 360 3309
2534 3309 -4026 3311 -2337 294 3438 -5241 3592 -1467 356 2252 -5935 5690 -1549 -1589 2314
2549 2314 -3784 5455 -3656 -847 3608 -4000 4442 -3991 394 3774 -4378 3523 -3588 1930 2471
2564 2471 -5765 4207 -1845 1353 823 -4712 6155 -2963 -156 1713 -3471 5490 -4132 54 2602
2579 2602 -3260 4577 -4695 1119 3781 -4592 3331 -3146 1971 2232 -5676 4641 -1981 394 1075
2594 1075 -4501 5512 -2330 -731 1656 -3465 5135 -3816 -752 3212 -3077 3672 -3996 1001 3728
2609 3728 -4925 3439 -2543 1582 2114 -5653 4968 -2055 396 1444 -4890 6142 -3026 -838 2209
$$ packed form
2504B250n251P429q843M984K718o904O108n036M351n84m824O830n337L345l51
2519H85m291O759m529J403k42k350O746p153J697L559m484M891o041L510K949
2534C309p335P337n648K631L144q679Q833n059J823J896q187J1625p239m0L903
2549B314o098R239r111K809M455p608Q442q433M385L380q152P901p111N518N41
2564B471q236R972o052L198n30n535J0867r118K807J869n184Q961r622M186K548
2579B602n862P837r272N814K662q373P923o477N117K61p908J0317o622K375O81
2594A075n576J0013p842J599K387n121Q600q951L064L964o289O749p668M997K727
2609C728q653Q364n982M125N32p767J0621p023K451J048o334J1032r168K188L047
$$ plain form
2624 2209 -3477 5730 -4771 184 3370 -3962 4087 -4558 1973 2960 -5122 3769 -3037 2279 1263
2639 1263 -5012 4822 -2473 1113 134 -3419 5350 -3186 89 1086 -1911 3981 -3911 677 2145
2654 2145 -2427 2380 -3024 1238 2390 -3804 2601 -1554 1015 1487 -4503 4178 -1199 -654 1536
2669 1536 -3576 4773 -2407 -1007 2583 -3149 4067 -3518 66 3289 -3800 3435 -3614 1671 2190
2684 2190 -4520 3889 -2602 1986 482 -3940 4621 -2781 1197 -81 -2242 4392 -3539 802 375
2699 375 -1046 2716 -3457 1471 926 -1366 1280 -1973 1710 496 -1869 1347 -586 680 273 -1912
2715 -1912 2196 -287 -862 888 -1582 2249 -1323 -1145 2155 -2054 2232 -1731 -356 2674 -3188
2730 -3188 2342 -1847 726 1797 -3716 3176 -1943 847 777 -3062 3702 -2489 934 252 -1709 3150
$$ packed form
2624B209n686R207j0501M955L186p332Q049q645O531R87q082Q891o806N316j016
2639A263o275R834p295L586r79l553Q769q536L275R97k997N892p892M588J468
2654B145m572M807n404M262J152o194O405m155K569M72n990Q681n377N45K190
2669A536n112Q349p180J400L590n732P216p585L584L223p089P235p049N285N19
2684B190o710Q409o491M588j504m422Q561p402L978j278k161O634p931M341m27
2699C75j421L762o173M928n45k292K646l253L683j214k365L216j933J266m07k185
2715a912M108k483n75J750k470L831l572J78L300m209M286l963J375L030n862
2730c188N530m189K573J071n513O892n119K790p0l839O764o191L423o82j961M859
$$ plain form
2746 3150 -2932 1500 16 -689 1629 -2496 1663 -369 -414 494 -1175 1414 -906 -190 262 -182 460
2763 460 -516 122 31 236 -512 275 34 328 224 -1053 1388 -1118 464 -47 -907 1959 -2146 1308
2781 1308 -367 -805 1865 -2432 2072 -888 -195 1257 -2157 2599 -1762 295 677 -1203 2002 -1923
2797 -1923 1222 -371 -612 1360 -1621 1862 -1236 582 347 -1090 1758 -1426 745 -237 -225 764
2813 764 -1373 1250 -734 221 -92 -80 549 -984 1144 -1106 746 238 -417 1103 -1508 1473 -890
2830 -890 -261 1077 -1300 1512 -1186 765 164 -1095 1556 -1299 985 -520 232 607 -1350 1750
2846 1750 -1389 792 -234 -700 1137 -1745 1795 -1212 -170 1270 -1474 1381 -1124 851 89
2861 89 -1029 1292 -1125 644 -368 328 43 -847 1259 -1070 928 -594 194 331 -1142 1622 -1402
$$ packed form
2746C150o082M432j484p05K318m125M159k032m5R08j669K589k320P16M52m44O42
2763D60r76O38r1K05p48P87k41K94j04j277K441k506J582n11q60K866m105L454
2781A308j675m38K670m297M504k960O93J452l414M756m361K057L82j880L205l925
2797a923L145j593k41J972k981L483l098J818k35j437K848l184K171r82J2R89
2813G64k137K623j984R55l13J2O29j533K128k250J852n08o55J520k611K981k363
2830h90O29J338k377K812k698J951o01j259K651k855K284j505P52L75j957L100
2846A750l139K181j026m66J837k882L540l007J042J440k744K855k505J975p62
2861H9j118K321k417J769j012O96k85q90K106k329J998j522P88J37j473K764l024
$$ plain form
2878 -1402 532 361 -833 1133 -1384 1362 -738 -222 937 -976 788 -948 1034 -623 -418 1089
2894 1089 -1296 1321 -1015 592 185 -1382 1989 -1876 756 186 -805 1221 -1740 1577 -550 -508
2910 -508 845 -1221 879 -897 565 -163 -388 1088 -1229 674 -238 411 -71 -879 1489 -712 130
2927 130 249 62 314 -599 435 -414 395 -213 313 -52 -433 1153 -1660 1031 -67 -383 702 -1755
2945 -1755 2179 -1400 -414 1445 -1702 1832 -1691 574 664 -1537 1967 -1899 1077 213 -975 1169
2961 1169 -1436 2072 -1015 -646 1541 -1240 1184 -1373 616 857 -1576 1492 -1027 375 506 -1249
2977 -1249 686 -291 275 216 -1192 1160 178 -1386 589 -167 294 30 -1398 1726 -585 -350 760
2994 760 -1491 2174 -1229 -85 831 -1242 2278 -2509 799 1414 -1672 1553 -2261 2266 -12 -2052
$$ packed form
2878a402J934j71j194J966k517K746k100N16J159j913J764j736J982j657K05J507
2894A089k385K617k336J607m07j567L371l865K632n70r91K026k961L317k127M2
2910e08J353k066K100j776J462p28k25J476k317J903r12O49m82q08K368k201Q42
2927A30J19j87K52r13J034q49Q09o08N26l65l81J586k813K691j098l16J085k457
2945a755L934l579R86J859l147L534l523K265R0k201L504l866K976q64j188K144
2961A169k605L508l087L69K187k781K424k557J989K41k433L068k519J402J31j755
2977a249J935r77N66n9j408K352r82j564J975p56M61k64j428L124k311K35J110
2994G60k251L665l403J144R16k073L520m787L308O15l086L225l814M527k278k040
$$ plain form
3010 -2052 2447 -2035 2118 -1083 -1429 2567 -2284 1900 -1528 -278 2670 -2765 1216 -552 438
3025 438 1253 -3099 2095 39 -779 820 -1625 1993 -436 -1383 1210 -823 1338 -657 -1423 2506
3041 2506 -854 153 -423 -567 2622 -2529 243 1162 -909 1835 -3113 1783 1102 -2091 1685 -2444
3057 -2444 2625 -59 -2857 2749 -1855 2283 -1612 -1741 3912 -2660 1159 -1111 -69 3059 -3951
3072 -3951 1757 -133 -297 1408 -3885 2869 119 -1256 956 -2223 3029 -1086 -1991 2236 -1147
3087 -1147 1570 -1638 -718 3171 -2291 638 -793 -26 2566 -3477 1082 761 -464 1178 -3426 2567
3103 2567 553 -1987 1315 -1812 2727 -1051 -2300 3059 -1718 1379 -1636 -1034 3866 -2954 935
3118 935 -633 -41 2690 -3905 1756 425 -718 1356 -3353 3184 -84 -1931 1512 -1787 2858
$$ packed form
3010b052M499m482M153l201l46L996m851M184l428J250K948n435L981j768R90
3025D38Q15m352N194k056q18J599k445L618k429r47K593k033K161j995p66L929
3041B506l360J007n76j44L189n151K772R19k071K744m948M896o81l193L776m129
3057b444N069k684k798N606m604M138l895j29N653o572L819k270J042L128p010
3072c951N708j890j64J705n293O754k750j375K212l179N252m115r05M227l383
3087a147K717l208R20L889n462K929j431P67K592o043M559l21j225J642m604N993
3103B567k014k540L302l127M539l778j249N359m777L097l015O02M900o820L889
3118I35j568N92K731o595N661j331j143K074m709O537l268j847L443l299M645
$$ plain form
3133 2858 -1623 -1861 2863 -1575 1623 -1881 -257 3153 -2809 1110 -719 472 1786 -3548 1994
3148 1994 268 -598 835 -2533 2936 -432 -1553 1298 -1431 2490 -1653 -1397 2733 -1630 1070
3163 1070 -1458 -146 2768 -2672 995 -106 -54 1529 -3211 1816 448 -931 760 -2135 2490
3178 2490 -364 -1541 1637 -1278 1888 -1257 -1097 2679 -1716 897 -1139 -187 2500 -2658 1190
3193 1190 -427 135 1375 -2893 2234 -252 -793 1009 -1880 2637 -1075 -898 1345 -1239 1601 -1585
3209 -1585 -525 1678 -1411 823 -1042 386 1207 -1741 909 -62 220 527 -1595 1366 50 -666
3225 -666 437 -876 1386 -463 -898 1272 -800 858 -524 -594 1627 -1522 547 -234 -194 1550 -1791
3242 -1791 756 1 -478 1055 -1872 1513 -346 -482 945 -1343 1715 -951 -300 934 -1017 1044
$$ packed form
3133B858m481k38M724m438L198l504J624L410n962L919j829J191J314n334N542
3148A994j726q66J433l368N469l368j121K851k729L921m143K56M130m363K700
3163A070k528J312K914n440L667j101N2J583m740N027j368j379J691k895M625
3178B490k854j177L178k915L166l145J60L776m395K613k036R52K687n158L848
3193A190j617N62J240m268N127k486n41J802k889M517l712J77K243k584K840l186
3209a585J060K203l089K234j865J428Q21k948K650r71K82L07k122K961j316p16
3225f66J103j313K262j849m35K170k072J658j382p0K221l149K069p81M0J744l341
3242a791K547p55m79J533k927L385j859j36J427k288L058k666O51J234j951K061
$$ plain form
3258 1044 -1034 185 687 -1061 801 -973 520 268 -720 644 -337 310 -226 -402 787 -292 41
3275 41 11 -109 398 -23 -401 324 -83 -19 217 -498 744 -434 -130 552 -404 735 -972 349 286 -574
3295 -574 745 -832 567 -108 -502 889 -1078 975 -580 -241 769 -916 971 -817 293 508
3311 508 -939 817 -480 255 -155 -232 552 -645 465 -212 114 -25 -93 453 -531 586 -198 -92 156
3330 156 -146 451 -549 552 -134 -243 329 -444 384 -329 376 -81 -242 455 -405 633 -482 340 171
3349 171 -720 849 -812 244 -185 -257 786 -983 698 -205 -211 500 -664 628 -663 452 -4 -353
3367 -353 492 -358 490 -513 260 180 -595 757 -513 321 -95 -195 542 -762 509 -202 -62 26 -152
3386 -152 320 -500 574 -244 152 108 -153 369 -649 749 -312 -307 573 -569 633 -638 195 354 -851
$$ packed form
3258A044k078J219N02j748J862j774J493k52r88J364r81O47n36j76J189j079L33
3275D1l0j20N07m21l78P25m07O4K36p15J242j178L04O82r56J139j707J321o3q60
3295e74J319j577J399o75l94J391j967K053j555L39J010j685J887j788J110K15
3311E08j447J756j297P35m10p7P84j197J110o77L26j39o8N46r84J117p84J06K48
3330A56l02N97j000J101o86j09N72p73Q28p13P05m57j61O97q60J038j115Q22j69
3349A71q91J569j661J056m29p2J043j769J681r03oP11j164J292j291J115m56l49
3367c53Q45q50Q48j003P73q0p75J352j270Q34m16j00P37j304J271p11J40Q8j78
3386a52M72q20J074q18L96m4k61N22j018J398j061NQ80j142J202j271Q33J59j205
$$ plain form
3405 -851 883 -504 429 -105 -229 373 -763 792 -426 264 162 -456 697 -722 664 82 -568
3422 -568 821 -794 653 -427 -82 663 -664 614 -298 3 250 -227 269 -139 69 19 -366 35
3440 35 184 -20 -345 284 -242 185 -139 -16 132 -444 588 -656 244 73 -586 496 -878 1008 -535
3459 -535 -484 889 -961 926 -1066 124 817 -1204 1108 -930 562 541 -1215 1337 -918 629
3475 629 -2 -793 1371 -961 385 -90 -370 980 -1226 387 57 -134 485 -724 586 248 -374
3492 -374 310 -317 473 142 -684 636 -137 -17 190 -895 1129 -239 -567 666 -801 1037 -893
3509 -893 -290 984 -1284 1271 -1105 256 1190 -1782 1375 -810 684 542 -1854 1849 -891 355
3525 355 -163 -1313 2085 -1484 285 145 -758 1605 -1810 530 385 -728 764 -1336 1019 473
$$ packed form
3405h51J734j387R33n34j24O02j136J555j218O90j02o18J153j419J386n82o50
3422e68J389j615J447j080L45P45j327J278r12L01K47m77M96m08K08n0l85M01
3440C5J49k04l25O29n26M27l24J23J48n76J032j244R00j71o59J082j374J886j543
3459e35N1J373j850J887j992J190O93k021K312k038J492k1j756K552k255J547
3475F29o31p91K164k332J346m75k80J350k206J613l30j91O19j209J310l38o22
3492c74O84o27P90l31q26J320p73J20K07j085K024j368l28J233j467J838j930
3509h93O03J274k268K555k376J361R34k972L157k185J494j42k396L703k740J246
3525C55n18j150L398l569J769j40r03K363l415K340j45j113J492k100K355n46
$$ plain form
3541 473 -1142 838 -524 812 -150 -1316 1589 -479 -109 -142 -739 1555 -1061 -306 661 -739 1370
3558 1370 -1419 213 1280 -1307 863 -1247 695 1056 -2039 1606 -769 700 335 -1932 2263
3573 2263 -971 -4 -21 -1300 2255 -1767 219 642 -987 1667 -2178 1036 877 -1300 1027 -1564
3589 -1564 1502 204 -1670 1297 -1014 746 -313 -1279 1931 -975 34 -240 -599 1935 -1699 325
3605 325 750 -649 1132 -1732 780 876 -1704 920 -1124 803 522 -2104 1738 -666 391 71
3621 71 -1313 2256 -1179 67 372 -672 1948 -1945 129 972 -739 1204 -1883 1335 766 -1525
3637 -1525 1258 -1193 1489 -38 -1620 1760 -723 890 -503 -961 2361 -1522 130 73 -594 1359
3653 1359 -1814 549 818 -867 849 -1435 1055 643 -1537 993 -860 820 -126 -1432 1551 -631
$$ packed form
3541D73j615J980j362J336r62j166K905k068L70l3n97K294k616P55R67j400K109
3558A370k789J632J067k587K170k110J942L61l095L645k375J469l65k267M195
3573B263l234R67j7j279L555m022J986M23j629K654l845L214j59k177K327k591
3589a564L066j298j874K967k311J760j059r66L210k906J009k74l59K534l634K024
3605C25M25j399J781k864K512R6k580K624k044J927k81k626L842k404J057l20
3621G1j384L569l435J246L05j044K620l893K074Q43j711J943l087L218n69k291
3637a525K783k451K682j527j582L380k483J613j393m58L322l883J652n7o67J953
3653A359l173K363K69j685J716k284K490m12k180K530j853J680r46j306K983k182
$$ plain form
3669 -631 250 -215 -945 1655 -1211 96 251 -192 1329 -1733 533 733 -910 769 -1467 1089 466
3686 466 -1367 1208 -850 765 -149 -1295 1716 -938 312 119 -602 1613 -1315 286 336 -228 1142
3703 1142 -1352 738 546 -778 793 -911 1097 105 -1037 876 -639 721 -485 -654 1196 -800
3719 -800 254 -111 -443 1321 -1348 359 9 -477 635 -1073 554 142 -816 639 -426 700 114
3736 114 -975 923 -373 323 -48 -659 917 -484 -113 -71 -391 799 -841 150 303 -639 562 -876
3754 -876 469 133 -763 703 -802 711 -101 -568 631 -454 478 -299 -319 828 -599 205 63 -99
3772 -99 461 -709 428 -37 -163 322 -385 197 -76 -267 141 -37 399 -123 -165 449 -76 -116 -50 -28 468
3793 468 -242 -96 276 -323 359 -372 100 257 -303 404 -382 219 238 -508 504 -203 30 -25 -282 465
$$ packed form
3669f31Q81m65p30K600k866J307J55m43J521l062K266K00j643J679k236K556o23
3686D66j833K575k058J615r14j146L011k654J250j93p21K215k928J601N0n64J370
3703A142k494K090j92j324J571j704K008r92j142J913j515J360j206j69J850j996
3719h00J054l65l32J764k669J707l50m86J112j708J627m12r58J455j065J126n86
3736A14j089J898j296O96l71o11J576j401L71M2l20J190j640R91J53r42J201j438
3754h76J345l36q96J466j505J513q12m67J199j085R32p77k0J147j427Q04j42j62
3772i9N60j170J137m65j26M85p07N82k73j91M08j78M36n22m2O14n25m0O6K2M96
3793D68p10J46L72n99O82p31M72J57n60P07p86O01J9p46J012p07K33n5k57P47
$$ plain form
3813 465 -524 40 138 -129 255 -228 277 -101 -72 255 -362 335 -142 124 49 -270 426 -229 241 -122 18
3834 18 98 -182 180 -41 14 286 -8 -154 -195 128 -160 158 -85 -65 -127 -185 58 -359 176 30 -223 42
3856 42 -410 248 -152 -17 153 -368 361 -361 -80 12 -102 340 -317 61 75 -153 190 -438 289 -314 91
3877 91 226 -287 300 -230 182 143 -5 161 -100 119 -66 -19 -27 -56 248 -329 200 -15 -53 15 -30 329 -195
3900 -195 173 -194 208 -17 -152 204 -100 272 -107 -96 286 -215 245 -160 76 174 -611 326 -321 247 -194
3921 -194 -233 330 -543 377 -87 7 417 -603 500 -284 138 122 -397 419 -190 185 -41 -124 375 -351 3
3942 3 -109 -36 119 -195 304 -25 -35 -70 -73 65 126 -86 54 101 -179 -17 -213 137 -65 -394 222 -265 251
3965 251 59 -584 612 -298 300 -73 -453 711 -598 316 -310 -31 545 -829 631 -146 -91 208 -974
$$ packed form
3813D65r89N64R8k67L84m83N05l78K9L27o17O97m77K66p5l19O96o55M70l63J40
3834A8Q0k80L62k21N5K72k94j46m1L23k88L18k43K0o2n8K43m17N35j46k53K65
3856D2m52O58m00J35J70n21P29p22K81R2j14M42o57L78J4k28L43o28P27o03M05
3877I1J35n13N87n30M12l9j48J66k61K19j85M7qk9L04n77N29k15l8O8m5L59n24
3900a95L68l67M02k25j35L56l04L72l79J1L82n01M60m05K36R8p85R37o47N68m41
3921a94l9N63q73R20m64R4M10j020J103p84M22j6n19Q16o09L75k26q3M99p26L54
3942Cj12P3J55l14M99l29j0l5lJ38O1k12J40M7k80J62j96L50k02l29O16m87N16
3965B51j92o43J196r10N98l73l80J164j309R14o26K79N76j374J460p77N5K99j182
$$ plain form
3984 -974 680 -299 -135 259 -484 588 -640 156 142 -384 521 -611 302 170 -387 184 -311 331 232
4003 232 -475 401 2 199 -42 -458 596 -182 -287 216 -331 531 -312 -334 890 -545 420 -371 -104
4022 -104 887 -1020 519 -248 57 583 -1064 768 -237 -125 463 -965 1320 -514 -322 445 -471
4039 -471 1115 -1182 92 502 -532 790 -1162 333 423 -877 489 -591 602 231 -802 795
4055 795 -113 -8 -100 -718 1019 -531 -383 294 -466 506 -613 -321 905 -654 460 -501 161 869
4073 869 -977 646 -189 117 530 -1285 1143 -48 -147 273 -1006 1447 -817 -433 650 -862 1086
4090 1086 -1034 211 810 -1085 800 -1028 740 499 -1476 943 -666 354 68 -914 1249 -238
4106 -238 -116 63 -439 1086 -910 -186 549 -507 608 -900 206 789 -810 488 -587 203 505
$$ packed form
3984i74J654r79J64L94p43J072j228P96j4n26R05j132R13j32n57N71m95O42r9
4003B32p07Q76l99J97k41m16J054p78j05N03n47Q62q43k2J224j435R65p91K67
4022a04R91j907J539p67L05N26j647J832j005J12N88j428K285j834J92P67r16
4039d71J586k297J274M10j034J322j952J495R0j300J366j080J193l71j033J597
4055G95r08J05r2o18J737j550J48O77p60R72j119K92J226j559J114r61O62P08
4073H69j846J623q35L06M13j815K428j191r9M20j279K453k264L84J083j512J948
4090A086k120J245N99j895J885j828J768k41j975K419j609J020k86r82K163j487
4106b38J22J79n02J525j996P24P35j056J115j508J106N83j599J298j075P90L02
$$ plain form
4123 505 -1087 945 -113 121 161 -1129 1146 -380 -391 455 -732 1034 -812 -126 729 -744 1016
4140 1016 -803 334 887 -1128 808 -637 267 451 -1432 1174 -565 8 49 -896 1353 -747 -66
4157 -66 336 -327 1083 -950 73 433 -578 572 -957 293 467 -860 506 -427 449 2 -1071
4174 -1071 951 -470 -11 95 -786 943 -585 -61 337 -411 913 -725 173 796 -707 581 -667
4191 -667 430 606 -961 819 -394 190 115 -897 971 -398 68 34 -626 976 -726 -100 271 -360
4209 -360 840 -891 442 464 -674 546 -787 435 158 -660 729 -516 240 -32 -516 861 -282
4226 -282 6 36 -326 520 -536 29 160 -395 383 -559 109 220 -398 394 -445 214 252 -609 522 -93
4246 -93 180 73 -453 715 -385 93 215 -397 583 -512 -4 374 -531 481 -473 329 178 -533 239
$$ packed form
4123E05j592K032j058K34M0j290K275j526j1Q46j187J766j846O86Q55j473J760
4140A016j819J137N53k015J936j445R04J84j883K606j739N73M1r45K249k100O81
4157f6M02o63J410k033J023L60j011J150j529J250J74j327J366r33Q76m47j073
4174a071K022j421M59J06q81J729j528N24L98p48J324j638Q98O23j503J288j248
4191f67J097J76j567J780j213N84p5j012J868j369M66l4o60J602j702O26L71o31
4209c60J200j731J333K2j138J220j333J222k77q18J389j245P56k72m84J377j143
4226b82K88L0l62Q46j056N65J31n55P78r42O68J11o18P92q39O59L8q61J131o15
4246i3K73j07n26J168j100M78J22o12R80j095N08L78r05J012r54Q02j51p11P72
$$ plain form
4265 239 -284 180 -31 -436 604 -361 148 165 -345 419 -270 143 89 -42 380 -427 164 36 -109 292
4285 292 -437 236 145 -372 347 -278 54 140 -270 389 -241 44 32 -285 321 93 -52 60 -253 -14 -250
4306 -250 63 197 -208 22 -177 62 18 -284 358 -123 43 103 -223 166 -95 48 -125 -181 390 -272 126
4327 126 61 -200 103 -234 30 62 -124 243 -158 17 29 -165 121 -248 139 16 15 40 83 -83 -131 30 19
4350 19 -65 30 -23 -131 13 225 -20 141 67 127 -42 -154 180 -70 224 202 -3 154 -240 186 -22 -91 101
4373 101 -215 30 -234 -61 28 -291 294 -78 116 146 -129 143 78 146 -70 -115 199 -91 7 -62 75 -118
4395 -118 -315 214 -239 24 -80 -157 -51 -46 52 -130 -53 -20 81 -124 65 -37 -156 -68 -98 30 -13 28 145
4418 145 -121 82 29 -13 135 -56 222 -290 38 117 -362 223 -239 92 43 -325 154 -274 244 166 -55 313
$$ packed form
4265B39n23M64k11m05J040r65N09J7n10P64o89M13n4j31M22q07N91j28j45M01
4285B92p29O73r1n17P19o25L32Q6m10O59o30K85j2l17O06k28j45J12l13K39k36
4306b50L13J34m05K30j99K39m4l02O42m81J66O0l26L89k61J43j73n6N71o62L98
4327A26o5k61L03l37K64L2j86L67m01J75J2j94K86l69L87j23jK5M3j66m8J61j1
4350A9q4R5n3j08J44K12k45J61p4O0j69j12L34k50K94k2k05J57l94M26k08o9J92
4373A01l16K45k64J73Q9l19N85l72J94L0k75K72o5O8k16m5L14k90R8o9J37j93
4395a18j97N29m53K63j04p7J06NR8j82P7L3J01k05J89j02j19Q8l0J28m3M1J17
4418A45k66K03n3m2J48j91K78n12L28P9m79N85m62L31m9l68M79m28N18p8k21L68
$$ plain form
4440 313 -301 183 2 -82 205 -290 224 -57 -45 66 -187 295 -160 48 -99 -168 14 -89 109 100 -184 240
4462 240 -68 -89 173 -260 153 193 -100 131 -126 -126 16 -320 162 -132 59 82 -330 353 -356 0 68 -426
4484 -426 390 -449 5 -19 -285 353 -525 179 24 -264 429 -500 419 -12 15 294 -522 346 -116 -113 514
4505 514 -328 204 -235 -73 362 -356 355 -35 151 203 -560 240 -7 -176 46 -175 214 -233 -296 455 -283
4526 -283 255 -251 -80 535 -487 122 -50 -224 427 -607 406 79 -199 705 -811 619 -21 -323
4544 -323 495 -611 693 -347 -279 562 -502 421 -300 -78 479 -702 281 -223 34 504 -622 580
4562 580 -75 -87 176 -546 625 37 -88 252 -325 409 -230 -157 593 -696 165 -264 8 464 -657 405
4582 405 -60 -215 555 -738 516 71 -377 450 -900 569 -169 -377 824 -709 478 -313 -329 668
$$ packed form
4440C13o14M84j81q4K87m95N14k81J2J11k53M82m55K08j47o9J82j03J98rk84M24
4462B40l08k1K62m33M13M0k93K31k57%J42l36M82k94J91K3m12O83p09L56O8m94
4484d26Q16q39M54k4k66O38q78P04j55k88O93r29R19m31K7K79q16Q68m62LO27
4505E14q42N32m39J62M35p18P11l90J86N2p63Q00k47j69K22k21L89m47o3P51p38
4526b83N38n06J71O15j022O09j72j74O51j034J013l27k78R04j516J430o40l02
4544c23Q18j106J304j040O8Q41j064R23p21K22N57j181R83n04K57M70j126J202
4562E80o55j2K63p22J171n88j25L40n77P34o39P3P50j289Q61m29K72M56j121J062
4582D05m65j55P70j293J254m45m48Q27j350J469p38k08J201j533J187p91j6R97
$$ plain form
4600 668 -706 525 -275 -3 572 -790 533 -317 -83 414 -728 746 -146 -337 354 -525 934 -393
4618 -393 -189 515 -413 582 -567 -39 555 -609 381 -125 75 447 -872 548 -17 -95 406 -568 583
4637 583 -44 -329 487 -448 497 -346 -246 608 -534 626 -143 -75 728 -777 497 -111 -101 423 -884
4656 -884 701 -217 -78 341 -710 877 -432 -87 475 -582 757 -446 -101 561 -491 408 -538
4673 -538 -1 531 -688 308 -235 263 454 -577 571 -49 -169 7 -409 715 -251 -171 245 -462 511
4692 511 -507 -67 540 -349 306 -327 129 558 -454 514 -267 -1 336 -670 649 -173 -115 395 -582
4711 -582 500 -496 -111 348 -378 503 -379 -103 320 -430 259 -194 148 306 -720 498 -211 100 256
4730 256 -346 508 -254 22 255 -316 364 -347 -126 248 -316 169 -386 33 333 -485 241 -78 230 327
$$ packed form
4600F68j374J231q00K72N75j362J323q50K34M97j142J474q92j91O91q79J459j327
4618c93K04P04r28R95j149N28N94j164R90n06K00L72j319J420n65p8N01r74J151
4637E83o27k85Q16r35R45q43J00Q54j142J160p69O8Q03j505J274o08J0N24j307
4656h84J585r18J39M19j051J587j309L45N62j057J339j203L45O62j052Q99r46
4673e38N37N32j219R96n43M98J91j031J148o20j20J76m16J124r66Q0M16p07R73
4692E11j018M40O07q89O55o33M56M29j012R68p81K66L37j006J319q22N8N10r77
4711e82J082r96L85M59p26Q81q82K76M23p50O89m53L42J58j026J218p09L11J56
4730B56o02Q54p62K76K33n71O80p11K21L74n64M85n55M19L00q18P26l19L08R7
$$ plain form
4750 327 -499 316 0 -127 213 -375 305 -188 -150 172 -201 277 -202 0 301 -303 189 -183 -37 205
4770 205 -347 198 -131 126 237 -402 446 -63 36 14 -280 397 -331 3 101 -215 421 -106 57 279 -323
4791 -323 60 -89 -72 -30 -164 -40 17 30 202 -209 313 20 -82 -140 -41 344 -141 32 88 -188 51 -246
4813 -246 48 155 -300 243 -19 99 199 -205 116 -144 3 119 -114 179 -153 16 235 -26 114 -1
4833 -1 15 -28 -207 137 -28 -26 100 -147 -4 -78 142 -7 57 133 -115 -65 -83 -102 91 -198 -81 5 -145 133
4857 133 -23 172 101 -118 -23 -24 -31 186 4 8 22 32 162 48 121 36 -150 133 -225 76 8 9 111 -120 123
4882 123 -136 -101 104 -85 57 -195 -90 93 14 345 -103 -106 85 -111 110 -75 -10 170 -328 54 50 -45 12
4905 12 195 -17 -33 32 -13 -55 111 -93 -67 -140 -138 120 19 -12 56 -142 218 -4 125 -6 70 58 4 -133 135
$$ packed form
4750C27q26Q15l16j27L40n88O80m93L8L22l73M78m79K02L01o04M92l72J46K42
4770B05n52N45l29K57J11o39Q48n09R9k2k94O77p28L34R8l16O36n27J63K22o02
4791c23L83j49J7M2j34J24N7J3J72m11N22k93j02n8R9L85m85J73N6k76K39k97
4813b46K94J07m55N43k62J18J00m04L21k60J47J16k33K93l32J69K19k61J40j15
4833aJ6m3j79L44j65KJ26k47J43p4K20j49O4P6k48N0j8j9J93k89J17Q6j50K78
4857A33j56J95p1k19R5jpK17j82MJ4J0J30j14P3q5j86K83l58L01o8JJ02k31K43
4882A23k59L5K05j89J42k52J05J83p9L31m48lJ91j96K21j85O5J80m98L82mr5N7
4905A2J83k12j6O5m5m2J66k04K6p3KK58j01l1O8j98L60k22J29j31P6j2n4j37K68
$$ plain form
4930 135 -90 -82 28 40 249 -337 224 2 13 128 -248 216 -45 -6 107 -83 247 -109 35 -66 -113 139
4952 139 -78 145 -20 -166 33 -86 -161 -87 -122 109 -18 167 16 49 105 -17 114 -152 -164 110 -224 14
4974 14 116 9 76 -124 28 77 -131 169 109 107 101 -143 192 -174 74 103 -301 373 -72 18 99 -245 311 -137
4998 -137 156 110 -283 269 -250 202 126 -315 258 -424 79 86 -165 411 -47 48 100 -51 432 -286 100 20
5020 20 -76 327 -522 214 -15 -178 278 -178 84 87 -306 231 -264 114 206 -300 273 -96 89 77 -324 423
5042 423 -320 30 67 -240 461 -470 159 287 -299 251 -479 255 101 -352 569 -332 282 -203 -379 570
5062 570 -468 216 -10 -211 546 -387 413 -204 -207 460 -632 510 -8 -204 309 -378 303 145 -258 447
5082 447 -184 283 -92 -357 385 -341 209 6 -72 532 -384 170 141 -308 576 -631 192 56 -421 535
$$ packed form
4930A35k25QJ10J2K09n86N61k22J1J15l76M64k61L9J13j90L30l56J44j01m7K52
4952A39k17K23j65j46J99j19p5P4l5K31j27J85j51L3N6j22J31k66j2K74l34K38
4974A4J02j07O7k00J52M9k08L00o0kok44L35l66K48K9m04O74m45R0Q1l44N56m48
4998a37K93m6l93N52n19M52p6m41N73o82N03Pk51N76m58R5N2j51M83p18L86q0
5020B0r6M03q49P36k29j63M56m56K62Ll93N37m95L78R2n06N73l69J85j2m01P47
5042D23p43L50L7l07P01r31O29J28n86N50p30P34j54m53R21r01O14m85j76R49
5062E70j038O84k26k01P57r33Q00o17lO67j092J142n18j96N13o87O81j58m03P05
5082D47o31M67l75k65P42p26N50k03p8O04r16N54k9m49Q84j207Q23j36m77R56
$$ plain form
5102 535 -407 314 91 -480 585 -591 401 -27 -287 649 -655 205 116 -255 545 -516 388 -181 -199
5121 -199 484 -614 340 -129 -176 403 -428 405 -92 -100 587 -767 287 -124 -210 391 -522 357 2 -176
5141 -176 345 -613 382 206 -390 404 -514 277 -33 -363 408 -421 373 -92 -467 575 -548 345 83
5160 83 -503 541 -482 371 50 -314 573 -502 317 -16 -201 440 -585 360 -199 -220 545 -526 342
5179 342 -233 -132 376 -573 394 -214 -136 380 -449 297 -78 -155 318 -490 344 -106 -218 397 -467 246 -18
5200 -18 -200 415 -526 176 59 -185 325 -521 139 49 -271 319 -460 245 64 -154 344 -504 251 -134 -225
5221 -225 406 -419 193 -189 -185 356 -412 371 -82 -315 350 -573 403 -90 -169 203 -411 290 20 -245 304
5242 304 -135 166 72 -187 171 -344 97 -217 -128 306 -366 292 31 -11 327 -373 306 -1 -171 361 -360
$$ packed form
5102E35r42P21k23n71J065j176R92m28k60R36j304Q60q9l71Q00j061R04n69j8
5121a99O83j098R54m69m7N79q31Q33m97qO87j354J054m11q6O01r13Q79l55j78
5141a76N21r58R95j76n96P94r18P91l10l30P71q29P94m65l75J042j123Q93k62
5160H3n86J044j023Q53l21l64Q87j075Q19l33j85O41j025R45n59k1P65j071Q68
5179C42n75J01N08r49R67o08P8N16q29P46l75p7M73q08Q34m50j12O15q64P13k64
5200a8j82O15r41P02j17k44N10q46O60r0l20N90p79P05j81k18M98q48P55l85r1
5221b25O31q25O12l82MN41p68P83m53k33O65r23R76m93p9L72o14P01k70k65N49
5242C04m39L01r4k59L58n15M41l14Q9M34o72O58k61m2L38p00O79l07j70N32p21
$$ plain form
5263 -360 44 -85 -283 388 -327 382 -44 -49 324 -375 331 -85 -286 234 -497 181 -94 -9 207 -285 187
5284 187 -28 -182 233 -112 177 -42 -75 172 -260 300 -11 -176 193 -125 54 -45 122 -15 -229 210 33
5305 33 -108 -24 -1 197 132 -233 96 -273 167 -26 15 73 -217 77 -145 -171 256 -158 6 -54 -23 137 -229
5328 -229 165 -135 -128 13 -214 -19 -78 -96 129 -246 230 21 -176 107 -129 36 -72 90 262 -306 -5
5349 -5 16 -37 92 -141 39 1 -96 -12 42 50 165 -60 90 -83 -65 117 69 -52 -104 -17 134 -46 90 -21 7
5374 7 -13 -155 -246 83 98 -99 -38 -120 -32 -2 127 -75 234 35 64 38 -226 112 -20 -5 137 -248 -1 -25
5398 -25 -24 -3 -137 55 -24 235 -212 -88 180 124 32 85 40 -58 -52 145 -143 -88 -56 -40 -70 124 71 36 -124 34
5424 34 -4 -62 0 -201 132 -38 -49 -10 51 155 -84 -168 49 -56 80 112 1 230 -191 36 152 -212 118
$$ packed form
5263c60M04j29j98O71p15P09m26nL73o99P06m16k01N20p31O78k75Q5K16m92M72
5284A87k15j54M15l45K89k19l3K47m32N60l11j65L69l18J79r9J67j37k14M39j77
5305C3j41Q4K3J98o5l65L29l69M40j93M1N8k90K94k22k6M27m14J64o0L1J60l66
5328b29L94l00PJ41k27J95n9j8K25l75M76k09j97K83k36J65j08J62J72n68L01
5349eK1n3J29k33J80l8r7Q4N4QJ15k25J50j73J8J82m8j21n2Q7J51j80J36j11K8
5374Gk0j42r1L29J5j97O1q2Q8L0J29k02L09j99K9k6k64L38j32J5J42l85K47k4
5398b5JK1j34J92p9K59m47J24K68n6r2N3m5r8OJ97k88N5L2J6l0J94n3l5j60J58
5424C4l8n8O2k01L33j70j1L9O1J04k39q4K17j05J36L2j11K29m21K27J16l64L30
$$ plain form
5447 118 -47 244 77 -91 159 -150 -18 17 -34 20 -124 295 59 -40 66 -257 72 -246 -35 67 -88
5468 -88 100 -73 -120 16 -33 55 -107 -33 9 -250 -50 -122 91 135 -6 113 -139 25 51 -86 88 -259 -174
5491 -174 29 -194 123 88 120 295 -118 238 56 -58 68 -317 302 -145 -91 118 -10 259 -24 -144 194
5512 194 -254 271 -170 66 299 -263 322 -170 149 83 -194 210 -41 -105 52 -209 290 -92 -32 317 -107
5533 -107 251 -131 159 39 -126 160 -109 15 200 -286 182 -300 -44 164 -330 180 -168 -37 222 -368
5553 -368 235 -31 20 407 -289 299 -46 -33 309 -377 226 -288 32 390 -449 189 -194 -35 80 -376 386
5574 386 -78 86 126 -396 414 -247 -22 121 -86 353 -224 98 133 -174 299 -255 172 147 -330 189 -205
5595 -205 54 204 -373 456 -219 -143 175 -543 440 -115 97 191 -309 411 -391 57 317 -340 391 -248 123
$$ packed form
5447A18j65K91j67j68K50l09J32L5n1N4j44M19k36r9J06l23L29l18K11J02j55
5468h8J88j73m7J36m9Q8j62P4M2k59K00p2K13M4j41J19k52J64K6j37J74l47Q5
5491a74K03k23L17l5L2J75m13L56j82j14J26l85O19m47N4K09j28K69k83j20L38
5512A94m48N25m41K36K33n62N85m92L19o6k77M04k51o4J57k61M99l82O0L49m24
5533a07L58l82K90j20j65K86k69J24J85m86M68m82K56K08m94N10l48J31K59n90
5553c68O03k66N1L87o96N88l45J3L42o86O03n14L20L58q39O38l83J59J15m56P62
5574C86m64J64M0n22Q10o61K25J43k07M39n77L22L5l07M73n54M27k5m77N19l94
5595b05K59J50n77Q29o75P6L18p18R83n55K12R4n00P20q02M48K60o57P31o39L71
$$ plain form
5616 123 485 -441 493 -204 115 174 -390 400 -379 71 113 -566 514 -188 174 33 -403 413 -314 -31
5636 -31 78 -481 414 -278 100 29 -225 511 -267 331 86 -493 319 -262 81 239 -301 346 -320 198 331
5657 331 -307 352 -379 37 266 -309 355 -100 197 284 -447 249 -328 79 97 -560 327 -290 61 278 -402
5678 -402 395 -248 106 302 -356 522 -442 -20 41 -107 477 -326 151 194 -280 278 -267 280 128 -513 254
5699 254 -332 -6 -28 -267 393 -157 48 238 -145 211 -295 186 263 -309 285 -207 165 134 -234 222 -332
5720 -332 69 90 -452 472 -232 166 146 -278 526 -376 -169 -21 -274 252 -394 33 150 -201 345 -255 123
5741 123 66 -337 337 -164 140 184 -181 307 -221 205 21 -402 436 -65 79 178 -82 343 -132 140 92
5762 92 -198 155 52 150 0 -244 210 -77 43 112 -229 136 -120 -163 15 -203 96 -115 15 19 -144 124
$$ packed form
5616A23L62r26R34o97L19N9n64P90p79M50M2o79J080p02L62j41m36Q16p27K83
5636c1J09n59Q95o92L78p1k54P36p78N98k45n79Q12n81L43J58n40O47o66N18J33
5657C31o38O59p31M16K29n75O64m55K97Q7p31O96n77M07J8o57Q87o17L51K17o80
5678d02P97o43L54J96o58Q78r64M22O1j48N84q03M77M3m74N58n45N47j52o41P67
5699B54n86L26k2k39O60n50K05J90l83L56n06M81P7n72N94m92L72l1l68M56n54
5720c32M01K1n42R24p04L98k0m24Q04r02K07J48k53N26o46M27J17l51N46o00L78
5741A23n7m03O74n01L04M4l65M88n28M26j84m23Q38n01J44R9k60M25m75K72m8
5762I2k90L53j03R8j50k44M54k87J20O9l41L65k56m3J78k18K99k11J30Mj63K68
$$ plain form
5784 124 -237 -33 47 -132 227 -51 133 150 -227 219 -166 64 -182 -66 316 -40 27 -4 -89 398 -220 14
5806 14 220 -188 207 -36 154 42 -12 148 -228 85 72 -146 135 -46 172 64 35 224 -55 -4 157 92
5828 92 33 -286 214 99 -104 101 -126 260 131 -227 285 -107 71 14 -156 237 -30 41 54 -60 160 -84
5850 -84 -33 109 -137 154 -208 -21 53 -157 -82 -40 233 -85 27 -69 -12 146 -119 -169 134 34 65 -86 -84 -40
5874 -40 -68 93 -26 -233 108 -59 -16 273 -34 125 23 -15 168 77 58 -57 -1 151 -125 -157 -70 96 -3
5897 -3 56 -40 -5 44 32 -95 29 5 1 5 53 -15 49 126 75 -24 76 -22 103 -168 -43 -2 -181 92 5 -115 94
5924 94 21 68 47 23 18 -42 116 132 -94 147 -111 81 124 -34 95 23 21 -216 -80 209 -86 35 -19 43 134
5949 134 -44 127 -50 -107 33 -156 -98 -9 -58 269 -156 133 146 -143 39 -229 -69 73 96 188 -273 242
$$ packed form
5784A24l61K04Q0j79L59k78J84J7l77M46l85K30k46J16L82l56O7l1q5M87o18K34
5806A4K06m08L95k43J90j12n4J60l76L13j3k18K81j81K18j08k9J89k79N1J61o5
5828I2n9l19N00j15k03K05k27L86j29l58N12l92J78n7j70L93k67P1J3j14K20k44
5850h4N1J42k46K91l62J87P4k10P5M2K73l18J12r6N7J58k65n0L03j00L1j51KM4
5874d0k8J61j19k07L41j67M3K89l07J59j02l8J83r1j9j15N6J52k76l2Q7J66r9
5897cN9r6L5M9j2j27J24k4mMM8o8O4P7n1r9J00r8J25k71J25M1j79K73q7j20K09
5924I4p3M7k1k4no0J58J6k26K41k58J92M3j58J29p2kk37J36K89k95J21n4O2R1
5949A34j78J71j77n7J40j89N8Q9m9L27m25K89J3k89J82k68J60J42K3R2m61N15
$$ plain form
5971 242 33 -75 148 -183 43 -56 93 202 -140 -100 -91 -203 -74 -109 9 59 41 144 47 141 -62 -36 102
5994 102 -159 -28 203 13 276 -120 -38 56 -100 263 -210 68 -4 179 41 -246 209 279 -353 183 -192
6015 -192 198 -19 -81 361 -120 127 -71 -92 315 -227 166 -63 -85 120 -203 170 101 -159 -2 -409 210
6036 210 -13 -43 192 -190 201 -145 -150 330 -178 281 45 -234 325 -244 100 4 -287 194 -299 127 48 42
6058 42 303 -333 198 42 -120 243 -205 202 -19 -227 198 -257 108 -63 -141 542 -285 224 -187 5 356
6079 356 -439 354 21 -197 241 -259 454 -27 -248 304 -246 373 -187 -55 289 -176 249 -159 3 340
6099 340 -377 255 -93 -1 326 -287 169 142 -109 39 -217 311 -87 -314 192 -248 422 -61 -180 363 -326
6120 -326 208 -54 -70 475 -439 169 -43 -76 253 -486 135 30 -140 256 -476 419 -121 -234 334 -319 455
$$ packed form
5971B42k09j08K23l31K26r9J49J09l42M0Rj12J29l5J18N0j8J03r7R4k03K6J38
5994A02k61J31K31j90K63l96Q2R4j56L63m73K78p2J83j38k87M55P0o32N36l75
6015a92L90k17o2M42m81K47j98k1M07n42L93k29k2K05l23L73o9k60J57m07O19
6036B10k23l0K35l82L91l46nM80n08M59k36k79N59n69L44r6k91M81m93M26p9o
6058D2K61o36N31j56j62L63m48M07k21k08M25m55L65j71p8O83q27N09m11J92L51
6079C56p95P93l33k18M38n00P13m81k21N52n50O19n60J32L44m65M25m08J62L37
6099C40p17O32l48R2L27o13M56k7k51J48k56N28l98k27N06m40O70m83j19N43o89
6120c26N34k62j6N45r14O08k12l3L29p39O21j05j70L96p32Q95n40j13N68o53P74
$$ plain form
6141 455 -139 -180 462 -406 424 -228 -167 383 -512 326 -261 -143 229 -230 393 71 -116 264 -157 251 -133
6162 -133 -234 304 -289 163 -217 -68 210 -88 178 -36 -80 481 -380 -5 -31 11 170 -431 392 -126 -236
6183 -236 128 -439 338 14 -248 455 -423 322 -155 -104 275 -420 262 -164 -32 376 -399 278 211 -167 304
6204 304 -352 346 35 -151 144 -185 255 -44 -56 257 -160 244 -31 -175 301 -242 194 -187 72 268
6224 268 -209 83 -39 -42 206 -361 221 97 -94 175 -287 353 -130 -220 320 -292 408 -273 -105 345 -243
6245 -243 212 13 -140 209 -256 237 -87 18 229 -213 39 27 -178 16 -323 215 -55 -83 209 -119 114
6266 114 -308 -11 203 -44 37 -67 98 185 -131 79 46 -183 387 -286 161 95 -133 133 -146 146 -34
6287 -34 -127 193 -169 116 14 -119 119 -84 221 -245 -163 200 -280 105 -72 -53 121 -168 165 -1 38 121
$$ packed form
6141D55n94m1O42q68Q30o52O1N50q95Q38n87J18L72m59O23l22j87L80m21M08l84
6162a33j01N38n93M52l80J49K78k98K66k14m4N61q61L75k6M2J59o01Q23n18j10
6183b36L64n67P77l24k62P03q78P45m77N1L79o95O82m26J32M08p75O77o7l78M71
6204C04o56O98l11j86K95l29M40k99j2L13m17M04k75j44M76n43M36l81K59J96
6224B68m77K92j22lK48n67N82j24j91K69m62O40m83r0N40o12P00o81J68M50n88
6245b43M55j99j53L49m65M93l24J05K11m42K52j2k05J94l39N38k70k8K92l28K33
6266A14m22K97K14k47Q1j04J65Q7l16K10l3k29N70o73M47o6k28K66k79K92j80
6287c4r3L20l62K85j02j33K38k03L05m66Q2L63m80L85j77J9J74k89L33j66L9Q3
$$ plain form
6309 121 -188 179 -144 -23 254 92 5 -206 103 112 -243 -109 -185 -40 44 -157 169 -46 -59 44 -76 -18
6331 -18 -5 -39 141 -115 -29 -28 -290 165 -106 99 160 1 67 -63 -64 5 -278 95 120 90 -14 -21 72 -105 -111 -221
6357 -221 -23 8 -115 79 34 -15 -44 -18 140 -102 39 185 -231 0 8 -36 204 -74 36 97 7 162 -32
6380 -32 -194 192 6 96 -57 -50 -62 92 122 -81 6 -166 -72 177 -145 -4 44 -187 -24 -12 165 -159 70
6403 70 42 16 11 12 -132 88 1 113 94 103 50 -52 -139 54 114 188 -183 84 -105 67 43 90 94 -97 -113 24 65
6430 65 -151 134 -39 27 -22 -15 -38 -177 241 9 53 -17 -3 83 -59 59 99 36 133 -167 83 -38 -147 201
6454 201 -127 -78 -57 -215 -16 -80 126 -132 -49 48 -197 43 -7 98 111 21 -22 -218 126 135 -36 140 -123 -98
6478 -98 -136 -47 -100 -97 42 212 -111 37 45 -144 206 -251 82 -64 21 140 -11 2 -139 -47 84 -236 68 54
$$ packed form
6309A21l09L67l23J21K77j62q7k11L09Rl55J34p6J45Q4k01L26k15j3J03j20N8
6331a8J3l4J80k56Q6Jk62M55k71K05O1j59O6j30jO9k83L73K5l0j04pR3j77oj10
6357b21J98L1j23J94m5m9k9K6J58k42J41J46m16K31Qm4K40k78J10O1r0J55j94
6380c2j62L86j86R0j53Pj2J54L0k03Q7j72R4K49l22J41M8k31J63J2J77l24K29
6403G0k8k6nJj44K20q7J12j9Rn3j02q7J93O0P4l71K67j89J72k4M7Mj91j6J37M1
6430F5k16K85j73O6m9Pk3j39M18k32M4p0J4Q6j42J18M0o3R7l00K50j21j09L48
6454B01l28M9K1j58J99o4K06k58Q3R7k45K40n0J05J3r0m3j96L44Rj71J76k63K5
6478i8l8Q9n3LJ39J70l23J48Qj89L50m57L33j46Q5J19j51J3j41R2J31l20L04j4
$$ plain form
6502 54 -47 3 -140 -21 -4 -73 48 -167 77 -49 -70 177 -85 171 -275 44 234 -195 166 -97 -87 183
6524 183 -219 248 -65 80 -171 -189 164 -154 -67 74 -214 240 -23 -113 -14 -146 -16 -81 44 84 78 185 -43
6547 -43 274 212 -135 -23 -89 -14 -77 -171 241 -171 10 209 -284 120 -122 73 -218 -39 87 -62 108 171
6569 171 -253 125 -50 119 349 -192 268 -191 114 -85 -125 190 -313 -99 213 -63 200 -167 93 -9
6589 -9 -138 286 -264 27 148 -240 146 -203 120 319 -239 253 -128 86 13 -209 377 -202 0 -40 -57 295
6611 295 -257 43 20 -304 290 -254 214 124 -31 98 -85 132 126 -342 375 -87 94 171 -312 375 -64 49
6633 49 -48 -105 226 -308 86 255 -240 265 -206 151 6 -211 329 -247 165 215 -346 215 -146 106 92 -198
6655 -198 368 -275 38 60 -225 339 -209 104 173 -38 300 -281 224 159 -147 294 -259 160 -84 -367 256
$$ packed form
6502E4j01N0j43J19J7o9J21k15K44j26k1K47k62K56m46L19J90m29L61k63J0K70
6524A83m02M67l13J45k51j8L53l18Q7J41k88M54k63r0R9j32J30o5J25M0oJ07k28
6547d3L17o2l47J12o6P5o3r4M12m12J81J99m93M04k42J95k91J79J26j49J70O3
6569A71m24L78j75J69K30n41M60m59L05j99m0L15n03K14L12k76K63l67K60j02
6589ij29M24n50K91J21l88L86l49L23J99n58M92l81K14p3k22N86n79K02m0j7L52
6611B95n52L00k3l24N94n44M68r0j55J29j83K17om68P17m62J81P7m83O87m39J13
6633D9r7n7L31n34L94J69m95N05m71L57j45k17N40n76M12N0n61N61l61K52j4k90
6655a98N66o43L13K2k85N64n48L13O9k11L38n81N05o5l06M41n53M19k44k83O23
$$ plain form
6676 256 -187 47 192 -141 292 -226 -117 301 -87 197 -268 27 219 -167 182 -302 253 301 -334 225
6696 225 -146 76 133 -205 373 -205 176 14 -284 374 -303 109 67 -49 526 -321 99 147 -96 158 -302
6717 -302 80 102 -191 262 -180 167 -76 -202 151 -105 5 140 -195 363 -256 69 216 -7 258 -206
6737 -206 -202 132 -42 144 -120 186 212 -331 117 -210 104 -163 -262 198 -145 71 58 -99 155 -256 -86 181
6759 181 -45 146 -314 227 75 -298 72 -151 3 14 -261 131 -44 109 20 -67 150 -152 16 -1 37 89
6781 89 -142 177 -12 -11 127 -157 64 66 -238 176 -210 98 85 -193 232 -72 -78 92 -60 186 -144 -47 67
6804 67 -124 261 -161 98 25 -133 300 -88 172 42 -99 233 -28 90 -45 -130 219 -34 103 71 179
6825 179 174 -21 42 35 -168 221 -42 88 60 -112 121 -92 4 189 -34 -47 -71 213 37 -220 148 -133 59
$$ packed form
6676B56m43K34J45l33M33n18J09M18l88K84m65K95J92l86L49m84N55M8o35N59
6696B25l71K22N7l38N78n78L81j62k98O58o77M12m2j16N75q47M20M8k43K54m60
6717c02L82K2k93M53m42L47k43j26L53k56J10J35l35N58o19L25J47k23K65m64
6737b06ML34j74J86k64L06K6n43M48l27L14k67r9M60l43K16j3j57K54m11J70K67
6759A81k26J91m60N41j52l73L70k23J54J1k75L92j75J53q9q7K17l02J68j7L8N2
6781H9k31L19j89JJ38k84K21Kl04M14l86L08j3k78M25l04oJ70j52K46l30R7J14
6804F7j91L85m22K59p3j58M33l88K60j30j41L32k61J18j35q5L49k53J37l2J08
6825A79nj95O3pk03L89k63J30k8j72K33k13R6J85k23j3k4K84j76k57L68k81J92
$$ plain form
6848 59 -71 -58 -71 57 97 108 -103 -4 -9 -86 63 -93 76 -89 -37 67 16 287 56 -31 27 -132 33 83 -99
6873 -99 58 58 68 -162 32 35 -48 -52 -58 58 29 -67 46 54 -31 54 -127 -5 -110 68 31 -142 7 -22 -79 0 -90
6900 -90 89 -124 86 75 194 62 112 61 61 -252 -29 -73 91 281 0 1 0 -48 -5 -21 107 79 -56 -23 62 -40
6926 -40 -83 97 49 -63 180 42 51 65 29 49 174 -25 174 231 53 -57 56 -49 -153 88 21 -73 37 23
6950 23 128 -64 -9 -210 -39 114 -101 -6 127 20 -69 -41 -17 -33 -28 47 -164 149 100 -114 71 -291 229 31
6974 31 17 161 83 2 54 -141 59 -70 207 130 -101 41 -124 33 -29 24 76 -157 -24 33 73 123 -55 136
6998 136 -60 22 198 -105 -23 -8 -10 269 44 155 117 -8 69 -60 4 133 -96 281 -73 76 -44 -67 233
7021 233 -224 -16 126 -176 205 -241 26 31 -143 198 -8 80 58 42 125 -183 208 46 -87 155 -227 85
$$ packed form
6848E9j30J3j3J28M0J1k11R9np7J49j56J69j65N2J04n1K71k31q7N8j59J65N0j82
6873i9J57%J0k30J94Lq3moJ16k9r6J13Qq5Q5j81J22j05J78l7j73J49k9n7P9r0
6900i0J79k13K10j1J19j32N0n1%l13K23m4J64J90k81Jjm8M3j6J28k8j35L3Q5j02
6926d0m3J80m8j12K43j38RJ4l6K0J25j99J99N7j78j10J13j05j04K41o7r4J10j4
6950B3J05j92N5k01J71J53k15R5J33j07q9K8K4j6NP5k11L13m9k14J85l62N20j98
6974C1j4J44p8q1N2j95K00j29K77p7k31J42j65J57o2N3N2k33J33N7M0N0j78J91
6998A36j96Q2J76l03Q2J5kK79k25J11l8j25P7j29O4J29k29L77l54J49j20k3L00
7021B33m57K08J42l02L81m46K67Nj74L41k06Q8k2j6Q3l08L91j62j33K42l82L12
$$ plain form
7043 85 -35 -210 106 -149 31 9 -177 165 -99 183 102 -129 242 -271 -7 -83 -29 137 -258 16 101 -86
7065 -86 194 -199 217 9 -208 -97 -168 204 44 -148 248 -288 46 -196 -133 359 -313 60 -107 -6 212
7086 212 -280 78 46 -114 87 -201 63 -73 -181 88 -216 283 6 -89 331 -214 101 -70 -256 395 -364
7107 -364 104 -21 -210 171 -188 172 52 -62 -36 -145 179 -11 -95 119 -315 141 -105 -51 348 -235 -1
7128 -1 -143 35 394 -382 58 -7 2 82 -301 208 5 -126 237 -179 -53 57 -7 137 -94 126 -143 -120 327
7151 327 -346 75 -217 -99 186 -299 162 75 -156 30 -97 132 -16 -19 199 -83 240 -37 -149 100 -148
7172 -148 -63 -14 -85 172 -286 157 -6 -19 213 -242 168 13 -213 118 -259 238 125 -48 33 -85 143 -23
7194 -23 -69 144 -208 188 -61 -103 364 -225 79 94 -89 244 -282 -15 21 -59 42 -280 180 -87 47 166
$$ packed form
7043H5j20j75L16k55J80k2j86L42k64K82q1k31L71n13K64p6N4J66l95K74Q5j87
7065h6K80l93M16k08k17J11p1L72j60j92L96n36L34k42O3M92o72L73j67J01K18
7086B12m92L58l2j60K01k88K64j36j08K69l04M99k77r5M20n45L15j71j86O51p59
7107c64M68j25j89L81l59L60j20j14K6j09L24j90q4K14m34M56k46N4L99n83K34
7128aj42J78L59p76M40o5RQ0l83N09k03j31L63m16J26J10o4J44k31K20k69K3M47
7151C27o73M21k92J18K85m85M61q7k31J86j27K29j48lK18k82L23k77j12K49k48
7172a48Q5M9p1K57m58M43j63j3K32m55M10j55k26L31l77M97j13j73Q1j18K28j66
7194b3m6K13l52L96k49m2M67n89L04J5j83L33n26K67L6q0J01l22M60k67J34J19
$$ plain form
7216 166 -166 92 31 -202 252 -144 119 -145 58 133 -371 199 -46 11 220 -117 201 2 -38 75 -56
7237 -56 294 -95 -63 298 -94 143 -104 168 217 50 25 -105 26 243 32 138 116 9 162 -305 86 -66
7259 -66 9 95 -329 184 -65 -36 169 -126 144 -147 -21 21 1 -72 -280 -55 58 -132 157 37 -90 52
7281 52 -92 198 -1 -126 100 -116 178 26 35 114 -153 24 -39 10 138 -137 232 -62 4 18 -140 20 -162
7304 -162 -49 148 -98 90 100 -265 43 -43 78 75 -40 177 -206 205 -34 40 61 -263 125 -200 96 89 -199
7327 -199 -17 3 41 39 68 75 -115 -7 -29 -207 76 -4 -129 245 -70 131 121 27 -83 -192 183 217 4 230
7351 230 -289 212 -120 -106 97 -125 67 87 81 -61 41 39 -83 -52 93 -134 -21 62 134 41 -74 33 46 90
7375 90 194 50 82 -127 -128 -136 -89 61 19 -41 -26 61 -76 -18 -57 120 14 100 1 147 32 -29 14 34 -63 -81 8
$$ packed form
7216A66l32K58o1k33M54l96K63k64K03P5n04N70k45N7K09l37L18j99m0J13j31
7237e6L50l89L2L61l92K37k47K72M9j67k5j30J31K17k11J06k2j07J53m67L91j52
7259f6P5Q6m24N13k49K9K05k95K70k91J26M2k0p3k08K25J13j90K89j20j27J42
7281E2j44K90j99j25K26k16K94j52RP9k67J77o3M9J28k75L69k94O6J4j58J60j82
7304a62J13J97k46J88J0l65L08q6J21lj15K17l83M11k39P4K1l24L88l25K96pk88
7327a99J82K0L8kK9Pj90J08k2j78K83q0j25L74l15K01j0r4j10j09L75L4k13K26
7351B30n19N01l32J4K03k22J92K0oj42J02kj22L1J45k27J13Q3P2r3j15J07J3M4
7375I0J04j44L2k09jqM7J50m2o0J5Q7j37N8l9J77j06Q6r9J46j15o1M3K0r7j8Q9
$$ plain form
7402 8 161 -7 16 51 -89 -151 -2 -9 -40 -154 -26 62 -76 232 -21 -76 -45 -284 14 -35 96 -117 -191 77
7426 77 -19 208 28 -58 151 -79 50 110 -19 58 120 -171 -22 -93 0 -24 116 -27 -6 -15 -74 95 53 -93 64
7451 64 101 83 -32 -66 28 64 142 -30 -165 6 13 95 23 36 183 -176 -196 -121 -124 47 93 130 81 -206 160 -48
7477 -48 87 213 -136 -17 107 184 88 40 -49 -92 63 -88 -145 -32 -16 39 64 48 89 -35 100 -32 -3 229
7501 229 3 108 -51 103 48 -240 32 6 -47 133 -110 191 -169 -113 -47 -220 -118 -96 -74 6 -107 25 -16
7524 -16 83 64 -258 69 8 130 237 42 84 59 12 223 67 197 -193 6 152 -252 65 -14 -113 228 -13
7547 -13 175 -107 42 31 -146 146 -35 191 159 -21 79 -9 -76 159 -234 232 -39 13 55 -226 94 -96
7569 -96 -6 82 -255 93 -45 83 285 -322 221 -36 6 -16 -142 90 -21 5 -35 -68 152 -112 70 40 -42
$$ packed form
7402HJ53j68K3L5j40o2J49pl1j14J28Q8j38L08k53n5L1k39K98m9J31k13p4K68
7426G7r6K27j80q6K09k30J29O0j29P7O2k91J49p1R3k4J40j43K1rn9J69m2j46J57
7451F4L7j8j15l4R4L6P8j72j35J71PQ2p2J3J47l59k0P5lJ71M6L7m9k87L66k08
7477d8J35J26l49J19J24P7r6m8q9m3J55j51n7J13J6N5K5j6M1j24J35j32K9K32
7501B29k26J05j59J54n5k88K72k6n3J80k43L01l60N6O6j73J02K2K2Q0j13J32m1
7524a6R9j9l22L27o1J22J07j95M2k5m7K11j56J30l90J99J46m04L17p9r9L41k41
7547a3J88k82J49j1j77K92j81K26l2j80J00q8o7K35l93M66k71N2M2k81L20j90
7569i6R0Q8l37L48j38J28K02o07N43k57M2k2j26K32j11K6m0l3K20k64J82l0q2
$$ plain form
7592 -42 112 -110 123 151 -203 125 -108 203 226 -153 130 -27 -16 54 26 181 -106 86 -2 -187 249 -203
7614 -203 -131 13 -122 259 -100 41 145 -117 173 -107 80 109 -37 66 -35 -5 160 -158 113 -4 99
7635 99 61 -224 169 -171 -80 177 -77 236 -112 -11 123 -253 127 -269 10 180 -203 110 -77 106 -21
7656 -21 -189 306 -189 -89 -101 -295 207 -249 -70 94 -168 292 -144 61 123 -165 62 -221 -139 60 -241
7677 -241 193 -99 164 -72 53 100 -164 -88 -37 -159 99 -130 53 176 -117 181 -288 172 103 -14 101
7698 101 -131 114 257 -39 170 -111 -101 59 -176 215 29 7 102 -332 260 -89 20 220 -51 110 -178
7719 -178 180 189 -352 172 -111 11 11 -117 233 -121 135 -15 -93 210 -137 14 86 -170 61 -173 -46 104
7741 104 -43 162 -136 50 -34 -229 -32 -37 20 222 -222 172 -47 147 151 -141 138 -115 -105 128 -18 8 -151
$$ packed form
7592d2J54k22K33K8l54L28k33L11K3l79K83j57J1P0k8J55k87J92q8j85M36m52
7614b03P2J44j35L81l59J41J04k62K90k80J87K9j46J03j01L0J65l18K71j17J03
7635I9l8k85L93l40R1K57k54L13l48J01J34l76L80l96K79J70l83L13j87J83j27
7656b1j68M95m95J00j2j94N02m56J79J64k62M60m36K05O2k88K27k83Q2J99l01
7677b41M34k92K63k36J25M7k64P6N1j22K58k29J83J23k93K98m69M60o9j17J15
7698A01k32K45J43k96K09k81J0J60k35L91j86k2R5m34N92l49J09K00k71J61k88
7719a78L58Rn41N24k83J22%j28L50l54K56j50p8L03l47J51P2k56K31k34J27J50
7741A04j47K05k98J86q4j95J97nN7K02m44L94k19J94Mk92K79k53J0K33j46K6j59
$$ plain form
7764 -151 -11 214 -209 -112 -199 -126 104 -180 314 77 54 -2 -16 34 -9 -90 -154 -158 45 -31 44 90 -44 184 -32
7789 -32 -49 -7 12 165 -22 60 362 -88 266 -123 17 -5 -21 103 44 -165 78 25 50 1 -67 -12 -176 96
7813 96 -260 85 66 -112 -20 -78 115 57 -63 284 -127 -56 -149 -205 104 -237 -124 11 -194 165 46 -41 108
7836 108 45 100 -55 66 0 -174 -43 -174 88 91 -214 59 -54 38 36 -52 163 76 -48 17 -244 3 -144 33
7860 33 66 -83 23 14 -68 -156 -199 -86 46 22 183 -33 69 -71 -80 -18 -327 121 -86 -60 100 -172 -139 -114 -47
7885 -47 26 -99 -1 25 -107 -10 -12 183 -20 111 -43 -119 135 43 -40 73 -96 129 -39 74 105 -213 147 -115
7909 -115 27 -54 -15 -87 -127 -54 6 -9 -82 -134 16 219 46 -9 -251 78 203 -53 40 -67 -70 67 -34 63 -63
7934 -63 -81 78 93 254 84 -120 -23 -38 49 28 -31 -164 6 -168 92 -120 -66 -68 -128 111 92 46 -77 83 -92
$$ packed form
7764a51J40K25m23R7q7P3K30k84M94k37k3n6j4N0m3q1o4mK03p6P5M6j34K28k16
7789c2j7M2J9J53j87Q2L02m50L54l89J40k2j6J24n9k09K43n3K5m9o8N5j64K72
7813I6l56L45j9j78R2n8J93n8j20L47m11P1r3n6L09l41J13J35k05L59j19q7J49
7836A08o3N5j55J21o6j74J31j31K62Ll05K73j13R2kq8K15q7j24O5k61K47j47J77
7860C3L3j49J06rq2q8m3J13J32k4J61k16J02j40rO2l09M48k07K6J60k72L3K5O7
7885d7P3j25R8K6j32R7kJ95k03J31j54p6K54r2q3J13j69K25j68J13L1l18L60k62
7909a15J42q1L9p2m0P3O0j5p3n2J50K03j73n5k42L29J25k56R3j07lJ37j01R7j26
7934f3j8J59J5J61j70k04R7j5Q7k1n9j33J70j74K60k12N4ko0K39j9m6j23J60j75
$$ plain form
7959 -92 132 -5 -117 -39 -117 89 48 -92 -107 7 67 7 -95 -66 49 169 37 97 341 26 -111 -17 46 162
7983 162 -106 46 199 51 234 -26 198 19 -158 104 -58 -68 49 -92 336 12 10 138 -118 34 -98
8004 -98 -93 -163 -10 46 -108 -64 21 -62 250 -14 145 -30 -65 74 -94 10 -74 70 105 -120 -43 105 -184 -103
8028 -103 -61 -40 -48 -148 85 -44 -129 177 24 195 -93 72 79 -27 255 -194 15 1 -73 98 -167 165 -44
8051 -44 23 82 -120 81 130 6 229 -84 158 99 -33 84 -78 133 -45 -161 -41 -5 64 -114 -40 127 -197
8074 -197 78 98 -62 158 -142 -55 32 35 325 -216 88 -192 -103 65 -109 105 -16 -29 122 -68 -30 -23 -37 88
8098 88 -25 65 -124 -66 158 -12 15 -11 7 164 47 10 -37 -42 88 -159 -34 -179 -72 50 -93 88 119 -77
8122 -77 332 -152 21 -10 -48 370 -172 244 105 -123 60 -121 258 47 -36 140 -162 131 -141 29 191
$$ packed form
7959i2K24j37j12P8p8K06m1j40j5J14O0o0j02K9J15J20j32O0K44l15j37R4O3J16
7983A62k68J52J53j48J83k60K24j79j77K62j62j0J17j41M28l24kJ28k56J52j32
8004i8Np0J53N6j54M4Q5q3L12k64J59j75l5J39j68J04q4J44L5k25P7J48k89Q1
8028a03M2K1qj00K33j29q5L06j53J71k88J65Pj06K82m49K09j4p4J71k65L32k09
8051d4O7N9k02K01M9j24K23l13K42n9j32J17j62K11j78j16J20L6O9j78P4J67l24
8074a97K75K0j60K20l00Q7Q7LK90n41L04k80Q9J68j74K14j21j3J51j90L8Pj4J25
8098H8j13R0j89N8K24j70K7k6J8J57j17l7m7nJ30k47J25j45J07J22j43J81L1j96
8122g7M09m84J73l1l8M18n42M16j39k28J83j81L79k11q3J76l02K93k72J70J62
$$ plain form
8143 191 -236 157 -50 -96 216 -97 185 -110 -19 191 -100 -20 -105 170 328 -124 -33 4 -134 4 -45 -45 38
8166 38 -169 156 -220 333 -103 -42 314 -98 160 60 -39 64 39 107 -17 -62 16 -147 89 -40 -242 91
8188 91 -121 104 80
$$ packed form
8143A91m27L93k07m6L12l13K82k95R1K10k91Q0q5K75J58m52R1L7j38J38m9%Q3
8166C8k07L25l76N53m36O1L56m12K58j00r9J03k5O8j24m5P8j63K36j29k02L33
8188I1k12K25k4
8191H0
$$ Imaginary data points
##PAGE= N=2
##DATA TABLE= (X++(I..I)), XYDATA
$$ plain form
0 0 0 0 0 0 0 0 0 -8 8 -8 8 -16 16 -16 24 -32 40 -48 56 -64 79 -93 108 -125 144 -165 189 -220 249 -285
30 -285 322 -362 409 -460 515 -575 641 -713 794 -878 971 -1074 1184 -1304 1438 -1581 1739
47 1739 -1911 2102 -2311 2542 -2800 3089 -3413 3784 -4207 4696 -5269 5949 -6773 7789 -9070
62 -9070 10741 -12994 16179 -20965 28826 -43619 79739 -309236 -340676 493691 -367362 374785
74 374785 -320986 -73193 442922 -403209 223988 -198789 96236 197078 -307834 123978
84 123978 -52578 185678 -123650 -153700 193866 12192 -7846 -199541 160281 98121 -136234
95 -136234 -21996 2842 131867 -66788 -67686 -16632 138247 -28595 -104636 39826 -26976
106 -26976 226552 -288525 14696 224987 -191162 171884 -300251 241828 104347 -346148
$$ packed form
0@%%%%%%%qJ6j6J6k4L2l2M0n6P2q8J04j20J43j72K01k33K69l09L54m09M69n34
30b85O07o84P71q69R75j090J216j354J507j672J849k045K258k488K742l019L320
47A739l650M013m413M853n342N889o502P197p991Q903r965J1218j2722J4562j6859
62i070J9811k3735K9173l7144M9791p2445J23358l88975l1440Q34367q61053P42147
74C74785o95771K47793N16115q46131O27197m22777K95025J00842n04912M31812
84A23978j76556K38256l09328l0050L47566j81674k0038j91695L59822o2160k34355
95a36234J14238K4838J29025j98655q98N1054J54879j66842p6041J44462o6802
106b6976K53528n15077L03221K10291m16149L63046m72135N42079j37481m50495
$$ plain form
116 -346148 305285 -243077 234868 -53490 -245959 341432 -244990 211912 -179238 -57095
126 -57095 310586 -288598 144728 -149315 150053 71216 -296064 256425 -119709 105841
136 105841 -72405 -115459 249135 -177444 78568 -63155 -12711 159512 -161502 18373
146 18373 27963 40254 -12896 -84943 37884 95934 -69712 -78551 114535 -51627 60554
157 60554 -85582 -19795 158627 -164923 104366 -86937 27178 126996 -214283 145439
167 145439 -70936 69581 -5952 -152293 222031 -138465 62413 -52938 -15098 154122
177 154122 -211484 151756 -87349 33657 78808 -193928 194557 -117109 60664 5376
187 5376 -128391 205233 -143224 35965 5283 -30686 99506 -131629 66681 7359 -14585
$$ packed form
116c46148O51433n48362M77945k88358j92469N87391n86422M56902l91150J22143
126e7095L67681n99184M33326k94043K99368p8837l67280N52489l76134K25550
136A05841j78246m3054L64594m26579K56012j41723N0444J72223l21014J79875
146A8373R590J2291n3150p2047J22827N8050j65646q839J93086j66162J12181
157F0554j46136O5787J78422l23550K69289j91303J14115R9818l41279L59722
167A45439k16375J40517p5533j46341L74324l60496K00878j15351L7840J69220
177A54122l65606L63240k39105J21006M5151k72736L88485l11666J77773n5288
187E376j33767L33624l48457J79189l0682l5969J30192k31135J98310n9322k1944
$$ plain form
198 -14585 9383 -36011 42966 -13807 11543 -42234 37304 3576 -16207 8902 -42055 86269
210 86269 -65517 2627 23438 -23357 53698 -89285 70827 -19394 -11210 33102 -72638
221 -72638 97197 -75107 34821 -645 -47668 105831 -119781 75196 -20100 -21171 70302
232 70302 -117816 114361 -56051 -6427 47063 -78622 96354 -76349 29085 12552 -40391
243 -40391 62774 -68221 46230 -17118 236 15155 -39462 53430 -42226 23147 -11146
254 -11146 -3129 27076 -43621 40952 -29549 17955 -989 -19504 32069 -34179 33350 -27935
266 -27935 11183 11447 -26551 34376 -39036 36744 -19490 -6482 28587 -41351 45690 -37872
278 -37872 16966 8867 -30391 43399 -45153 33611 -11476 -11669 29031 -38195 38611 -28100 9631
$$ packed form
198a4585K3968m5394P8977n6773K5350n3777P9538l3728j9783K5109n0957J28324
210H6269j51786O8144K0811m6795P7055j42983J60112r0221Q184M4312j05740
221g2638J69835j72304J09928l5466m7023J53499k25612J94977r5296j071R1473
232G0302j88118K32177j70412M9624N3490j25685J74976j72703J05434j6533n2943
243d0391J03165j30995J14451o3348J7354J4919n4617R2892r5656O5373l4293
254a1146Q017L0205p0697Q4573p0501M7504j8944j8515N1573o6248O7529o1285
266b7935L9118K64l7998O0927p3412P5780n6234J3008L5069o9938Q7041q3562
278c7872N4838q099l9258P3790q8552P8764m5087j93M0700o7226P6806o6711L7731
$$ plain form
291 9631 10173 -24876 32129 -31676 23312 -9973 -5172 18583 -26901 27666 -20717 9996 1996
304 1996 -12981 21028 -24312 20805 -11747 5 10562 -18101 21549 -19202 11818 -717
316 -717 -9868 16350 -17917 14805 -8869 790 7103 -12571 13784 -11416 6578 -1335 -3720
329 -3720 7887 -10259 10206 -7227 2380 2535 -6689 9193 -9429 6566 -1749 -3582 7370
342 7370 -9035 7781 -3283 -1904 5910 -7552 7106 -3774 -1370 5634 -7567 6677 -3430
355 -3430 -1449 5672 -7511 7343 -5417 1153 5531 -9965 9366 -5931 3448 -26 -6989 12943
369 12943 -13132 7699 -2115 -4520 11693 -15626 13546 -7529 -63 10820 -18547 15629 -5967
382 -5967 -362 2927 -9735 15313 -9437 -2610 6142 -1008 -1717 105 -822 818 6350 -12729 11337
$$ packed form
291I631N42l5049N7005o3805N4988l3285M801K3755m5484N4567m8383L0713q000
304A996j4977L4009m5340M5117l2552J1752J0557k8663L9650m0751L1020j2535
316g17r151K6218l4267L2722k3674R659O313j9674K6355k5200J7994p913k385
329c720J1607j8146K0465j7433R607J55r224J5882j8622J5995q315j833J0952
342G370j6405J6816j1064J379P814j3462J4658j0880K404P004j3201J4244j0107
355c430J981P121j3183J4854j2760O570M378j5496J9331j5297R379l474o963J9932
369A2943k6075K0831r814k405J6213k7319K9172k1075P466J0883k9367L4176k1596
382e967N605L289j2662K5048k4750O827Q752p150p09J822r27J640N532j9079K4066
$$ plain form
397 11337 -7254 3075 9630 -27392 29495 -12453 -2461 6924 -17680 35500 -35090 11834 9169
410 9169 -16368 25320 -37109 33171 -13705 -3688 19425 -41649 52334 -33703 5047 10440
422 10440 -27467 56766 -64572 28023 17485 -34554 40024 -52155 44979 -4188 -33101 39868
434 39868 -35208 31035 -9336 -20474 23929 -7090 8125 -18523 2802 19462 -4293 -24670
446 -24670 13933 18108 -18134 1007 -11727 30139 -13592 -14838 17457 -16158 34636 -38027
458 -38027 7728 12796 -8830 27778 -70101 66494 -7651 -32658 34663 -55917 92892 -70807
470 -70807 -10488 67433 -77050 83662 -79324 21583 54219 -80890 73847 -74582 49616
481 49616 27108 -82817 62256 -30375 40869 -34179 -28683 69777 -38592 7278 -23295 25369
$$ packed form
397A1337j8591J0329O555l7022N6887m1948R992R385k4604N3180p0590M6924k665
410I169k5537M1688o2429P0280m6876J0017K3113o1074R3983q6037L8750N393
422A0440l7907Q4233j21338R2595j0538n2039P4578r2179R7134m9167k8913P2969
434C9868p5076O6243m0371j1138M4403l1019J5215k6648K1325J6660k3755k0377
446b4670L8603M175l6242J9141j2734M1866m3731j246L2295l3615N0794p2663
458c8027M5755N068k1626L6608r7879J36595p4145k5007O7321r0580J48809j63699
470g0807O0319P7921j44483J60712j62986J00907L2636j35109J54737j48429J24198
481D9616k2508j09925J45073r2631P1244p5048N496R8460j08369M5870l0573M8664
$$ plain form
493 25369 17169 -39583 17664 -11926 29208 -9768 -31527 21153 17557 -6117 -26665 3901
505 3901 30755 7335 -65280 41516 22143 -34203 26444 -61626 82285 -22778 -53930 76848
517 76848 -83187 97103 -53607 -50893 109596 -88949 74152 -77676 14246 97413 -129604
528 -129604 72086 -37098 39194 8749 -89253 101964 -56221 37118 -28415 -29408 86973
539 86973 -72977 39853 -46257 27916 55875 -105128 54836 -1984 14078 -8603 -56326
550 -56326 79004 -12570 -37244 14829 1496 17874 -1238 -46822 36201 22706 -38041 22328
562 22328 -48752 70186 -1414 -88564 85976 -37512 40297 -42668 -33291 111928 -96649
573 -96649 43628 -31032 9330 63721 -110003 82432 -51257 44187 10523 -104719 129025
$$ packed form
493B5369q200n6752N7247k9590M1134l8976k1759N2680l596k3674k0548L0566
505C901K6854k3420p2615J06796j9373n6346O0647q8070J43911j05063l1152J30778
517G6848j60035J80290j50710K714J60489j98545J63101j51828R1922Q3167k27017
528a29604K01690j09184P6292l0445r8002J91217j58185R3339o5533r93J16381
539H6973j59950J12830q6110P4173K7959j61003J59964n6820J6062k2681m7723
550e6326J35330r1574k4674N2073j3333J6378j9112m5584Q3023j3495o0747O0369
562B2328p1080J18938p1600q7150J74540j23488P7809q2965R377J45219k08577
573i6649J40277p4660M0362N4391j73724J92435j33689R5444l3664j15242K33744
$$ plain form
584 129025 -71742 35180 -27144 -38584 133049 -133668 48201 6731 -21233 66805 -112654
595 -112654 76671 544 -28696 30261 -58356 63218 -3826 -38272 7288 16594 17568 -29389
607 -29389 -17765 31034 26484 -55000 11527 16440 5038 642 -46368 52600 -13711 2778 -12673
620 -12673 -21129 68952 -57107 19195 -22368 22636 42426 -106820 86450 -30960 12216
631 12216 10993 -82621 129289 -88588 18756 21842 -63113 114653 -110172 38779 20552
642 20552 -41131 72077 -102993 68017 11075 -43583 29993 -40478 64092 -35967 -18954
653 -18954 28426 -8580 18393 -37241 18183 8453 288 -8900 -15112 28234 -3979 -6679 -20031
666 -20031 28792 2583 -18421 42 -2820 39424 -49554 16401 9093 -14053 35669 -65786
$$ packed form
584A29025k00767J06922o2324j1440J71633k66717J81869m1470k7964Q8038j79459
595a12654J89325p6127k9240N8957q8617J21574o7044l4446M5560R306R74m6957
607b9389J1624M8799m550q1484O6527M913j1402m396m7010R8968o6311J6489j5451
620a2673q456R0081j26059P6302m1563M5004J9790j49246J93270j17410M3176
631A2216j223r3614K11910k17877J07344L086q4955J77766k24825J48951j8227
642B0552o1683J13208j75070J71010n6942n4658P3576p0471J04570j00059J7013
653a8954M7380l7006K6973n5634N5424r730q165r188o212M3346l2213k700j3352
666b0031M8823k6209k1004J8463k862M2244q8978O5955p308k3146M9722j01455
$$ plain form
678 -65786 56403 -13689 -16880 36263 -67470 81344 -43406 -11872 36981 -48772 71177
689 71177 -71815 24299 28994 -46405 49547 -59946 50963 -9318 -28731 39774 -45724 52762
701 52762 -35488 -2615 25403 -28312 36965 -44829 24876 9789 -22303 16744 -21313 28270
713 28270 -15592 -4665 7279 -1187 7448 -16587 14283 -11145 16669 -14282 -4696 21291 -24206
726 -24206 26617 -31425 18826 10673 -32491 36203 -35065 31547 -12956 -16609 36938 -41185
738 -41185 38246 -28461 5129 21456 -36534 39891 -38036 26116 -472 -24847 36428 -37243
750 -37243 33956 -20881 -2783 24278 -32962 32343 -27199 14838 3457 -17953 24324 -25991
762 -25991 23350 -13648 -145 10393 -15903 20820 -22424 16673 -6048 -3503 11087 -18540
$$ packed form
678f5786J22189p0092l191N3143j03733J48814j24750L1534M8853q5753J19949
689G1177j42992R6114M695p5399R5952j09493J10909o0281j9413O8505q5498R8486
701E2762q8250L2873K8018n3715O5277q1794O9705j5087l2092L9047l8057M9583
713B8270m3862J0927J1944q466Q635k4035L0870k5428K7814l0951R586K5987m5497
726b4206N0823n8042N0251q153m3164O8694p1268O6612m4503l653N3547p8123
738d1185P9431o6707L3590J6327n7990P6425p7927O4152k6588k4375O1275p3671
750c7243P1199n4837J8098K7061n7240O5305n9542M2037j1381k1410M2277n0315
762b5991M9341l6998J3503J0538k6296L6723m3244L9097k2721K545J4590k9627
$$ plain form
774 -18540 22681 -20051 11666 -1446 -8594 18230 -24164 22569 -15742 5005 7785 -20055
786 -20055 26390 -24669 16616 -4722 -8638 20781 -26467 23843 -15233 3540 8845 -18471
798 -18471 23223 -21718 14644 -4352 -6564 15695 -20509 20471 -15808 7033 4279 -14168
810 -14168 19986 -20184 15500 -7089 -3179 12659 -18559 18742 -13919 6331 1849 -9554
822 -9554 14751 -16181 13769 -8054 939 6099 -11811 15666 -15369 10575 -2540 -5880 12128
835 12128 -15267 14886 -10556 2786 6057 -12299 14170 -12252 8226 -2733 -3605 9459 -12405
848 -12405 11030 -7669 3595 1017 -6038 10666 -12743 10128 -4059 -2071 6687 -10166 12129
861 12129 -10457 3767 4180 -9050 10091 -8514 5705 -1517 -3608 7430 -8015 5177 -1265
$$ packed form
774a8540M1221m2732L1717j3112p148K6824m2394M6733l8311K0747K780k7840
786b0055M6445n1059M1285k1338l916K9419m7248N0310l9076J8773N305k7316
798a8471M1694m4941L6362j8996k212K2259l6204M0980l6279K2841k754j8447
810a4168L4154m0170L5684k2589L910J5838l1218L7301l2661K0250m482j1403
822i554K4305l0932K9950k1823Q993N160j7910K7477l1035K5944j3115l340J8008
835A2128k7395L0153k5442J3342L271j8356K6469k6422K0478j0959q72J3064k1864
848a2405K3435j8699J1264k578p055J6704k3409K2871j4187J988Q758j6853K2295
861A2129k2586J4224M13j3230J9141j8605J4219p222k091J1038j5445J3192o442
$$ plain form
874 -1265 -871 905 -1197 3205 -4350 2296 456 406 -2473 1121 3254 -5361 3748 -1856 1224 -485
890 -485 -1704 4295 -5919 5156 -1578 -2247 3121 -2057 4277 -7914 5441 2663 -7691 5992
904 5992 -5013 6542 -4292 -4190 11554 -12056 7560 -887 -6980 12095 -11039 7086 -2998
917 -2998 -5201 16030 -18183 6526 6055 -9116 9376 -13376 12457 102 -13257 15959 -11557
930 -11557 6890 -278 -8158 11703 -10866 10123 -7221 -4638 15822 -13681 5178 -5217 6241
943 6241 5139 -20103 18380 -4576 -2947 5054 -11500 16928 -9941 -2265 9152 -13589 16646
956 16646 -6990 -11673 17711 -8355 3304 -5059 -5126 23732 -22935 395 15231 -14540 14639
969 14639 -18031 7945 12383 -21908 20506 -19044 10932 10372 -25663 20314 -13588 17521 -10774
$$ packed form
874a265L94J776k102M402p555O646j840n0k879L594K133q615R109n604L080j709
890d85j219N999j0214J1075o734o69N368n178O334j2191J3355k778j0354J3683
904E992j1005J1555j0834J02J5744k3610J9616q447o093J9075k3134J8125j0084
917b998k203K1231l4213K4709m71j5171J8492k2752K5833j2355j3359K9216k7516
930a1557J8447p168p880J9861k2569K0989j7344K583K0460k9503J8859j0395J1458
943F241j102k5242L8483k2956J629Q001j6554K8428k6869P676J1417k2741L0235
956A6646k3636m683K9384k6066J1659q363o7K8858m6667K3330J4836k9771K9179
969A4639l2670K5976M438l4291M2414l9550K9976n60l6035M5977l3902L1109k8295
$$ plain form
982 -10774 -17574 36816 -26479 11720 -9859 1224 24987 -41167 30005 -11456 -1786 20571
994 20571 -39696 34723 -11813 -2328 10818 -30407 41971 -18672 -15701 21549 -11163 15530
1006 15530 -20280 -610 24691 -19773 2006 2398 -3697 14873 -15510 -2884 12860 -6043
1018 -6043 8741 -20521 9119 20823 -27293 9797 -7072 17905 -4088 -29181 38673 -22466
1030 -22466 12813 -6990 -17828 44619 -42730 23717 -10809 -10420 47166 -62121 34187 -895
1042 -895 -10518 25627 -54565 55436 -13875 -23500 28375 -29123 37834 -26604 -6634 24530
1054 24530 -20520 21141 -23911 5158 19101 -15139 1108 -9306 18948 391 -22363 10723
1066 10723 9311 -3629 -6280 -6749 17371 -55 -18848 16173 -11376 14724 -1417 -28553 38717
$$ packed form
982a0774o800N4390o3295L8199k1579J1083K3763o6154P1172m1461R670K2357
994B0571o0267P4419m6536R485J3146m1225P2378o0643K971L7250l2712K6693
1006A5530l5810J9670K5301m4464K1779L92o095J8570l0383J2626J5744j8903
1018f043J4784k9262K9640J1704m8116L7090j6869K4977k1993k5093O7854o1139
1030b2466L5279j9803j0838O2447q7349O6447l4526L89N7586j09287R6308l5082
1042h95r623L6145q0192J10001o9311r625N1875n7498O6957o4438J9970L1164
1054B4530m5050M1661m5052K9069J3943l4240J6247j0414K8254j8557k2754L3086
1066A0723j412j2940k651m69K4120j7426j8793L5021k7549K6100j6141k7136O7270
$$ plain form
1079 38717 -22057 10386 -4821 -22193 55982 -51523 13636 12184 -21414 40959 -57601 37871
1091 37871 4454 -28965 36575 -46017 43070 -11926 -20096 28321 -31190 41124 -32245 -3494
1103 -3494 28573 -24336 21382 -30992 22803 9511 -28985 22140 -15815 17640 -5405 -16656
1115 -16656 20700 -8795 4857 -4472 -8510 18056 -3002 -16161 12124 -900 3226 -2501 -17936
1128 -17936 32646 -18398 -4706 14060 -20747 33120 -31013 6951 15805 -25190 32986 -38693
1140 -38693 22785 8455 -26395 28965 -34370 36678 -15536 -18020 34277 -33412 33013 -27954
1152 -27954 4003 24940 -36607 33709 -28479 14608 11763 -30916 29864 -21727 16107 -2747
1164 -2747 -18339 25999 -14547 4418 -4085 -87 9642 -9679 -557 3901 2546 -5288 4086 -6972
$$ packed form
1079C8717o0774L2443j5207j7372P8175j07505O5159j452l3598O2373r8560R5472
1091C7871l3417l3419O5540q2592Q9087n4996q170M8417n9511P2314p3369K8751
1103c494L2067n2909M5718n2374N3795j3292l8496N1125l7955L3455k3045j1251
1115a6656L7356k9495J3652r329m038K6566k1058j3159K8285j3024M126n727j5435
1128a7936N0582n1044J3692J8766l4807N3867o4133L7964Q854m0995N8176p1679
1140c8693O1478j4330l4850N5360o3335P1048n2214k484N2297o7689O6425o0967
1152b7954L1957K0937o1547P0316o2188M3087k845m2679O0780n1591L7834j8854
1164b747j5592M4338m0546J8965q503L998R729j9321R122M458j355p834R374j1058
$$ plain form
1178 -6972 9466 -1288 -10600 13578 -12332 14645 -12106 -3064 18226 -20876 17947 -17494
1190 -17494 10755 7147 -23528 27403 -24211 18669 -5173 -15217 29347 -31077 25839 -15650
1202 -15650 -3512 24732 -33243 28329 -19151 7323 10808 -27158 29610 -20399 10531 -648
1214 -648 -11955 20869 -19707 12787 -6671 406 7840 -12474 10650 -8233 8013 -4843 -1887
1227 -1887 6041 -5916 7080 -10530 9896 -4492 -647 3992 -8706 14323 -14510 9625 -3079
1240 -3079 -3901 12655 -18930 18111 -12010 4097 5656 -16490 22654 -19854 11755 -1930 -8556
1253 -8556 18830 -23337 19551 -10389 -337 10946 -19473 21900 -17097 8279 1835 -11653
1265 -11653 18241 -18548 13297 -5979 -1580 8924 -14159 14477 -10850 6339 -1154 -4254
$$ packed form
1178f972J6438j0754r312K4178k5910K6977k6751R042K1290l9102L8823l5441
1190a7494K8249l608l0675N0931n1614M2880k3842j0044M4564o0424N6916m1489
1202a5650J2138K8244n7975O1572m7480K6474L485l7966N6768n0009L0930j1179
1214f48j1307L2824m0576L2494j9458P077P434k0314K3124j8883J6246j2856K956
1227a887P928j1957J2996j7610K0426j4388L845M639j2698K3029k8833K4135j2704
1240c079q22J6556l1585L7041l0121J6107J559k2146L9144m2508L1609j3685o626
1253h556K7386m2167M2888k9940J0052J1283l0419M1373l8997K5376o444j3488
1265a1653K9894l6789L1845j9276M399J0504k3083K8636k5327J7189p493l100
$$ plain form
1277 -4254 9238 -12012 11857 -9452 4943 1308 -7646 11840 -13562 12292 -7136 -689 7935
1290 7935 -12349 13561 -12062 7442 44 -6736 11015 -12715 11766 -8273 2576 3985 -10324
1303 -10324 13918 -14137 9964 -3382 -3947 10707 -15180 14849 -10000 1825 5797 -11008
1315 -11008 13295 -12372 8216 -1852 -4735 9161 -10558 9909 -7723 4293 500 -6139
1327 -6139 10345 -11288 9350 -5688 791 5382 -10723 12845 -10594 5012 1295 -5967 9151
1340 9151 -10764 9429 -5119 -485 5087 -6976 7783 -8060 7097 -3284 -2153 7012 -8929
1353 -8929 8869 -7635 4464 887 -7134 11103 -10453 7043 -1995 -2052 6246 -9447 9814
1366 9814 -6655 1170 3088 -5182 6210 -7172 7095 -3854 -1277 5405 -6646 6371 -5952
$$ packed form
1277d254J3492k1250K3869k1309J4395l635q954J9486k5402K5854j9428O447Q624
1290G935k0284K5910k5623J9504p398o780J7751k3730K4481k0039J0849J409j4309
1303a0324K4242k8055K4101j3346n65J4654k5887L0029k4849J1825L972j6805
1315a1008K4303k5667K0588j0068k883J3896j9719K0467j7632J2016l793o639
1327f139J6484k1633K0638j5038O479M591j6105K3568k3439J5606l717p262J5118
1340I151j9915K0193j4548M634N572j2063J4759j5843J5157j0381J131R165j5941
1353h929J7798j6504J2099l577q021J8237k1556J7496r038n7Q298j5693J9261
1366I814j6469P825J918q270J1392j3382J4267j0949K577O682j2051J3017j2323
$$ plain form
1379 -5952 4544 -521 -5100 8196 -7313 4251 -1599 -445 2851 -5514 6315 -3970 306
1392 306 1489 -824 449 -2493 4414 -4130 1866 -725 626 1203 -5207 7941 -6459 1730 2756
1407 2756 -5510 6536 -6960 6022 -2037 -4051 8746 -8845 4932 -1843 443 2519 -7220
1420 -7220 9215 -6172 637 2494 -4032 5741 -7091 6050 -1891 -4197 8424 -8005 3906
1433 3906 -475 -1758 4507 -8205 7481 -658 -6594 7599 -4043 1266 467 -3532 6523 -5828
$$ packed form
1379e952J0496n065m579J3296j5509J1564n850J154L296q365J1829j0285M276
1392C06J183k313J273k942O907q544N996k591J351N77o410J3148j4400Q189J026
1407B756q266J2046j3496J2982q059k014J2797j7591J3777o775K286K076r739
1420g220J6435j5387O809J857o526R773j2832J3141p941k306J2621j6429J1911
1433C906m381j283O265j2712J5686q139n936J4193j1642N309p99l999J0055j2351
$$ [...]
8191a96
##END NTUPLES=NMR FID
##END=
