##TITLE=1H_LR-755-R3-P1
 CCl4
 8 sc, 
 17.1.2023
##JCAMPDX= 6.0         $$ Bruker NMR JCAMP-DX V2.0
##DATA TYPE= NMR FID
##DATA CLASS= NTUPLES
##ORIGIN= UXNMR, Bruker Analytische Messtechnik GmbH
##OWNER= root
$$ XWIN-NMR		Version 3.5
$$ Tue Jan 17 14:26:06 2023 Russian Standard Time (UT+4h)  she@DPX200
##.OBSERVE FREQUENCY= 200.13135
##.OBSERVE NUCLEUS= ^1H
##.DELAY= (6, 6)
##.ACQUISITION MODE= SIMULTANEOUS
##.ACQUISITION SCHEME= undefined
##.AVERAGES= 8
##.DIGITISER RES= 18
##SPECTROMETER/DATA SYSTEM= spect
##.PULSE SEQUENCE= zg30
##.SOLVENT NAME= CDCl3
##.SHIFT REFERENCE= (INTERNAL, CDCl3, 0, 15.7039)
##AUDIT TRAIL= $$ (NUMBER, WHEN, WHO, WHERE, WHAT)
$$ ##TITLE= Audit trail, XWIN-NMR		Version 3.5
$$ ##JCAMPDX= 5.01
$$ ##ORIGIN= Bruker BioSpin GmbH
$$ ##OWNER= she
$$ F:/spectra/data/she/nmr/H-F/1/audita.txt
$$ ##AUDIT TRAIL=  $$ (NUMBER, WHEN, WHO, WHERE, WHAT)
(   1,<2023-01-17 14:24:41.34 +0400>,<she>,<DPX200>,
      <created by zg, POWCHK disabled, PULCHK disabled
       configuration hash MD5:
       00 E9 B6 7A A2 85 ED C7 34 08 36 98 17 FE 4E 26
       data hash MD5: 16K
       D2 5C AD 9B 93 18 5F 72 70 AC 51 B1 DA 63 29 54>)
$$ ##END=
$$ 
$$ hash MD5
$$ 4A CC E6 55 2A 7D 6B FC B7 5B F6 E3 26 9E 15 1A
##$RELAX= 
##$RELAX= 
##$RELAX= 
##$RELAX= 
##$RELAX= 
##$RELAX= 
$$ Bruker specific parameters
$$ --------------------------
##$DU= <F:/spectra>
##$EXPNO= 1
##$NAME= <H-F>
##$PROCNO= 1
##$TYPE= <nmr>
##$USER= <she>
##$AMP= (0..31)
100 100 100 100 100 100 100 100 100 100 100 100 100 100 100 100 100 100 
100 100 100 100 100 100 100 100 100 100 100 100 100 100 
##$AQSEQ= 0
##$AQ_mod= 1
##$AUNM= <au_zg>
##$AUTOPOS= <>
##$BF1= 200.13
##$BF2= 200.13
##$BF3= 200.13
##$BF4= 200.13
##$BF5= 200.13
##$BF6= 200.13
##$BF7= 200.13
##$BF8= 200.13
##$BYTORDA= 1
##$CFDGTYP= 0
##$CFRGTYP= 5
##$CHEMSTR= <none>
##$CNST= (0..31)
1 1 145 1 1 1 1 1 1 1 1 1 1 1 1 1 1 1 1 1 1 1 1 1 1 1 1 1 1 1 1 1 
##$CPDPRG= <>
##$CPDPRG1= <>
##$CPDPRG2= <>
##$CPDPRG3= <>
##$CPDPRG4= <mlev>
##$CPDPRG5= <mlev>
##$CPDPRG6= <mlev>
##$CPDPRG7= <mlev>
##$CPDPRG8= <mlev>
##$CPDPRGB= <>
##$CPDPRGT= <>
##$D= (0..31)
0 1.2 0 0 0 0 0 0 0 0.06 0 0.03 0 0 0 0 0.0002 0 0 0 0 0 0 0 0 0 0 0 0 
0 0 0 
##$DATE= 1673951080
##$DBL= (0..7)
120 120 120 120 120 120 120 120 
##$DBP= (0..7)
150 150 150 150 150 150 150 150 
##$DBP07= 0
##$DBPNAM0= <>
##$DBPNAM1= <>
##$DBPNAM2= <>
##$DBPNAM3= <>
##$DBPNAM4= <>
##$DBPNAM5= <>
##$DBPNAM6= <>
##$DBPNAM7= <>
##$DBPOAL= (0..7)
0.5 0.5 0.5 0.5 0.5 0.5 0.5 0.5 
##$DBPOFFS= (0..7)
0 0 0 0 0 0 0 0 
##$DE= 6
##$DECBNUC= <off>
##$DECIM= 32
##$DECNUC= <off>
##$DECSTAT= 4
##$DIGMOD= 1
##$DIGTYP= 9
##$DL= (0..7)
0 120 120 120 120 120 120 120 
##$DP= (0..7)
150 150 150 150 150 150 150 150 
##$DP07= 0
##$DPNAME0= <>
##$DPNAME1= <>
##$DPNAME2= <>
##$DPNAME3= <>
##$DPNAME4= <>
##$DPNAME5= <>
##$DPNAME6= <>
##$DPNAME7= <>
##$DPOAL= (0..7)
0.5 0.5 0.5 0.5 0.5 0.5 0.5 0.5 
##$DPOFFS= (0..7)
0 0 0 0 0 0 0 0 
##$DQDMODE= 0
##$DR= 18
##$DS= 0
##$DSLIST= <SSSSSSSSSSSSSSS>
$$ [...]
##$SUBNAM2= <"">
##$SUBNAM3= <"">
##$SUBNAM4= <"">
##$SUBNAM5= <"">
##$SUBNAM6= <"">
##$SUBNAM7= <"">
##$SUBNAM8= <"">
##$SUBNAM9= <"">
##$SW= 18.05172834244
##$SWIBOX= (0..15)
0 0 2 0 0 0 0 0 0 0 0 0 0 0 0 0 
##$SW_h= 3612.71676300578
##$TD= 16384
##$TD0= 1
##$TE= 0
##$TE2= 300
##$TE3= 300
##$TEG= 300
##$TL= (0..7)
0 120 120 120 120 120 120 120 
##$TP= (0..7)
150 150 150 150 150 150 150 150 
##$TP07= 0
##$TPNAME0= <>
##$TPNAME1= <>
##$TPNAME2= <>
##$TPNAME3= <>
##$TPNAME4= <>
##$TPNAME5= <>
##$TPNAME6= <>
##$TPNAME7= <>
##$TPOAL= (0..7)
0.5 0.5 0.5 0.5 0.5 0.5 0.5 0.5 
##$TPOFFS= (0..7)
0 0 0 0 0 0 0 0 
##$TUNHIN= 0
##$TUNHOUT= 0
##$TUNXOUT= 0
##$USERA1= <user>
##$USERA2= <user>
##$USERA3= <user>
##$USERA4= <user>
##$USERA5= <user>
##$V9= 5
##$VALIST= <valist>
##$VCLIST= <CCCCCCCCCCCCCCC>
##$VD= 0
##$VDLIST= <DDDDDDDDDDDDDDD>
##$VPLIST= <PPPPPPPPPPPPPPP>
##$VTLIST= <TTTTTTTTTTTTTTT>
##$WBST= 1024
##$WBSW= 4
##$XGAIN= (0..3)
0 0 0 0 
##$XL= 0
##$YL= 0
##$YMAX_a= 465390
##$YMIN_a= -557492
##$ZGOPTNS= <>
##$ZL1= 120
##$ZL2= 120
##$ZL3= 120
##$ZL4= 120
##$ABSF1= 10
##$ABSF2= 0
##$ABSG= 5
##$ABSL= 3
##$ALPHA= 0
##$AQORDER= 0
##$ASSFAC= 0
##$ASSFACI= 0
##$ASSFACX= 0
##$ASSWID= 0
##$AUNMP= <proc_1d>
##$AZFE= 0.1
##$AZFW= 0.1
##$BCFW= 1
##$BC_mod= 2
##$BYTORDP= 1
##$COROFFS= 0
##$CY= 11.3945322036743
##$DATMOD= 1
##$DC= 2
##$DFILT= <>
##$DTYPP= 0
##$F1P= 2.36226072786647
##$F2P= -0.459571619588291
##$FCOR= 0.5
##$FTSIZE= 0
##$FT_mod= 4
##$GAMMA= 1
##$GB= 0.15
##$INTBC= 1
##$INTSCL= 1
##$ISEN= 128
##$LB= 0.24
##$LEV0= 0
##$LPBIN= 0
##$MAXI= 10000
##$MC2= 0
##$MEAN= 0
##$ME_mod= 0
##$MI= 1.114404
##$NCOEF= 0
##$NC_proc= 0
##$NLEV= 6
##$NOISF1= 3.799351
##$NOISF2= 2.8
##$NSP= 1
##$NTH_PI= 0
##$NZP= 0
##$OFFSET= 15.70392
##$PC= 1
##$PHC0= -19110.8
##$PHC1= 12.20073
##$PH_mod= 1
##$PKNL= yes
##$PPARMOD= 0
##$PSCAL= 0
##$PSIGN= 0
##$REVERSE= no
##$SF= 200.130013532006
##$SI= 16384
##$SIGF1= 3
##$SIGF2= 2
##$SINO= 400
##$SIOLD= 16384
##$SREGLST= <1H.CDCl3>
##$SSB= 0
##$STSI= 0
##$STSR= 0
##$SW_p= 3612.71676300578
##$SYMM= 0
##$S_DEV= 0
##$TDeff= 0
##$TDoff= 0
##$TI= <>
##$TILT= no
##$TM1= 0
##$TM2= 0
##$TOPLEV= 0
##$USERP1= <user>
##$USERP2= <user>
##$USERP3= <user>
##$USERP4= <user>
##$USERP5= <user>
##$WDW= 1
##$XDIM= 8192
##$YMAX_p= 0
##$YMIN_p= 0
$$ End of Bruker specific parameters
$$ ---------------------------------
##NTUPLES= NMR FID
##VAR_NAME=  TIME,          FID/REAL,        FID/IMAG
##SYMBOL=    X,             R,               I
##VAR_TYPE=  INDEPENDENT,   DEPENDENT,       DEPENDENT
##VAR_FORM=  AFFN,          ASDF,            ASDF
##VAR_DIM=   8192,          8192,            8192
##UNITS=     SECONDS,       ARBITRARY UNITS, ARBITRARY UNITS
##FACTOR=    0.0002768,     1,               1
##FIRST=     0,             0,               0
##LAST=      2.2672688,     0,               0
##MIN=       0,             -557492,         0
##MAX=       2.2672688,     465390,          0
$$ Real data points
##PAGE= N=1
##DATA TABLE= (X++(R..R)), XYDATA
0@%%%%%%%%qJ6k4L2m0M8n6Q0j04J28j60J92k32K80l35L99m70N51o45P51q70J004
30E37j154J323j508J715j946K196k473K782l120L488l891M333m815N340n913O541
46C435p226P974q793R690j0672J1750j2938J4248j5706J7337j9169K1242k3612
59a2440K6350k9552L3357l7965M3684n1000O0745p4484R5646j34455L15507o71009
71d35616N13527K0507k77949N99196r77157Q64961k81804j35071K48463m28286
81b89229N83605l43239m6065J12333o3527K80267m51365J98221Q7235K4015j63436
92g1185o9063L02824j60427j4110r2618J55196M6952j63347L1200p673J95038
103A52787k32777P7395o9422J39242R9785m89646N10131k09626L5001M9192l54015
$$ y = [0, 0, 0, 0, 0, 0, 0, 0, 0, -8, 8, -16, 16, -24, 24, -32, 48, -56, 72, -88, 104, -128, 152, -183, 216, -254, 297, -348, 403, -467, 537, -617, 706, -802, 913, -1033, 1163, -1310, 1472, -1648, 1840, -2051, 2282, -2533, 2807, -3106, 3435, -3791, 4183, -4610, 5080, -5592, 6158, -6780, 7468, -8238, 9099, -10070, 11172, -12440, 13910, -15642, 17715, -20250, 23434, -27566, 33179, -41305, 54341, -80114, 235393, -435616, 77911, 98418, -179531, 419665, -557492, 307469, 25665, -109406, 139057, -289229, 294376, -48863, -94928, 17405, -46122, 234145, -217220, -18999, 68236, 92251, -71185, -140248, 162576, 2149, -11961, -104579, 50617, 97569, -65778, -34578, -42251, 152787, -79990, -2595, -72017, 67225, 167010, -322636, 187495, -22131, 12870, 62062, -291953]
114b91953O65962n51978J56443J05351k67120N14007o28110L89167m6502j49408
124a04141L44782n88612N67635k09012j00370J86963l09368N08940m57876J18270
134d2789J43908k05701K91971m07599L08265k8887j53562K06682k68580K59979
144A03687o6300j21049R9356j8051N8548q5682j8649N9846Q6531j95613R5894
155a482M5984q5266J34555k41303K39350p7266q1216J71562k73248L29653k02536
166d1213k5108J55880k05947K89225l17941J58242P1474j79812K08369k70146
176a56977K86328j50828m5889J78279k65531L22957k60356O9088J10811k06370
186a18488K70946k87078J64283M1607j60743J66703j66721J66588q3486m5756
$$ y = [-291953, 374009, -177969, -21526, 83825, -183295, 330712, -297398, 91769, 45267, -104141, 240641, -347971, 219664, 10652, -89718, 97245, -212123, 296817, -161059, -42789, 101119, -104582, 187389, -220210, 88055, 59168, -94394, 112288, -156292, 103687, 37387, -83662, 15694, -2357, 56191, -29491, -48140, 11706, 98237, -97376, -1482, 44502, -40764, 93791, -147512, 91838, 14572, -66644, 104918, -168330, 161323, -41213, -66321, 89559, -116388, 172837, -145104, 13138, 84612, -95200, 113169, -156977, 129351, -21477, -67366, 110913, -154618, 168339, -92017, -22929, 87882, -118488, 152458, -134620, 29663, 71270, -89473, 77230, -89491, 77097, -6389, -52145]
196e2145J02146q6087Q0817q3274M6283o377R114n825m3943Q3272p3159O6671
208C7493q1895M7069N2322j20634J11564q9275Q4481m4041m1888J05795j21188
219f0197J24472j14300N2717M1363j10854J48835j69101J38023l3287q5321J48308
230H0658j62787J56592j06407r96J07356j54093J49450j18800N7362K7935r4405
241e8135J16478j09530Q4675l4558k4203N7221o5214P3340p7121N1759n070l1304
253b1662N1318o8152P5250n5718J7768J6051m0812O0200o5761N1278k8338N930
265b648K1359n1817O7805o0491M0661j7079j3648M8734p1465P0833n0826J8979
277C97J8866n3245P1617o9467N0177j6610k3296N4950o7100N9372l9008J1403
$$ y = [-52145, 50001, -36086, 44731, -38543, 7740, 1363, 10477, 4652, -39291, 43981, -29178, 37493, -44402, 2667, 54989, -65645, 45919, -43356, 41125, -2916, -44804, 60991, -60197, 64275, -50025, 2692, 44055, -66799, 82036, -87065, 50958, 17671, -67650, 80658, -82129, 74463, -31944, -32940, 74416, -79677, 69773, -49027, 8335, 36270, -58135, 58343, -51187, 33488, -1070, -25273, 31948, -33266, 40074, -37047, 14712, 9642, -21662, 29656, -38496, 36754, -18964, -1196, 14855, -25957, 34243, -31518, 19760, -8578, -2648, 18711, -33106, 34699, -25792, 14869, -2210, -15858, 32876, -38589, 32244, -18582, 397, 19263, -33982, 37635, -31832, 18345, 1735, -21561, 33389, -33711, 25661, -13347, -1944]
289a944J9748m5628N6359n0149L2428r438j3385L2101m3686M4557l3354J2911
301E20R195k5504L4230l6383L1444j8121j232J9773l0651L2777k8462J8039k040
314C585j5619K8133l0700K3459j1544l95J1007j9036K2541j9363J0524r32o198
327d538J1365j5130J6414j2779M434M531j0458J2776j2697J0542n628k251R913
340F494j3210J1671o756L26N425r330R580n612k51N529p464N397j707j924N271
355C439p792P103k791k840P549j0318J0200n616j682P362r884J1571j1698O996
369A599J815r887J4761j7280J5178o300o235J6076k0900K0414j1578l019J3654
382H298j5395J4132j3192O115O578j2649O975m49J131l360L998p344J1473o857
$$ y = [-1944, 17804, -27824, 28535, -21614, 10814, 1376, -12009, 20092, -23594, 20963, -12391, 520, 9715, -15789, 18441, -17942, 13502, -4619, -5851, 13922, -16729, 16048, -12414, 5625, 3585, -12034, 16099, -14601, 8858, -2686, -3081, 7926, -11110, 11431, -7932, 2592, 1660, -4538, 6827, -8303, 8111, -4668, -234, 4297, -6161, 6615, -6082, 4460, -1168, -3419, 6494, -6716, 4955, -1801, -1475, 3950, -5380, 4200, -1412, -1663, 3866, -3598, 1799, 92, -1832, 3439, -4353, 2750, -41, -2881, 4668, -5650, 4550, -1066, -2748, 4614, -5270, 6301, -5397, 1599, 3414, -6473, 8288, -8992, 6186, -114, -6349, 9727, -11173, 9241, -2337, -5356, 8298, -7097, 7035, -6157, -42, 6536, -6113, 862, 413, 1544, -1816, 2182, -5162, 6311, -546]
396e46n697J6721k4871L0155k1845n302L0967l6192L0740k7490J5567J4236m0675
409b4232M3212l3461K6183j1384j7508M2009m8937M7054l6271M050L6624n4832
421b7493N1306m9041L7987O530n9920P4554n3249L1544r122l2670O9173o2380
433b2781K6700R58k0491L9247l6069O746R426L212o342j1372Q967J7358j4652
446I07k4016L8431j3248J335j4669L545L5571m9354L1595k2434J5647K0754n8117
459c4053N2931l4961M2364l1196l6266R5331q4861N1903m4545J1779P8105j41780
471g5249J12824m4940n110O1617j24151J25368n7161m169L5672q0723J16705p5452
483a4769p078L3975k0508M7140q3932M5973K6987l5516L869j4895M3112k1983
$$ y = [-546, -6243, 10478, -14393, 15762, -6083, -11385, 19582, -16610, 14130, -13360, 2207, 16443, -24232, 18980, -14481, 11702, 318, -17190, 24819, -24118, 22936, -13335, -9285, 27339, -27493, 23813, -25228, 12759, 19289, -40631, 33923, -19326, 12218, 3096, -29574, 39599, -22781, 3919, 4877, -15614, 23633, -12436, -5690, 3736, 6948, 606, -10766, -1799, 15559, 907, -23109, 15322, 2074, 3409, -11260, -7715, 27856, -21498, 10097, -12337, 3310, 24064, -34053, 18878, -16083, 26281, -4915, -41181, 54150, -30711, 21192, -23353, -11574, 66531, -75249, 37575, -7365, -12475, 49142, -75009, 50359, -6802, -10971, 24701, -56022, 60683, -14769, -21847, 12128, -8380, 38760, -45172, 801, 27788, -7728, -3859, -18754, 24358, 2375]
495B375j2116J175J0661K0513l4350m794K2275J5470k7522j0866Q567M7601m3677
508d688m4581R4876n9990K8640k4950k8113J18034j35977P1222r164m1135J19386
520H3560j67066J08147o626m2466P7480j47686J65094o0593o0895R0194q4040
531d4897J11945j06392J6875O6923p6760P3244r1865O7904P762n1631N2085p7280
543e2087J03588m3507o0026Q3601m0143L3110m4847q652P9337o0126j3482L6458
555A3224k1523K9605k4688l3632P7421n2472J7138p169l8550J17721j20695K7919
567a5701M5235n5757Q1779j28116R7437J0717q3294Q9493r7087J05884n5708k7163
579c2281P1908r4953J31774j24133K7709P4721j05682J13127j34765R6769K9974
$$ y = [2375, -9741, -8566, 2095, 22608, -11742, -16536, 5739, 21209, -6313, -17179, -8612, 38989, -4688, -49269, 45607, -14383, 14257, -10693, -38806, 79228, -56749, 14473, 5309, -35826, 83560, -83506, 24641, 18015, -24451, 53029, -94657, 70437, 9844, -51051, 39143, -44897, 67048, -39344, -22469, 44454, -32306, 40938, -50927, 16977, 24739, -26892, 25193, -52087, 51501, 7994, -52032, 31569, -8574, 24536, -20311, -28963, 50374, -9752, -23234, 13224, -8299, 21306, -3382, -37014, 40407, -12065, 5073, -2096, -40646, 77075, -43620, -15701, 29534, -26223, 55556, -72560, 24877, 35594, -47700, 41793, -55294, 50590, -5118, -32281, 39627, -55326, 76448, -47685, -19976, 54745, -50937, 62190, -72575, 24194, 54168]
590E4168j33520J33860r4250O8670j2706p8647J20443q6129M2943j1817m3332
601d0317Q8978n8548o150J7782j207K3406m1725p597O0656l2309k5320K8699j3311
614f963L4291m5969N667L2033k9808L7079o6608N3386P967m2591M3147p2829J09489
627E8291o5387l8370R5538r4637J01675r9315K3301Q6748j36315J24428j00119
638d4162M5859N6558j35388J30499q7788N1827J1530j02221J33328p5820J6634
649H56k809k1970P3645q1473L0675M389p64J2343m2845L8185n543N66j1384q143
663a4272K9958o315k3318L254K7389j4239m123j8311L5598M10m4392M6059l5557
676a7859M0378k3131l2643P4644p2565N7926l9582j3515Q2793j02987O9990l7195
$$ y = [54168, -79352, 54508, -39742, 28928, 16222, -62425, 58018, -28111, 14832, 3015, -40317, 48661, -9887, -16037, 1745, 538, 23944, -17781, -25378, 35278, 2969, -22351, 6348, -6963, 27328, -18641, -12974, 19059, -10749, 26330, -40278, 13108, 21075, -21516, 21631, -51198, 58291, -7096, -45466, 50072, -44565, 57110, -42205, -18904, 67844, -68471, 55957, -44162, 1697, 58255, -77133, 53366, -34422, 17405, 28935, -73286, 60042, -15778, 856, -1953, -23923, 49722, -31751, -1076, 3313, 2549, 14892, -27953, 10232, 4689, 5255, -6129, -14272, 15686, 9371, -13947, -10693, 16696, 2457, -1666, -19977, 15621, 16031, -28361, 17698, -17859, 22519, -612, -33255, 41389, -31176, 26750, -12832, -26347, 56446, -46541, 23449, -13746]
688a3746J0470M3144r9803J00452n2962J2687J4923n6593R1368p9862L7782l651
700D209k6671O4569q0644N4409j7511l160K6756n9455O5341l1830j359J0297j8758
713a3807L6547l6603J2584L885j373J533r325Q900m193J2862k5737K1086n260
726A099l689J3071l4264M8498l4579N708J5135l0574M7825n2871L3245k155k3051
739a6602M2626n5725N0775k6697j870K5881m7370N9972m9733K0097R864l1639
751b0421M8153n4647M1511j3510j3654L2245m3397M4464l1584J0512R519k5831
763a6640L6720l6364K4277q947l584J5040k5640K9881k4748J5021m922o873J9305
776A2526k7306K7875k1729J0832K688j5951K5392k9173K7254j8125J878J6235
$$ y = [-13746, -3276, 39868, -59935, 40517, -12445, 242, 15165, -41428, 49940, -29922, 7860, 4209, -22462, 42107, -38537, 15872, -1639, -4799, 21957, -37498, 27843, -3987, -5346, 4951, -13807, 22740, -13863, -1279, 2606, 1233, 2766, -6559, 2341, -1852, 11010, -14727, 6359, 1099, -2590, 10481, -23783, 24715, -9864, -4156, 10979, -19595, 28230, -24641, 8604, 6449, -16602, 26024, -29701, 21074, -5623, -7493, 18388, -28982, 30990, -18743, 1354, 11218, -20421, 27732, -26915, 14596, 1086, -12568, 19677, -23720, 20744, -10840, -328, 9191, -16640, 20080, -16284, 7993, -954, -4538, 10502, -15138, 14743, -10005, 5016, 94, -6779, 12526, -14780, 13095, -8634, 2198, 4886, -11065, 14327, -14846, 12408, -5717, -3839, 12396]
788A2396k9217L3993l0402J8476k53j8572L1136l3768K7481j5377K9J5254k6804
801a5628L1703k8132J6870j584j3184K4244k9597K7450j7746L092J1518k2134
813a3128K7177k6017J8628n379j0018K1733k6511K3657j5433M783O469j5937K1269
826A1293k0960J6078q258j320J1455k0316K3994j9878R831K159j2497J9331k1836
839a0924J8854j0148j550J1714j7692J9010j6304J0013k76r495J5631j6913J4323
852F243r765L418M712j3188J8474j7575J1397l237n284J3819j9552J8172r980
865b346m68R103j3996J5196j2938O834J485q830J2264j0545N771k241J69L368
879B826p156P437l854J422k249K192J610n842O491m583K906j494k47K294m701
$$ y = [12396, -16821, 17172, -13230, 5246, 4993, -13579, 17557, -16211, 11270, -4107, -4078, 11176, -15628, 16075, -12057, 4813, 3229, -9955, 14289, -15308, 12142, -5604, -2512, 9006, -13128, 14049, -11968, 6660, 1281, -8737, 12996, -13515, 10142, -5291, -508, 5961, -9976, 11293, -9667, 6411, -1847, -3167, 8288, -12028, 11966, -7912, 1919, 4078, -8419, 10912, -10924, 7930, -2218, -3768, 7946, -9746, 9264, -7040, 2973, 2697, -6798, 8833, -8080, 6243, -3522, -104, 4608, -8580, 9894, -7681, 3716, 479, -4805, 9014, -10538, 7634, -2346, -2814, 6289, -7707, 7489, -5449, 1385, 2870, -5960, 6304, -4241, 1530, -711, -542, 2826, -4330, 3107, -747, 675, -1574, 618, 2228, -3614, 2877, -1706, 1200, -294, -541, 1753, -2948]
894b948P234o589J818J333o55J894q091J1853o895q74L796n530J0714j4332R239
909A967J781j1310J7022j6828Q739L595j2452J6156j7918J3392K105j9021K1836
922I064j2664N565r65j0050K2097k0638O988N592j2311J6775j6684Q431J464o969
936d305J2763j9336J5234j90q827P327j0169J9721j6866l362J9143j8203J2957
949E887j0224P19J4470k0498J4306n673m193J7203k0960O538R217j0013Q128j4690
963i783J2786R213k8683K2963n444l690J1358k4946K8747j3392n311J6819k7216
976a6579L1806j8023m068J3319j5509K8536l9052K1541J0903k6761K8505l5317
988b0699L6721j2220k3508M1897m2795L6702j6913j6109L8229l8473L3167k5417
$$ y = [-2948, 4286, -2303, -485, 848, 193, 2087, -6004, 5849, -1046, -1920, 1876, -3654, 7060, -7272, 1967, 3748, -7562, 9460, -7368, 1371, 4966, -7486, 8670, -9248, 4144, 6249, -12772, 9064, -3600, 1965, 1000, -9050, 13047, -7591, -603, 4989, -7322, 9453, -7231, 1200, 2664, -4305, 8458, -10878, 4356, 4166, -4661, 2666, -7503, 12218, -4648, -8010, 11133, -7070, 5887, -4337, -3618, 10852, -9646, 4660, -1013, -5206, 11997, -8963, -2425, 6792, -3221, 4907, -9783, 3003, 12216, -16467, 6496, 1052, -2638, 8720, -16226, 12521, -871, -6182, 10637, -16579, 15227, -2796, -6864, 6455, -9054, 19482, -19570, 1971, 12874, -13887, 14618, -20699, 16022, 3802, -19706, 22191, -20604, 16098, -815, -16924, 21305, -17168, 15999, -9418]
1000i418k012L8334m5453K1351k525j507J3490k9952K2656M337j7593J1628o583
1013c247K079J1745j9492P087N688m052Q051k6066K7642r31j9461J6080j7576
1026a2453L4314l2102r15L0210l6985L9840m1037J8370K0547m3584M9397n4300
1038b8698M1960N480n4138O3264m9092M0540j8888l2528P1948o1332K7980q255
1050a759j0127L9217n0041K9634r023K759J1680l2861K8603m605j60r460k811
1063h954K5304j6887j0033J0126Q781o841n974l725J9943r584j1836J6201j8573
1076a2052L2852k9941n808L7043l9855M0636m6410K0117L8945p4064O1829l8930
1088a5638K1867J4706o4285P9600n2168K0879L700l9392O9205o0636K8437p932
$$ y = [-9418, -11430, 26904, -18549, 2802, 277, -1230, 12260, -17692, 4964, 9301, -8292, 3336, -3247, -1168, 10577, -8915, -1828, 3860, -192, 7859, -18207, 9435, 8504, -10957, 5123, -12453, 21861, -10241, -11156, 19054, -17931, 21909, -19128, -758, 19789, -23795, 25602, -28698, 13262, 18742, -35396, 27868, -21224, 19316, 428, -32100, 39848, -21484, 6496, -1759, -11886, 27331, -22710, 6924, -2099, 660, 12340, -20521, 8082, 3477, 3317, -6143, -8954, 16350, -537, -10570, -444, 8337, 1496, -4478, -8203, 11740, 2156, -9680, 6521, -12052, 20800, -9141, -14949, 22094, -17761, 22875, -23535, -3418, 35527, -38537, 23292, -15638, 6229, 20935, -43350, 36250, -15918, 4961, 8661, -30731, 38474, -22162, 6275, -1657]
1100a657r501M3316o4646M3045q198k841R418l5008N0243k8637m76P469j1016
1113h489K6711k9482P967P853m331M580j2053K882J5680j0179j4926K3023j2854
1126c618J2235j4800p348M0358m6483K7440j0456n532L3896n6523M9430k4083
1138e484J537K3178n2998O3656m1814J1434R020l2337N9819o3363L4173m03k0768
1151a4350M0645n9042N4025k2974r397L0418m6124N1223l3266K765J7697k7067
1163a5447L4841l2625J1850J0081j4352R429j0508J1509l421k608l677J0608o460
1176g80k045Q029j5552K4196k2471Q674N502j6425K8629l6726K8371o830j2453
1189i881K5636l7557M2581k9956M273J9825l6260M5628m2966K4180K554k6420
$$ y = [-1657, -11158, 32158, -32488, 10557, 2359, -482, 8936, -26072, 24171, -4466, -4942, 2527, -8489, 18222, -11260, -3293, 4560, 229, 4809, -7244, -4362, 11318, 1139, -13787, 9236, -3618, 8617, -6183, -13531, 26827, -19656, 7784, -2672, -8204, 25692, -30831, 18599, -5484, -3947, 19231, -33767, 29889, -11925, -491, 8529, -23808, 36011, -27352, 6821, 6418, -14350, 26295, -32747, 21278, -1696, -11093, 19325, -26799, 24424, -8842, -6077, 11620, -15447, 19394, -13231, -1381, 8700, -5652, 3777, -6731, 4778, 1357, -1251, -4928, 5680, -780, -2825, 5204, -10348, 13848, -8623, 51, 5553, -10872, 17757, -18969, 9402, 2572, -9881, 15755, -21802, 20779, -9177, -4904, 14921, -21339, 24289, -18677, 5503, 8057, -18363]
1201a8363M3181m9345L8664j2892j3928L2306m2269M2095k7268K055J9233k9227
1213a5758L1523k7994J6338k84j1972J8508k1337J9505j2250L829K121p326J3063
1226G966j5910J3382r743P730k826o930J5679j9102J8797j5325O819N944j7710
1239a1229K4577k5917K0883q591p546K1051k9371L1411k4209P448J2407k6798
1251a5884L2428l0366K0751l839j4310K6941l1856K8551j7508J163J4915k5642
1263a4656K9325k4982J3083J963j3969J9962k1510J9266j2120J833P436j3610
1275g979J7141j7819J4478p428j289R644j6093J8823j6857J1310l106o984J6504
1288A0345k1489J9683j2279K497P172j5569K0229j8953J2686m282m230J2162j8044
$$ y = [-18363, 24818, -24527, 14137, 1245, -12683, 19623, -22646, 19449, -7819, -5764, 13469, -15758, 15765, -12229, 4109, 3825, -8147, 10361, -10976, 8529, -3721, 108, 2229, -5097, 7966, -7944, 5438, -4305, 3425, 599, -6331, 9348, -9754, 9043, -6282, 537, 6481, -11229, 13348, -12569, 8314, -277, -7823, 13228, -16143, 15268, -8941, -1493, 10914, -15884, 16544, -13822, 6929, 3090, -11220, 15721, -16135, 12416, -5092, -3929, 10986, -14656, 14669, -10313, 2770, 4733, -9236, 10726, -10784, 8482, -3638, -1805, 5631, -7979, 9162, -8657, 5821, -1607, -2896, 6748, -9345, 9478, -7379, 3931, 825, -6159, 10345, -11144, 8539, -3740, -1243, 5929, -9640, 10589, -8364, 4322, 40, -4190, 7972, -10072]
1301a0072J9896j6870Q527L077j3770J9990k0766J6362p450l847J4251j9838J9064
1314H554j3680N625L322j1322J6724j7153J2670n469j646P263j1617J4609j4540
1327f660J0048k486n555J1801j5499J6034j1852L177O763j3655J5212j2929Q731
1340C130l114l718J0099j3429J2362q474M048N29n860J1162j3713J1612n959k00
1354a525N535j0562J4118j3496P750R62q412J1918j2194J0470o148m27P191j0976
1368e796J0419p454M532j605k883Q361j1218R398n001O43K898o590R850j0156
1382d602N851M71m747N999n866N683m446J201K696m481L368j978L062m868L804
1397A147r1l246M447n061O389o608K719M314r723J0377p298L436M95n027R794
$$ y = [-10072, 9824, -7046, 1481, 4558, -9212, 10778, -9988, 6374, -1076, -4923, 9328, -10510, 8554, -5126, 499, 3821, -7501, 9223, -7930, 4740, -729, -2375, 4888, -6729, 7880, -6660, 3388, 902, -4653, 7148, -8351, 7683, -4169, -992, 5771, -7884, 7328, -5601, 3130, 16, -3702, 6397, -7032, 5330, -3144, 904, 1433, -4427, 6735, -6978, 4634, -1325, -1525, 4010, -6552, 7566, -5930, 1820, 2782, -5630, 6288, -5906, 4564, -1584, -2011, 5180, -5796, 4623, -2831, 1701, 96, -2787, 5574, -5644, 3754, -1247, -604, 2294, -4296, 5554, -4602, 1249, 1720, -3027, 2972, -2894, 2789, -1657, -456, 2240, -2241, 1127, -851, 2211, -2657, 1147, 1056, -2190, 2257, -2804, 3585, -3023, -304, 4010, -5713, 4664, -2634, 802, 1297, -3730, 6064]
1412F064j1565P732m10n023O431o814P827p181K176M573q364Q108n928L672m94
1427H04m504R216j0386N904J804o900P014n335M875k129m924J0239q254Q77N062
1442C363o757O419m864Q26N009r457R590m048m576R955q847M589j734o22N787
1457D633j0774R523k258l819N517o479Q228p306J566N677j0545J1074o670r9M886
1472C154p277R847j0850N010O597j4431J2538o314J486M479j3121J7095j0673
1485b460j548J1761j6166J4188o456l442J0422j3908J4844r576k782J3939j5638
1498f822J0468o427K874O239j6142J7013q886j79O150j0925J3583j1277M976K514
1512C159j0273J5888j3943M447M281q261J2002j5006R306N335j6258J4929p543
$$ y = [6064, -5501, 2231, 1821, -3202, 3229, -3585, 4242, -2939, -763, 3810, -4554, 3554, -2374, 1298, 804, -3700, 5516, -4870, 1034, 2838, -4062, 2952, -2383, 2492, 363, -4561, 5678, -2576, -1699, 3363, -3394, 3025, -1839, -1013, 3996, -5461, 4129, 81, -4495, 5460, -3387, 1202, -532, -1154, 4633, -6141, 3382, 1124, -2695, 2822, -3657, 4571, -2735, -1169, 4508, -6037, 5037, -1633, -1732, 3154, -4123, 5724, -5126, -116, 6481, -7950, 4588, -1726, -240, 4239, -8882, 8213, -2460, -4008, 7753, -8413, 5775, -681, -4123, 6299, -7609, 7235, -2341, -5123, 8816, -6822, 3646, -2781, 93, 6332, -9810, 7203, -1683, -1862, 4288, -6637, 6946, -4331, 645, 3159, -7114, 8774, -5169, -722, 3559, -4702, 7300, -7706, 1600, 6935, -9323, 5606, -1937]
1525a937J147N973j3609J4998p610k900J0899j5187J3981m876o670J2684j3595
1538f702J3281q947l947J7640j9926J2479n176q51J0613j9981J9624j0472j16
1551b481R409j7561K0569j5175N160N292j6474K4719k1387O533Q302j5828J9234
1564A0312j9650J1379N194j7886J8904j2945N600L544j2683J5076r753K135N102
1577D329j1700J3190n422m919Q995q418Q224n329m064J3185j3598P459j474m010
1591c552J1172j6181J3783n674l578J3083k0404J9471r741k372J2541k1284K4690
1604A1954j6616O8J4541k1620K3046j8506N828J0446k1435K3097j7401O552O844
1617F798j6716J8706j4671P452K256j1568J4757j0524L953J164n256Q763q354
$$ y = [-1937, -790, 5183, -8426, 6572, -1038, -3938, 6961, -8226, 5755, 879, -5791, 6893, -6702, 6579, -2368, -6315, 11325, -8601, 3878, -1298, -2149, 8464, -11517, 8107, -2365, -2481, 6928, -10633, 9936, -5239, -79, 5213, -11261, 13458, -7929, -1396, 6906, -8922, 10312, -9338, 2041, 7235, -10651, 8253, -4692, 908, 4452, -8231, 6845, -2908, -773, 4329, -7371, 5819, 397, -4522, 4473, -3945, 4279, -1050, -5114, 8071, -5527, 1932, 458, -3552, 7620, -8561, 5222, -452, -4030, 9053, -11351, 8120, -1621, -3993, 8548, -12736, 11954, -4662, -4594, 9947, -11673, 11373, -7133, -1305, 9141, -12294, 10803, -6598, -46, 6798, -9918, 8788, -5883, 1569, 3825, -7743, 7014, -3510, 443, 1607, -3649, 5114, -3240]
1630c240L006K664n486O109m598K11N019p326O331l315k565R716j2771R426k460
1645G21n210J2412j7279J5443n550o638J5921k0358J8324r042m631J6065k1457
1658a1279K0575j2612q85J3689k0094J9740j4781M860Q058j7267J8606j4025O991
1671A576K011j1191J5321j3189P781j487n108J0303j0538O367j827j905N354o774
1685c306L750J121l037K200q65o25L603n491K734K566o167P505p984N125J593
1700B722q168J1467j1440Q654j825p790J4498j5386J2156n956l276J3014j7848
1713i178J5598r158J199P969j5659J7352j2907N160L561j1489J5885j4107P598
1726A824m04n862J0724j1824Q319l063r28L659n933O951n333K178j57j086K420
$$ y = [-3240, -234, 2430, -3056, 3053, -1545, -1334, 3685, -3641, 2690, -625, -3190, 6526, -6245, 3181, 721, -4489, 7923, -9356, 6087, 537, -6101, 9820, -10538, 7786, -1256, -5887, 10178, -11279, 9296, -3316, -4201, 9488, -10606, 9134, -5647, -787, 7271, -9996, 8610, -5415, 1576, 3587, -7604, 7717, -5472, 2309, 822, -4286, 6017, -4521, 1846, 19, -1886, 3468, -3306, 444, 1565, -1472, 728, -137, -762, 2841, -2650, 84, 2650, -3517, 3988, -3996, 1129, 2722, -5446, 6021, -5419, 3235, 1410, -6380, 8118, -7268, 4888, -1068, -4344, 8670, -9178, 6420, -2738, -1539, 6430, -9229, 8123, -4784, 376, 3937, -7552, 8333, -5774, 1824, 1420, -4442, 6282, -5542, 2777, -286, -1214, 2445, -3488, 3463, -1870, 308, 151, -935, 1485]
1741A485l226L124k998L247k617R40R05k734N108p161O528k956r91M177p458R992
1757E365r136M468J680p259J1267j2402R399l015m349J0310j3315J2098o459o56
1771b004O031r530J1357j0242N484P60n713Q704r935Q705m998K2M660p929R094
1786D466p556M211o38k848O363q343P483m402J026J539l811N909o725N870l327
1801g83N26K107n265P781q421O538k120l237P453r346Q531n815J606L424p249
1816d270Q779p715M790j613j909N784q411Q412o018K296J527m790P501r107P916
1831C172l440k267O709q681Q471o504K685K202o465Q040o434L934j914k17K960
1846B251n706O799n759L541j191j432M697p827Q518n621J011L100n961P585p694
$$ y = [1485, -1741, 1383, -1615, 1632, -985, -45, 860, -1874, 3234, -3927, 2601, -355, -1346, 2831, -4627, 5365, -3771, 697, 2377, -4882, 6385, -6017, 3382, 367, -3982, 6328, -6987, 5111, -1348, -2004, 4027, -5503, 5854, -4388, 1096, 1856, -3857, 4847, -5088, 3617, -1381, -1359, 3301, -4628, 4466, -3090, 1121, 483, -2365, 3998, -4345, 3138, -1264, -238, 1301, -2510, 3399, -3326, 2544, -783, -257, 1850, -3415, 4366, -4055, 2483, 363, -2874, 4579, -4767, 3764, -2051, -445, 2979, -4270, 4509, -3206, 1584, -29, -1938, 3846, -4565, 3847, -2171, 125, 1652, -3138, 4363, -4744, 3172, -268, -2535, 4174, -4507, 3964, -2540, 145, 2347, -4118, 3922, -2512, 1422, -492, -709, 2251, -3455, 3344, -2415, 1126, -65, -1497, 3200, -4627, 3891, -1730, -719, 2381, -3580, 4005, -3689]
1861c689N579j142l712O460o535N323m194K484P28m411O675o388M938l405R92
1876b97L119p473R099p027K981J132m494P304q849P295k490l276O705o590N051
1891B190l930K282J226m610N424m188K793k054J004J408m236N440m372J952j26
1906B03p91K291m604N356l182J21J317j187J852l964M933l429R68P37j939M015
1922B697o743P466m346j315O730q994P919n568K128L490r138J1026p612J816K414
1937A970m929P022q162O142j065m093O709o277M198k381M97K375n554O571l521
1952d98k30J733k260L253m102K222J668l975L013j41k145K711j861M37J225l636
1968b586N586m388l18N498p475N884l213N72L465q063R690o459M34N146q195Q345
$$ y = [-3689, 1890, 748, -2964, 3496, -3039, 2284, -1910, 574, 1302, -3109, 3566, -2822, 2116, -1289, -297, 2822, -4651, 4448, -2579, 402, 1534, -2960, 4344, -4505, 2790, 300, -2976, 3729, -2861, 2190, -1740, 542, 1768, -2842, 2582, -1606, 1187, -867, 137, 1545, -2691, 2749, -1623, 329, 203, -588, 1703, -2901, 2455, -727, -606, 711, -476, 1376, -2588, 2345, -1084, -116, 621, -1318, 2697, -4046, 3420, -926, -2241, 4489, -4505, 3414, -2154, -26, 3464, -5674, 5352, -2260, -444, 1970, -2959, 4063, -4099, 2043, 978, -3115, 3594, -2683, 1515, -866, -369, 2006, -3548, 3023, -498, -728, 1005, -1255, 1998, -2104, 118, 1786, -2189, 824, 683, -1462, 1249, -612, -175, 1050, -2586, 3000, -1388, -1706, 3792, -3683, 2201, -1012, -440, 3025, -5038, 4652, -1807, -1373, 3773, -4422, 3923]
1984C923o518L437J385p409J0596q402L092J075l598O759r423Q017k496m051Q591
1999D978r360O865k362k511O946r929Q605k147n108Q257p116M676j815k908Q125
2014E196r100M763J188n653P585o757L134J279m928P654p852L564L468p364O319
2029B496m665L841l77n947R421p448L344O55n022Q619q701N033q1n098J0050j0701
2045d581N315J550n611P912j0180Q276k07q081J0613q776N976r56o399J1199j0053
2060d003N740p00n730J0922r935M255L51l206P336j0623P467m7m803O332p744
2075d388P701k900m119P627p295O401l224l009P437p013M558k374j746P416r048
2090c976M578M87l199N907q088N607J068o389P772p146M546J474p494R164o975
$$ y = [3923, -2595, 842, 2227, -5182, 5414, -2988, 104, 1179, -2419, 4340, -5083, 2934, 438, -3613, 4978, -4382, 2483, 121, -2390, 4556, -5373, 3232, 1085, -4023, 4234, -2882, 1794, -21, -2929, 5196, -3904, 859, 2047, -3606, 3979, -2778, 356, 1635, -3293, 4361, -3491, 73, 3541, -3823, 2496, -2169, 1672, 1295, -4652, 4769, -2679, 665, 1320, -3702, 4917, -3784, 1249, 1168, -3930, 6120, -4581, 734, 2284, -3327, 4585, -5595, 2681, 2474, -5607, 5006, -3770, 2206, 1250, -5149, 6050, -4003, 1737, 1037, -4693, 6229, -3706, 549, 900, -2306, 5030, -5593, 1874, 1827, -2976, 3356, -4388, 3313, 413, -3706, 3921, -3374, 3027, -197, -3206, 4231, -2782, 1776, -598, -2344, 5072, -3976, 602, 1089, -2110, 3797, -4291, 1316, 2384, -4005, 3767, -3379, 1167, 2641, -4853, 4311, -2664]
2105b664L797O01p068J0989q664L462J015n491J0122j1009O351L25n495Q888j0568
2120e409Q252k006m024P789r817R133l998l208P663q536P611m537j182O359p588
2135c498N866l171n80M707o190M221j519q08L409m992L011R09l187L339l061J837
2151B93J673n199N361l296R13K409o077P341n065J531J892n572Q635q007L433
2166B65J598n304Q252r297O175j40m871P818r441Q107k721l574O845p804P682
2181C590m940o59N678o846N857m566J508K790m925M138l055K302o8k701K925r97
2197C1J94l98l58J184K24k407J989j92j020K228l891M183j669j681L817n256O108
2214C086m491J78L874n826O716o551L548J843o147P099o756N460j292l596O349
$$ y = [-2664, 1133, 1734, -5334, 5655, -3009, 453, 1468, -4023, 6099, -4910, 1441, 1766, -3729, 5159, -5409, 2843, 837, -3187, 4602, -5215, 3918, -80, -3288, 4375, -4161, 3450, -1087, -2269, 4090, -3498, 2368, -803, -1383, 3324, -2866, 1355, -164, -972, 2437, -2555, 456, 1365, -1822, 1517, -1544, 293, 1966, -3233, 2128, -1168, -255, 2154, -3923, 3418, -1647, -116, 1776, -3796, 4839, -3168, 265, 1863, -3441, 4811, -4486, 1689, 1549, -3322, 4496, -4945, 3162, 441, -3133, 3712, -4092, 3590, -1350, -2009, 3669, -3177, 2680, -1886, -378, 2412, -2513, 1625, -1430, 872, 804, -1897, 1028, 31, 225, -173, -531, 653, 877, -1530, 459, 267, -753, 1475, -2416, 1767, 98, -1583, 2234, -3022, 3086, -1405, -1227, 2647, -3179, 3537, -3014, 534, 2377, -3770, 3329, -3427, 2033, 741, -2855, 3494]
2229C494o780N965l687m03M325n890N534m686K720J256m575N024l937K884j419
2244a75j221K937k703K168k113J654m09m13Q61j734K726k760J752j148K77J697
2260A396l599M161l360K093r4k469M304m812M243k553m5K931m840N208m697L048
2276I15j35l306N717n990M590k160j005M097n774N352l481R41K017m034M451m001
2292a806K904j140j103K584k946K944k689J875n16j222K739l476L553k739J226
2307A88P14k776M181m318L023r88r90K377l235L853l228J442N05k053K868l445
2323a882L465k526M85K195m045M389l850K587n05j790L862m592L666j818l5J567
2339A173l013L712l408K246l16j280K370l170L294k796J283R65k682L261l240
$$ y = [3494, -3286, 2679, -1008, -1411, 2914, -2976, 2558, -2128, 592, 1848, -2727, 2297, -1640, 1244, -175, -1396, 1541, -1162, 1006, -1107, 547, 138, -275, 586, -1148, 1578, -1182, 570, -578, -301, 1396, -2203, 1958, -1402, 691, 597, -1872, 2432, -2380, 1863, -690, -735, 2196, -2644, 2564, -2133, 915, 780, -2526, 3191, -2799, 1791, -369, -1374, 2723, -3051, 2301, -1180, -239, 1778, -2256, 2195, -1806, 1098, -42, -1145, 1439, -1507, 1437, -1252, 623, 107, -1115, 1624, -1852, 1701, -1038, 188, 902, -1874, 2307, -2011, 1012, 24, -966, 1411, -1824, 2029, -1199, 243, 748, -1305, 1563, -1882, 1583, -943, -458, 1737, -2308, 2081, -1769, 818, 313, -1477, 2385, -2207, 1459, -359, -394, 1173, -1840, 1872, -1536, 710, 394, -886, 1484, -1686, 1608, -1188, 95, 1060, -1622, 1639, -1601]
2354a601K746j474n32K411l547L247j812R24j39j288K484l016K719j524K89N37
2370D24j751L350m157K988m97j539K723l345L542k709P70J599l241L412k577J612
2386F04p37o78K402l001K409j396M99P8j129K759l840L045q44j039K230k619K791
2403A534k329M52J838k905K079r72O09n35j26R44j122Q11o09J002j525J218P9
2420D43j612K412k203J548r68l23K433l916L125j062k88J003j825K865k979J889
2436E42j30j597K943l290K747k065N49K217m572M177j930K16Q62k553M365l883
2452a402J271J320k962L156k189Q26N84j584K365k283O07J664k154O11M57j78
2468A09K10j463J748K23j831J806j541J204k62j210K235k671K770j287j815L918
$$ y = [-1601, 1145, -329, -861, 1550, -1997, 1250, -562, 362, 223, -1065, 1419, -1597, 1122, -402, -113, 424, -1327, 2023, -2134, 854, 357, -1182, 1541, -1804, 1738, -971, -201, 1398, -1843, 1569, -1008, 604, -133, -811, 1591, -1410, 999, -397, 102, 180, -949, 1810, -2030, 1015, 171, -868, 1362, -1257, 1534, -795, -343, 1495, -1410, 669, -303, 306, -229, -355, 589, -533, 278, -331, 671, -854, 364, 443, -1169, 1243, -960, 588, -380, -703, 1730, -2186, 939, -123, -411, 592, -1233, 1632, -1347, 542, 412, -1185, 1758, -1532, 1215, -850, -301, 1916, -2656, 1521, -409, -193, 669, -1884, 2481, -1402, -131, 1189, -1773, 1383, -806, 20, 604, -980, 1385, -898, -291, 1373, -781, -170, 287, 109, 319, -1144, 604, 827, -1004, 802, -739, 465, 203, -1007, 1228, -1443, 1327, 40, -1775, 2143]
2484B143l410K027j266l50L335n384M407j487j035L169n166N168k542o38L089
2499B060n100N517k592j576L441l499L837l564N22L426m585L070j778Q36J730
2514A745m099L663j887L26J825m087M183j671o52J650l111M551l124o94L598l810
2530a594L411k943K69L516n370M569k672M1L633n779M665k212j74K877n902O166
2546B501k616j236L250m295N127l823l84L880n039M759l266J15L565n001M305
2561A842l166R76K892n963N386k650L99K073n189O356l923J1L066n134O198m546
2577a372L04L283m759N477m771O73L986n511M754l669J703K353n975O000l250
2592g74N50J911m875N881l366j01K053l740N402m032k08L370l785L842l862J071
$$ y = [2143, -1267, 760, -506, -856, 2479, -2905, 1502, 15, -1020, 2149, -3017, 2151, -391, -1029, 2060, -3040, 2477, -115, -1691, 1750, -1749, 2088, -1476, -954, 2472, -2113, 957, -821, 15, 1745, -2354, 1309, -578, -252, 1573, -2514, 1669, -2, -654, 996, -2115, 2436, -688, -1382, 2216, -1594, 1817, -1126, -857, 2659, -2711, 1858, -814, -773, 2860, -2919, 1746, -466, -640, 2237, -3665, 2501, -115, -1351, 1899, -2396, 2731, -1092, -1476, 2404, -2635, 2124, -1142, -1027, 2538, -2463, 1842, -1324, -348, 2544, -3419, 1967, -683, -284, 1789, -3400, 2956, -967, -956, 2110, -3024, 3174, -1372, -1068, 2215, -2544, 2933, -1838, -1165, 2821, -2690, 2064, -1605, 98, 2451, -3524, 2476, -774, -224, 1687, -3188, 2693, -673, -774, 1279, -2461, 2941, -1091, -1299, 2071, -1714, 2128, -1734, -663]
2608f63L399n427M225k709R52K686n725N205k398J86K037n274O443l595n22K881
2624A701m082N937n259M69L684m715M732m433J698L071n669M849l544K139J272
2639A850n203N736l275J337K41l227N568m107N17J440k518M389m605J159K273
2654A575k961K788l032J758J786l869K851j514Q86R56m041M743j909p10J878l385
2670b200M500k856p29K974l415M031l692P61K864m269L718l218J626J707m531
2685b729M448k750J352P83l917N262l522J136L96k286M306l793J293O60j660K583
2701A562l326K073P30j976J814j877J619n5j727J638q64M66L13j344J787p82n28
2718d77J026j301J739j275p31K282k133J585j106k21J937k716K176j198J58J638
$$ y = [-663, 2736, -2691, 1534, -1175, -223, 2463, -3262, 1943, -455, -269, 1768, -3506, 2937, -658, -1180, 1701, -2381, 3556, -1703, -1234, 2450, -2265, 2467, -1966, -268, 2803, -2866, 1983, -1561, 578, 1850, -3353, 2383, -892, 445, 686, -2541, 3027, -1080, -563, 877, -1641, 2748, -1857, -698, 1575, -1386, 1402, -1630, 128, 1914, -1955, 896, -618, 268, 1224, -2817, 1926, 17, -693, 1185, -2200, 2300, -556, -1285, 1689, -1726, 2305, -1387, -626, 2238, -2031, 1687, -1531, 95, 1802, -2729, 1719, -1031, 321, 1104, -2813, 2449, -1073, 63, 459, -1827, 2479, -1314, -21, 639, -1021, 1562, -1764, 309, 1039, -937, 877, -1000, 619, 564, -1163, 475, -389, 77, 390, -954, 833, 51, -477, 549, -752, 987, -288, -1019, 1263, -870, 715, -391, -612, 1325, -1391, 785, -413, -255, 1383]
2734A383l073K949j750K11J077k662L646k592O44Q44j924K787k726J245M28j226
2750g39J916k312J793n25m80J120j584J532r85j0R46j004R04j035M66J82k48J28
2768F5j44L5j43J97o43J197p48J07K63r51J468j340P19K47j025J739j961J386
2786D68m62n31J569k115J860j165r4J190j529J825j653P88L49j034J385j789J571
2803F33q67j02Q17j295J713j504P52K40r30J160j244R97m11j04M25p22P14o75
2821d03Q68p27K37M07r75J096j117Q59j31p56J564j702J288p80R0P83j442J509
2839F68j139N48O8l53O30j222J338r79L33M48r52J293j480J134l24p36J700j912
2857i37J536q19J00P49j479J570j250N55N3j32M29j082J361j121O73M2o55J080
$$ y = [1383, -1690, 1259, -491, -280, 797, -1865, 1781, -811, -167, 677, -1247, 1540, -1186, 59, 487, -739, 1177, -1135, 658, 133, -347, 773, -811, 721, -264, -274, 672, -332, 572, -463, 3, 185, -63, 65, -79, -44, -187, 10, -633, 564, -184, -77, 186, -765, 703, -637, 82, 329, -696, 1043, -918, 468, 6, -525, 1044, -1071, 789, -376, -470, 720, -809, 1016, -637, 151, 500, -534, 851, -938, 633, -234, -336, 481, -814, 899, -605, 147, 387, -543, 617, -627, 370, -41, -145, 280, -442, 272, -403, 465, -262, -25, 382, -593, 503, -614, 245, 114, -642, 922, -780, 508, -272, -182, 601, -841, 668, -471, 77, 145, -208, 422, -800, 538, -441, -108, 340, -612, 681, -799, 335, 11, -725, 975, -937, 599, -220, -120, 629, -850, 720, -530, 25, 78, -54, 375, -707, 654, -467, 206, 248, -407, 673]
2875F73j376J234o85m2P55j006J070j080O81j33o91J356j244Q11m77L36Rr28J535
2894G98j426R27l65j86P54j447J905j463L43R26j472J476j636J441k76r84J472
2911G87j258Q20p21L53L46j108J514j303P59j0l78N81j043J297p47k29O23n13
2929b30P06q69P18l43j55L55k74J72l36R71j117M06L03q32J188j551J608o25j041
2948i46J875j923J690j003q3J155j874K090j764O63J016j755J660j745J708o41
2964A23q32J518j623J359r19K61P81j563J514r73K30O05j106J007l38R4O0n43
2982c45N32J47p31K85M17l97L53q82J003j27q06J197j577J468k90j080J630j657
3000h60J896j586N7J833k242J735j733J149O38k331K686k070J455k74j732L102
$$ y = [673, -703, 531, -154, -196, 559, -447, 623, -457, 224, 91, -600, 756, -488, 323, -154, 182, 191, -737, 798, -628, 299, -66, -252, 502, -945, 960, -503, -160, 766, -706, 770, -866, 575, 299, -685, 787, -471, 349, -372, -19, 327, -781, 733, -570, 189, 179, -199, 382, -661, 636, -111, -340, 283, -230, 476, -393, 325, -18, -173, 182, -92, 80, -256, 715, -402, 4, 307, -525, 663, -888, 720, 95, -946, 929, -994, 696, -307, -390, 765, -1109, 981, -783, -120, 896, -859, 801, -944, 764, 123, -709, 809, -814, 545, -374, -113, 668, -895, 619, -354, -124, 481, -625, 382, 44, 138, 198, -345, 187, 334, -397, -112, 305, -92, 261, -621, 382, 255, -551, 646, -931, 537, 247, -833, 797, -860, 1036, -550, -493, 1340, -902, 833, -900, 249, 887, -1444, 1242, -828, 627, 353, -1379, 1723]
3016A723k707J476n92q73K737k987J395k25k15J386k643K069q1r40R56j365J634
3033G48l66j251J480j183R50k72j252K097r08l77L19n67K034k104OJ512j382J606
3051A090k052P15J583k604K020j661J503N22k993L252j814J275p27k068M233l071
3067g97Q36J9r68L048l859J770L92j064J990l349K610J95j831J609j868K550j082
3084B01j720K668j440R34j135l45K360k194M50J14j82J802k931J270Q88j123J256
3101H73k481K195L99k502K285j711K020o56k466L616k177J092p31j015L439l326
3117a146J069J78o95K459l687K154O57j638J647k800K895l58k046K178j768K262
3133A361j452j306K652j895J265j250j71K590k943J432l74k09J589l018K240J47
$$ y = [1723, -984, 492, -100, -973, 1764, -1223, 172, -53, -268, 1118, -1525, 544, 463, -477, 479, -886, 748, 382, -869, 611, -572, 378, 106, -1146, 951, 43, -334, -15, -582, 1452, -652, -646, 866, -516, 1090, -962, -247, 1336, -1268, 752, -909, 594, 1116, -1877, 1375, -439, 836, 109, -1959, 2274, -797, 39, 58, -910, 2138, -1721, 49, 441, -623, 1367, -1982, 628, 823, -1008, 601, -1267, 1283, 201, -1519, 1149, -291, 643, -492, -837, 1523, -671, -221, -107, -289, 1513, -1418, -148, 740, -383, 873, -1608, 587, 986, -1516, 769, -942, 1078, 422, -2044, 1572, -605, 487, -244, -1259, 2180, -1146, -77, 101, -594, 1865, -1822, 332, 989, -649, 998, -1802, 1093, 735, -1311, 867, -901, 1361, -91, -1397, 1255, -640, 625, -625, -796, 1794, -1149, 283, -91, -300, 1289, -1729, 511, 658]
3149F58j282J549k324K493o40j615J841j351J570r89j322K839k003J080o51o44
3165g91K372k685J180J05n65J613k751J874J57j305J471j842K116q18j133J944
3181I42j800J692j180n35K238k262J334n90l72J857k408J462l89k12J270k438
3197a391K059n91q27J455j824K036j032p43J639j440J481j221k00J419j385Q87
3213C22o91J71J131j706J066k57j10O19j455J467k18o24P64j030J110n13n99R97
3231D44q46Q56n78n61J414j252M90J44m62J281j705J078j17m99Q83j405J241k15
3249A91o38J006j198J060n48l30J052j111J171r39J1O67q50R96q95N08K29j035
3267f53J005m24K76j6m18O10n47M8Km6K68n1j31J19j45K82j19k84O17m41q3L49
$$ y = [658, -624, 925, -1399, 1094, 454, -1161, 680, -671, 899, -90, -1412, 1427, -576, 504, -147, -791, 1581, -1104, 76, 181, -384, 1229, -1522, 352, 509, -796, 675, -1167, 949, 131, -1002, 942, -858, 834, -346, -881, 1357, -905, 429, -161, -533, 1324, -1084, 378, -11, -223, 1047, -1391, 668, 77, -750, 705, -1119, 917, -115, -858, 781, -659, 822, -399, -599, 820, -565, 322, -369, -198, 933, -773, 293, 36, -74, 545, -910, 557, 339, -285, 479, -551, 559, 46, -553, 444, -402, 454, -124, -685, 729, -523, -33, 111, -351, 930, -775, 303, 186, -313, 570, -835, 406, 191, -447, 559, -639, 421, -127, -457, 595, -516, 655, -284, -273, 394, -456, 540, -355, 153, 382, -653, 352, -72, 204, 188, -230, 380, -167, -119, -117, -163, 105, 54, -77, 42, -103, 179, 60, -224, 393, -48, -131, 218]
3289B18m68N95p54L11L05n73P58p29N17j03m00O97r99P91l26j06P55r43R07p34
3309b81R0N29r02R42o27L16o7k32N97p60N00j34L0K13l65L32m96M62l01J15L9
3330@k51M57m31M18q5k60L09k03K81n11J82K57l59O10o57M24l35O7L76q18J027
3351D98q29L63J1j78N29q40O65k42j54O09p05M50j90K45j34m23P07o49L61k52
3371a58K12J26o73Q59m72K99j33j71M56n58L40j26L4Q9kj2m03M15k79J58K49n20
3393b70O08n76M97k14l06O09o27O07o72J18L93n41O35l61J12K6r3L86o62O60m19
3414i0O5R2n10P29p61O86j82k79M52m37N94l26j46N77p13N46m88J16K00p3%q4
3436c2k0R7j20p7L17k24p2M91m66J79j7k26L31l66L67n03K41L33m00M28q50Q87
$$ y = [218, -250, 345, -409, -98, 207, -366, 392, -337, 180, 77, -323, 374, -625, 166, -160, -266, 489, -454, 453, -281, -191, 338, -564, 378, -249, 67, 0, -232, 365, -395, 105, -29, 1, 214, -151, 181, -315, 147, -154, -39, 0, -251, 206, -225, 193, 108, -152, 157, -46, 235, -276, -94, 163, -196, 414, -243, 181, -154, -87, 289, -529, 498, -331, 32, 43, -135, 394, -446, 219, -23, -177, 432, -273, 177, -13, 232, 98, -325, 382, -267, 94, -158, 54, 180, -493, 366, -106, 193, 60, -111, 345, -213, 127, 1, 35, 124, 122, 110, -293, 122, -157, 1, 250, -270, 338, -238, 259, 45, -261, 348, -279, 328, -344, -226, 167, -374, 261, -100, 12, 38, -55, 331, -331, 329, -90, -25, 67, -443, 286, -475, 211, 29, -250, 202, -235, 359, 33, -113, 464, -249, 297, -191, -75, 125, 52, 52, -32, -52, 45, -75, -152, 165, -59, -131, 360, -106, 73, 56, -170, 161, -205, 162, -341, -100, 233, -167, 261, -589, 298]
3458B98k21n05Q10p99O38m37O7P30j065Q21o77K82N56j054R13o86L04J89p79J097
3478D82n96J37Q4j90N43n55J0K19j94K42n10M09J11n26L09k43M5O59p04L37J80
3499B49l56K40m92P87j12p86Q77r23Q08m99k31J072j183Q01m66Q9Q77j591R82
3518A43l32O8O94j462J479p09K7L75q67J494j248j8O44o62Q42r04L29N51o75M96
3538B65o91L46O50j259R39k38j4K24r91J023j71k58M01q31J123m69m05Q46q47
3557c57P12n44j68J167j377Q67l98j42J049j715J302l82j98Q29j883J841o70j32
3575a99N82j283J715j087j41J019j007J082j118L26Q06j316Q95o27L64M73j243
3592g59J137m70J68L80j159J419p96j22L81p64J494j269L4Q80r78J083j054m7
$$ y = [298, 77, -428, 382, -417, 221, -216, -149, 581, -484, 337, -340, -58, 498, -556, 357, -329, -25, 164, -615, 482, -114, 23, 107, -83, 460, -95, -85, 134, -60, 182, -328, 81, 192, -334, -25, -268, -223, 436, -268, 69, 249, -107, 133, -359, 428, 316, -470, 407, -516, 292, -207, -438, 634, -549, 252, -214, -125, 752, -839, 143, -189, -121, 573, -889, 590, -119, -92, 283, -584, 910, -338, -356, 288, -374, 468, -436, -107, 444, -231, 265, -426, -80, 570, -689, 250, 12, -2, 222, -769, 254, 83, -175, 226, -605, 518, 49, -356, 490, -357, 355, -189, -357, 810, -567, 300, -98, -240, 809, -906, 396, 14, -184, 645, -1238, 603, -67, -199, 383, -900, 815, -272, -413, 606, -401, 681, -437, -111, 695, -621, 274, -353, 11, 484, -759, 378, -92, 76, 456, -703, 716, -80, -202, 179, -585, 909, -360, -326, 554, -424, 659, -395, -442]
3610d42J332j558J142o51L06N02j627J454k85k15N51j383J693q70k71P50j176
3627g48J433j039O8Q51j040J108j096M65P55j406J076q47M18N85j472J595j066
3644c60K49L66j155J800j094k27P86r08J494j389J34R94j282J144j086N31P47
3661G44j378J057o15L96K51j315J427n81o8K01o34J253q32j99P29p83J052j301
3679e96L97N97j034R88p00L44N70j326J169o13L32K00j179J298m57j94M26q00
3697e78J475j202J1O81p83R42r34P4J016j099Q64r36O59K68j126J153o58L10L3
3716A70o70R85n89l6K00l53P12n81o1L39l24M08o05L96M38q97O82m26J30L12n54
3737c24N08k40M8O8l54O16n33N9K26l50N35n84P8O44p21N63m78K03L60p87Q48
$$ y = [-442, 890, -668, 474, -177, 129, 631, -996, 458, 173, -42, 509, -874, 819, -51, -322, 428, -748, 685, -354, -286, 565, -475, 633, -463, 2, 757, -649, 427, -420, -2, 583, -889, 706, -360, -111, 255, -900, 900, -194, -421, 365, -543, 951, -438, -304, 690, -592, 552, -534, -3, 744, -634, 423, -192, 204, 455, -860, 567, -14, -82, 119, -515, 738, -94, -293, 436, -347, 705, -596, -199, 398, -636, 352, -348, -4, 566, -760, 409, -204, 128, 328, -851, 447, -10, -204, 222, -578, 897, -305, -294, 387, -396, 546, -388, -314, 702, -397, 467, -469, 190, 458, -668, 485, -173, 137, 170, -500, 485, -104, -140, 60, -293, 419, -162, -223, 116, -208, 200, -405, -9, 429, -468, 214, -212, -82, 230, -324, 184, -56, -8, 60, -294, 322, -211, -152, 74, -276, 259, -325, -247, 397, -324, 239, -239, -36, 324, -463, 385]
3758C85p65M35L37q96Q32m79J73J44o04Q17o17J70J61l32O58o92L59j79lK48m04
3779b52L60j4k81L74j51J22k32J04J5j4k7K5j68J78R0j58K85m62M48l98J39J46
3801A29l90L20k22J55J38l88K32J92k87J40j46N51m80j30L34l74K84j78K55k33
3821i8J29J79m87M27j11j66J70j99M38k98J18o4j19N7j17L86k16k85L23l7P7j13
3843fl5J8Q8j04j13J69k88L57k63Q3P9k71J66Jo2K76j79L16m11K23j40J67m4o4
3867c7N8k14K07k0p5J97j32J19r7K5J72m77K62o0k1R8N7j06k0O0k1m1L1j38K23
3892E0r0Ol8o3K32k99K11j59R6J97l29K01j55K01R2p2j5j08J71k59L43l10J9J01
3916B3j53L80k86J34L7l34L31k07j3l0J61K36m59L76l66J41O2k33J95N3j33K52
$$ y = [385, -380, 55, 392, -504, 328, -151, 22, 166, -438, 379, -238, -68, 93, -239, 419, -273, 86, -93, -96, 152, -252, 108, 94, -187, 187, 36, 158, -74, 30, 45, 31, 4, 29, -139, 39, 129, -29, 256, -206, 242, -156, -17, 129, -261, 59, -163, -8, 130, -258, -26, 166, -121, 19, -127, 424, -56, -186, 148, -226, 58, -120, 135, -98, 31, 210, -277, 150, 39, -127, 43, -156, 282, -16, 102, 38, -81, -24, -141, 245, 29, -256, 67, 30, 107, -6, -41, -23, 65, -39, -152, 17, -271, 86, -177, -94, -15, -286, -120, -119, -181, 95, -84, 232, -179, 44, -96, 71, 27, -37, 21, -193, 14, -6, -81, 116, -16, 103, 6, 31, 203, -274, -12, -72, -93, 5, 62, -44, -64, -4, -25, -66, -35, -173, 50, -40, -34, -72, -135, 97, -202, 9, -150, -54, 143, -186, 15, -140, 61, 153, 81, 66, -42, 129, -130, 213, -97, -78, 23, -130, 250, -36, 98, 135, -199, 132, -75, -88, -118, 43, 279, -180, 196, -170, -29, 33, -200, -5, 48, -85, 167]
3938A67k53L46k78P7j0j53K11k04J47K4j63L79m96L06j64k9Q5l6O5o0r6N3J88
3961A06l26M34k99r4L40l36J77J06j02J17l52L17k43R4K33k73M90n82J44J24m70
3982c95N66n03N02k60j3K07l64O80l73k86L01l05M86o02K54J69k93K36j90K56
4002G3L06n64J25K22j32J08k11J84j2k90K76N0pj71k64N44l68K22J7k96M99o25
4024c14L07o3J46L51o33K18Q5k59L98p03Q56l65l50L94l88N23m00j12N93o08O61
4045C37n69QO38p96O42n41M53k4n93O52j60o9R1m04O22l13j70K94l31K80o2k79
4067b94O09m84K57j74j88P83q88K08P2J06L12p39N29J35l14K29n06P18k50n51
4087d30R14q29P00n40j68Q28q98N83k08R3N44j148P39m6j05J88p03P38j71m08
$$ y = [167, -86, 260, -18, 59, 49, -104, 107, -97, 50, 74, -89, 290, -206, 100, -64, -93, -8, -44, 21, -39, -135, -82, 106, -220, 214, -85, -179, 161, -175, 2, 108, 6, 123, -229, 88, -155, -61, 172, -101, 389, -193, -49, 75, -395, 171, -332, 170, -90, -103, 104, -260, 420, 47, -239, 62, -243, 243, -359, -105, 64, -229, 7, -183, 73, 379, -185, -60, 162, 30, 138, -73, 111, 99, -191, 85, 135, 128, -43, -307, 237, -131, 91, 108, -188, 311, -314, -7, -70, 76, 427, -206, 12, 97, -162, 236, -467, 389, 24, -326, 68, -320, 203, -197, -309, 284, -324, 337, -232, -224, 414, -382, 260, -281, 172, 148, -445, 207, 47, -22, 69, -335, 287, -26, -196, 98, -233, 47, -15, -294, 315, -169, 88, -86, -274, 509, -379, -171, -99, 7, 319, -420, 109, 244, -70, 159, -347, 371, 121, -430, 484, -345, 355, -185, -353, 475, -423, 160, -48, 45, 589, -559, 180, 134, 29, 217, -486, 252, 81, -327]
4107c27L60m77P57l91k68M62k23L66m27J13M09m02Lk26M4O99p31K06L54m79L34
4128A56n44O53o9m29N36q23P69k37m24Q34p85O90n66r7R27q59K35j21J63N11j215
4149f95R11k42j82M26o33P90l79o8K18l58P85p11j25L61l86M59l27J74L15p39
4169d06N20o1MK02o14M70J60l74L54p10Q48k73m10P62o24L70j03l21N79o40M60
4190A93k41o1P31r30M06rk27L99p82O65r0l56N24n66O26l57l6K43m51O86o50J04
4212a79M04m58L55p2j11L93n56N13j17k47K48k91L78l25p3K44j98M52n02K9L72
4233B59l50L49p6k63L04l97L62k65oL01o52N22o6j49M50o64O89k67k21L16m43
4254b67N74l58k55M12m61M96l55R8M22n31L17j12n0K48l86L33m2j68L83m93L47
$$ y = [-327, 33, -444, 313, -78, -346, 116, -107, 259, -168, -55, 354, -48, -45, -271, -227, 472, -259, -53, 301, -178, 156, -388, 265, 196, -233, 303, -520, 249, 12, -412, 422, -363, 327, -239, -336, 591, -268, -33, -154, 9, 520, -695, 216, -26, -208, 218, -415, 375, -4, -72, 146, -212, 573, -138, -263, 98, -288, 171, -156, 18, 333, -406, 114, 53, 57, 259, -355, 115, 275, -99, 255, -455, 393, 120, -290, 472, -152, 218, 115, -206, 373, -267, 193, -48, -109, 622, -308, 98, 89, -138, 261, -521, 144, 54, -302, 222, -344, 282, -75, -111, 132, -319, 367, -283, -179, 225, -233, 122, 50, -61, 332, -224, 289, 172, -75, 173, -118, 260, -65, -138, 106, -92, 360, -142, -113, 259, -91, 258, 182, -81, 223, -174, 188, -77, -83, 218, -434, 88, 22, -127, 323, -341, 348, 81, -140, 176, -267, 307, -51, -306, 106, -355, 141, -214, -116, 306, -225, 92, -20, -70, 178, -208, 125, 83, -85, 298, -195, 152]
4275A52k81J41M5m1K01k98J42j6l40K91j19O4O2J0N7k87Q6K85m30L61p7j19L15
4298B04l35K65j90m9K38l11K85q0p5K12k68J98j81K0J71j14J66p8j22J08j72K15
4320A07j70Q8j29m8K13j07J77r7k5Q3j10j3J32j04K8Lql2o1J26j09J05pj34K05
4345A13k93J50N2P8j65l8jK0K6Q8O8p2n5N0j3j36J06r2P9l8J03j3j18M4J0j3L0
4372c0J09j20j26R0j5K4m9J00l4K5J1k22J32J89r5P7k15K23j24J24J2k93K00o8
4396g5N4N9n8K53k29P7l4p8N0j06J84Nk18J44q0kL7l6QK6j04K32k3k2J6j40j37
4423a97P1O3M0k3Mj80L83r5r6J70l20K17p2Q0L5k3P7j64J25Pj86K88k35J16K3
4448A08j03K06m43K67mj84K26l13L46j38L7l3j94J34K8k9j3K42j99M4M6j25J92
$$ y = [152, -129, 12, 57, 16, 217, -81, 61, 45, -295, -4, -123, -59, 3, 13, 70, -217, -131, 154, -276, 85, 8, -111, 204, -131, 134, -56, -105, 133, -178, 107, 27, -48, 164, -104, 94, -87, -67, 104, -10, 156, 78, -44, 64, -108, 107, -63, 25, -104, -152, 61, -46, 131, 34, 9, 92, -18, -31, 101, -3, 25, 28, 20, -12, -73, 53, -56, 49, 42, -92, 113, -180, -30, 22, 100, -65, -103, -104, -84, -58, 30, 98, 26, -29, 21, 8, -128, -22, -114, -35, -73, 30, 17, -101, -57, -47, -60, -30, 79, -41, -167, -77, -92, -68, -117, -17, -51, -26, -15, -237, -105, 84, -11, 66, -149, 74, -50, 74, 86, -207, -7, -75, -21, 38, -20, 233, 4, 81, 47, -31, 19, -87, 97, 102, -116, 28, -52, -54, -17, -53, -45, -19, -123, 109, 86, 64, 80, -60, -197, -126, -63, -23, -46, -42, -222, 161, 66, -30, 140, -180, 37, -35, 45, 80, 57, 134, -30, 95, 102, -84, 204, -31, 85, 108, 5, 211, -232, 35, 31, -153, 73, -240, 106, -32, 5, -28, -222, -88, -60, -89, -102, 140, -59, -15, 31, -94, 98]
4471I8j38M8l2K00j31M4J52m37K77j40j03K63k99L73k96J02J37l98N84n55M34
4492A83j00k99M93m32K56l1k97N20l85L47j52j85L36m11K52q0j1J04k07J48L1
4513H0k36K07j34J60j13j26L71k90O1M4j90L72j86q5K72j69K41m19K95j90j37
4534a72M60n02J75J56k65N00m68J42P3m06M67k79L50l06j83N47l82J61k16q2N46
4555C16n85K80Q4j21K87m39L90k22m2K89l81K66q2q9J44j90R2N1l02N01l15K9
4577c9q0j22M34l85K08P1l61O05o47L94q2k33M58l11K32j28lL58n30K54R7l89
4599a99M77n74L44J18j85L54o78M54J25m19M65m63K87j32q8K80k36L50j42k74
4619a36K51l71M05r3j30K68o30M64k1J35ql60K81M5k69M88n40K86M6m41Q18p43
$$ y = [98, -40, 8, -24, 176, 45, 89, 241, -196, 81, -59, -162, 101, -198, 175, -121, -19, 118, -280, 304, -251, 183, 83, -216, 277, -155, 101, 70, -227, 293, -92, 255, 103, -82, 254, -157, 95, 15, 4, 108, -99, 49, 80, -156, 51, -83, 77, -36, -162, 209, -81, -20, 24, -166, 206, 20, -65, 207, 38, 279, -140, 155, -35, -172, 288, -214, -39, 117, -148, 352, -116, 26, 99, -307, 160, -119, 231, -75, -258, 289, -93, 68, -148, -230, 316, -269, 11, 95, -26, 261, -178, 212, -10, -52, 237, -144, 122, 40, -49, 95, -95, -3, 48, -254, 247, -68, -39, -119, -241, 193, -192, 16, 87, -274, 331, -316, 78, -4, -237, 221, -90, 142, 14, 11, 369, -161, 93, 190, -199, 278, -296, 48, 166, -19, 335, -343, 111, 236, -183, 282, -181, 106, -26, -114, 166, -70, 280, 138, -136, 115, -256, 149, 56, -74, 194, -436, 28, 7, 142, 134, -226, 55, 100, -169, 319, -221, 65, 111, -330, 488, -255]
4641b55K90J09l37M29m84K05kr8K86k50M7R0j93L64l05K78n3m28N60l51K88n0
4663A40l83M88m44M09k28k00L54l86L97m8l17M74l99J42J03k48L42n33L29O4q7
4684c1K86k60J36j16j98L43l07L39k25j87N07m12J98K0j45K58k72Q7Jk06M42m54
4706a96K88P4k98M04m98L75k98k8M01k92K71k94k70N31k43J55j7j49K00j65J46
4727I7j69N5J14j43J73q6l36M18j52Q9l9q8K57k11J50k17r3L77k22J4J23o8R5
4750A38k53K32j81q6K38j38K81Jk58l5R6L0Oj19L06n66L11q8K0J31k79K57Q8k98
4774a66N07l86J48o4q1R0k70K00o9o8J79k13L21j1k80L42k37J32Q1k00J33o3P1
4797I6J69k78J10j15q1J01L6q6k71K30N2o5k0J73j83J59m8pm7n4J32j50K55k50
$$ y = [-255, 35, 144, -193, 236, -248, -43, -45, -143, 143, -107, -60, 30, -163, 201, -104, 174, 121, -307, 253, -98, 190, 140, -243, 245, -199, 210, -18, -218, 136, -250, 147, 99, -218, 256, -143, -1, 102, -146, 196, -337, -8, 56, -31, 255, -5, 131, 15, -183, 160, -147, 192, -33, -220, 287, -125, 73, 93, -52, 206, -66, 21, 22, -184, 258, -196, 92, 166, -132, 272, -226, 149, -149, -177, 224, -68, 203, -91, -361, 170, -73, 82, 65, -84, 116, -49, 97, -72, -17, 97, -46, 127, 41, -295, 123, -29, 60, 21, -67, 190, -21, 129, -88, -181, 196, -26, -12, 111, 43, 138, -115, 117, -64, -150, 88, -50, 231, 232, -26, -61, 35, 65, 71, -48, 258, -308, 3, -85, -65, 66, -213, 44, 132, -166, 341, -45, 103, 39, -42, 48, -222, -22, -91, -159, 20, -193, 128, 117, -163, 179, -58, 74, 155, -45, 88, 25, 96, 265, -13, 97, -18, -99, 2, 38, -48, -319, -89, -37, -102, -122, 51, -132, 27, -21, -28, -75, -129, 3, -147, 108, -142]
4821a42J60J6j07P2k3J67q1j17n7J95j5j09j01K42j32N2j41Q4K91l35K16k94K34
4844G5j6n8L0O5q5k3k56L29n4J14l3j30J21k40L10l61L20q3j33l8J92J6N2kj86
4869g4n1J41r5K10l43L01n5qL5q6K6Nj44J77K4p9J16k4p9j95K66j4M0j20m5p5
4895a46Q9l6O8R8j02l5J63j2j78n2J8J90j94K6K49j72Q0k6j35M5NMrlq2J91K0
4922F4m2j6L5k2j4j31k1J31n8K22j68j3J19j0o3rJ2N4j01q6J29J33M9l06L51k29
4948A0j3J20j62J60m6J4L3k32K71k44q6K88j53mO9o7k3m6K08j23n3K05l04J70
4972hk3n2O7K4q0l8O4N3j58J37K52m16L48k45M9k2j28K62j93K36k47J16P1k83
4996b14K05K9q3K56l88L83m55K09L46m12K11k02J6Q6j84M17k89J20L07n13K96
$$ y = [-142, 18, 34, -73, -1, -24, 143, 62, -55, -112, 83, 68, -41, -142, 100, -32, 20, -121, -37, 254, -81, 135, -159, 75, 59, 1, 31, 96, 11, -12, -268, 61, 7, 121, 88, -42, 79, -161, 149, -212, 108, 25, -108, -146, 46, 62, 114, 112, -74, -125, 16, -79, 131, -212, 89, 34, 26, 61, -25, 1, 6, -138, 39, 63, -16, 100, 76, -3, -198, 68, 54, 94, -26, -71, -146, -57, -93, -25, 73, -29, -64, 99, 87, -91, -143, -125, 65, -129, -103, 146, -26, 54, 28, -107, -62, -57, -53, -62, -65, -147, 44, 64, 22, 6, 41, 19, 5, -126, -147, -16, -74, 148, -20, -33, 86, 76, 13, 4, 16, 70, -31, -117, 12, 145, 194, -112, 239, 10, -3, 117, -45, 115, 69, 83, 116, -116, 155, -89, -175, 113, -40, -44, 25, -42, -65, -111, 97, -26, -79, 126, -178, -8, -31, -83, -16, 8, -72, -110, -46, 7, -151, -14, 238, -178, 170, -75, -26, -48, -176, 86, -107, 129, -118, -2, 69, -214, -9, 20, -63, 193, -195, 188, -267, -58, 288, -124, 87, -115, -99, -13, -197, 220, -69, 51, 358, -155, 141]
5017A41k98J0J60l84N68l31K0K57l17J90K5k3J73m76K77k04K72N5k54K30n6j81
5039a46J18r0K37j46M3L05m89K72m9j56M01n89N43l52J88J02m82M40j76N4K89
5060C17n30L66k98N8K67m94N42l71J30M2j85L80l26kM12n42L39j54J14J47k05
5081GJ11j41J42r4m91P33l33nJ92k39L60k77p5K82m25M19j81j85L30l81M08j70
5103a3J25O6n64O65m90Q6K65l85N01m40O9L75n44N73m73J33nr6M27m85M73k21
5125D2k28M30l81L68n7n34N06k06J27K9k71K79l32K79l9q0K53k13O6j12q0K52
5147I8k48J24J88k41J90l52J29J10j95K81j52P1J19n02N78m52J07K25l62M20j12
5168B4j14K74l34L21l03j31N60n29K38j28N2K10k89M51m83J14K09l26N28l75n0
$$ y = [141, -157, -147, 13, -371, 197, -134, -114, 143, -174, 16, 41, 18, 191, -285, -8, -212, 60, 115, -139, 91, 35, -146, -28, -118, 119, -27, 16, 321, -168, 104, 55, -101, 300, -289, 254, -98, 90, 192, -290, 150, -26, 28, 317, -213, 153, -145, -87, 180, -314, 228, -143, -13, 29, -156, 224, -102, -104, 308, -234, 105, -49, 65, 212, 7, 118, -23, 119, 25, -466, 267, -66, -71, 121, -118, 242, -35, -110, 172, -253, 166, -15, -200, 130, -251, 157, -13, 112, 178, -386, 279, -211, -125, 140, -245, 256, -184, -115, 260, -284, 289, -184, -51, -56, -152, 275, -210, 263, 42, -186, 244, -137, 231, 174, -360, 146, -60, 67, 96, -175, 104, -228, 51, 12, -68, 185, -28, 38, -74, -154, 98, -150, -26, 162, -79, 111, -241, -112, -2, -197, 84, -68, 3, 122, -380, 198, -254, -147, 78, -284, 136, 24, -90, 184, -150, 171, -132, -263, 297, -232, 6, -122, -70, 140, -149, 302, -181, -67, 142, -184, 344, -31, -81]
5189h1J25j28J51j43J09J13k94J02L6R1J36m55M24k93k9N9m2M55o06K97n3j92
5211b18M70l79J52Kk08L57r4j70P4j48L50k90L0K12k37K66l99L14j76k9L19m36
5233b38K78J50l01J08j44L0j2O3J55j61J14P1o5R4j09j3rn4J21k02J01Q5j22O4
5257Dj18j15J69J05Q3k28J34l0j15J33n0q6K97l74K11j97K03J7j49K27j78m0J8
5280g9J36kj76J56q5p5J76l7n7J03k38K95j80R0p2j43M57l34P2Q2j00J55j12J07
5304A39j24J05l0j82J07j55Q1K22r3J1q2jm3K8O7Q3j74K35j83n8P8j37K77p4l1
5329F6j06n5NO1o9J87k75J21J83j49J86k08R1k9L7p0%K25k63J04O8q9N2k07Q0
5354e4J00j23J05L4p0J98k42J17j71j0J23J1J11j97J52j51PJ28J56j69j40k3O0
$$ y = [-81, 44, -84, 67, -76, 33, 146, -148, -46, -10, 81, 217, -238, 186, -107, -136, -77, -119, 336, -270, 27, -26, -218, 252, -127, 25, 27, -181, 176, 82, -88, -14, -162, 188, -102, -72, 140, -97, 169, -230, 84, -92, -121, 198, -238, 40, 190, -111, -3, -147, -117, -129, -66, 89, -72, 42, 113, 48, 142, 33, 20, 11, -43, 78, -124, -23, 62, -60, 4, -114, -229, -60, 45, 128, -100, 34, 4, -111, 22, -28, -114, 183, -191, 20, -177, 26, 43, -106, 121, -57, -97, -79, 57, 55, -121, 35, -50, -125, 51, 14, -43, 60, -178, 117, -63, 27, -45, -188, 269, -65, 7, 89, -11, 144, 32, 139, 15, 120, 90, -92, 15, -140, -59, 163, 70, 81, -1, -2, -45, -17, 50, 133, -41, 194, 11, -47, 31, -106, 171, 97, 66, -40, -95, -90, -29, -98, 89, -186, -65, 118, -31, 155, -53, 38, 9, 46, -24, -24, 201, -62, 42, 110, 21, 73, -134, -54, 46, -77, 28, 62, -8, 190, -52, 65, -106, -116, 7, 18, 129, -68, 84, -67, -60, 68, 224, 55, -85, -108, -48]
5377d8p3QLJ07Mj0J91j80j50J67q2k4j15K96k4o3k06J68p4J17kj2R3j41l4M3J35
5404I4l8k31K49j31K0L2P1Q8j32n7P4J3j5p9r6J56q1L18k10q8Q9q3k5J3J29M9
5430A29j58p5R5oJ03p2P1j68L2P8n6n9J41j23O8J08j29o7l1K43j78J94j31Q6j17
5455b2q8K77j80J53M2m22J70l5L8P4j46J35J7j05J50j17J10k14N3J67N5Ml19J32
5479g1J62j06R6j0q1J72j24M4L2j32kq3R6j06J21J38k64K48k5r4j13JJ10P2j36
5504e5L0K6pj83J47K03q8J25k48K6m4l5K19m1j47L5j4P9j86J83K6oj0j67J49n5
5530c8M5l0J41Nj36j8K49j28q4j3Ojj60L7N2j41L28j12q0K33k27J98j40M4J1k63
5556b22K31j64L05%l62M59l25K67j80j42L36l06L3P8j2J10k73R0K29j78K63k28
$$ y = [-48, -121, -113, -110, -3, 1, -9, 182, 2, -148, 19, -63, -87, -202, 94, 70, 7, -199, -31, -105, 12, 10, -2, 91, -50, -84, -41, 94, 56, -175, 74, -57, -37, -5, 66, 154, 22, -35, 39, 52, 37, -42, -138, 18, -63, 255, 45, -43, 46, -37, -62, -49, 80, 129, -29, -104, -9, -15, 88, 16, 87, -81, -49, 29, -27, -86, 55, -68, 0, 108, -21, -88, -119, 124, -54, 140, 9, 95, -22, -110, 167, -13, 140, 182, -240, -70, -105, -67, 7, -139, -4, 13, -92, 58, -59, 51, -163, -110, 57, 112, 116, -203, -71, 91, -15, 81, 71, -10, 162, 38, 82, 114, -18, -20, -103, -7, -113, 8, 146, -118, 130, 105, 11, -102, -101, 9, 81, -55, -25, 1, -6, -189, -42, 161, 73, 198, -50, -24, -68, -103, 116, 75, -72, -37, -51, 28, -158, 25, 51, 45, 35, -132, 17, -38, 7, -23, 118, 123, -13, -31, 218, 90, 6, -7, -1, -2, -162, -125, -73, -214, 114, 2, -78, 155, -72, 126, -14, 30, 41, -222, 9, -155, 150, 150, -212, 247, -78, 189, 9, -133, 203, -103, -70, 8, -4, 106, -167, -77, 152, -26, 237, 9]
5578IN6n3r9J73j05O0j7n8Q2j18K49o5j55K53l02N9j2j00K18k19J05r7R0K80l06
5603g2m0J46j55K39m1j8L7p2J9j20K28j58j95L88k68L99l47k1K05l32K12L2j56
5626i0Q4k47L14j56jM1p7K90k15J33r9q2J63p7j1K03j86O7jj29L16n62K05J84
5650F7j57L3j26K46k19J68K56l25K28r8k22K46k58J99j21j17L60l98K41m1p2K88
5672A78m45K71J43j93K42k95L98l20j35J63k12L33P6k69J57k65K21k04K16k3M
5693D1J70j04k73M15m29PK35k82K08K0O7q0p5K47m10K19R8o9M6j39j55L64j43
5716b2J64k01P0K2QJ5k60K71k05O7K23l81K66K8p3K25l27L17k90kJ82k61L30l0
5740A36j79R2j74J95o6j25K84k27J57j33r7J17j41K41j00K9J69l71K21P6k19J57
$$ y = [9, 65, 12, -87, 86, -19, 41, 24, -34, 48, -70, 179, 114, -41, 212, -90, -31, -43, -143, 75, -144, -39, -136, -46, 234, -72, -112, 34, -121, 118, 77, 59, 96, 24, 43, -77, 151, -7, -202, 186, -82, 317, -30, -51, 154, -178, 34, 66, -90, -6, -253, 61, -95, -96, -55, -132, 158, -57, 76, -23, -105, 58, -19, -30, 173, -13, 54, 53, -76, 240, -322, -117, 67, -90, -57, -183, 63, -156, 12, 268, -57, 171, 73, -149, 97, -161, 38, -83, -200, 160, -238, 3, -38, -110, 178, -267, 4, 147, -46, 196, -99, 299, -21, -156, 7, -205, 128, 204, -65, 92, -173, 48, -156, 60, 37, 41, 211, 107, -166, 249, -180, -173, 62, -220, -12, 8, 75, -5, -80, 167, -243, -24, 74, 5, 51, -88, -243, 121, -22, 142, -59, 11, 33, 41, 56, -204, 67, -138, -71, 152, -229, 37, 65, -8, 217, -110, 207, -83, -85, 97, -164, 166, 136, -43, 49, -125, 70, 4, -121, 163, -64, 93, -40, -137, -20, -161, 80, -20, 9, 178, -193, 28, 104, -115, 42]
5762D2j39J03m4J08L2q5J60k67L9J90l53K31m5L9m1N6q4K1JJ52j57J7J33j96J35
5787D8o7K5O9j07K15l69K59k4r8J48j41Q3m3L8J03j20L7o6J2P9q2O3N2j21k6j09
5813a42K02l1R5j07J03r3r9J52k0j98M2J21K3K7o8K10l48K08m0j12J57j04j42
5836a64J95j43P5K5J1j17K7J60N3k11J42N1m5m5o5J71j48K55k14L6K8j37J32K5
5860I7n7k8K1n6L5N5j36J51O1j21J00q9k77J16K03j34J21j26N3M2L4K4j9o9Q2
5885H3j66J27m4n1j23K12L4j69Jn4J41O0n0M9m5j7O1j89J09J04q7K7R3K0r4mJ39
5912A67k20J58M8j21p9O7l5j12J54m9jQ1r4J3o3P2Q0j40J46L8l8K2J7j70J23k3
5938D1j18j18K67j86P5Q5k8j03J60m0N6o0k14J42K0N1pl6K5j53J30J57j56Q8k27
$$ y = [42, -97, 6, -38, 70, 102, 17, 177, -90, -51, 139, -214, 17, -28, 11, -30, 26, -58, -37, -36, 116, -41, -24, 109, -87, 48, -19, 6, 75, -32, 183, -186, 73, 49, -49, 99, -42, 41, -2, 36, 139, 19, 56, -10, 2, 81, -1, 62, 114, -7, -33, -142, 60, 29, 124, 17, 120, 27, -72, 80, 60, -138, -96, 25, 48, 75, 7, 217, -131, 77, 37, -75, 82, -22, -164, 31, -112, -37, -12, -1, -118, -91, 69, 122, -89, 53, 104, 59, 14, -51, 120, -28, 227, 13, 49, 77, -60, 72, 97, 40, 12, 33, -23, 12, 67, -69, 82, 143, 22, 122, 33, -244, -128, 75, -59, 62, -64, -11, 31, 65, 89, 70, 1, 83, -83, 44, 0, -51, -174, 38, 72, -97, -96, -150, -9, 51, 1, 50, 5, -12, 49, -140, -31, 73, -14, 13, 106, 126, 32, 28, 167, -53, 105, 153, 32, -47, 20, -15, -127, 27, -22, -23, 58, -36, -23, -86, -14, 66, -74, 72, 110, 72, 94, 111, -59, 64, 41, -77, -195, 72, -114, -39, 46, 18, -85, 75, 35, 91, 31, -183, -41, -21, 30, 23, -13, 12, -141, -11, 146, -10, 78, -149]
5963a49L17r0j13P6M7L5j34J77j89R9K0j37p7J13M9J9l41K76R4o2J3k03J37J23
5987A00o9J6M2k6P4k45O4J11k06J42M0Q2Kk54R4M2j43lK87n6Pk61J80O4nk07K82
6014A54j72j04K07k60K02J62l64K69k39J44J22j19M6o3J43j42j1Q0k36K86k48
6035a43O1J82k27K8KP5lk40K54l6J7R2j84J97j79N2K9p2R2L7k5K8p9O7N7k75L57
6062A64m0J4j81J89R3k98J35o8r5Q5p2O1J00k10K30l04J97j20M9K41k16J32j73
6085h7L0L03m76L19r7l4K02l84K49L2j18Q6p3M4r1k2K81k35K06k23M5R8j04Pj97
6110b39O2L85k45J23m3k91K95k57K01P7j52K02j62J93l3p0P4l43K42j72J07K09
6132A63l04J05l4o1J99j19P1N9j24L8j55K07r5j0J7j30K35m4j1M9l50K60JR1J50
$$ y = [-149, 168, 78, -35, 41, 88, 123, -11, 166, -23, 76, 96, -41, -118, -5, 44, 63, -278, -2, 92, 30, 43, -160, -23, 100, 31, 47, 89, 63, 137, -108, -44, 67, -139, 3, 43, 125, 127, -127, -33, 9, -134, -137, 150, 94, 101, -160, 20, 84, 79, -128, 154, -18, -122, 85, -175, 27, 189, -175, 94, -145, -1, 121, 2, 48, -15, 128, -14, -25, 55, -181, 105, -143, -82, 100, -127, -99, -97, -22, -25, -265, -11, -47, -30, 62, -122, 75, -104, -52, -23, -95, -3, 34, 9, 37, -42, 25, 82, -193, 164, 124, 138, -43, 146, 239, -59, 76, 8, -87, -2, -74, -13, 87, -123, 107, -197, 0, -120, -71, 170, -46, 86, -87, -57, 246, -230, 89, -8, -42, 160, -224, 25, 57, -61, 25, -48, -4, -95, -117, 164, -71, 135, -88, -43, 55, -49, -42, -239, -177, 208, -37, 86, 43, -248, 47, -210, -9, 68, -84, 118, -44, 149, 116, 46, 120, -223, 19, -153, -46, 163, -141, -36, -70, -131, 68, -51, 20, 79, -45, -7, -162, 45, -50, -60, -43, -173, 62, 18, 7, 56, -294, -34, -33, 58, 208]
6157B08j86Q1k04J28J07k20K59j37j7J77k99R2QPj44N2L35k13k11K37k5O7j53
6180e1J12k0r6k9P5m9K4j41L67k43K6J66k49K16j38O5Q1l43L24J10k70Q2j04N4
6204c1j36K08J74k13J28k93j6J75l8Q6J64k49J19k73L50j40j4n5o8K64j02l7J5
6227A8j95L18j51O8K0J1P4j07j47J52l19J00J76j03J45r9K14k22J90L8k89K04
6249I6j79n4K48j89J40r9L6J08k15J99K3r3lj26J27QK7j43J20k60Q6jL8K15r4
6274A5k4rJ00j46M1j09J92q9PO2n1o4J30j37J24J3P6p8o6L7n5L0k7L5j52K04o3
6301dJ62j66J93o6j14L8o6O7l9L4L5q5N1P0k8j61O9M5j4O8j10r1J42L1j02P1o0
6328c0L5p7L2P1P3lq1o8P3j26J59j95Q9J05J4P1r5K0Nl6m4K2k9J68j86J09j41
$$ y = [208, 22, 103, -101, 27, 134, -86, 173, 36, 19, 196, -103, -11, -3, 4, -140, -88, 247, 34, -177, 60, 35, 102, -51, 61, 41, -55, -84, -9, -58, -34, -175, 192, -51, -25, 141, -108, 108, -30, 35, 116, -227, 97, 207, -63, 19, -85, -31, -167, 41, 215, 2, 130, -163, -179, -4, -42, 44, 208, -41, 78, -195, 155, 15, 1, -54, -122, 142, 40, 3, 18, -177, 141, -10, 58, 78, 89, 163, 56, -91, 61, -258, -158, 18, -85, 60, -39, 175, -47, 143, 181, -108, 96, -83, -137, 111, -78, 62, -37, -1, 107, -108, 91, 114, 21, 18, -108, 19, 27, 54, -89, 31, -229, -143, -144, -106, 109, 15, -9, -18, 82, -64, -23, -132, 60, -29, -22, 40, -11, -75, 55, -82, 42, 55, 131, 53, -13, 24, -31, -1, -28, 7, -145, 59, -4, 158, -8, 185, 119, 5, 43, -23, 44, 5, 39, 74, -11, 40, 110, 82, -79, -10, 35, 21, 89, -21, -112, 30, 61, -41, 30, -30, 5, -72, -40, 31, 104, 101, 20, -48, 25, -101, 58, -137, -48, 57, 71, 142, 47, 67, 72, 36, -8, 14, -15, 153, -33, 76, -65]
6355f5R6l1j00M5j8m8K21J1q8l4m6n7O3p2K4K68j49n1o5O9k12N17j74q4j33K29
6381A16p8m0l2M4O1l1j19J22p5k06K84k58L08j07M0J07q4j00J13q6p1J2J38M8
6405A06l06J44J17o2N3P0j51M1p8J57kJ1m7o8j37J16O4M0O1j69%J87J2j98k1K
6431e8O5J32k82k8J63m8o6K75k82J01j07L3P4L7p1J52K9k83J25L2M7kj21M5J13
6456G5r3J90q2L0l13O0K43j08K6k9k4j5PJ51pp1j2l5l2K6p2O3R6o1j43K01n3k1
6484cJ26op8L6j34J34r7L6J25j19q7j9lK3J18j15J38mj4P3j25J38j4j20ml5om3
6512g9M5J0m2J89k8p7j2j94K24K3j8j63Q4R9n0m0M9j15J45n7K1N8m7k0q7j25K22
6539A5n3N6J23j79R8j36N5N4j77K69p8N3qq5M0L5j30J23n2J61k57J90o7j05pM
$$ y = [-65, 31, 0, -100, -55, -73, -121, 100, 111, 23, -11, -57, -114, -51, -123, -99, 169, 20, -31, -96, -27, -239, 278, 104, 20, -113, 116, 38, -2, -34, 10, 71, 40, -79, 43, -32, -238, 46, -212, 96, -11, 29, 136, 52, -48, 65, -21, -92, -80, 58, 106, -200, -56, 61, -1, 52, 122, -29, 12, -66, 91, 89, 100, 53, -15, -152, -36, 28, 68, 129, -40, -40, 147, 159, -39, -60, -58, 7, 139, -143, -171, -8, -56, -122, 153, -129, -28, -135, -102, -28, 9, -62, 90, 119, -164, -39, -7, 40, 38, -83, -38, 75, -18, 172, 90, 120, -193, -133, 110, 2, 28, -1, -25, -40, -33, 118, 111, 40, 28, -7, -39, -13, -85, -22, 74, 13, -130, 71, 18, -3, 123, 117, 39, 75, -59, 75, -22, 14, 139, 20, -67, -86, -89, -66, 52, -63, 75, 71, 57, 130, 5, 143, 129, 9, 5, -30, -36, -79, -34, -24, -66, 123, 95, 18, 6, -188, 36, 59, 41, -122, -38, 61, 11, -29, 20, -95, 50, -7, 14, 72, 25, 5, -82, -207, 15, -38, 18, 141, -38, 60, -76, -21, 33, -144, 125, 47, 100, 92, 7, 47, 82, -48, 75, 23, 184, -73, 117, 50, -55, -62, -58]
6565e8J35p1K8K30j95O5k74K4J46k1j82J48k1%O0oNj82L38k30m6K72j89P3J04
6590A53j55j57K7J35k52J69M4J7K49j88ro6kJ56j61m3J25q8J76k87K65l4j77M0
6614f3O3k3RM5n5n3J03N6l6k4j79lM0Q6J52j57kj7J17m3n3q8P4o6P0j61K55lN
6643D9o6M5K8j21K1Oq7N1K4K0J45j08N0J0j90J82j07Q5k62J78J67j54Q7O2j61
6668d6R6k21J09J23j70L48m78K45q6J01J30l8p4K2j26J55j26P4l6j64L08k47J09
6691Hm5K1J0M2r6K31j46J78l23L45j78j1P2j63K34j79l42L25j20L03j55j27K57
6714A41j72J06j18r7J47Q2Q6L1k44K4Lj26K21j58P0n0J73M3j88K00j72J23n5o
6738F4J31k27J40j67K6J13j64P4J19j80J62j79P8r4N9J16j48K9%m7O4q2J23P4
$$ y = [-58, 77, 6, 34, 264, 69, 134, -140, -116, 30, 9, -173, -25, -46, -46, 14, 8, 13, -169, 169, -61, -107, 165, -24, 49, 153, -2, -159, -132, 3, -249, -80, -36, -19, 230, 42, 33, -33, -35, 121, -40, -83, 42, -46, 130, -157, 108, 74, -103, -63, 0, -23, -14, 31, -24, -77, 26, 82, 46, 22, -157, -160, -120, -34, 118, -39, -41, -58, 59, 16, -37, -125, -51, -117, -47, -208, 47, 44, 49, -17, 28, 56, -65, -44, -38, -125, -74, -50, -30, 115, 7, 57, 67, -123, 59, -48, 37, -225, -47, 120, -34, 53, 115, -46, 50, -171, -62, 61, -109, 239, -239, 6, -80, 21, 151, 113, 39, 61, -65, 90, -36, 38, 2, -162, 146, -101, 8, -37, -16, -6, 36, -60, 171, 25, 203, -120, 225, 47, 36, 108, -55, 179, 0, -342, -17, -137, 166, 11, -116, 141, -31, 75, -43, -140, 7, 89, 175, 206, -38, -14, -11, -137, 84, -74, -4, -54, 119, 162, -26, 174, 2, 125, 70, 64, 195, -32, 108, -59, -33, 80, -84, -10, 109, -71, 91, -88, -10, -104, -45, 71, -77, -48, -48, -95, -31, -113, 10, 84]
6762H4k7n4r3J09p6p6P7r7J58j58L12j36N7Q5k23J02Q8p2L9k5k8J10l01Q5J71
6787A11j61J79k10K9J20q1o5R6l7K91m36K02j84J13J34j60K61k81J19J6k38J83
6809Aj0l7N2n4J13k84J47J87q6L2o8M3M5k38K58j58J29r9P0n8J15j8Oo2K7r4o8
6836a09K91j37N6j24O9Lk11J46j5N9j62j5L98j81r6j2K4K09k86O7j02R3P3N1R5
6861A84l23K30J02l14J83j53J87j36Q2mJ6R5q1j23J68j3P4j38j57K29N0j53l5
6884c0k0N3m3j17J26J02k4j50J65M6k04R5J54kk15L6N0k49K58K4Lj24J57m8k32
6909a89K46k19J59R5m4j54K23k03J45M2k39J40L2j1j86J42Q5j10J27j67MK0Q9
6932B7m5J42J0K4n4q2qm1j55J05N6K0K05j94L5k8k6J67j89J13p3j23J88j22L8
$$ y = [84, 57, 3, -90, 19, -57, -133, -56, -153, 5, -153, 159, 23, 80, 165, -58, 44, 132, 60, 99, 74, 46, 156, -145, -60, 111, -50, 129, -81, -52, 68, -13, -78, 18, -19, 272, -164, 38, -146, -33, 101, -59, 202, -79, 40, 56, -182, 1, -9, -46, 6, -48, 65, -219, -72, 115, 29, 61, -7, 36, 81, -157, 101, -57, 72, -27, 43, -15, 100, 82, 88, 26, 53, -41, -109, 182, 45, 101, -23, 46, 49, -162, -16, -31, 28, -134, -149, 249, 68, -28, -40, -16, 193, -93, -26, -128, -35, 38, 89, 184, -139, 91, 193, -121, 62, -91, 96, -40, 42, 38, 54, 149, 68, -55, 113, 100, 174, 36, -121, 108, 158, 5, -30, -50, 3, -40, -157, -31, 71, 47, -103, 62, 108, -96, -1, 153, 151, -64, -28, 22, -227, 31, 55, 58, -66, 91, 43, -189, 57, -162, -3, 92, 48, -106, 117, -86, 59, 101, -138, 2, 34, 23, -163, -21, 64, -46, 81, -86, -82, -62, 27, -18, 124, 134, 158, 104, 22, 14, -27, -182, -77, -21, -1, 204, 10, 45, 17, -9, 158, -31, 82, 9, -114, 74, -48, -10]
6957a0j5n4Q1L6M4k08J19R1k12K14q0l0j12O0L2n0J09kR5j3j03n0O0j8O3J0m1
6984A6N0Q2n1j40J89L9m27L03RR4k49P0J05j67J0J07on2J60j45N0j56J68JM6j35
7010b9J6P1p3o6k8J21O7l8oO0j66J33q5P6j02L%K7m2J57l9m9j30J34n0J70j24
7037HQ5o8j27O8J28q8l3j36K09k12J24J84j91J29Nn5j9p6JO7k9O9J21p2j55LO6
7064FR9j24J20j37R6l7r3JJ56r6n0L5L2q8N0j18J72K5O2k9j61L41j66Kr1j18J37
7091B6J7l8O8j89L27k32l7J5RlJ68q2p1M8N2O8k51Q2k23L12j30q2K55j76m2J68
7117E9m6J97k28R7j30J06p1L0J05j78K34o6j40J51j55J01j50J17K06l08jQ5k9
7140a4J66k10OJ17p2M0J6P5j52K5p4j29K09J0p7mn1J81q5P1J8j5k64K83r7k7Q9
$$ y = [-10, -25, -79, 2, 38, 82, -126, -7, 84, -128, 86, 6, -24, -136, -76, -44, -94, 15, 13, 108, 95, -8, -58, 2, -16, 47, 57, 16, 66, 148, 97, -43, 146, 185, -242, 61, 70, 164, -85, -15, 90, -77, -67, 40, 34, -18, 142, -3, 47, -109, 59, 60, 106, -29, -13, 58, -15, -81, -109, 12, 79, 41, 35, 95, -71, 62, -23, 53, -49, -46, -46, -19, -61, 96, 57, 8, -122, 12, -38, 132, 8, 93, 25, -102, -34, 94, 6, -27, -163, 46, -166, -42, 142, -49, 80, 85, 30, 11, -65, -64, 3, -26, 43, 164, 92, -63, -60, 6, 105, -19, 101, -36, 60, 23, -70, -69, 87, -9, -59, -24, 8, -80, -30, -148, 24, 49, 111, 82, -79, 262, 96, 98, 7, -111, 26, 43, 5, 73, -116, 211, -21, -58, -43, -34, -37, 131, 49, -22, 26, 78, 146, -105, -23, -246, 66, -64, -146, 109, -67, -109, 59, 13, 210, -18, 79, -51, 55, -16, 14, 119, -59, 175, 109, -31, 120, -35, 66, -84, 33, 239, -69, -70, 15, -14, 152, -58, -52, 65, -7, 33, 49, 124, -28, -3, -77, -206, 3, 13, -64, -68, -119, 62, -23, 48, 66, 51, -213, 70, -27, -54, 35]
7167C5j41M6j19K60j9j24J49j29Q0J74l56K71r5M0q3p7J52j49P3n2L3K19r8o7
7191B3P5j25Qk08O5J76l0N5m7Q5J4n6P6k56J80l0q8K06j77J61j51J5L3j7L3q3
7217f3O0P9k09J77m3p1J53j05J34j84RJ18r6J16j07r0K35p1j07M4q2J25r3J9O
7242d6jj35K8O5O8j67L31k33J06n4j51K41k1J7k6J5l0q1J85j75K12j57o8R1k45
7267b31J32J96j37J60o5k05P8mL8j1J58o7k40L82j48j17K4k9J03np2N9L2J41k32
7292f0l0O5q5J07J32m2R1k21Q1J04k07N3k13K3K43O5k6r9N7M5l35K81P3j65p0
7317a33K71j33K0M4j32K5o6k5K39k52N0N9J9m3n2J41L6n8ql1o7J40p9jj00l6J96
7344B4l14K46N1j56J91j10pM3LJ22j54J8M6k4JOR7k00K51j86J9O8n9M6j52K04
$$ y = [35, -106, -60, -179, 81, 62, -62, 87, -42, 38, 212, -144, 127, 32, 72, -11, -88, 64, -85, -12, -64, -31, 188, 90, 23, 98, -27, -19, -227, -162, 14, -16, 39, -8, 77, 91, 35, 111, -145, 35, 5, -83, 123, -54, 107, -44, -29, 4, -13, 20, -63, -3, 76, -133, 44, 1, -70, 83, -22, 112, -72, -63, 55, -41, 75, -32, -122, 113, 42, -65, -21, -103, 22, -71, -52, -46, -47, -182, -154, -89, -21, -188, 143, -90, 16, -38, -189, 52, 31, 48, 22, 37, 7, -74, 111, -64, 148, -9, -77, 14, -231, -99, 97, -40, 120, 55, -150, -72, -76, -38, -49, 109, 42, -198, 184, 36, -81, -57, -86, 17, 12, -60, -1, 31, 172, -60, -90, -25, -110, -3, 129, 87, 178, -43, 38, 142, -65, -12, -225, -202, 41, 106, 80, -19, 38, 83, -252, 29, 102, -63, -133, 138, 5, 25, 69, -63, -38, -104, -129, 110, -142, -92, -33, -14, -57, -109, 32, 68, 10, 2, -29, -96, 44, -35, -36, -136, -172, 24, -290, -44, 7, -149, 42, -68, -75, -32, -29, 93, -61, -43, 3, -21, -20, -14, 83, -117, 134, -52, -33, 35, -24, 22, -130, 74]
7370G4j30M7q5M1O6J12Lj24o6Jp5lO6K93j84r8r8K60k3q1q6J34M6P6k02R6p9Q1
7398F2n6j3l7K0J7R1o3p1K16l14L4J59q8L2l2J18j09k8PK7K02k52R2n0K03j49
7424A8mR5q4Q2j76K55Rr6k4j7r8R3j03M4r3o4M5J88j65K02k15l8J30Q8n9j12J76
7451G7j86P7j25K33Ll0r6l3P2o9l6J85J4j55J11O5L9k92K81j94M9j35J62n2R5
7476F0p8J7J04j54j52J74j53L15k85L31k92M7P3R0p9p5P7j8q3o1J03J02j24L2
7500b9J6qK76k76Q4L1j60N5Q8J3n5n3Q8k4p1R9j29P3j44J65P7j27N4K4j49K01
7526A19k01J42j47J37L0l11J06J49p1l5K99j63k0j46K77j22J1r9k4J48j47J00
7548C2l4l8K87l58J56j09J7R5k05K08j3Q6q0ok9j07M6mK9p2K03j74P2k98K53k
$$ y = [74, -56, -9, -94, -53, 13, 125, 128, 4, -62, -61, -136, -139, -73, 220, 36, -62, -160, 100, 77, -4, -90, 44, 90, 166, -36, 60, -19, 62, 6, -7, -44, -24, -7, 84, 21, -50, 166, -148, -114, 45, -43, -11, -43, 75, -34, -62, -55, -28, 174, -78, 14, -36, 167, 18, 14, 109, 25, 107, -69, 186, 195, 99, 75, 58, -40, 53, -50, -6, -99, -163, -118, 70, -95, 107, -108, -146, -16, 72, 13, -99, 77, -109, -32, -157, 76, 79, 49, -47, -80, -8, -77, -113, 72, 86, -69, 42, 107, 146, -146, 135, -59, -10, -145, 17, -35, 60, -18, -1, 103, -51, -203, -29, -182, 133, -152, 179, -113, -66, 7, 97, 18, -57, 20, 2, -81, -142, -39, 63, -61, -29, -13, -21, 255, -21, 63, 94, -66, -11, 77, 90, 35, -18, 70, 46, -25, 74, -55, 18, -126, 39, 116, -11, 43, 67, -82, 119, -82, 60, -87, 50, 80, -231, -125, 24, -47, -82, 217, 54, 34, -112, 165, 43, 54, -45, -69, 79, -68, 32, -2, -40, 247, -111, 45, -64, -47, 48, -157, 51, 38, 124, 44, 38, 9, -98, -52, -56, -27, -99, 104, -70, 2, -296, -43, -45]
7574d5mJ34j13K5j57K47J61l40j28J62rK03j84J46j58N9N3r5l5J34j04M4M4J8
7598E8j05l9K82k64J6L06l45K34r1o3K3n4P3j04J91k32J49O6k67K92o0R0o6n3
7622C7Kn5J84k31O6P4J4j40J02r2J61j28p7J27N4k09K53j39J11m2n2Oo9R8j28
7647g3n9J00J05k36p8K72j60O7oL2Oj4R6L9j15P5j20j2J61R1o7o1k7J79n3q3j9
7674D0r2K22k38J36j63j42J64l8L9K00j80OR9j93J89M6j91j4o2K09j26L2KJ66
7698A11j56j00K44K9p7L7q3J59j78N1k85L01j4L3q7N9l35K20J63j35O1M9j43Q6
7722A0R5R8j80J61j08j99P1k4k1M0Kl2K10l35J74N0q2k2J0P5j7J7N4n0p7O5K76
7749B61j71J4k28R9j16J88M7j01n5j4K57q3k8j63M0Q5m9M0N7l3o5L7j44K49j92
$$ y = [-45, -49, 85, -28, -3, -160, 87, 248, -92, -220, -58, -67, 136, -48, 98, -60, -1, 52, -43, -78, 56, -48, -4, 40, 58, -47, -86, 196, -68, -52, 254, -91, 143, 52, -11, 12, -42, 31, -73, 118, -114, 35, 101, -166, 126, 66, 156, 90, 37, 39, -16, 168, -63, 3, 77, 91, -49, 53, -39, 122, -6, -83, 44, 98, -111, 142, 3, 114, 72, 20, 26, -43, 55, -73, -132, -32, 73, -163, -241, 31, -129, -62, -68, -36, -30, -44, 52, 91, -24, 51, -69, -81, 80, 171, 104, 43, 16, 195, 142, 59, 40, -52, 170, -68, 68, -95, -237, -73, -111, -72, 128, -52, -46, 53, -140, 49, 95, -96, -110, -172, 37, -89, -57, -55, 111, -45, -145, 99, 128, 51, 88, 5, 164, -14, 37, -248, 53, 39, 72, -15, 44, -291, -71, 92, -43, 18, 67, -76, 10, 105, 203, 23, 184, 76, -123, -52, -76, -97, -57, -55, -87, 123, -212, -38, 12, -70, -92, -82, -7, -24, -7, 47, -3, -80, -15, 261, 90, 104, -124, -25, -141, 47, 94, -7, -62, -76, 181, 98, 70, -93, -53, 32, -17, 23, 80, 47, -18, 19, -125, 124, -68]
7774f8R0K50l15J83m1k15Q2J40n1k9oR7r5j5J6J9M1r9J70m9k23R8p8M3O3J40n8
7801I0k34K00j00J2KO0J95l77J85o0J34Oj47NK5M2o8J8J42k12o9J41j50K35m2
7826C3m5o6l6K5J65j93K47j53O9N0k19q5J76K4j36k7J44K6L6m2j31J63o1j07J35
7851hj02J70j17m9K6r4K21O0J6j45M5J06j52j09J63p8N0J11R7k30p9N3K50l27
7875a22J67n4q7O2k62L86r7J6r0MJ3K4N3M2o6L8J02j41m4o5L9Q3j6J00p3J5J56
7902A83N8k90k7K25j13r7J74k9p9j47J60o9K04l0j06j01N4O8j55J28M9k1j45J86
7926H0j76p7J48j59K06j53J77j1rj4j67K14%k04J02m9L8K7r7j9J46Q7j01K0m9
7951d0j1J05q1M5o2L3M5J04j31N7M3j05P1j57J5o4O8QO0m0NL4r6J25J07l9j51
$$ y = [-68, 22, 272, -43, 140, 99, -116, -34, 106, 55, 26, 20, 117, 22, 7, 23, 42, 83, -16, 154, 105, -118, -20, -98, -55, 8, 148, 90, -144, 56, -44, -32, -30, 30, 225, -152, 33, -27, 107, 113, -34, -29, -4, 38, -30, -12, 130, -82, -151, -10, -160, 75, 33, -12, -78, -114, -89, 76, -117, 130, -23, 46, 96, -123, -208, -32, -8, -144, -171, -27, -1, 35, -7, -138, 25, -36, -143, -8, -110, 60, -57, -106, -80, -174, 47, 107, 123, -22, 23, 129, -23, -132, 31, -47, 3, 114, 211, -19, -98, -45, 205, -122, 45, -9, -96, -34, -296, 90, -7, 9, -81, -77, -64, -40, 13, 55, -11, 27, 129, -12, -56, -121, -82, 1, -15, 85, 12, 27, 183, 241, -49, -76, 149, 36, -61, 113, 84, 5, -142, 18, -51, 153, 123, 17, -84, -30, 38, -117, 11, 60, 39, -106, 80, -96, -173, -25, -184, 22, -131, 46, 35, 26, 12, -155, 59, 59, -145, -43, -92, -54, -27, -124, -143, 3, 90, -11, 9, -40, -51, 54, -27, 18, -44, -11, 34, 138, 7, 64, 107, 2, 73, -84, -69, -133, -65, -57, 3, -37, -32, 2, -94, 31, 138, 99, -52]
7978e2J67j37m4J09L4m5k7M6k2l3P9p5o7J83j22Qj00K12p4p2Q2j64K08Nj75m6
8004a22J91r4o5K24k23J1Q9j3j22J85j05Q1M8n3L7j32L9J71k62J84j06L9M8m3
8028GKM0j85K00k07J98j2J23r0n8J23k82K81j38O0j68N3J61p2j30NL1mJ9O2j41
8054a22J53j99J37q3J57r6J82j70K7o8J66J12l61J59J14j07J30kj75M0j27K07
8076G4M3j6r4o0N5k80J97J07j8j25J28N1%j72J11j08Q1j50J16jl9p3J14J87j88
8101f0Q4q0J06r4P2m9o0P9L0J05j44Q1k16RJ69k6J58k60J11n1M0j8L3O9j52J00
8127C6k1m3l6k9j7K77l3Qj19l1P2J8j6o4R9j13l8N8j0L3N3j73R0N1k81J23K4L8
8155d4R1p5P7K8j36J61k02J71j82K66kj90r8M0nK21k3P2k60J30l6k46K62j26P1
$$ y = [-52, 115, -22, -66, 43, 77, 32, 5, 51, 29, -4, 75, 0, -67, 116, -6, 2, -98, 114, 40, -32, 50, -114, 94, 99, -76, -122, 69, -25, -90, 134, -89, -78, 11, -2, -124, 61, -44, 37, 85, 32, 69, -63, -24, 147, -115, 69, -37, 2, 50, 7, 9, 49, -136, 64, -143, 55, 43, 166, 76, 18, 141, -141, 140, 2, 62, -106, -53, 108, 36, -94, -89, -58, -62, -43, 19, -122, 31, -168, -31, -114, 43, -53, 129, -41, -14, -82, 84, 196, -165, -6, 108, 1, 131, 129, -46, -6, -133, 74, 117, 101, 7, -53, 2, -278, -81, 26, 8, -117, 11, 62, 62, -110, 1, -107, -26, -176, -60, -61, -100, -173, -59, 128, -60, 24, -56, 50, -44, 28, -21, -81, -2, 28, 133, -11, 70, -146, -137, 32, 6, 164, -96, 15, -36, 4, -14, 19, 88, -64, 36, 15, -28, -64, -93, -110, 167, 134, 142, 23, -8, 64, 82, 66, 2, 101, -12, -50, 8, -2, 31, 84, -89, 1, 52, -229, -106, -82, -44, 47, -28, 49, 77, -59, 102, -100, 71, -111, 155, 153, -37, -135, -95, -100, 121, 98, 170, -90, 40, 4, -242, 20, -106, -35]
8180c5J69r2j58k3l7K23r2J74k63Q5J79
$$ y = [-35, 134, 42, -116, -139, -176, 47, -45, 129, -134, -49, 130]
8191A30
$$ Imaginary data points
##PAGE= N=2
##DATA TABLE= (X++(I..I)), XYDATA
0@%%%%%%%qJ6j6J6k1K9l2M0n6O4p4R5j17J36j60J89k18K53k93L38l86M42n06N73
31C04o48P30q21R22j031J151j283J426j581J749j932K134k353K592k854L139l452
48a808L797m177M593n054N572o152O808p557Q420r425J0610j2031J3767j5936
62h573J8719k2416K7540l5047M6947o8235J15991l62593k3533P76590q21556P05272
74C49106o34697K14454M70684p62931N67685l90829K90131N6935m39828M12918
84A33628j99172K34338k77309l0276L17762j71511k6538j42721L11386r2165j51180
95i3758O4185K6067J43867k36520O2403K2421J14974j15687r3886J62198r1678
106c5414K26390m32883K50962J98966l97481L48838m06632M42118j03731l88453
$$ y = [0, 0, 0, 0, 0, 0, 0, 0, -8, 8, -8, 8, -13, 16, -16, 24, -32, 32, -42, 53, -64, 72, -88, 101, -117, 136, -157, 181, -205, 237, -269, 304, -344, 386, -435, 487, -544, 607, -676, 750, -831, 918, -1014, 1120, -1233, 1359, -1495, 1644, -1808, 1989, -2188, 2405, -2649, 2923, -3229, 3579, -3978, 4442, -4983, 5627, -6404, 7363, -8573, 10146, -12270, 15270, -19777, 27170, -41065, 74926, -287667, -311200, 465390, -356166, 349106, -285591, -71137, 399547, -363384, 204301, -186528, 103603, 160538, -279290, 133628, -65544, 168794, -108515, -138791, 178971, 7460, -19078, -161799, 149587, 57422, -93758, -29573, -3506, 140361, -96159, -33756, -11335, 103639, -12048, -105934, 56264, -35414, 190976, -241907, 9055, 208021, -189460, 159378, -247254, 194864, 91133, -297320]
116b97320N62588m72766M10439k67894j20054M74601n23170M42483l84874J47222
126b8745K90054n33593M33272l06809K75342p2614l07021M83769l58985K28290
136A02960j71547j8657K97787l81566K60965j50387M8703J42522k67274J62238
146B5744q171J2880m7155l3514O8083N5210j17436l1035J84787j70028J14593
157E3958j12021L1582J59766k77905K48208j85806J03004Q8469k93566L23950
167A39639k20668J44070n7892j39490L22998l14893J91071j11511L1599J39551
177A24474k97970L12005k30099J29645K5789k23373L24373k75535J75377o6106
187a420j00613K64179k79928J61144n7462K240Q4075j75349J66693p9939K4158
$$ y = [-297320, 265268, -207498, 202941, -64953, -185007, 289594, -233576, 208907, -175967, -28745, 261309, -272284, 160988, -145821, 129521, 56907, -250114, 233655, -125330, 102960, -68587, -87244, 210543, -171023, 89942, -60445, -11742, 130780, -136494, 25744, 17573, 30453, -16702, -50216, 17867, 73077, -44359, -75394, 109393, -60635, 53958, -58063, -26481, 133285, -144620, 103588, -82218, 20786, 109255, -184311, 139639, -81029, 63041, 5149, -134341, 188657, -126236, 64835, -46676, -15077, 124474, -173496, 138509, -91590, 38055, 63844, -159529, 164844, -110691, 64686, -1420, -102033, 162146, -117782, 43362, -14100, -11860, 72215, -103134, 63559, -16380, 7778]
198G778o578l1285O7039n5658M1031o6004P7113l3519r105J9026n3668J22834
210G9004j37124O5274Q040l6801P1620j26399J37126q4806K4913K3077q7849J50063
222H6138j55689J08775m7953l0618J31789j95982J70030q9401J1450O6115j49772
233i5118J89372j45970N7519K2404q8002J38261j43897R6716l2072k2807P0403
244D6809j02025R5347o0739L1079q107k8603O9166q1864O6085m5225K1748J5541
256A9212n4461P0892o5058N0364k6787o536L6042n1390N8349n9229M3342r494
268E246k5038M7400o0974O6460n3484K0039J9750n1619P0106p1418N2058j7038
280A488k0871N2360p1101O9198m5025R272K3854m7426N9395n6941L7946q747j9407
$$ y = [7778, 1200, -30085, 36954, -18704, 22327, -43677, 33436, -83, -9188, 9838, -43830, 79004, -58120, 7154, 15194, -21607, 50013, -76386, 60740, -24066, 847, 23924, -63925, 86138, -69551, 39224, -8729, -39347, 92442, -103540, 66490, -22911, -11461, 54654, -95118, 94254, -51716, 5803, 28207, -59795, 78466, -65431, 31285, -787, -23594, 46809, -55216, 40131, -20608, 10471, 2364, -26239, 42927, -38937, 27148, -18077, 3671, 19212, -35249, 35643, -29415, 20949, -5838, -12374, 23668, -27722, 30627, -28602, 14740, 5246, -19792, 27608, -33366, 33094, -20390, -351, 19399, -32220, 37886, -33532, 18526, 1488, -19383, 32977, -38124, 31074, -13951, -4679, 19175, -28251, 31144, -25797, 12149, 3402, -16005]
293a6005L9258m7801M5175l3237J3769R772l0572M1904m0441K9121j3836k915
305e808J9696l3090L7235l0032J5527O96j5440K7267l2918K9233j5941j783J6231
318A0873k3349K4168k0508J2618j204j0232J6892j7815J5049j0861N293K838j1223
331g461J6123j4996R656l787j887P591j2630J4018j0131K727M686r420J1076r187
345c622M172K378p437Q830o156N43M085n994N946m332O54M731q588Q805o091J557
361e19M872j0597J1677q406M104o1o251J3412j5687J2072o042j739J1903j9947
375a1209K0258j3341L205Q980j9953K1826j3697L910J875q125J5770j5178M323
388a356M168k324j732J566j250R43N970j6692J9967j4725N793R796l1940M2544
$$ y = [-16005, 23253, -24548, 20627, -12610, 1159, 10931, -19641, 22263, -18178, 10943, -2893, -5808, 13888, -19202, 18033, -11999, 3528, 4224, -11216, 16051, -16867, 12366, -3575, -5358, 10873, -12476, 11692, -8816, 3802, 2598, -7634, 9258, -8557, 6492, -4369, 924, 3762, -7461, 8662, -6334, 3322, -465, -2352, 5239, -7391, 6627, -3504, -777, 3909, -5511, 5565, -3622, 550, 2928, -4509, 4321, -1835, -1292, 2793, -3201, 2745, -1587, -933, 3798, -4790, 4015, -2076, -519, 4353, -6244, 5433, -2973, 1131, 1070, -5181, 8231, -7456, 4616, -1426, -3165, 8738, -11209, 9049, -4292, -1087, 7893, -12060, 9766, -3931, -21, 1854, -6271, 9499, -5679, -1356, 2812, 488, -1244, 322, -928, 15, 5985, -10707, 9260, -5465, 328, 10124, -21816, 20728]
402B0728k7650L819J0138k1804L9954m6814K7041J322j7603K9114m4564M8048
414B1729k9461L943J8581m4552O4046n3346K0400N144k4526N6348p9302N6218
426A5222l159l2692M6582o1416O3126k5940k5637M8088m4497L6933j7430j5315
438a6135K7586q657j629j1889J1264J0282o341k6780L1045N378k4526J0767j3865
451a3500L9682l5994j198K3495k7535M5441n8440K9070J1772k0277K9848p3791
463e1427R3802m0577k6488M7098o3147J07634j10427K5227P1117j05143J06566
474E4235j01701M9025M6755j02712R4851q0738O3990M077q4997Q9300m1026L1192
486B2251m1209o873P3240o2723P716k342K4587j580l4588K1394R29J8227k7633
$$ y = [20728, -6922, -3103, 7035, -14769, 25185, -21629, 5412, 6734, -10869, 18245, -26319, 21729, -7732, -3789, 14792, -29760, 34286, -19060, 1340, 6484, -18042, 38306, -40996, 15222, 12063, -20629, 25953, -35463, 27663, 1723, -23914, 24174, -20323, 16610, -820, -16135, 11451, 2794, 1165, -10724, 540, 10822, 4481, -22299, 8746, 14124, -10402, 365, -13500, 26182, -9812, -11010, 12485, -15050, 30391, -28049, 1021, 12793, -7484, 22364, -51427, 42375, 1798, -24690, 22408, -40739, 66895, -43532, -18305, 52812, -52331, 54235, -47466, 1559, 48314, -54398, 40453, -40285, 23705, 27782, -57215, 32085, -8941, 22251, -18958, -25831, 47409, -15314, -7598, -9940, 14647, 13067, -21521, -127, 802, 19029, -8604]
499h604j0523K8200R511k4328j3890K0486K1666j1523o5023Q5223j1490m7716
511b8011M9768o8980J05924o7862l8462J05863j13076J15415q9437j4330J22044
522G8856j36763J03065r2689M9306P4118j68617J36493n8397L0067J146q5371
533f8786J37240r4663L4861j5235j9543Q4802j02448O0371l5151K5565L8734j16361
545g0614R7453j1533k1860J0313m1730Q1186l5060m9248N8567j2674l601Q791
557I990m7610O3731r977m5468N1305o0365Q5232m2861o8055J25404q8957N3207
569B5576m6660j1197J12802j44653Q7041l2312M184N2526j17587J20006p8617
580b8891M9112r16r5993J60460j25425N6456j7853m0600J40288j78195R7948N426
$$ y = [-8604, -19127, 9073, 18584, -5744, -19634, 852, 22518, 10995, -54028, 31195, 19705, -28011, 21757, -47223, 58701, -9161, -47623, 58240, -54836, 60579, -28858, -43188, 78856, -57907, 45158, -47531, 1775, 75893, -92724, 43769, -14628, 15439, 16585, -68786, 68454, -26209, 8652, -6583, -26126, 58676, -43772, 16599, -18552, 7013, 45747, -70614, 26839, 15306, -6554, 3759, -37971, 43215, 8155, -41093, 17474, 4800, 1199, 9990, -37620, 26111, 16134, -29334, 21971, -38394, 46838, 3977, -64078, 61326, -27631, 25576, -21084, -32281, 80521, -64132, 22909, -9403, -5219, 47307, -70280, 49726, -28891, 20221, 19305, -76688, 83772, -41653, 14803, -3050, -43650, 96638, -81557, 16391, 21817]
592B1817n2656Q5741j26147J08172k1980m7097O5648p8508P8706k0420n0854N1375
604A3797j2118J2280k1721k0116N5722j1103n1517M2807m037N496r526k9746N9921
617C0139l8260J5803j9349n288O3493q0933M7950l2972L0143L0599j18534J29092
629E1883o4448J3352J8865q6695J52299j30938M3757K8807q2683J39147j47606
640f4260P1275K3074p0822J01125j30110R7836K519p4094O9996n7764O9817m6354
652g762k2032N7135l7051K5331l7306K1185J9101k5674O820j3807K7667l104k4424
665a3921K539K7961j0954j5430J848J0598K3460n5819L4980J692j3210K8728o5707
678d3235P5421l3889j3411M1060p3246R9441p0583k045N2151o6688Q3048r0389
$$ y = [21817, -30839, 54902, -71245, 36927, 14947, -32150, 33498, -45010, 33696, 13276, -37578, 13797, 1679, 13959, -7762, -27878, 27844, 16741, -34776, 8031, 3994, 9490, -36, -29782, 30139, -8121, 7682, -11667, -16955, 46538, -34395, 13555, -19417, 10726, 41325, -77209, 51883, -12565, 787, 19652, -67043, 85256, -45682, -1925, 26882, -55801, 83346, -64260, 7015, 30089, -40733, 60392, -69718, 28118, 30637, -43457, 26539, -31225, 38592, -7762, -29794, 27341, -9710, 15621, -21685, -500, 18601, -7073, -253, -14060, 13607, 10503, -13921, -11382, 16579, 5625, -9805, -7957, 2641, 26101, -29718, 5262, 6954, -6256, 22472, -43235, 32186, -1703, -15114, 25946, -47300, 52141, -18442, -20487, 31664, -35024, 48024, -42365]
690d2365M5325L0271p1736P3607p3808O5474j9215m0302O7731o8880O6812m6230
702a3316m074M7726n6067N2096n2255L0746J6831m7917M1877k9372K7759j4848
714h14j3751K7639j7319R036j2400J0361k661N273j0969k33J9715k5903K3992
727A1966k7277K2332N497l6862M6228l9436L1178j4572j6911M5981n4055M5912
739A9981l0948N366K7413m9619N3423m6014K9698M60l5307N4473n2714M0513k1442
752d717p275L6757n1046M6839l2841J3381J0378l1226M0581l8464K8822j2060
764h71q934K4525k9365K8398k4716J5209p8j3757K1540k5431K6118k0661Q685
777F62N862j7984K5892k8481K3877j3551M85J3584k6688L3908l0381J7511o66
$$ y = [-42365, 2960, 33231, -38505, 35102, -38706, 26768, 7553, -32749, 34982, -33898, 32914, -13316, -17390, 30336, -25731, 26365, -25890, 4856, 21687, -26230, 15647, -13725, 14034, -814, -14565, 13074, -4245, 4791, -7609, 2752, 91, 5364, -5605, -5838, 13877, -12026, 11966, -15311, 7021, 12518, -24344, 21884, -17552, 13626, -946, -17857, 28124, -25931, 19981, -10967, -5601, 21812, -27807, 25616, -20398, 9300, 9760, -25547, 28926, -23788, 16725, -4717, -11992, 24765, -26281, 20558, -12283, 1098, 11476, -19750, 20831, -17633, 11189, -871, -9805, 14720, -14645, 13753, -10963, 4246, 4168, -9589, 11951, -13480, 12638, -8023, 662, 6524, -11460, 14432, -14049, 9828, -3723, -3238, 10346, -16342, 17566, -12815, 4696, 4030]
790D030j6199K9898l5801L0576j6181j716J7644k8005L1380k7561J7033j764j4343
803a1009K6127l0290K6812j7099L269J1736k3884K9001k6006J6792m272r261K1235
816A3151k8105K6881j7358L577R544j8984K3079k1878J5965o175m601J3327j8899
829a0476K1303j9000J1188R74j3498K1382k2670J8176r760q19J1737j9844K1574
842A0267j7190Q924P07r556J6441j9137J6164q629LP011j2167J5669j6557J2720
856D670l782o530J3983j7352J6998j2764L671Q197j6637J8069j3972P095K09p307
870e452J2928j4563J0885l309l694O757o854P203p312M213J142l883K706k179
884a412M935o707M153O1k825L885m432M663m644L930p10m276O497m381L429n915
$$ y = [4030, -12169, 17729, -18072, 12504, -3677, -5393, 12251, -15754, 15626, -11935, 5098, 3334, -11009, 15118, -15172, 11640, -5459, -2190, 9546, -14338, 14663, -11343, 5449, 1177, -8084, 13151, -14954, 11927, -5431, -1854, 7690, -11294, 11785, -10093, 5872, -303, -4904, 8423, -10476, 10827, -8173, 3015, 3989, -9509, 11873, -10797, 7379, -2381, -3200, 8537, -11307, 10267, -6923, 2001, 2708, -6848, 9593, -9544, 6620, -2009, -2006, 5005, -7162, 8507, -8050, 4670, 888, -5642, 8341, -9011, 7987, -4777, -1106, 7091, -9546, 8523, -5449, 1646, 1855, -5452, 7476, -7087, 3798, 489, -3205, 3552, -3302, 3901, -3411, 802, 1944, -1939, 767, -1412, 3523, -3184, 969, 1030, -1795, 2090, -2342, 2321, -2323, 1607, 897, -3379, 3118, -1263, 2166, -3749]
900c749N473K190r965R939o788O329m452l784J3871j7116J2575l948p500J7089
914A0164j8274J1835m082m773J7210k4374J5557K090j1938J2966j5672J7411o950
927A170j1066K0411j7713J1517l928p274J5522j5060J2139r395j52J4667j9259
940h421J0753n215O845M85j8620K5799j3310j442P306j2814J9799j6092J207J0779
954G059j5271J7269j1422o438J9579j3821L177k045k021J8451k6633Q797J5123
967A1804k1305J7903j7575J0019J0931k7515K7606k0522J0450R248k8684K9187
979A1547j8210J5307j1783j1681L9519m0878K2197r694o93K5655m9294M5145k0212
992c075l620K5266m5585M6678k3717m64J5264l3416M8683l3574n425K7145k2590
$$ y = [-3749, 1724, 3914, -6051, 3888, -2900, 3429, -1023, -4807, 9064, -8052, 4523, 575, -6925, 10164, -8110, 3725, -357, -5130, 12080, -12294, 3263, 5353, -6585, 6381, -9291, 8120, 1170, -9896, 10515, -7198, 4319, 391, -6883, 8639, -6421, 5718, -3677, -3829, 10838, -8421, 2332, -2883, 3962, 4447, -14173, 11626, -1684, -3126, 4180, -8634, 11165, -4927, -3720, 7059, -8212, 9057, -2365, -8803, 10776, -3045, 132, -1913, -3934, 14517, -12116, -3319, 11804, -9501, 8402, -9173, 846, 11777, -15738, 11868, -8654, 1796, 11044, -17640, 11547, -6663, 8644, -3139, -14820, 24699, -16179, 6018, -3676, -4369, 21286, -28008, 17137, -3075, -6695, 18571, -27014, 19664, -4053, -4517, 10747, -22669, 26014, -7560, -12985, 14160, -8430]
1005h430J9507k1762O230K0688k5825Q113M565p189J2561j2305m131J7377j2045
1018b646P078j3368O932K0512l4751J9610o337R505L22l2327M9173l3054J1561
1031B210K665k6541N3489n3714K9552p035j7278N4752p6060N0642n363k0289L7604
1044B4634o4956P0284k7260k4756M2823m1987M5212l3976j473K7464k7303K6048
1056A4754l0398J5028J4131j9405N121q930K3346r874j7612J4653Q254q197p173
1069f302K014J0625J909k3104K0898q723P508L115l4805N1266l1177O160N679
1082E063l1233O9671p0762K2648K3389m1355N7066p2316N0868M665m5352N5703
1094B8055n9972N5571j9958k7104M6266m5357N0368m3289K512L8025m1385K9849
$$ y = [-8430, 11077, -10685, -4455, 16233, -9592, -1479, 3086, -4103, 8458, -3847, -7978, 9399, -2646, 4432, -8936, -2004, 18508, -16243, 3367, -2970, 6535, 6857, -25470, 23703, -9351, 2210, 4875, -21666, 31823, -21891, 7661, 626, -16652, 38100, -37960, 12682, 7319, -12970, 24634, -40322, 29962, 2702, -22054, 20769, -21218, 23994, -9982, -11455, 16009, -11294, 14754, -15644, -616, 13515, -5890, -769, -9699, 13647, 3773, -13839, 814, 9068, 871, -6302, -4288, 6337, 8246, -14858, 6040, -2683, 4825, 7940, -26865, 24401, -6776, -616, 5063, -26170, 43501, -27261, -4613, 18776, -22579, 34487, -37829, 13039, 17704, -27648, 28055, -31917, 23654, 3696, -23408, 22858, -22499, 27869, -15420, -12908, 25117, -16268, 13581]
1106A3581l3627L0126L500l4554L2220j9844K0261j3512j1232K4739j3456M038
1118B240o797L00J2999m458j8863J9817N81r962Q868k2809L9772k5680j0042L1512
1132A7478l6592M2801l9824J0332K7117m5076M9025m9187L1315R010m2982N0796
1144B4213m8291M4893k2127k1157N2527n4674M5429l4466P989L0797n4131N1747
1156B2749l8486J9491J0477l8906M5073l3048K0285n567j6821L1800k4732Q960
1168A275l560K930M110q888K258L528L081j2659J4468j3045J1014r66j5907K6466
1182A4105k6211K2371j4258m834K7722l7992L3896k5039J1831J1298l5755M5834
1194B2968l9788K4929m049k1959M2886m8263L9429k1104n146L2681m7817M4482
$$ y = [13581, -20046, 10080, 13580, -20974, 11246, -8598, 11663, -1849, -13081, 11658, -1798, 2240, -4557, -4257, 8742, 4284, -14579, 5238, 5819, -4143, 4725, -18084, 21688, -3992, -14034, 17478, -19114, 23687, -16137, -5805, 21312, -23764, 25261, -23926, 7389, 16399, -26583, 24213, -24078, 20815, -1312, -22469, 30058, -24616, 20813, -13653, -5664, 25133, -28998, 22749, -15737, 3754, 14231, -24675, 20398, -12650, 7635, 2068, -14753, 17047, -7685, 1275, -2285, 645, 4755, -4133, -1875, 1653, 4734, -7925, 6543, -6502, 4512, 3546, -12361, 14105, -12106, 10265, -3993, -8827, 18895, -19097, 14799, -10240, 1591, 12889, -22866, 22968, -16820, 8109, 4060, -17899, 24987, -23276, 16153, -4951, -10097, 22584, -25233, 19249]
1206A9249k9740J0138J3725l5092M2065l2762J6904j650j3306K5180k7828K1696
1218H579j2953L350P291j4621J6089j4591J3140r265J436N407q508J1583j6443
1231i506J7855j2058K742O086j4808K2166k3676J7776p159n559J8728k8237K9101
1244A3451k1421Q534P412k3981L4356l2612K0542m229j2146K6363l3711L0319
1256A2877j8035J913J3888k6558L1581k6727J5139l44j4565K5033k6625K0294
1268G871j0591M75R527j7558K0286j7501J1756m820l189J1352j6930J8393j5650
1281f579R363q45q078J5223j9304J9343j3766K955Q444j6623K0198j8906J3272
1294D697l767o852J4944j8457J7638j3913P248K214j2304J9912k1786J6868p324
$$ y = [19249, -10491, -353, 13372, -21720, 20345, -12417, 4487, 2837, -10469, 14711, -13117, 8579, -4374, -1024, 6267, -8354, 7735, -6856, 6284, -2981, -1545, 3862, -4646, 6937, -9506, 8349, -3709, -967, 5119, -9689, 12477, -11199, 6577, -582, -6141, 12587, -15650, 13451, -7970, 564, 7976, -16005, 18351, -14261, 6281, 2052, -10094, 16269, -17442, 12877, -5158, -3245, 10643, -15915, 15666, -11061, 4078, 3734, -10831, 14202, -12423, 7871, -2720, -2245, 7282, -10276, 10010, -7491, 4265, -555, -3744, 7608, -9322, 9071, -6579, 2784, 1939, -6139, 9084, -10220, 9123, -4643, -1688, 6756, -9867, 10331, -8575, 4697, 930, -5922, 9022, -9435, 8203, -5710, 1538, 3752, -8552, 11360, -10426, 6442, -882]
1307h82l662J3303j9970K1229j5938N902N114j3235J7304j7650J3978o356l000
1320c863J0711j4406J4284j1835P866j973n600J2374j5714J4806j0176L188M839
1333D501j2898J7671j6214R436r10n904J0495j3330J3444r748L006L793q313J0513
1347E542j1593J0846o806J24P191j1814J2507j0991P799j814o651J3600j5165
1360g225J1369n122r91O533j0908J2952j0709M668J547n469P470q918R496p180
1374b487J189N099q271Q607q045O630k686l484Q508r471O771l149O48J783m677
1389c035O522n661K517n1K0p42j091M880o507M938k507J102P17m987R492j0218
1405d611N736R98o042Q450r290Q695n037k026Q965j0971P572l431J462J122n990
$$ y = [-882, -4544, 8759, -11211, 10018, -5920, -18, 5096, -8139, 9165, -8485, 5493, -863, -3863, 6848, -7558, 6726, -5109, 2757, 784, -4816, 7558, -8156, 6650, -3526, -338, 4501, -8397, 9274, -6940, 2496, 1586, -4318, 6177, -7153, 6291, -3457, -451, 3342, -4971, 5542, -6051, 4795, -2011, -1887, 5304, -6510, 5997, -4994, 2805, 991, -5660, 7940, -7225, 4144, -978, -1969, 4564, -6344, 6608, -4101, 567, 2114, -3355, 4115, -4803, 4693, -2487, -1298, 3801, -4470, 4137, -3908, 2722, 36, -3448, 5060, -4411, 2360, -789, -141, 1642, -3035, 3487, -2174, 343, 292, 312, -430, -1521, 3359, -3148, 1790, -717, 385, 1102, -3885, 5607, -4611, 1125, 2123, -3919, 4531, -4759, 3936, -1101, -3127, 5838, -5133, 2439, -992, 470, 1592, -4398]
1420d398R757q946M168J080m306O324q140Q034m183k924R124r953N510m83k214
1435a550M656q111Q492k151o308R603o510J792J714n209Q057p403K495M924j0817
1450f326J0482m118l005N988o060P377p684K073O425j0223P550l969K178Q58o493
1465d947J0700r638M197L017q686J0057p682M761j305n762J3700j4100N158M961
1479D431r525J0985j2121Q462K884j4603J7955j2296K261P696j4346J4961r960
1492c216L015N266j4744J8633j1419m81P153r004J2433j4814Q152M698j3236J3989
1506F425j1237P017j74p800J2635j3537J0781k466q564J4454j2313P976m255l946
1520e004J5321j8287Q149M602j0688J2061j1637O244M678j3735J4972j0192J985
$$ y = [-4398, 5359, -3587, 581, 1661, -2645, 3679, -4461, 3573, -610, -3534, 5590, -4363, 1147, 664, -1550, 3106, -5005, 3487, 1336, -4972, 4631, -1879, -87, 1627, -3582, 4475, -2928, -433, 4491, -6326, 4156, 38, -2967, 3021, -3039, 4338, -3346, -1273, 5152, -5071, 2479, -1490, 688, 1546, -4947, 5753, -3885, 312, 3329, -5357, 4700, -2982, 1779, 474, -5288, 8412, -5688, -530, 4431, -5094, 5891, -6230, 2232, 5116, -9487, 8468, -3828, -1567, 6129, -8217, 6744, -3216, -201, 5065, -9679, 8954, -2465, -2946, 4207, -4797, 7636, -7178, 974, 5672, -7564, 6425, -4812, 2205, 2031, -5769, 6866, -6671, 4110, 1644, -6920, 7534, -4779, 3197, -1058, -5004, 10317, -7970, 179, 4781, -5907, 6154, -5483, 761, 5439, -8296, 6676, -3516, -1531]
1533a531Q767j6353J4776p359M37O555j5853K0658j2632k269J1637j4063J5967
1546H737j5177N892P954j6919J8686j6506R513K459j3872J9362j9778J5565l030
1559B886j4358K3982k0515J1863l325q110K0337k2691J2155J634j0133J4230j5347
1572g392R810R26r398J2204j1055N702M375j2357J1084m377m70M373j0635J3595
1586F385o776m090R882j1239J2003r385O84R690j5869J6934j3591L859R889j9172
1600a0796K0673j7227Q929N694k0924K6440k0138Q711L421j5993K5019k3597J2264
1613B476K054j3818K0672k0311J1848l44q789J4549j6208J1180r39p357R686q986
1627d287P441k863m022P991o782L170O32m571O787n082M82M122p739R755o948
$$ y = [-1531, 7236, -9117, 5659, -1700, -1263, 5292, -10561, 10097, -2535, -4804, 6833, -7230, 8737, -6440, -548, 7406, -9513, 9173, -7333, 2180, 4639, -9233, 10129, -9649, 5916, 2886, -11472, 12510, -8005, 3858, 533, -7577, 12760, -9931, 2224, 3858, -6275, 7955, -7392, 2418, 3344, -6054, 6150, -4905, 797, 5172, -7185, 3899, -478, -948, 3425, -7210, 6385, -391, -4481, 5401, -5838, 6165, -3220, -2536, 7154, -8715, 8219, -5372, -1513, 8376, -10796, 9877, -7350, 1579, 7273, -13651, 12789, -7349, 1362, 4783, -11210, 13809, -9788, 2476, 4530, -9288, 11384, -8927, 2921, 2577, -6212, 8337, -7871, 3309, 2370, -4987, 4699, -4287, 3154, 291, -3731, 4260, -2522, 648, 1280, -3291, 3496, -1586, -1104, 3018, -4721, 5034, -1914]
1642a914j039R287j3099J2771q990L31J1093j8848J8462j1564J097J0882k0362
1655a1893K2104j5244L941Q279j9030K3139j7809O904M341j4006K0427j9539J0507
1668B121J121r783J4972j6457J2365l437n400J0185j1780J0769n712j730O492
1681C726p300O699m311m98M692m469J080J104j802K883k318j878O408o826L805
1696I95k98l990R011j1174Q221k285l919J0075j4785J4027o734k335R573j5049
1710h667J6997j2407K439P383j3739J6340j5058Q342K127j0792J5185j5664J1638
1723D124k845o541J1874j2962J1172o360q51O910q752P594o064L878O0l753M644
1738B128m029L726l205J690k47r8J245l312M553m560M214l401J96M490p510P820
$$ y = [-1914, -2953, 6334, -6765, 6006, -2984, -2653, 8440, -10408, 8054, -3510, -2413, 8469, -11893, 10211, -5033, -1092, 7187, -11843, 11296, -6513, 391, 4732, -9274, 11153, -8386, 2121, 3242, -6541, 8431, -8026, 4339, 902, -4498, 5687, -6093, 4676, -1036, -2766, 3726, -3574, 3125, -1186, -1684, 3008, -1461, -381, 723, -1079, 1804, -514, -2392, 4016, -2810, 995, 697, -3293, 5718, -5456, 2765, 480, -3439, 6636, -8149, 5878, -856, -3191, 6382, -8667, 8330, -4077, -1638, 5745, -7994, 8346, -6712, 1630, 3757, -7035, 8150, -7514, 4124, 1279, -5262, 6612, -6350, 4822, -1538, -2389, 4521, -4231, 3363, -2701, 1177, 1237, -2516, 2128, -1901, 1825, -1380, 310, 63, -35, 1210, -2102, 2451, -2109, 2105, -1296, -1100, 3390, -4120, 3700]
1754C700o685M435J88n959J0053j0963Q756m310k365R077j2603J2170q132J534
1768a104N849j1139J2286r882N714n05n355J0062j1136Q706m956J81M833q555
1782e001R794q203M660k6m219O985p893P263n253J363L091n877O509n941M886
1797B138k719l39L197n345O298o252N266k499j867O392r420R054n584R26L276
1812B522o637R071q853N475q03l436O096p372P635o161K524K100n984P989p731
1827c565O006l229r25N773r166R316o615K399J900n701Q663q735N628j079k627
1842a957M434n147N743n625L649m11k769M960n922O340n759K534K379o671Q333
1857D111p240M732j587k324O537q695P458l788L9K291l908N627o655N297j931
$$ y = [3700, -2985, 1450, 1638, -4321, 5732, -5231, 3525, -785, -3150, 5927, -6676, 5494, -2638, -1104, 4745, -6394, 5892, -3990, 1724, 1219, -4136, 5926, -5210, 3496, -1460, -1279, 3554, -5001, 4793, -3410, 1250, 1224, -2995, 3990, -3903, 3360, -1893, -530, 2561, -3316, 3193, -2748, 2138, -581, -920, 2277, -3068, 3230, -3022, 2244, -255, -2122, 4270, -5150, 3904, -1680, -754, 2522, -4115, 4956, -3897, 1578, 775, -2661, 3435, -3937, 3698, -2463, 61, 2161, -3823, 4166, -3565, 2441, -788, -1713, 4060, -5106, 4210, -2405, -6, 1894, -3807, 4856, -3879, 1749, 670, -1957, 2477, -2670, 3073, -2552, 1097, 686, -2083, 2877, -3045, 3295, -2464, 70, 2449, -4222, 4111, -3129, 1603, 16, -2308, 4229, -4466, 2992, -796, -757, 1534, -2374, 3253, -3402, 1895, -36]
1872c6j418L507m998O755p193M501N65n420P878p809O224l599o30N754q887P971
1888C165m000q4K478l912N518o221M360p93j695K493l124M295m862L470k08k933
1904b053M209l891L580l373J780J371m153M505k960J864k315K124N44l417M337
1919B152m044L900l534J279L107p574R291o801J690K910o298Q855r622O218Q62
$$ y = [-36, -1454, 2053, -2945, 3810, -3383, 1118, 1683, -3737, 4141, -3668, 2556, -1043, -1673, 4081, -4806, 3165, -835, -919, 1559, -2353, 3165, -3056, 1304, 511, -1184, 1309, -1815, 2480, -2382, 1088, 880, -2053, 2156, -1735, 1845, -1528, 252, 1623, -2530, 1975, -985, 879, -1436, 688, 1232, -2185, 2152, -1892, 2008, -1526, -247, 2860, -4714, 4577, -2224, -534, 2376, -3922, 4933, -4689, 1529, 2391]
$$ [...]
8191a8
##END NTUPLES=NMR FID
##END=
