##TITLE=1H_LR-755-R2-P2
 CCl4
 8 sc, 
 14.12.2022
##JCAMPDX= 6.0         $$ Bruker NMR JCAMP-DX V2.0
##DATA TYPE= NMR FID
##DATA CLASS= NTUPLES
##ORIGIN= UXNMR, Bruker Analytische Messtechnik GmbH
##OWNER= root
$$ XWIN-NMR		Version 3.5
$$ Wed Dec 14 14:49:21 2022 Russian Standard Time (UT+4h)  she@DPX200
##.OBSERVE FREQUENCY= 200.13135
##.OBSERVE NUCLEUS= ^1H
##.DELAY= (6, 6)
##.ACQUISITION MODE= SIMULTANEOUS
##.ACQUISITION SCHEME= undefined
##.AVERAGES= 8
##.DIGITISER RES= 18
##SPECTROMETER/DATA SYSTEM= spect
##.PULSE SEQUENCE= zg30
##.SOLVENT NAME= CDCl3
##.SHIFT REFERENCE= (INTERNAL, CDCl3, 0, 15.7039)
##AUDIT TRAIL= $$ (NUMBER, WHEN, WHO, WHERE, WHAT)
$$ ##TITLE= Audit trail, XWIN-NMR		Version 3.5
$$ ##JCAMPDX= 5.01
$$ ##ORIGIN= Bruker BioSpin GmbH
$$ ##OWNER= she
$$ F:/spectra/data/she/nmr/H-F/1/audita.txt
$$ ##AUDIT TRAIL=  $$ (NUMBER, WHEN, WHO, WHERE, WHAT)
(   1,<2022-12-14 14:48:25.26 +0400>,<she>,<DPX200>,
      <created by zg, POWCHK disabled, PULCHK disabled
       configuration hash MD5:
       00 E9 B6 7A A2 85 ED C7 34 08 36 98 17 FE 4E 26
       data hash MD5: 16K
       9C F7 CD B0 D4 68 C3 B0 62 FD 06 7A 12 21 50 6B>)
$$ ##END=
$$ 
$$ hash MD5
$$ C8 F5 03 3D 8F 23 13 61 AF 1D 80 79 19 F8 70 C6
##$RELAX= 
##$RELAX= 
##$RELAX= 
##$RELAX= 
##$RELAX= 
##$RELAX= 
$$ Bruker specific parameters
$$ --------------------------
##$DU= <F:/spectra>
##$EXPNO= 1
##$NAME= <H-F>
##$PROCNO= 1
##$TYPE= <nmr>
##$USER= <she>
##$AMP= (0..31)
100 100 100 100 100 100 100 100 100 100 100 100 100 100 100 100 100 100 
100 100 100 100 100 100 100 100 100 100 100 100 100 100 
##$AQSEQ= 0
##$AQ_mod= 1
##$AUNM= <au_zg>
##$AUTOPOS= <>
##$BF1= 200.13
##$BF2= 200.13
##$BF3= 200.13
##$BF4= 200.13
##$BF5= 200.13
##$BF6= 200.13
##$BF7= 200.13
##$BF8= 200.13
##$BYTORDA= 1
##$CFDGTYP= 0
##$CFRGTYP= 5
##$CHEMSTR= <none>
##$CNST= (0..31)
1 1 145 1 1 1 1 1 1 1 1 1 1 1 1 1 1 1 1 1 1 1 1 1 1 1 1 1 1 1 1 1 
##$CPDPRG= <>
##$CPDPRG1= <>
##$CPDPRG2= <>
##$CPDPRG3= <>
##$CPDPRG4= <mlev>
##$CPDPRG5= <mlev>
##$CPDPRG6= <mlev>
##$CPDPRG7= <mlev>
##$CPDPRG8= <mlev>
##$CPDPRGB= <>
##$CPDPRGT= <>
##$D= (0..31)
0 1.2 0 0 0 0 0 0 0 0.06 0 0.03 0 0 0 0 0.0002 0 0 0 0 0 0 0 0 0 0 0 0 
0 0 0 
##$DATE= 1671014904
##$DBL= (0..7)
120 120 120 120 120 120 120 120 
##$DBP= (0..7)
150 150 150 150 150 150 150 150 
##$DBP07= 0
##$DBPNAM0= <>
##$DBPNAM1= <>
##$DBPNAM2= <>
##$DBPNAM3= <>
##$DBPNAM4= <>
##$DBPNAM5= <>
##$DBPNAM6= <>
##$DBPNAM7= <>
##$DBPOAL= (0..7)
0.5 0.5 0.5 0.5 0.5 0.5 0.5 0.5 
##$DBPOFFS= (0..7)
0 0 0 0 0 0 0 0 
##$DE= 6
##$DECBNUC= <off>
##$DECIM= 32
##$DECNUC= <off>
##$DECSTAT= 4
##$DIGMOD= 1
##$DIGTYP= 9
##$DL= (0..7)
0 120 120 120 120 120 120 120 
##$DP= (0..7)
150 150 150 150 150 150 150 150 
##$DP07= 0
##$DPNAME0= <>
##$DPNAME1= <>
##$DPNAME2= <>
##$DPNAME3= <>
##$DPNAME4= <>
##$DPNAME5= <>
##$DPNAME6= <>
##$DPNAME7= <>
##$DPOAL= (0..7)
0.5 0.5 0.5 0.5 0.5 0.5 0.5 0.5 
##$DPOFFS= (0..7)
0 0 0 0 0 0 0 0 
##$DQDMODE= 0
##$DR= 18
##$DS= 0
##$DSLIST= <SSSSSSSSSSSSSSS>
$$ [...]
##$SUBNAM2= <"">
##$SUBNAM3= <"">
##$SUBNAM4= <"">
##$SUBNAM5= <"">
##$SUBNAM6= <"">
##$SUBNAM7= <"">
##$SUBNAM8= <"">
##$SUBNAM9= <"">
##$SW= 18.05172834244
##$SWIBOX= (0..15)
0 0 2 0 0 0 0 0 0 0 0 0 0 0 0 0 
##$SW_h= 3612.71676300578
##$TD= 16384
##$TD0= 1
##$TE= 0
##$TE2= 300
##$TE3= 300
##$TEG= 300
##$TL= (0..7)
0 120 120 120 120 120 120 120 
##$TP= (0..7)
150 150 150 150 150 150 150 150 
##$TP07= 0
##$TPNAME0= <>
##$TPNAME1= <>
##$TPNAME2= <>
##$TPNAME3= <>
##$TPNAME4= <>
##$TPNAME5= <>
##$TPNAME6= <>
##$TPNAME7= <>
##$TPOAL= (0..7)
0.5 0.5 0.5 0.5 0.5 0.5 0.5 0.5 
##$TPOFFS= (0..7)
0 0 0 0 0 0 0 0 
##$TUNHIN= 0
##$TUNHOUT= 0
##$TUNXOUT= 0
##$USERA1= <user>
##$USERA2= <user>
##$USERA3= <user>
##$USERA4= <user>
##$USERA5= <user>
##$V9= 5
##$VALIST= <valist>
##$VCLIST= <CCCCCCCCCCCCCCC>
##$VD= 0
##$VDLIST= <DDDDDDDDDDDDDDD>
##$VPLIST= <PPPPPPPPPPPPPPP>
##$VTLIST= <TTTTTTTTTTTTTTT>
##$WBST= 1024
##$WBSW= 4
##$XGAIN= (0..3)
0 0 0 0 
##$XL= 0
##$YL= 0
##$YMAX_a= 714616
##$YMIN_a= -894818
##$ZGOPTNS= <>
##$ZL1= 120
##$ZL2= 120
##$ZL3= 120
##$ZL4= 120
##$ABSF1= 10
##$ABSF2= 0
##$ABSG= 5
##$ABSL= 3
##$ALPHA= 0
##$AQORDER= 0
##$ASSFAC= 0
##$ASSFACI= 0
##$ASSFACX= 0
##$ASSWID= 0
##$AUNMP= <proc_1d>
##$AZFE= 0.1
##$AZFW= 0.1
##$BCFW= 1
##$BC_mod= 2
##$BYTORDP= 1
##$COROFFS= 0
##$CY= 11.3945322036743
##$DATMOD= 1
##$DC= 2
##$DFILT= <>
##$DTYPP= 0
##$F1P= 2.36226072786647
##$F2P= -0.459571619588291
##$FCOR= 0.5
##$FTSIZE= 0
##$FT_mod= 4
##$GAMMA= 1
##$GB= 0.15
##$INTBC= 1
##$INTSCL= 1
##$ISEN= 128
##$LB= 0.24
##$LEV0= 0
##$LPBIN= 0
##$MAXI= 10000
##$MC2= 0
##$MEAN= 0
##$ME_mod= 0
##$MI= 1.114404
##$NCOEF= 0
##$NC_proc= 0
##$NLEV= 6
##$NOISF1= 3.799351
##$NOISF2= 2.8
##$NSP= 1
##$NTH_PI= 0
##$NZP= 0
##$OFFSET= 15.70392
##$PC= 1
##$PHC0= -19105.75
##$PHC1= 9.400721
##$PH_mod= 1
##$PKNL= yes
##$PPARMOD= 0
##$PSCAL= 0
##$PSIGN= 0
##$REVERSE= no
##$SF= 200.130013532006
##$SI= 16384
##$SIGF1= 3
##$SIGF2= 2
##$SINO= 400
##$SIOLD= 16384
##$SREGLST= <1H.CDCl3>
##$SSB= 0
##$STSI= 0
##$STSR= 0
##$SW_p= 3612.71676300578
##$SYMM= 0
##$S_DEV= 0
##$TDeff= 0
##$TDoff= 0
##$TI= <>
##$TILT= no
##$TM1= 0
##$TM2= 0
##$TOPLEV= 0
##$USERP1= <user>
##$USERP2= <user>
##$USERP3= <user>
##$USERP4= <user>
##$USERP5= <user>
##$WDW= 1
##$XDIM= 8192
##$YMAX_p= 0
##$YMIN_p= 0
$$ End of Bruker specific parameters
$$ ---------------------------------
##NTUPLES= NMR FID
##VAR_NAME=  TIME,          FID/REAL,        FID/IMAG
##SYMBOL=    X,             R,               I
##VAR_TYPE=  INDEPENDENT,   DEPENDENT,       DEPENDENT
##VAR_FORM=  AFFN,          ASDF,            ASDF
##VAR_DIM=   8192,          8192,            8192
##UNITS=     SECONDS,       ARBITRARY UNITS, ARBITRARY UNITS
##FACTOR=    0.0002768,     1,               1
##FIRST=     0,             0,               0
##LAST=      2.2672688,     0,               0
##MIN=       0,             -894818,         0
##MAX=       2.2672688,     714616,          0
$$ Real data points
##PAGE= N=1
##DATA TABLE= (X++(R..R)), XYDATA
$$ [...]
2497A315M99o281J1183j3128R672l580k598R678j5024J2502k586m159N097q040
2511e450J2681j0131o76Q991r484P941o810K419M820r588R975p857K252O677j2245
2526f485R150l114M72K923j0508J3866o606m157R029r279J0042p673q48R337j2272
2541f123J1618q075j131J1605j4297R612n764K692O196j6647J6630o707j473N638
2555C774j0919J5431j1972J925O331j1820J5344j3001L244O680j0422J2341j4085
2568g149Q685N054j5377J4558r799O434L18j1382J7429j3099N065K511j0966J6453
2582H735j3041L893L012p735J4046j6470P445N903j1616J1272j1569R129Q19j1575
2596g752J4404j1181O869K66r984J4863j1676N826q17p024J6031j6034O103L260
$$ plain form
2497 1315 1814 -4467 6716 -6412 3260 -320 -2918 6760 -8264 4238 1652 -2507 2590 -5450
2511 -5450 7231 -2900 -3576 5415 -4069 3872 -2938 -519 4301 -5287 4688 -3169 -917 5760 -6485
2526 -6485 2665 -449 23 2946 -7562 6304 -302 -4459 4570 -4709 5333 -2340 -3188 6149 -6123
2541 -6123 5495 -2580 -3711 7894 -6403 3209 -2555 137 6333 -10314 6316 -391 -1864 3774
2555 3774 -7145 8286 -3686 -1761 4570 -7250 8094 -4907 -1663 5017 -5405 6936 -7149
2568 -7149 1536 6590 -8787 5771 -4028 2406 2724 -8658 8771 -4328 737 3248 -7718 8735
2582 8735 -4306 -413 2599 -5136 8910 -7560 -115 5788 -5828 5444 -6125 3004 3823 -7752
2596 -7752 6652 -4529 2340 2606 -7378 7485 -4191 1635 818 -6206 9825 -6209 -106 3154
2610C154p447J1565j5249J0962R75j0493J3447j3600J0269q41r868J4345j3361
2623f142J0762m078q197J7212j5536Q202k056m258J3238j8196J2762k246n556
2636d089J1172j5346J3365m479m374R353j2960J3812p047m407J1147j0835R359
2649D671p524lR739j3314R473l844j148P332j1393R077k830k384O988j1564J1009
2664D285l106n402Q366q976R585n647l531J1317j2514R255m731k189R827j3078
2678f539J0644n616k69Q169j4350J3248o199p07N422j0752J4151j0187J415N820
2692D250r492J0991r806M191L157p965R674r143N001K165o973O863n169M030p48
2707A026m903P794n017L51K240l538M637m067M67L146m754N376l917p17N394o529
$$ plain form
2610 3154 -4293 7272 -7977 2985 3960 -6533 6914 -6686 3583 2742 -7126 7219 -6142
2623 -6142 4620 542 -7655 9557 -5979 2223 167 -4091 9147 -9049 3713 1467 -4089
2636 -4089 7083 -8263 5102 623 -3751 5602 -7358 6454 -593 -5000 6147 -4688 4671
2649 4671 -2853 -2856 6883 -6431 3042 -802 -1950 5382 -6011 3066 236 -2148 4840 -6724 4285
2664 4285 1179 -4223 4143 -4833 4752 -895 -4426 6891 -5623 3632 -1099 -3288 6539 -6539
2678 -6539 4105 -1511 -1780 6389 -7961 5287 -912 -1619 3803 -6949 7202 -2985 -1570 4250
2692 4250 -5242 5749 -4057 134 3291 -4674 5000 -4143 858 3023 -3950 2913 -2256 1774 1026
2707 1026 -3877 3917 -1100 -749 1491 -2047 2590 -1477 -1010 2136 -2618 2758 -1159 -1876 3518 -3011
2723c011N029l366J201L844q952Q978m876K25L505p485R839p903K793K814p561
2738d926J0212q812M080J098m460P177q855O912j612l644N798n891N422l524M09
2753f16K856m982M947l415J142Q61j870K291k467J985j90j327N26R47q36q5N06
2770B73p60J328k315K712j395r91L260m503L859k126J68K255m777O324n193J647
2786b34J790l951N292n366L901j192k255M805n339M401k786M36J855l681M901
2801B577m492K683N3k043K894l718L959k688K81J694k429K493k743K192j056k3
2817c66J263j754J886k182K471k309R07J293l006L598l248K134k00j951L489m255
2833b230L712j609l39J703k678L180l451K853j087r24K207l194L838l454J922
$$ plain form
2723 -3011 2018 -1348 -147 3697 -5255 3723 -1153 -928 2577 -4908 4931 -2972 -179 2635 -4926
2738 -4926 5286 -3526 554 1652 -2808 4369 -4486 2426 814 -2830 2968 -2923 2499 -1025 -616
2753 -616 2240 -2742 2205 -1210 -68 793 -1077 1214 -1253 732 542 -785 -259 688 -148 -233 273
2770 273 -487 841 -1474 1238 -157 -1148 2112 -2391 1468 -658 -490 1765 -3012 3312 -1881 -234
2786 -234 1556 -2395 2897 -2469 1432 240 -2015 2790 -2549 1852 -934 -498 1357 -2324 2577
2801 2577 -1915 768 821 -1222 1672 -2046 1913 -775 -494 1200 -1229 1264 -1479 713 -343 -366
2817 -366 897 -857 1029 -1153 1318 -991 -84 1209 -1797 1801 -1447 687 487 -1464 2025 -2230
2833 -2230 1482 -127 -466 1237 -1441 1739 -1712 1141 54 -870 1337 -1857 1981 -1473 449
2848D49N57k755M118m403L291j570n83K794m269M173k562P05R44j808K348k665
2864a236K253j468J68R16j457K062k813L029j988k96K209k920L127k737J984n83
2880B50k040L857l773K582j451M95R67k616L397l344K527r77q4J122l159M718
2896B471m126J872Q62k698L600l973L627j986p95L091m043L361j964R01K49j955
2912a506L248l196J992o86n9Q85j962L142k740R50K75j088J808k043J877j539
2928f42P15P22j378M06J48J230k589K220n32p67J040k130L721l589J467J305l783
2945b436M985m082K283o59j514M044n651M608j253j371J976k921M595m372J587
2960a81J503l171L853l996K733p56o14K726m767M172j221j304J739j698K777k826
$$ plain form
2848 449 1006 -1749 2369 -2034 1257 -313 -896 1898 -2371 1802 -760 -55 889 -919 1429 -1236
2864 -1236 1017 -451 -283 633 -824 1238 -1575 1454 -534 -830 1379 -1541 1586 -1151 833 250
2880 250 -1790 2067 -1706 876 -575 -80 887 -1729 1668 -1676 851 -126 -210 912 -2247 2471
2896 2471 -1655 217 1079 -1619 1981 -1992 1635 -351 -1146 1945 -2098 1263 -701 200 449 -1506
2912 -1506 1742 -1454 538 -148 -207 678 -1284 1858 -882 68 343 -745 1063 -980 897 -642
2928 -642 73 795 -583 -177 -29 1201 -1388 832 300 -467 573 -1557 2164 -1425 42 1347 -2436
2945 -2436 2549 -1533 750 91 -1423 2621 -3030 1578 325 -1046 930 -1991 2604 -1768 -181
2960 -181 1322 -1849 2004 -1992 741 -15 -629 2097 -2670 1502 281 -1023 716 -982 1795 -1031
2976a031m8K528j851K70K06j34P49q38l65J123j415J931j732p33L760l604J171
2993a3l51N75J532m911M818j251p07J049l148N186l993J159Q95l090N766o173
3009b657K785M53j173K849o314O400j372k785L309l494M793l864n24L645l885
3024a834M044l535P4L481l108J257j600K184J425n169K826R66j245K16j915L905
3040A972r65k751K235j631L178k060k283M113k346J761k995M30N217o174K074
3055b25Q7N44J917o407O303j825r47J706m811P119l772r39K074k455N858p071
3071b844J251M371l988K686m872M938J038n487L893k062K824j307l574N324k313
3086a22Q68j811j236O257m746p56J646L36K190o001L474K426l563J747l052L944
$$ plain form
2976 -1031 -1079 1449 -402 -132 74 -60 689 -149 -514 609 -806 1125 -607 -1340 2420 -1184 -13
2993 -13 -364 211 1743 -3168 1650 399 -308 741 -2407 2779 -1214 -55 840 -2250 3516 -2657
3009 -2657 128 581 -592 2257 -4057 2343 971 -1814 1495 -1999 2794 -1070 -1594 2051 -1834
3024 -1834 2210 -1325 -1251 2230 -878 379 -1221 963 2388 -2781 45 1011 -234 -18 -1933 1972
3040 1972 1007 -1744 491 -1140 2038 -22 -2305 1808 -538 1223 -1772 -1342 3875 -2299 -225
3055 -225 -138 406 2323 -4084 2219 394 -553 1153 -3658 3461 -311 -1250 824 -1631 4227 -2844
3071 -2844 -1593 2778 -1210 1476 -3396 1542 2580 -2907 986 -1076 1748 441 -3133 2191 -122
3086 -122 746 -1065 -2301 3956 -790 -1546 100 436 2626 -3375 99 2525 -1038 709 -2343 1601
3102A601J28m433L541j767L016k150l468O408l041L17j476J1N726p253K090J706
3118I56j274K612n946M810P22l080K146l785N681j669m360M542j992L363m692
3133a966j68N966n152J530j912J904K928o225L598n08R33N50n379N987r93j650
3149e57M20j771N506m518j196L633j924K596m888K218L356m559K428k140K501
3164A105J197n346L478k16O40q19l104N881k528j365J213j342M081m519M32K973
3180A761k731K550l813K121K571m265K497k366L005j46m701N424k089P47r23j874
3196b232N360m620J349M84j460L764n080K798L89j320J742l876M268m59k721K533
3212I19k164L102k467j089L456k480J620j678J56K268k486Q55k36L51J140l048
$$ plain form
3102 1601 1729 -2704 837 -930 2086 -64 -3532 2876 -165 152 -1324 -1313 4413 -2840 -750 956
3118 956 -318 2294 -3652 1158 1880 -1200 946 -2839 2842 1173 -3187 1355 -637 2726 -1966
3133 -1966 -2134 3832 -1320 210 -1702 202 3130 -3095 503 -5 928 1478 -3901 2086 1093 -557
3149 -557 -137 -1908 3598 -920 -2116 1517 -407 2189 -2699 -481 2875 -1684 744 -1396 1105
3164 1105 2302 -3044 434 218 858 39 -3065 2816 288 -1077 136 -1206 2875 -1644 -1212 1761
3180 1761 -970 1580 -2233 -112 2459 -1806 691 -1675 1330 1184 -3517 1907 -182 565 -358 -2232
3196 -2232 3128 -1492 -143 341 -1119 2645 -2435 363 752 -568 1174 -2702 1566 1107 -1614 919
3212 919 -1245 1857 -610 -1699 1757 -723 897 -781 -625 1643 -843 12 -224 127 1267 -1781
3228a781K128Q45j813R83j758K647n15k448K670j474J198n99j339L021k606J290
3244D49n82r02L330m089K130l2l76J303l610L864j728l77J594k487L145k548M73
3261d43J270j903K735k825Q85J194j345J165j944J749j82j612J857o56J79k06
3277h2k84O73o30L04l2k53L74J94q68Q35M8l01nn11J540j985Q61L97p85J212j829
3298a127K024j105k99J438k257K269j236J49M20j455K453k046P10O03j163J369
3314G47j701J555o53m62J301j353J228j205Q28l07j23P84j387J093l01J04l2m98
3332c82J134j272P38k96K52J98p19J020j304R34m11L50J41r18J617k212J450m9
3350B71q50J462j867J721j304K33R44j611J889j298N69N2n81J455j658J236j096
$$ plain form
3228 -1781 347 1192 -621 362 -1396 1251 736 -1712 958 -516 682 83 -1256 1765 -841 449
3244 449 -133 -1035 2295 -1794 336 304 -72 1231 -2379 1485 -243 -620 974 -1513 1632 -916 -443
3261 -443 827 -1076 1659 -1166 -281 913 -432 733 -1211 538 356 -1256 601 -55 124 -82
3277 -82 -366 307 -323 -19 -51 -304 70 264 -604 231 279 -22 -27 -538 1002 -983 -122 275 -510 702 -1127
3298 -1127 897 -208 -507 931 -1326 943 -293 -144 276 -1179 1274 -772 -62 541 -622 747
3314 747 -954 601 -52 -514 787 -566 662 -543 285 -22 -145 639 -748 345 44 148 116 -382
3332 -382 752 -520 218 -78 174 372 -347 673 -631 303 -108 242 383 -535 1082 -1130 320 271
3350 271 -579 883 -984 737 -567 -334 610 -1001 888 -410 159 211 -370 1085 -573 663 -433
3367d33L87N3n25J340j821J300m11j08P89j262J191q47K15M44p37J162r94L47
3385I0m59O01j60n57J021j208J189j018N06K97j016J466j372J243n42k62Q49j376
3403g08J447j119L21O05j114J273j493J435r81O6J012j541J799j537Q93l1j478
3420a151K345k088J302k86q36J994k344J524o66q0Q19j402J237l35L28k37p39
3437f15P55j62j37n9L86j0J57k00j41M49r24N56m98R49n24n70J118j166J482j511
3457f65K43J811k615K327k047J309L71k404L068k424J830q15j747L747l295J877
3473E71o34o19K479l644L058j370l19J512k429K666j774N2Q42j326K452j850k42
3490e75J228j145J367j532L24J841k512J239k76l08J384k242J613k00r28K026
$$ plain form
3367 -433 -46 7 -518 822 -999 301 -110 -218 571 -691 500 -347 -132 312 -425 737 -257 90
3385 90 -369 232 72 -485 536 -672 517 -501 5 302 -714 752 -620 623 81 -181 668 -708
3403 -708 739 -380 -59 546 -568 705 -788 647 -334 -268 744 -797 1002 -535 358 327 -1151
3420 -1151 1194 -894 408 122 -714 1280 -1064 460 -206 -286 533 -869 368 33 361 124 -615
3437 -615 140 -22 -159 -218 168 158 315 115 -26 423 -501 55 -443 506 -18 -588 530 -636 846 -665
3457 -665 -422 1389 -1226 1101 -946 363 734 -1670 1398 -1026 804 -11 -1758 1989 -1306 571
3473 571 -63 -682 1797 -1847 1211 -159 -478 1034 -1395 1271 -503 -451 391 -935 1517 -333 -575
3490 -575 653 -492 875 -657 -333 1508 -1004 235 -41 -349 1035 -1207 406 206 -722 1304
3506A304k943K621k74j925K582k811K989j861j241L753l821K760j763KK891m807
3522b544L962k228M73K323m594M625k501K97Q76l083M743l591P62J689k708L426
3538A927l813K183J073k839L337l083J412J367l276K679j581J114K44k934L904
3553A714k331K83J123k424L865l557O29K279l209L608l306J012K321m137M015
3568A885l541K239J330n077N432l443J619J05l088N657m705J727O12k833M813
3583B732n129K901K78k215L980n194M057j53l196L428l249L344j508k067M314
3598B323l806K159q38j227L813m282K446l74j378L493m533K816M24k257K829l768
3614b160L633q24l115M515l666K944j249j816M288m375K648j153r51M059m902
$$ plain form
3506 1304 -1639 982 708 -1217 1365 -1446 1543 -318 -1559 2194 -1627 1133 -630 -628 2263 -2544
3522 -2544 1418 -810 -337 1986 -2608 2017 -484 -187 689 -2394 2349 -1242 -480 1209 -1499 1927
3538 1927 -1886 297 1370 -1469 1868 -1215 197 1564 -1712 967 -614 500 744 -2190 1714
3553 1714 -617 -334 789 -1635 2230 -1327 -698 1581 -1628 1980 -1326 -314 2007 -2130 1885
3568 1885 -1656 583 1913 -3164 2268 -1175 444 549 -2539 3118 -1587 140 752 -2081 2732
3583 2732 -2397 504 782 -1433 2547 -2647 1410 1257 -1939 1489 -1760 1584 76 -1991 2323
3598 2323 -1483 676 -162 -1389 2424 -1858 588 214 -1164 2329 -2204 612 1036 -1221 1608 -2160
3614 -2160 1473 649 -2466 2049 -1617 1327 78 -1738 2550 -1825 823 -330 -1281 2778 -2124
3629b124L016p43q23K653m915M747j648j476K799l671M439k880q06L261l684L681
3645A826k648j63L108m032K966k157J027K158m618L866j173m93J385k934L723
3660A841k236l11K036k816L068k212l50K564k704K273k492R74K190l810K983j605
3676f07Q05R43l304L852k224M92J129k785L589k445L55J148k541L315k957N50
3692f85K448k965K117k162J537Q81l017L194j820O68J51j976K812j659P80j0j293
3709i99K698k479N61O51r81J681k525J952J21j698K223k040J357Q4j980K447j674
3726f01Q43j88j122K353j730L16J61l18J097j779R97N49j260J284j183Q72J2j073
3744g70J690j452Q88J2j362K065j255O78q92m46K041k011J023N0o65J218j554
$$ plain form
3629 -2124 892 149 -674 1979 -2936 1811 163 -1313 1486 -2185 2254 -626 -1432 1829 -1855 1826
3645 1826 -822 -985 2123 -1909 1057 -1100 -73 2085 -2533 1333 160 -333 1052 -1882 1841
3660 1841 -395 -706 1330 -1486 1582 -630 -980 1584 -1120 1153 -1339 -365 1825 -1985 998 -607
3676 -607 198 1141 -2163 1689 -535 -43 1086 -1699 1890 -555 -200 948 -1593 1722 -1235 -685
3692 -685 1763 -1202 915 -1247 290 1171 -1846 1348 -472 196 347 -1629 1183 -476 304 294 -999
3709 -999 1699 -780 -219 432 -549 1132 -1393 559 680 -1018 1205 -835 522 606 -1374 1073 -601
3726 -601 242 54 -1068 1285 -445 -129 32 -286 811 -968 29 578 -682 602 -581 291 303 -770
3744 -770 920 -532 356 368 -994 1071 -184 494 -398 -844 1197 -814 209 259 -406 812 -742
3761g42J388o21m88J238j714J665n63n26P88r79J397j182j37J209j110N83n96
3778c90O40q6n30P66k95l12L80k66J79j55N3K26m58Q52p86k53O34j74O6j30j82
3799b21R00j153Q08k6p53J031q03K63k83k6L75p91J175m23m25N37n40R13o95K47
3819A10J60m82O94p11K43j67J17J93o62P44k41j89L02j62N62r35N17K47m86R8
3839d8J07L6m77O28k14m19O39k48L1k24N06n03j02K87o2J82n09O19j28n38N91
3860A54o05O55k58K31k6n96Q13p00L70K1l90N97o70P47k08m37O52n84M53n12L69
3881G6K2l93O70n07K51l79N19k70k25N32l46K28j61J16j11l05O06p07K58L59k67
3902c4Lm01Q43o24J72J99k82L06n93P02n93K83K01m66M74n61O10k99j4M61j164
$$ plain form
3761 -742 646 25 -463 775 -939 726 163 -363 425 -554 843 -339 -476 733 -377 206 -390
3778 -390 250 164 -366 400 105 -207 173 -93 86 -69 -16 210 -248 604 -182 -435 199 25 91 -39 -221
3799 -221 679 -474 334 308 -445 586 -217 46 -237 -263 112 -679 496 73 -352 185 -355 558 -137 110
3819 110 270 -212 482 -229 14 -153 -36 157 -505 239 -2 -191 111 -51 511 -424 93 340 -146 -48
3839 -48 59 95 -382 246 32 -387 252 4 35 -189 317 -186 -288 -1 -63 119 -390 229 101 -437 154
3860 154 -451 204 -54 177 151 -445 368 -332 38 59 -331 266 -404 343 135 -302 350 -234 219 -293 76
3881 76 98 -295 375 -132 119 -260 259 -11 -236 296 -50 178 17 133 22 -283 323 -384 -126 233 -34
3902 -34 -31 -432 411 -213 -41 158 -124 182 -411 291 -302 -19 182 -284 190 -371 239 -60 -74 387 -777
3923g77Q65k44J99J14l74R54j337Q44p4m79M60n12O29m42J59M45j173R10k38K22
3943A51m59r7R06j209M85J26J34J07Nj40l88O08m78L95k13L36l1k83L75l86L73
3964C17o29M19J82q55R89m91J09K44r62J203q54P05m56o71J472j409R61m25N1
3983a00O07j388J472p32l4M03p61J274q79L43m38l20J408j337K40L97j69L53r26
4002e87P49J29k52Q5m42M14Pm81L32N1K54O9j005J255k83p18M90k54Q55j180J08
4023d04J259j234O46n46K60J065j736R89r66J161K0j585J791q92O04n63p24K224
4041A369k094Q15j33k93J265k188J616M3m16O04j982K300n86r85Q84p32J636j421
4059b98p76J897o79K39o60mJ280j609L94K43j55Q32j634Q42Q09j016M34j220K271
$$ plain form
3923 -777 88 -156 43 157 -217 737 -600 244 170 -309 151 -361 268 -174 -15 430 -743 167 -71 151
3943 151 -308 -405 501 -708 -223 -97 37 144 149 9 -379 229 -249 146 -67 269 238 -45 330 -56 317
3964 317 -312 107 289 -566 423 -68 41 285 -677 526 -328 377 -79 -750 722 -687 274 -151 -100
3983 -100 507 -881 591 -141 -175 228 -533 741 -138 205 -233 -553 855 -482 -242 155 -14 339 -587
4002 -587 162 291 39 124 -318 96 103 -378 -46 5 259 328 -677 578 295 -423 67 -187 668 -512 -404
4023 -404 855 -379 267 -279 -19 1046 -690 299 -667 494 514 -1071 720 -172 432 -131 -855 1369
4041 1369 -725 90 -43 -336 929 -1259 357 400 -16 588 -1394 906 320 -665 219 -513 1123 -298
4059 -298 -1074 823 144 383 -277 -281 999 -610 -216 27 -128 704 -930 -88 721 -295 139 -1081 1190
4078A190r20j384J757j118J441j399n78K175j859J093q41R4K054l157K037q97
4094c12N33Q39l070L071r71m39N99j216K491k072LJ243j309J737k269P37J461
4111A056j395O94j129J180O19k419J536r8O57o21j462K559j414J41K62q78J881
4128A169j779L00J118j298J363k372J414J463k359J638j423J185J86k453K984
4143A136j430N70j85j522K779j874Q19l30p07K267k746J191P86q36Q00k147K431
4160A002n41j531J644j577K025r75r71K152j752R72q20l05K033k276R85lj83J375
4178A254k364J522j09p59R19j269J600k62j393J601j435J397n74j189K207j158
4194a2K49q41L12J569k508J672n97j53J100k129K066n91m84J162k030K399j195
$$ plain form
4078 1190 270 -1114 643 -475 966 -433 -1011 1164 -695 398 -443 -349 1705 -1452 585 -312
4094 -312 221 1060 -2010 1061 90 -349 250 -966 1525 -547 -544 699 -610 1127 -1142 -405 1056
4111 1056 -339 355 -774 406 1025 -1394 142 44 701 80 -1382 1177 -237 -96 166 -712 1169
4128 1169 -610 -310 808 -490 873 -1499 -85 1378 -981 657 -766 419 605 -1848 1136
4143 1136 -294 276 91 -1431 1348 -526 293 -37 -744 1523 -1223 -32 754 -82 718 -1429 1002
4160 1002 461 -1070 574 -1003 1022 47 -924 1228 -524 448 -372 -677 1356 -920 65 62 -121 1254
4178 1254 -1110 412 303 -456 463 -806 794 532 -861 740 -695 702 128 -1061 1146 -12
4194 -12 237 -604 -292 1277 -1231 441 -156 -309 791 -1338 728 137 -347 815 -1215 1184 -11
4211a1p37J405j307J722j527J46J201j538J051r33L49Q15j539J641j266P84L63
4228F19j558J460n57o6L71q71J268j193Q7J161j121J000j029K48N83j268J226
4245C60q49O86M86j312J002n17L6L66j248K019j399k6Q74o66Q25j129K21O61j091
4264g01J082p28L50N02q37N63l81M47P0j216J314o00K91k72l63J154j131Q34l03
4283G5l85P37q22L08L92o09J109j069N54Po46M37k16L82Mm12N04o03Q5L68n20
4304c20N87m39J42J36k28O80j092N18M22o61K76l2L14l89k77P06n70R5L73m53
4324b12M89n67N93l60j67M55o21K28K19k32K34k65M88l65k82N55n59K34Q0L9L03
4345B87l93K08j05J24j08J48k04R6j22N2j18L06j19l38L70j20m2k7J52r7P8j55
$$ plain form
4211 -11 -748 657 -650 1072 -455 -309 892 -646 405 -528 -179 636 -903 738 -528 256 619
4228 619 -939 521 -36 -102 269 -602 666 -527 -440 721 -400 600 -429 -181 402 -866 360
4245 360 -489 197 683 -629 373 -144 -108 258 -990 1029 -370 -396 478 -188 637 -492 -271 390 -701
4264 -701 381 -347 3 505 -332 231 -150 297 367 -849 465 -135 156 -116 -479 675 -456 378 75
4283 75 -310 427 -395 -87 305 -304 805 -264 290 297 -349 88 -128 254 258 -154 350 -253 -168 200 -320
4304 -320 267 -172 -30 106 -122 558 -534 -16 406 -255 21 -11 303 -86 -363 343 -227 -132 241 -212
4324 -212 277 -290 303 -57 -224 231 -390 -162 57 -175 59 -206 282 -83 -365 190 -369 -135 -55 -16 287
4345 287 -106 102 -3 121 13 161 -43 53 -69 -17 -135 171 52 -286 84 -36 -78 -105 47 -50 28 -127
4367a27L53m67N11m12p4L90l71N57n39M18o2k44J0q5L79q85O05J96k74K45l76
4388b52N5K30j10K52n04O65m23l4J15r6L27l45q3L27j33j0J1K32l08M0J67P5l00
4411a02L17k35j66M21m3j94j31K68Lm55M95r5p1J41l32N27n69K98N1m80O11o70
4433d11K59L81n20N17n10N42j52n44N82j34l2r9j46M96n61O36l49k06N65n84K46
4454b4j24K25O5m59M61k88J92p9m5J33m4j08K14k02J48K28n41M66j50rO6l04O31
4477D52o60K36Q3k95O97q42N45l00j69N61r45J045n43j36P75j080J318j227L16
4496a69O73j230R95o38O01J89j003J193r90M30j29m70J095n67J3J85n77J065j038
4515c72L03L17p69Q16o60N44L65r25R16o30M3N11r93J303r24K5K31q57J381r17
$$ plain form
4367 -127 226 -241 270 -142 -216 174 -197 360 -179 239 177 -67 -57 -142 237 -648 -43 153 -121 124 -252
4388 -252 -197 33 -77 175 -329 336 -87 -121 -6 -102 225 -120 -203 124 -9 -19 -8 224 -84 -44 123 198 -102
4411 -102 215 -20 -186 235 192 -2 -133 135 138 -317 178 83 12 153 -179 348 -221 77 128 -352 259 -411
4433 -411 -152 229 -291 226 -284 258 106 -438 144 10 -22 -121 -267 229 -332 304 -45 -251 314 -270 -24
4454 -24 -148 77 142 -317 144 -144 48 -31 -76 57 13 -95 119 -83 65 293 -248 218 68 59 125 -179 452
4477 452 -208 28 111 -184 513 -329 216 -84 -253 308 -637 408 -135 -271 504 -576 742 -485 -169
4496 -169 504 -726 269 -369 232 421 -582 611 -379 51 -78 -548 547 -20 -7 178 -399 666 -372
4515 -372 -69 248 -521 295 -365 179 544 -381 535 -95 -52 459 -534 769 -155 -130 101 -756 625 -292
4535b92J07N31j036J321j294N88O54j436J722j112L30R0q48J302j336J261j28
4552D24j005J504j716J040r7o68J084j127R64l30n28J216j272N68J26o50J137
4569F70j134Q22k98m04Q87r80Q35l57l51R84j030O39M6p72J545j757R60j19q66
4588f80J455j694J268l62n99J496j397J133n44m11J369j822J350o53k73J188j626
4605h02J538q00k98J002j323J366p47J74K96j034J535j266L94O71j289J073r63
4622d73L68O66j320J348q50O3O63j227J148k24k15L01j018J363n92n01P16o00
4640c84R41p10J38N86j267J184o08JO69j314J461j426Q68j6j030J690j239K96
4658a60J49o30J475j636Q10M00j028J106j073O59J57p89J109r76Q00k12o76Q70
$$ plain form
4535 -292 -185 346 -690 631 -663 -75 579 -857 865 -247 83 173 -675 627 -709 552 424
4552 424 -581 923 -793 247 150 -518 566 -561 403 73 -455 761 -511 57 183 -467 670
4569 670 -464 358 60 -344 543 -437 398 41 -310 674 -356 283 329 -443 1102 -655 305 186 -680
4588 -680 775 -919 349 -13 -612 884 -513 620 76 -335 1034 -788 562 -91 -364 824 -802
4605 -802 736 -64 -362 640 -683 683 -64 110 406 -628 907 -359 35 706 -583 490 -473
4622 -473 -105 561 -759 589 -261 -198 465 -762 386 162 -53 248 -770 593 1 -500 216 -384
4640 -384 557 -153 -15 571 -696 488 -120 -119 550 -764 697 -729 139 123 -907 783 -456 -160
4658 -160 -11 -641 834 -802 8 408 -620 486 -587 72 229 -560 549 -427 373 161 -515 355
4676C55q08P77m74k8Q45j183M17J53k48M64p47Q09l06k98P13q83O82qo47P10o36
4697c41O91m06l25R71q32M38m4n96Q02o43N02l73j14P56r09Q01k60m7J76p39P63
4718B71k91l81O61n23J94l86L87L67o69O60m25J04N09q45P38l48oK47q56Q61l79
4739a10m1R7q6O11o16N4L49n50L90k55K44K21p35N01mj59L19p63O03k00N4J93
4761A17m48O71o33L22Mk06L08o65M09K64m87O46o35M58Q8n06P22o43K26L2j59
4782a15N55q16M91j88k63N00k29K38K2k66L32m71J16K45k59M0j40N50n18J45K65
4803B34l48K77l63K01O5k48J57j73K5M04m01J84J17j91O2Q8o4k95N6N97l93K10
4825B01j86n1K71k72J19j50m1K62K6j62r4J59m4j41K11j47M0r4rK05n3M6j09r3
$$ plain form
4676 355 -453 324 -150 -178 667 -516 -99 54 -194 270 -477 332 26 -272 441 -442 240 232 -415 295 -341
4697 -341 350 -56 -381 590 -242 196 152 -444 358 -285 217 -156 -270 486 -423 378 118 71 247 -492 271
4718 271 -20 -401 260 -263 -69 -455 -68 299 -370 290 -135 -31 478 -367 371 23 17 264 -592 269 -110
4739 -110 -151 -54 -140 471 -145 -91 258 -292 98 -157 87 308 -427 74 70 -89 230 -533 70 -130 -76 117
4761 117 -331 340 -293 29 33 -173 135 -530 -121 143 -344 302 -333 125 213 -293 429 -214 12 44 -115
4782 -115 440 -376 115 -73 -336 164 -65 173 195 -71 261 -210 -94 151 -108 -68 -208 342 -176 -31 234
4803 234 -114 163 -200 1 66 -182 -25 -198 -173 231 -170 14 131 -60 2 90 26 -269 -213 384 -9 201
4825 201 15 -36 235 -37 82 -68 -109 153 179 17 -77 82 38 -103 108 -39 1 -93 -102 103 50 96 -13 -106
4849a06M2j7N9n7K12Rk40P9P0M9j2J26j34l61K38K99m75K08r2K10p8R8R6n35L45
4874C3m8Q9N1j69J04j36K15m24J40P9L04m6k53K10j26J33P8j99l02J15J81j44
4896a15O2K18k17J71j93J04j14JK49k03J98k79K19j48J01J79m55J50M5J24m6J
4918E2qJ03l74K36M2l16K49J1j16l9J89j0j28j4K61r6J63k94Jq8K62O0k32N9M7
4943B0j30L03l4k40K15j34J96o01M51l07J22L13r9J95l37J74J25j74P6m25K23
4964f8N5j02L82m22K75l2j55j8q4N18k38j17J80l54K48J05l00P3k32L15o1k26
4986b58N83l66J43j37j72L67l79K62j88kL57m87N52k15m0J37m99P35m06l02M57
5007A42l32N51m23k19L16l41P14n73N4M55n09J79j05J51k8l15N00m92J36M60p55
$$ plain form
4849 -106 -64 -81 -22 -79 133 142 -98 -19 51 100 88 214 80 -281 -43 256 -219 -11 -103 107 29 127 223 -312 33
4874 33 -15 74 125 -44 60 -76 139 -285 -145 -66 238 192 -61 149 23 156 234 35 -267 -152 29 -115
4896 -115 -53 165 -52 119 -74 30 -84 -83 166 -37 161 -118 101 -47 54 233 -222 -72 -27 97 51 52
4918 52 44 147 -227 9 51 -265 -16 -5 -121 -160 29 19 -109 -123 138 42 205 -89 -88 -176 86 146 -86 -27 20
4943 20 -110 193 159 -81 134 0 196 -405 46 -261 -139 174 75 270 -67 107 232 58 134 -291 -68
4964 -68 -13 -115 267 -155 120 88 -67 -85 -169 349 111 -6 174 -180 68 173 -127 -54 -286 29 -32 -258
4986 -258 325 -41 102 -35 -207 160 -219 43 -145 -147 210 -277 275 60 20 157 -342 393 -13 -315 142
5007 142 -190 361 -62 -281 35 -306 408 -165 -111 344 -165 14 -91 60 32 -283 217 -275 -139 321 -434
5028d34P76l49O6m3k13N34m16j74N07n04P55p80J74L01p44P88l42J21M02o16M94
5049C03o27L77R5o67R08n12J36k0m19Q38o93K45N84r76R56j121P76J11o95P97
5069C96q24P56k40n89J137q72K71l3n25R37r19L80O6q8O12p92M49M4n18Q08j012
5090e56P81J3o52P01n42M10l10m62J302j086O01j86m87J236j636J014j45m43J149
5109G02j451O73K80o39J185j356J133m07q46J315j108J041o06o6Q55j312J057
5126D50m85j21O17j348J192n46L8P56j223J192p66j44O18r17J474q15m26J182
5144G28j478J251q87K56O97r66Q24m85k29P25r95R28k48l95P80j142J063l50l01
5163b24O24q09P54q03L35N41r65R62o99K84M67j108J146o33M15q0q50J521j211
$$ plain form
5028 -434 342 -7 59 16 -197 337 -79 -253 254 -250 505 -275 -101 200 -544 244 -98 23 425 -191 303
5049 303 -324 53 148 -519 389 -123 13 -7 -426 412 -281 -36 548 -428 528 -593 183 294 -401 396
5069 396 -428 328 88 -501 636 -236 35 2 -523 414 -505 -125 -59 -147 465 -327 122 166 -352 456 -556
5090 -556 225 238 -414 287 -255 155 -155 -617 685 -401 200 14 -473 763 -873 141 -4 -447 702
5109 702 -749 -76 204 -435 750 -606 527 120 -726 589 -519 522 -84 -150 705 -607 450
5126 450 -35 -156 461 -887 305 -241 -203 553 -670 522 -244 -388 230 -687 787 -28 -454 728
5144 728 -750 501 -386 -130 567 -399 425 -60 -289 436 -559 369 121 -274 506 -636 427 77 -224
5163 -224 400 -409 345 -458 -123 418 -547 415 -284 0 467 -641 505 -128 287 207 -643 878 -333
5182c33L22L4n02R08q78P29k08n71R88r98J92N37o91Q24o27K26L60o90P16n77
5202b39J24O31j108J273r10jL42n95J016r02N47k00m08Q55j237R07L73j094J158
5221E32p88J59L63q12J120q35K40K48q10J121j028O66j40j93M74o93O01lm46M80
5241B56l74J62J43l27M00o49Q13m72k28L21n31O22k11l4O45j136O67m1j52N55
5261D29p21L80J14m48P07q74N95j98n1M66o27L32j45k78Q11o96M17Ql51K29m35
5282c36O24k57P6P7l97L07O7n5J45p08L90p2N8M17n04L90m87J19K84l51L78l26
5304a61Q0L58m60M23l10J1L26n16M26j60Q2j3j99K05p0j67J80k82L20M5k81K19
5326E6k36M59m30J71K86n75K20K9L1K26k37L01m96K71m5l20K84r0R0M0m7j80Q5
$$ plain form
5182 -333 -11 23 -479 429 -449 280 72 -499 489 -509 -317 220 -471 353 -274 -48 312 -378 338 -239
5202 -239 -115 516 -592 681 -229 -230 112 -483 533 -369 178 -22 -430 425 -812 95 468 -626 532
5221 532 -256 -97 266 -546 574 -261 -21 227 -583 538 -490 176 36 -157 317 -376 225 222 -224 256
5241 256 -118 44 187 -140 260 -389 424 -48 -276 45 -486 136 -75 -109 536 -600 67 26 -126 429
5261 429 -292 88 202 -246 461 -413 182 -16 -67 399 -228 104 -41 -319 492 -204 213 221 -130 99 -336
5282 -336 288 31 107 184 -213 94 161 106 251 -457 -67 -139 -81 336 -168 222 -265 -146 138 -213 165 -161
5304 -161 -81 277 -183 240 -70 -59 267 -249 177 17 99 86 -113 92 22 -145 35 -247 73 118 -163 56
5326 56 -180 279 -151 20 306 -269 -49 -20 11 237 0 301 -195 76 31 -289 -5 -95 -5 35 -12 -192 -107
5349a07R8J66n07N83k78k12K75m6j66J13J33J30q1r0j08L37k74j33P05o34J47
5370E1q1j07K86m88M12q3q0L88k32L0K45m47K31K0k74K94l06L05j13j41J82q7
5392Er6j41N11q2j90R2M4r5q5J74m9k01K40j5k15M38m33Q0J92l45J03j80J68R1
5416A1L5j12nR9j38l9N18j73j99j06J10J23l17K4K1O9J75j64%Q4jN7l20J74J19
5441D5j85R3m2K42j98JK59n14P23m14m8J57j91J38l11K30K09o88O92m22M04k56
5463g6R2N6j77J94N5j94J6R7j59P9j11L00m73M94j49l15M73q0l25K02j98K07J06
5486A14k47J4J17o2q2j17K83l51L11O3l1l0l12J39R4J54j5k08K72l45L06k14n0
5509a97O22n81K01K18l85L14m32K25r2m1L14p97R52k41j33K67n09L19j06j20K55
$$ plain form
5349 -107 -9 157 -350 233 -45 -257 18 -28 -194 -81 52 182 101 11 -97 240 -34 -167 538 -96 51
5370 51 -30 -137 149 -339 73 -10 -90 298 66 96 341 -106 125 145 -129 165 -141 164 51 -90 92 5
5392 5 -91 -232 279 197 7 99 143 48 -37 137 88 -113 127 112 -103 335 -98 -18 174 -171 -68 -248 -80 11
5416 11 46 -66 -71 28 -110 -149 369 196 -3 -109 1 124 -193 -169 -148 -79 96 -68 -68 16 15 72 -248 -74 45
5441 45 -140 -47 -89 153 -45 -44 215 -299 424 10 -38 119 -72 66 -245 -15 194 -494 198 -224 180 -76
5463 -76 16 72 -105 89 144 -50 -34 63 -96 -17 -128 172 -301 193 44 -271 202 122 -203 -1 -199 8 114
5486 114 -133 -119 -2 -64 -146 -263 20 -331 -20 43 12 -18 -330 -191 -97 57 42 -166 106 -239 67 -147 -197
5509 -197 425 -156 45 263 -122 192 -240 -15 -107 -148 166 -631 321 80 -53 214 -295 24 -82 -202 53
5530E3k66L83p7l11P38p50M66m85J43L00o27Q44o97M30P2n79L37j92L40R2o15
5551d01N06n8n6L51m25K51m38K60M79q63L61j3Q6K64q49O55k15J05K06m87N82
5572C01l73k6K67k84M35o01O01k73l91N54m37L49k25k24M85k32L94k74l21M58
5592A83m71N18k29j90N93k78o7j06j86L18m47K89J20j64K96l32j7L49m59K42k11
5613b49K0P8l48R59n79L75l35k71O89n76L54k75j68P49j116Q14j12k35K23l49
5633c52O26l76K4K73j99L99l59l13M31l61K75J8k68K68j16K90n57K82K62m61N48
5654C34k85J7k1k42N24l46J10L13p19M98n42L24K83m22O05n32J51L01p57N50l31
5675a87J75K15n53P25n29K38j9j73K89l96L26k51j29Q43q20K99M5l63L60m14M71
$$ plain form
5530 53 -213 170 93 -218 520 -230 236 -249 -106 194 -433 411 -286 144 216 -363 -26 -218 122 214 -401
5551 -401 105 47 -9 342 -83 168 -270 -10 469 -394 -33 -46 40 304 -545 110 -105 0 206 -281 301
5572 301 -72 -98 169 -115 320 -281 320 47 -344 210 -227 122 -103 -327 158 -74 320 46 -275 183
5592 183 -288 230 1 -189 404 126 59 -47 -233 85 -362 -73 47 -117 179 -153 -170 179 -280 -38 -249
5613 -249 -229 -151 -499 460 -119 256 -79 -350 339 -237 117 -158 -326 423 -693 121 9 -226 -3 -352
5633 -352 274 -102 -78 195 -4 395 36 -277 154 -207 68 86 -182 86 -30 260 -297 -15 247 -214 334
5654 334 49 66 45 -197 327 -19 91 404 -315 183 -359 -35 248 -174 431 -101 50 351 -406 144 -187
5675 -187 -12 203 -350 375 -154 84 65 -108 181 -215 111 -140 -269 574 -246 53 98 -265 95 -319 152
5696A52P5m28L48l57L82k89N0L45q02N85j94q7M52l58M4M1P6J65m74M12k07R8
5718B9J54n37N26j98j96O06p56M78k5l32M08l94K15K65k87K24m44L93k76RM40
5739C02n75M37n13J55L55n13P92o83J47J24j55J94m59J47K80j34K77j61n9K00
5759A58l38K62j22M5K52o24O73m64L19k17oL95l97L0N1r8J06j56M0R3k54M45j21
5782G2K01k55k09K92l26K03p6j2L65l19J67K69p21M60k46L10l75j41N25k60j7
5803i3J60M3J3k16K62q4j89L61m09J63J20k72L49l65K18M4q3J38m75L81r6M4j20
5826a06j63J7K61l7l54K01K35k1p3L59k82%J26k47L21j85k35L81J2j45j87J92
5848G0K2r8K7p4R2N7k77L49j49Q0Mk51K63J37j94m08N03L7m49M28J20n74L12k10
$$ plain form
5696 152 227 -201 147 -210 172 -117 -67 278 -524 61 -133 -220 232 -126 -82 -41 35 200 -274 138 -69 29
5718 29 183 -354 172 -26 -222 384 -372 106 81 -251 157 -237 -22 243 -44 180 -264 129 -147 -138 302
5739 302 -273 164 -349 -194 161 -352 440 -243 -96 28 -127 67 -392 -245 35 -99 178 17 -42 158
5759 158 -180 82 -40 5 257 -367 306 -158 161 -56 -62 333 -64 -34 17 -81 25 -131 -91 2 -252 193 72
5782 72 273 18 -191 101 -225 -22 -98 -110 255 -64 103 372 -349 111 -135 175 -200 -341 184 -76 -93
5803 -93 67 110 123 -93 169 85 -104 257 -152 11 131 -141 208 -157 61 105 22 160 -315 66 -30 14 -106
5826 -106 -269 -252 9 -28 -382 -181 54 33 -40 319 37 37 163 -84 237 52 -183 198 210 65 -122 70
5848 70 92 -6 21 -53 39 96 -181 168 19 99 103 -148 115 252 58 -350 153 190 -259 169 289 -285 27 -183
5872a83L59k75M8J09j21L1J05k4N5k02J14J57k83J93j40N6j0PK3J07j72p8r9K31
5896Hj91L22p3r6J79l10P7j21J56K7M0j29J65k21K33j15K56q1k18L96n68K86j31
5919a09l3K95l20K94j67l2K68O0k75j58M4J98j25K0pN4K30l40J76j37Q8LJ83q8
5943A22J03j54k75J23J82l67K05M5n3Q9k45K49J48k59L51o31M43j00L9JO9p6J03
5966A12L3j15O0m9j53L8Q5j0J32k83Q9J36l87L52O0n8j02k00M79j73j12J98m80
5989c48N15k70K8J11k19L88k87J88j59K77j09k08J55q3m92O95k35m6J72m4Q7k13
6011i7L37n8l98L95l12J06J15l32O32n57K43M8l51L14l37L26l9k19N70n22M55
6032C19J19n03M43o63J37M75m32L36p60M76J19r0M20p26M28O8l85L59m36N70j10
$$ plain form
5872 -183 176 -99 -51 58 -63 -32 73 49 104 -98 16 173 -110 83 -57 -1 -11 -4 19 126 -46 -124 -223 8
5896 8 -183 139 66 -30 149 -161 -84 -205 -49 -22 18 -111 54 -167 66 -49 207 126 -92 304 -264 22 -109
5919 -109 -142 153 -167 127 -40 -72 196 256 -19 -177 -133 65 -60 -40 -47 7 237 -103 73 -64 24 27 210 122
5943 122 225 71 -204 -81 101 -266 -61 -16 -69 20 -225 24 172 -87 264 -367 76 -24 15 16 85 9 112
5966 112 145 30 90 41 -112 -74 11 1 133 -150 -61 75 -312 40 100 42 -60 -260 219 46 -66 132 -348
5989 -348 167 -103 -75 36 -183 205 -82 106 -53 224 115 -93 62 -21 -513 182 -53 -99 73 29 116 -97
6011 -97 240 182 -216 179 -133 -27 88 -244 388 -169 74 122 -229 85 -252 74 35 -184 386 -136 319
6032 319 438 -65 378 -285 -148 327 -105 231 -529 -53 66 -24 396 -330 98 166 -219 140 -296 274 164
6053A64l50N77o15P18n68j73O15p84M22L04l61N06q71P64j78l63M65o84Q04l67
6073B5j41L60n68P27k87n04R34j053Q79l13k41M95q09O70k45pM40r17R74l42j53
6094g6M43q82J008o11k51P71q03J141j013J07N29p02O33o26K70N54r06Q19l34
6113G1l8K99r21R77m86J15J8l68R80q67J05M97p09P68p88K68M76q61P20m99K10
6134c3M41r58R64m71j86M52q46R08n54M30l5m24P84r98P39Q2n20N46p89M37J14
6155H3j39K82n24M80n1o41R02o51K82N3m59Q59r38O22L4n54Q30n94K25O7n72P62
6177C58o04L85J23m95O62p09L92rk77P51q48N85j60l89P03p00M07N7o14R22j082
6198e42R78k33l74L34o53R77n26l22O77n03N82o98r4P69p22N56l77P1M38n61L74
$$ plain form
6053 164 -186 391 -224 494 -74 -247 368 -416 6 310 -51 455 -416 348 170 -193 272 -412 392 25
6073 25 -116 244 -324 403 116 -388 546 -507 372 59 -182 313 -496 174 -71 -78 362 -555 419 77 -76
6094 -76 367 -515 493 -118 -369 402 -401 740 -273 -166 363 -339 294 -332 -62 492 -414 405 71
6113 71 33 332 -589 388 -98 17 35 -333 647 -220 -115 382 -327 441 -347 -79 397 -464 256 -243 -33
6134 -33 408 -550 414 -57 -243 209 -637 271 -283 147 112 -312 472 -526 213 295 -225 321 -468 -31 83
6155 83 -56 226 -298 182 131 -510 392 -259 23 76 -383 476 -462 160 194 -360 470 -124 101 168 -404 358
6177 358 -246 139 262 -233 429 -280 112 103 -174 577 -271 314 154 -235 468 -232 175 232 -382 540 -542
6198 -542 436 203 -171 163 -490 487 -39 -361 316 -187 395 -303 -397 372 -350 206 -171 -100 338 -223 151
6219A51j49M4L81q92P22p8k02J71l85M34k54k42O17n33L45j51k80P40q89O65l25
6240a10j23N13m94K50Ll2L31q76R55n63j03M16m33N03l07J83J24k12K98o99M55
6261G9M6n02O31k58K34j17m10N97l38K02p0k64N75l69k19M94m11L61m07J41K90
6282B85n82N53l28m3K77m60L63l22K56J47l88P47o76K53j04p3L75o25K94J64m71
6303c58M71k56L52j96j52J81m65M23L7l15L40o5M59l85l25L28j15j46L97k60J18
6324F8k44J11K06k62J74M8J14l03N5p4J54j03K17l51M53m91O6O4L2J08l1K9k47
6347b07L72Mn34N83l49k3K85l96M78l59J03m8K81j20R5n03M55J6N5k76J31K89
6369C32l25q7J9K86k5k51Q8J5l6k6J1K39k74p5N5Q5O7m2M2j07j22O6P7m7Q0m4
$$ plain form
6219 151 2 46 427 -465 257 179 -23 148 -237 197 -57 -299 318 -215 130 -21 -301 439 -450 215 -110
6240 -110 -233 280 -214 36 39 7 338 -538 417 -146 -249 167 -266 237 -70 113 237 25 323 -376 79
6261 79 125 -377 254 -4 230 113 -297 300 -38 164 94 -170 405 36 -183 311 -100 261 -146 -5 285
6282 285 -297 256 -72 -115 162 -298 65 -257 -1 146 -242 505 -171 82 -22 -95 280 -345 -51 113 -358
6303 -358 113 -143 209 13 -139 42 -423 0 37 -278 62 -3 456 71 -254 74 -41 -187 210 -50 68
6324 68 -176 -65 141 -121 53 101 215 -88 -33 -107 47 -56 161 -190 263 -228 -162 -98 -66 42 11 40 -207
6347 -207 165 169 -365 218 -131 -154 131 -265 213 -146 -43 -91 190 70 165 -338 117 133 188 -88 43 332
6369 332 7 -80 -61 225 200 -51 37 52 16 -10 1 240 -34 -109 -54 31 98 56 98 -9 -131 -65 12 -35 45 1
6395AK11k91j32L74l11K51J8jq1j02J48j39k3J29k0j57n2K75j51P2J02q4J0N2
6419I9j06j62J46k48J75j7J45j79L24k42KL43j52k15J58l6o1j94L7L00j75P8m0
6442b0k20L11k5R4k31l2k6R0Q6k76J60J83j63p0K53j54J25j64K38l33N9J31k74
6465b58L85k54N3jK26l7l74K28j16R5J30j37j42J04nK44k81m4L60k59L93k07m2
6488F1j38J73j01R3O9j79m1N4m5J45r9J03j10k59M13j78o8J50j36K46l05K16r2
6511b8Q9k76k7M28l38j45K04j7q8M35n13M19J28k76l8K96n9k72P2q2K4J25j82
6534a21K22o7l3K59m64L53k04j7j13J86J59k54J60R5k16MJ38k68L35k26k6K6J90
6557A18J19k88n3J02k14J50k62K72J41k36K47l55L62l00L66M5k46K8k13M35k1
$$ plain form
6395 1 212 -79 -211 163 -148 103 121 120 39 -63 85 -54 -77 52 32 -125 -177 98 -53 19 121 37 47 99
6419 99 -7 -169 -23 -271 -96 -113 32 -147 177 -65 -63 280 128 -87 71 35 -26 -220 -183 117 -58 20 -20
6442 -20 -240 71 46 140 -91 -123 -149 -59 27 -249 -89 94 -69 -139 114 -40 85 -79 159 -174 -115 16 -258
6465 -258 127 -127 -74 -75 151 114 -260 -32 -148 -53 77 -60 -202 -98 -103 141 -140 -184 176 -83 310 103 61
6488 61 -77 96 -5 88 157 -22 -63 -9 -54 91 -8 95 -15 -274 139 -39 -107 43 -93 153 -152 64 -28
6511 -28 61 -215 -242 186 -152 -297 -93 -110 -198 237 -276 143 271 -5 -43 253 194 -78 -6 -88 -64 61 -121
6534 -121 101 34 1 260 -204 149 -55 -72 -185 1 160 -94 66 161 -55 -51 87 -181 154 -72 -98 -72 118
6557 118 237 -51 -104 -2 -216 -66 -328 -56 85 -151 96 -259 103 -197 169 214 -32 -4 -217 218 197
6578A97j77K36l85L8J62l97N16n9r2P1k99M89o32L10K86l63L53o51M18k26J10
6599i5L11l79J38q9l16O30j95J94q9k3J37m27R7K85n0L1n68M52M67p04K85k59
6621a67M33l22j86L81k57L44n1k57K70k28R7k93M9N64n33L06m6j96L64n02L58
6642A28k05p6K77k33J41l00J88L46l96N03o13k23P67n14M28m52J77M83p79Q51
6662D98p50R0K48m11O83m46k0K50l77N07k79k45K39l91M45j5K7m2l75L34N5k58
6684b33M09n12N99l97J70L25n79N25p41N47R3l80N87m00J49j09l79M33l44K87
6704E0J63n98L83r6J18J74n22O49m20K00m8k77N02m32p5L17j55L65q44O38n1r7
6726e6K60m42O30m23j7K07j75L9J57m00K84oJ07p4l24N18o17O98J25n16K16m68
$$ plain form
6578 197 20 256 -129 -91 71 -326 190 131 39 110 -189 300 -332 -22 264 -99 254 -397 21 -205 -95
6599 -95 216 -163 -25 -114 -430 200 5 199 110 87 224 -203 -106 179 129 160 -408 44 511 -193 92 -167
6621 -167 266 -56 -242 139 -118 226 175 -82 188 -40 57 -236 -187 377 -156 150 104 -92 272 -230 128
6642 128 -77 -153 124 -109 32 -268 -80 266 -130 373 -240 -463 304 -210 218 -234 -57 426 -353 498
6662 498 -252 -162 86 -325 358 -88 -108 142 -235 272 -7 -252 -13 -404 41 26 53 11 -364 -30 25 -233
6684 -233 176 -336 263 -134 36 361 -218 307 -434 113 206 -174 413 13 162 53 -326 107 -237 50
6704 50 213 -385 -2 -98 20 194 -328 321 -99 101 53 -224 278 -154 -229 88 -67 298 -546 92 41 -56
6726 -56 204 -238 392 -31 -48 159 -16 23 180 -220 64 58 165 91 -233 285 -332 366 491 -25 191 -277
6748b77L12J06l58K98k71K92J29k53K21l53N04m89l0M09m55N00l07j56L66l40
6768a52L07k09j74J74j39M29r8k40K51l10K03j24l0L63m19J49J35k36J91j30K42
6789A83M2l44M04n49M98j56j70K56m58M55l60L8M79n92L79j42M5K14l91M48o01
6810c22K41K34q10P03l0jK21m25M09k91J91l4k55J30pj39M39k19R1j52N7J82k67
6833e4J12J60j68O6j6J86m22j39K73j95K97j25j41L07m72L82Nl27N14m40L43j92
6855d6M8J04p2J65k25j5J00m2J07k84K25L5k43K18M8p9J97j44J22l15M79k07k83
6878a07N93n56K75k71N3k1Q4J9R3k54J09l5O0N6Q3j77Q7j19K27l48J17o8K03j29
6902b6j0J62l05L50k28p8L17k10K38k31j40J67j45K66o8N1m1j82K8O9R5N2k00
$$ plain form
6748 -277 35 141 -217 81 -190 102 231 -22 199 -154 350 -139 -169 240 -215 285 -22 -178 188 -152
6768 -152 155 -54 -228 -54 -193 236 138 -102 149 -161 42 -82 -112 251 -168 -19 116 -120 71 -59 183
6789 183 225 -119 285 -264 234 78 -92 164 -294 161 -199 -161 318 -274 105 -37 8 222 -169 279 -322
6810 -322 -81 153 -657 46 16 15 236 -189 220 -71 120 86 -169 -39 -46 -185 254 35 126 -26 31 213 -54
6833 -54 58 218 50 116 100 286 -136 -275 -2 -197 100 -25 -166 141 -331 51 56 -271 243 -197 146 -46
6855 -46 2 106 34 199 -26 -41 59 17 124 -160 65 100 -143 75 123 44 241 97 219 -96 383 176 -107
6878 -107 486 -70 205 -66 -13 -34 50 69 162 -92 17 -18 42 98 181 4 91 -28 199 -149 -32 -100 103 -26
6902 -26 -36 126 -179 171 -57 -135 182 -28 210 -21 -161 6 -139 127 59 110 69 -113 -85 -16 79 131 -69
6925f9J0%J79p8k93J62L16k86NJ8J24j56m6K28k32P7J36k03J61J48j76n8p6J21
6949A2JO0n1j95J47OJ96l42j0J97j44K30p2m1L0k20J73j2qJ51r2Q5j93%J32j3
6975B7N1k6j28J92l10K22j22J33M4j41K65k10j47K12j01K36n64O22j93l1K29n02
6997b42K70K4n64N47j88J35J15j88K52l65M41J4o22M31N0km1j61J45k61J76r2
7019a26l0M40n95L76L9k27J61k28K28Ml8J22n8n5J47l61K47l55L46R1j9J80m57
7042a68L54J10l33J8m5M27o27J98J96k75L35k00pL88n85L49n32K48M63o44N34
7063B04j42O3J01n87N06p7r5lj49L66k00N9L64n62M99k78pK75m90K70m39M02L76
7086D56q93N27q5j33J82j24L66l95J12J16j87L25n58L76M06q69N22l82K48J4j52
$$ plain form
6925 -69 -59 -59 120 42 -251 -89 227 -59 -54 -36 88 -68 -114 114 -118 -41 95 -108 53 201 25 -33 -109 12
6949 12 13 73 22 -173 -26 -20 176 -166 -176 21 -123 107 35 -6 24 -196 -23 -35 -43 108 16 101 -92 -92 40 27
6975 27 78 52 -76 116 -194 28 -94 39 83 -58 207 -3 -150 62 -39 197 -367 255 62 31 260 -242
6997 -242 28 52 -512 35 -153 -18 97 -91 161 -204 237 251 -371 60 110 108 67 -94 51 -210 -34 -126
7019 -126 -156 284 -311 65 104 -123 38 -190 38 42 4 126 68 13 160 -201 46 -309 37 128 109 289 -168
7042 -168 186 296 -37 -19 -64 363 -264 -66 130 -145 190 -10 -17 371 -214 135 -397 -149 314 -330 204
7063 204 62 125 226 -361 145 68 -27 -30 -179 187 -13 46 410 -152 347 69 62 337 -153 117 -322 80 456
7086 456 -437 90 5 -128 54 -70 296 -99 13 129 -58 267 -291 85 491 -378 144 -238 10 24 -128
7107a28M37k95m1R9r9K00n23O7j4J75N05k81k48K79l88Q44q12J97J79m46L74j50
7129f9K69j41l70N02m47L83l6m76O42m77K45q4j63L60j54m5J2j7L84n74M79j53
7151G0k87N62o06L69n5l92L84j55K41k61k81Q17n37K95q8j05P4k86O7K10k58M12
7173A90l94L32j16Q4q9p8M84m52l60M99m46N08p5l07M23o26N02j48j59P16p92
7194c04M69k22L8K35m87Q85q88N2K19j17L46l85K37N2l98M83j12k23J91m71O76
7215B76n56L78L37o70M86M6k34K04k39L49m42J2J39n2J94m05q9K90K3N6k26J1
7237a12rk91O05l25L43Mm38N11l77K00r3m56P85l26l1J09Pj01k58L00L58n32M35
7260C08m31L01l3l17L61k00J12j87j27K39k01J18M3j67J54j4P5j03j83M61l63
$$ plain form
7107 -128 309 14 -27 72 -27 173 -350 -283 -297 -122 383 102 -146 133 -255 589 -223 -26 153 -293 81 -69
7129 -69 200 59 -311 191 -256 127 91 -385 257 -220 25 -59 -222 138 -16 -61 -49 -66 318 -256 223 70
7151 70 -217 345 -261 108 53 -339 45 -110 131 -130 -411 406 -131 164 76 -29 45 -241 -174 36 -222 190
7173 190 -204 128 12 96 7 -71 413 -39 -399 100 -346 162 87 -220 203 -423 79 -69 -228 488 -304
7194 -304 165 -57 -19 216 -271 614 -274 -222 -3 -120 226 -159 78 130 -268 215 103 -120 71 -400 276
7215 276 -280 98 435 -235 251 297 63 267 28 377 -65 -53 86 34 228 -177 -266 24 47 103 -123 -112
7237 -112 -121 -412 193 -132 211 215 -223 288 -89 111 18 -438 347 21 -10 99 106 5 -253 47 405 -127 308
7260 308 -123 178 145 -172 189 -11 101 -86 -213 26 -175 -57 -14 -181 -27 -41 34 -69 -252 209 -154
7281a54M24k48j94K38k67J88mk69L49j57J79j6k17K13q9K06j92L58j15j91K0R2
7303A54j67K1j66M15m3m51J51l2M0J65j53j3pO7J1P0J15l18J76j57K67J7j78P
7327iQ8q1j12J73J42k21l2J43j09N6k66J54M5k1J0o2K52k24J01L21k90j0q4j81
7351b17M40k68O6J18l49O41o05L94j88k22J7J93M9k6N1J32k09Q0kk73J77O3k25
7374a63L56l58M08l36J70J69j68J05k89K62k79N1L16q7j3j21j3j3j08J41j23J54
7396F1K22r0l99J27N9Q7k62K9L06j84j5O5L5J7Q4k18N5J69l03J67N9j31J88n4
7420G4j15J05j35oJ5Nm9J91L12k53O5k09j80K27j35q3K00nJ63o3L6k84j6N7J52
7445F9L9o6L5Q3p1j39J5m5J99r4j9J02k36J52l2M1J5l97L83L9j26j58K84m3J8
$$ plain form
7281 -154 270 22 -172 66 -201 -13 -17 -286 63 -94 85 69 -148 65 -24 182 -10 348 233 42 62 154
7303 154 -13 8 -158 257 214 -237 -86 -118 -78 87 -66 -79 -86 -19 -8 62 177 -141 35 -122 145 162 -16 -9
7327 -9 79 -2 -114 59 201 -20 -52 91 -18 38 -228 -74 -29 -50 -40 -102 150 -74 27 348 58 48 -36 -217
7351 -217 223 -45 21 139 -210 431 -174 220 32 -190 -173 20 69 43 94 226 17 97 95 -178 -1 62 -163
7374 -163 193 -165 243 -93 77 246 78 183 -106 156 -123 -72 244 157 144 23 10 -3 -111 30 -93 61
7396 61 283 193 -206 -79 -20 67 -195 -166 140 -44 -59 6 41 58 142 -76 -21 148 -155 12 71 -60 128 74
7420 74 -41 64 -71 -77 -62 -57 -106 85 397 144 209 0 -180 47 -88 -171 29 24 187 124 160 -124 -140 -83 69
7445 69 108 42 77 160 89 -50 -35 -80 119 25 6 108 -128 24 -8 33 48 -349 34 73 -53 -211 73 30 48
7470D8M8m2j1J3K6K43l82NJ39J9m4j52J20N0k03Q5J49n8O3j32k2kp0J88k28L24
7496A74J09m11N5o6J30m5M15n22j8M09k25k04K51k32J95K32K2k16k25K39j21O3
7518IR2j07jl21K82L13n13L55j19Jj39J50K14j63j47J44j77L64j0j13o5J54k85
7541h2P6q2J72j84K15j86J05J81l97K79q5J7J57k68R5j18K00j29O3O9RJ04k67
7564e6l9K47k77K59J12m32K60l5L1R8j62k5j99M98k04l75M79m22K84J1j02M9l07
7587c07K06PK26Q7l76K48p1J47j37j67K36%k77L57j88M84n21j82L23l30N18j77
7609A06k04K64m02L16j22K18j56m66N31L7k0o6k11J28J3J39L00n96M58l42J11
7630C6K95o16N35l31nK23l54MO7R9J71k55mqL46j9m42N30m25K39L5n9K71n81J56
$$ plain form
7470 48 96 54 43 56 82 325 -57 -52 87 106 62 -90 30 80 -123 -38 111 53 116 -16 -38 -40 -110 78 -150 174
7496 174 283 -128 -73 -139 -9 -54 361 -161 -179 230 5 -199 52 -180 15 247 269 53 -172 67 -54 9
7518 9 101 -6 -7 -328 -46 267 -246 109 -10 -9 -148 2 216 53 -94 50 -127 237 227 114 49 203 -82
7541 -82 -6 -88 84 -100 115 -71 34 215 -182 97 12 29 186 -82 13 -105 95 -34 29 98 107 211 -56
7564 -56 -95 152 -125 134 246 -186 74 39 70 168 6 -19 -218 280 76 -299 180 -242 42 53 -49 0 -307
7587 -307 -101 -94 132 219 -157 91 20 167 30 -137 99 99 -178 179 -9 475 -46 -228 95 -235 283 106
7609 106 -98 166 -236 80 -42 176 20 -446 85 122 102 36 -175 -47 -34 105 405 -191 267 -75 36
7630 36 331 -285 250 -81 -86 137 -217 -213 -146 -47 124 -131 -135 -143 203 184 -258 272 -153 86 121 62 333 -248 -92
7655i2J04k61N00l88J40J9j47L56j00l1j15j11J0n7O5K74m46N33k17K59n0n27
7677b82O85m97L63k47m81P34l39L30j46l28M49l54J67Q4l15L32k63J00J60j57
7697eL37n17K32K5j89K70l24L16j27j86L49j28J51j25j76K02k33K47K0l07L08
7718A40n21M95P8j26J1k07j09O3L4L61n49K07L24m48N25l34K32k16LJ57l01j0
7740a91K1J03J05k37L58k29j51J76N2J34l02r0O05o06L89k57N8L00k42l0O7K3
7762E6M7k25L20j70R1O4k92K62k82L5J64k34O0O5j6M57n44J55Ll5L08k42K9j01
7786b5j41J84j93J65J58p0j38l6O0q6n6J72l5l2J25o3J53q4k2p2m6K86k67P3j19
7811a09K52J0k26n2K8K53j84n8K81l44K2K36j91k7r1J07K24r8J84l38R8o0k04
$$ plain form
7655 -92 12 -249 251 -137 3 22 -125 231 131 100 -15 -126 -116 -173 -108 166 -280 253 36 295 245 -282
7677 -282 403 -94 269 22 -459 275 -64 266 120 -208 241 -113 54 138 -177 155 -108 -8 152 -5
7697 -5 332 -185 47 72 -117 153 -171 145 18 -168 181 53 204 79 -97 105 -128 119 139 -168 140
7718 140 -381 114 192 66 77 -130 -239 -176 -142 219 -330 -123 201 -247 278 -56 176 -40 -37 120 -181 -191
7740 -191 -170 -67 38 -199 159 -70 -221 -45 7 141 -161 -251 354 -252 137 -120 -62 238 -4 -34 33 56
7762 56 103 -122 198 28 119 183 -109 153 -129 -94 70 -164 -104 -39 -55 402 -142 13 16 -19 289 47 76 -25
7786 -25 -166 18 -175 -10 148 78 -60 -96 -36 -122 -178 -6 -41 -73 52 -11 142 58 36 -36 -82 204 -63 10 -109
7811 -109 143 153 -73 -125 -97 156 -28 -86 195 -149 -127 109 -82 -109 -200 -93 131 33 217 -121 -23 -83 -287
7834b87K05j6J19J90p0k71J37j01K61j18k3j25O6J39J7o3k01P5J34p6K88j37l27
7857a84J19J25k78M3J98rk51O6J39n7R6j05k1P2r7K63l18K35j96K09j26p5J31
7880b1J4M8j52K11Rl00K45P7p8j6j46K48n1p9R7j86J86P6l15J71j19J09p7k0J65
7905I6j45RM2R8L0j19r0n2K64k62m4K30j47k00L63o4j47J93J82o4j71K38j23j43
7929b6P2k12J79L2l4Q4j96k8m1L3K03q8N0k53J98J44K9j27r7K1R7k1j35R8kR0
7955G0l4q6J62p9j35J59J18r9j89J47Nk41K90j85J19k1m2m4j15L89n21M99k46
7978g9J50j67j25K41K9k43R4j35L22Kj78J55j81K19k15O0K6K47Kl64Q4q9%N9K07
8003A21j51k4J24k08k1K39o4j61J40k09M48k41K4L4k95L46q1j7M2j04J48Ok76
$$ plain form
7834 -287 -82 -98 21 211 141 -130 7 -94 167 49 26 -99 -33 106 123 60 -141 -66 68 -8 280 143 -184
7857 -184 -65 60 -218 -175 23 14 -237 -171 -32 -89 7 -98 -119 -47 -144 119 -199 36 -160 49 -77 -152 -21
7880 -21 -7 41 -111 100 109 -191 54 131 53 37 -109 139 88 9 106 -80 106 182 -133 38 -81 28 -49 -69 96
7905 96 -49 -40 2 100 130 11 -79 -131 133 -129 -173 57 -90 -290 73 9 -138 55 237 173 2 240 117 -26
7929 -26 46 -166 13 45 11 95 -101 -129 -170 -137 66 -22 28 -225 -27 117 146 19 -78 -57 40 19 -116 -18 -20 70
7955 70 36 -50 112 33 -102 57 175 76 -113 34 39 -202 88 -97 22 1 -41 -85 -200 189 -332 167 -79
7978 -79 71 -96 -221 20 49 -194 -100 -235 87 89 -89 66 -115 104 -111 -51 -25 222 224 -140 -56 -145 -145 -86 121
8003 121 -30 -54 70 -138 -159 80 16 -145 -5 -214 234 -7 17 51 -244 102 21 4 46 -58 90 96 -180
8026a80L48m43m7K74n1M12k78K23j67j89J75n2k75L02P2J45j61l1q6K41j98l27
8048b93N23k10q3J18k64J83N5j99J99j82L52p4l82J2q9L93J06M3l8m61M16QJ25
8071B58j02l7P0L1k97J73k39P0N4k13K28k87M84k06qo2J85q3n5p6R6l8N7j01R2
8096fL0q1L02l72K01k41K59j41k11L72nj85L2J5J20p6k94M79k3j96J03j10J52
8119A24j40J45j86m2M61n28K96O3n78K24K26n4o4j27L99j84MN3j72M0p3R9pM2
8143B1K15p2j84J19m7P5m53K43K22k51L06l09J82ko2J10R8j17p6j67K49k33L48
8166B15j10o2J00j51R2k1j76r2J53K96k17l6N5j05J45n3j49J76p9L5P6O0R2k00
8190D4J92
$$ plain form
8026 -180 168 -275 -322 -48 -99 313 35 258 91 -98 77 25 -250 52 124 269 108 77 -9 232 34 -293
8048 -293 230 20 -63 55 -209 -26 29 -170 29 -153 199 125 -257 -245 -334 59 165 208 170 -291 125 133 258
8071 258 156 119 189 220 -77 96 -143 -73 -19 -232 -4 -291 193 -13 -21 -83 102 19 -36 -112 -16 -54 3 -98 -6
8096 -6 24 -57 245 -127 74 -167 92 -49 -260 112 107 -78 -46 -31 89 13 -281 198 175 -21 82 -28 124
8119 124 -16 129 -57 -99 362 -166 130 193 -385 -161 65 11 -53 -180 219 35 39 92 -80 -40 -113 -14 -21 21
8143 21 236 164 -20 99 52 127 -326 -83 139 -112 194 -115 67 65 3 113 211 94 18 -149 100 -133 215
8166 215 105 43 143 -8 84 63 -113 -205 -52 244 27 -9 46 -59 86 33 -116 60 -19 16 92 152 244 44
8190 44 236
8191B36
$$ Imaginary data points
##PAGE= N=2
##DATA TABLE= (X++(I..I)), XYDATA
0@%%%%%%Qj6J6j6K4l2L8m6N6p2Q8j10J34j58J88k22K60l04L52m06M68n32O04o88
30c66P80q82R92j113J249j396J557j732J921k129K355k599K866l158L476l824
46b003M206m624N082n587O144o762P453q231R115j0126J1295j2662J4282j6231
60h649J8624k1634K5520l0717L7970m8683O5823r6816J67277n38061j18046J262008
72G14616j194221R85006r70070L59476P63486j254289R18831o10088M23558J73179
82C09484p84475O54318k34197L17995m38301r2243O06003l11508j13192j49021
92b35137M63683p4366l82018J76880J36139L7347j97720l5718Q9811K70074l68480
103a19505J7837J17130J5525K74865q29720P02957N8223m71364M24754o32487
$$ plain form
0 0 0 0 0 0 0 0 8 -8 8 -8 16 -16 22 -24 32 -40 48 -62 72 -86 102 -120 140 -164 188 -218 250 -282 322 -366
30 -366 414 -468 524 -589 660 -736 821 -911 1010 -1119 1236 -1363 1503 -1655 1821 -2003
46 -2003 2203 -2421 2661 -2926 3218 -3544 3909 -4322 4793 -5333 5962 -6700 7582 -8649
60 -8649 9975 -11659 13861 -16856 21114 -27569 38254 -58562 108715 -429346 -547392 714616
72 714616 -479605 505401 -464669 -105193 658293 -595996 322835 -287253 136305 309484
82 309484 -474991 179327 -54870 263125 -175176 -267419 338584 27076 -86116 -235137
92 -235137 228546 154180 -227838 -50958 85181 122528 -75192 -110910 -21099 248975 -119505
103 -119505 -101668 15462 30987 305852 -523868 179089 237312 -234052 190702 -441785
113d41785R57369n92155k96816P95600q02527Q24677p18815R9694N94512p69893
123c50139P02810p64946N47214J91540p51474O50821m49962N60490m46023j94466
133c04135O95094o04563L91327l82915J99825K74894n33527M08227k93364K47110
143I7973M5239m00781L29743l411l2906j13484j2826K18551l0948l09462K49203
154C6891Q2295k08376J88303l03689L61520r6355k41968L54741l93286M66480
164B46556l01479j46513M39887l92826L45234m17062K61084J84470m78106M33850
174A75095l53174L52888j83803j76068M22498m61753M49661l53735M1994L10015
184B23618m29638L92118l81064K70810P5537l99518M08241k40771J56040q9138
$$ plain form
113 -441785 515584 -76571 -373387 422213 -380314 444363 -274452 -174758 419754 -350139
123 -350139 352671 -412275 134939 326479 -424995 225826 -224136 336354 -109669 -304135
133 -304135 390959 -213604 177723 -205192 -5367 269527 -264000 144227 -149137 97973
143 97973 143212 -257569 72174 68763 35857 -77627 -90453 128098 97150 -212312 36891
154 36891 119186 -89190 99113 -204576 156944 60589 -181379 173362 -219924 246556
164 246556 -54923 -201436 238451 -154375 190859 -226203 34881 219351 -258755 175095
174 175095 -178079 174809 -8994 -185062 237436 -224317 225344 -128391 -86397 223618
184 223618 -206020 186098 -194966 75844 151381 -248137 160104 -80667 75373 -13765
194a3765r6777K54072k11766Q8537m4679K2688L4701l2799l2812J1897J01842
205H1139j35790P1698o7634J14748l7082j49880K34622j69592J07394q8120M866
216c3631J38297k19718K16285j87500J15740L0705j69865K20902k31422K39208
226A19001j58329m7811K38959k89168K48477j96098R5917Q1992k43611K90352
236A39681k36154J33841l090j21098J84252j85113J62857j12299R001R6829j27952
247e9245J01640r2575J00404o4265j5860P6407r1248R0130q8482P1358l4214j5015
259b0965O8934j07740J04323o6909L6539j9375k0301Q5753j24774J05106n7399
270a6808K0009J2856o2289J14908j33437R9827l1207l8456Q3879j03609J10443
$$ plain form
194 -13765 -110542 143530 -68236 20301 -24378 -1690 33011 212 -32600 -20703 81139
205 81139 -54651 17047 -50587 64161 27079 -122801 111821 -57771 49623 -38497 -33631
216 -33631 104666 -115052 101233 -86267 29473 60178 -109687 111215 -120207 119001
226 119001 -39328 -87139 151820 -137348 111129 -84969 10948 92940 -150671 139681
236 139681 -96473 37368 34278 -86820 97432 -87681 75176 -37123 -28122 68707 -59245
247 -59245 42395 -50180 50224 -14041 -29901 46506 -44742 45388 -43094 28264 -5950 -20965
259 -20965 47969 -59771 44552 -22357 14182 -5193 -25494 60259 -64515 40591 -16808
270 -16808 3201 16057 -46232 68676 -64761 35066 3859 -34597 49282 -54327 56116
281E6116r9117N0304K9946r7767J14381r1413O3955l8392m442O3894j05194R9380
293D1651n8233J6677Q701l0580O1987q7147P7242l2319j3997L4526l9347N0968
305C0129o5884N7026j5152l1682N1946m6628M1152m3053L2770L824m6734O1706
317B9420m4202K0699j1728N985J5475m4334N2520l0036L49J0329o365J1453l0546
330b0981M0531k2940p055K1073j5046J0649k1378K9752j4023j6673L3334k3953
342f710P664m017P046J552k2717L2990j7188j0112K1882j3058M860r805J3473
355E860J702k5615L1271j3030p515J2694r745J3486k2210K1264l686k0068L1631
368A6039k5009J3559j0362Q494R733l7863M6701k6255l95J2687j9298L1432l8363
$$ plain form
281 56116 -43001 7303 37249 -60518 53863 -37550 26405 -11987 -16429 47465 -57729 41651
293 41651 -16582 95 8796 -21784 40203 -46944 30298 -2021 -16018 18508 -20839 30129
305 30129 -35755 21271 6119 -25563 26383 -20245 20907 -22146 10624 14448 -32286 29420
317 29420 -14782 5917 -5811 174 15649 -28685 23835 -6201 -5852 4477 -1888 9565 -20981
330 -20981 19550 -3390 -10445 10628 -4418 6231 -15147 14605 582 -16091 17243 -6710
342 -6710 954 -3063 3983 5535 -17182 15808 -1380 -11492 10390 -2668 2192 -7613 5860
355 5860 7562 -18053 13218 188 -7327 5367 -4378 9108 -13102 8162 4476 -15592 16039
368 16039 -8970 4589 -5773 2721 12454 -25409 21292 -4963 -5358 7329 -11969 19463 -18900
381a8900K6158q51k1582L2024k6908J0245J748J213n249l156J0542j587n113j5020
395a6436M2046l9428J1052J5230l5251N6418o3583M1372m316k9546O3686q9496
407d8252P5842k4789j8883L7581o1035R2570q8577L7148J6151m6178P7091j08568
419e9899J00301m7654j0985O4039j19515J42844r4694R860M8555q4200J24147
430G2799j29954N8415L8345q0360P6331p3567N9266r397l5039L3769k0356K6938
442A7190k1935k645m801M5480m3353j6034M9865l1644L3630p1232O3417P181n6086
455c0967N3024n8433Q2672o7899J6517J6796m6052J11426j57254J09975k0860
466H945k9522Q0265j78771K31549j39511j9677J17766j65719K12887j99576P4138
$$ plain form
381 -18900 7258 6407 -15175 16849 -10059 186 1934 3147 -2102 -5258 5284 3697 -1416 -16436
395 -16436 25610 -13818 -2766 12464 -22787 33631 -29952 11420 7104 -22442 41244 -48252
407 -48252 27590 2801 -16082 21499 -39536 53034 -35543 1605 17756 -28422 48669 -59899
419 -59899 40402 -7252 -18237 45802 -73713 69131 -25563 -15703 32852 -51348 72799
430 72799 -57155 1260 39605 -40755 35576 -37991 21275 11878 -23161 10608 -9748 17190
442 17190 -4745 -7390 -12191 33289 -10064 -26098 23767 -7877 25753 -45479 17938 25119 -30967
455 -30967 22057 -36376 46296 -21603 -5086 11710 -34342 77084 -80170 29805 8945
466 8945 -20577 59688 -119083 112466 -27045 -46722 71044 -94675 118212 -81364 -7226
477g226P7322j59245J90105j90583J12388K4518j03790J00657j10790J41143q8484
488a3985l3805Q4113m4844M5187j04567J00432j2735m3604M0712n6583Q5079n3330
500g930n667J0360J837L4331n2281r563M3661M0805j24208P9299P836k3367M1865
513C6978j44198K15042j34441j7219J22609j96895K50129j97274L5267J04516
523G4514j70999K33431k63163J44292O5979j71927J54319j63391K02435j27991
533b2501m5762J48834j49352J58269j75630J05201K4525j07506J54053k07149
543a17018J85371l6432j02799J17439j04332J48388j30837k2853J44672r7005
553a5406L726m406K5319J6196l1576l6914Q1590l9543p681L3682j08822J84315
$$ plain form
477 -7226 70096 -89149 100956 -89627 22761 47279 -56511 44146 -66644 74499 -13985
488 -13985 -47790 36323 -8521 36666 -67901 32531 19796 -23808 16904 -39679 45400 -7930
500 -7930 -13597 -3237 -1400 32931 -19350 -28913 14748 55553 -68655 10644 18480 -4887 36978
513 36978 -107220 107822 -26619 -43838 78771 -118124 132005 -65269 -30002 74514
523 74514 -96485 136946 -126217 18075 84054 -87873 66446 -96945 105490 -22501
533 -22501 -68263 80571 -68781 89488 -86142 19059 43584 -63922 90131 -117018
543 -117018 68353 31921 -70878 46561 -57771 90617 -40220 -63073 81599 -15406
553 -15406 -11680 -16086 9233 25429 -6147 -43061 38529 -1014 -8695 24987 -83835 100480
565A00480j22271l1156R9348q9079J42402k14459J33283N8305j55911J42399j57589
576i4248J92048j19392l3744J38057j91994K44897k23539P2554Q8912j60390K16161
587A29322k88621K33101k414j99669K27398j93439J95029j26982n9990K03492
597A17227j92754J25386q3054J2748P9752r2566M1775m3501P5236k6842m6598
608c3191J2763N9038r170j00614R5360j1980Q348n6315K0983O4217p9157N4289
620B4571p3982Q7489k9121l2241M6668r5982J91963j89510M3207Q9857j26476
631f3557J72032k51642K12686j0379j79871K39959k38014K13116r8592q5023K06033
642A16748k27376K13003j51082j758J51222j72671J23524j21208J13869m900j20144
$$ plain form
565 100480 -21791 -52947 46401 -42678 99724 -114735 18548 76853 -79058 63341 -94248
576 -94248 97800 -21592 -55336 82721 -109273 135624 -87915 -15361 73551 -86839 129322
587 129322 -159299 73802 71388 -128281 99117 -94322 100707 -26275 -86265 117227
597 117227 -75527 49859 -33195 -20447 59305 -33261 8514 -34987 40249 13407 -33191
608 -33191 -20428 38610 29440 -71174 24186 12206 20554 -35761 -14778 49439 -29718 24571
620 24571 -49411 38078 8957 -23284 23384 -72598 119365 -70145 -26938 62919 -63557
631 -63557 108475 -143167 69519 59140 -120731 119228 -118786 94330 -4262 -89285 116748
642 116748 -110628 102375 -48707 -50465 100757 -71914 51610 -69598 44271 39371 -80773
653h0773J26038o7228O5814q3860K8279N3078p1044N8216o7976N6768j691k3235
665g614l478k279N4376n6511L264n902P1370p4353j4531Q1189q0376Q7176j13895
678f1564P9030K4563j11384J50027j65647J33781k5054r3634J43341j52929J66328
689H6858j27570m530J35018j66093J39661j26748R2431Q958j17015J56081j43062
700f6011J15141n5740l3714R8214j16508J21867j10292M0945N5623r5247P4934
711B9212o4356P0949l8504k7148N6649l8073K5519l6192L8029k5530J7841n536
723B860k6368N4017n7051N7142o3224L7759L2207r0767R5424p5597O3151l4677
735e124l0557R5747j18003J01290o5579J4622M4396q9510J10264j10301P9498
$$ plain form
653 -80773 45265 -21963 43851 -40009 -11730 41348 -29696 28520 -39456 17312 15621 -7614
665 -7614 -11092 -13371 41005 -15506 -12242 -18144 53226 -21127 -35658 45531 -34845 52331 -61564
678 -61564 17466 42029 -69355 80672 -84975 48806 23752 -69882 73459 -79470 86858
689 86858 -40712 -45242 89776 -76317 63344 -63404 29027 37985 -79030 77051 -66011
700 -66011 49130 -6610 -40324 57890 -58618 63249 -47043 -6098 49525 -45722 29212
711 29212 -35144 35805 -2699 -29847 26802 -11271 14248 -21944 16085 -9445 8396 2860
723 2860 -23508 30509 -26542 30600 -32624 5135 37342 -53425 41999 -33598 29553 -5124
735 -5124 -35681 60066 -57937 43353 -22226 -7604 36792 -52718 57546 -52755 26743
746B6743j0552o3343R9809j00905R2284p0557J5289N6738r9859R9006p5692M5681
758A4642p577l4796O7826q2105P3375m2518L860K3052l6823N1416o5206N7398
770B2544k3891j0093K6063l4499M8500n8862M8858j9064j4340L8141n0439N5423
782B8341n4395M0386p316l5592O5256o7676N3394l6045J2561K3979o1540P6731
794C8084o1586L0746k280k0501M3138o2397O4426m2601P502K2735l9087M7947
806B6126n4650N0445k4926j3497M2624n1754M7548l9978K7302k188l0682N2582
818B8952n1186L4344j7769N270J1336l3395M8391m4414K4934n104p109J9093l6447
831b3104M8623m1087J5534J1284k6295L1877l6625L8107k4903k803K8176l6517
$$ plain form
746 26743 16191 -47152 52657 -48248 44036 -26521 -11232 45506 -54353 44653 -31039 14642
758 14642 7065 -27731 40095 -42010 31365 -11153 -7293 15759 -21064 30352 -34854 22544
770 22544 -1347 -11440 14623 -19876 28624 -30238 18620 -444 -14784 23357 -27082 28341
782 28341 -26054 14332 7016 -28576 36680 -30996 22398 -13647 -1086 22893 -38647 38084
794 38084 -23502 7244 4964 -15537 27601 -34796 29630 -12971 -5469 17266 -21821 26126
806 26126 -28524 21921 -3005 -16502 26122 -25632 21916 -18062 9240 7052 -23630 28952
818 28952 -22234 12110 -5659 -389 10947 -22448 25943 -18471 6463 1359 -5750 13343 -23104
831 -23104 25519 -15568 -34 11250 -15045 16832 -19793 18314 -6589 -9392 18784 -17733
843a7733L0881k3978J9733r365j1058L0417l5467K6427j5535R102n31j7003L5188
856B1078l8713K4649n240p944J6737k7272L5374k9082P373J5499k5974K3724j8667
869h458J4380o328p522K0481k1690J0269J013j314k866n92R340j0263K103J652
883B05M471r529M798M561j0078R414o874N875n821L158O084j7331J9202r249J192
898G8j841k812J9209k9270J9293j155j0088J7730k7434K9378j4884o908K5364
911A6660l7772L6770j5108j4533L1057l3962L4203k4102q846M4329m9570K8825
923G951r617o193L1195n0811M1463j2488j0941K7661m4320M5001k0383o009J8123
936A0632l1663M9519m2815O029K3221k8055L5155m8992L4450J1366m2893M2415
$$ plain form
843 -17733 13148 -10830 8903 -462 -11520 18897 -16570 9857 -5678 3424 2893 -14110 21078
856 21078 -17635 7014 1774 -6170 10567 -16705 18669 -10413 -3040 12459 -13515 10209 -8458
869 -8458 5922 -406 -7928 12553 -9137 1132 2145 831 -2035 -2627 6713 -3550 -1447 205
883 205 4676 -4853 -55 4506 -5572 3842 -3032 2843 -2978 180 6264 -11067 8135 -1114 78
898 78 -1763 -4575 14634 -14636 4657 3502 -6586 11144 -16290 13088 -1796 -8704 16660
911 16660 -21112 15658 550 -13983 17074 -16888 17315 -6787 -15633 28696 -20874 7951
923 7951 -1666 -7859 23336 -27475 13988 1500 -9441 18220 -26100 18901 -1482 -7491 10632
936 10632 -21031 28488 -14327 -8298 14923 -13132 22023 -26969 7481 18847 -24046 18369
948A8369l7995L3594l106m1399N4865l5686J7493J169l7939O3256l8541p652K7199
961A3627l2837N0495m6634p316O0324o0198L6402k6743K132N3356q4164N7247
973A5691j8266j824L4871q1411Q4425l7185p33J7568n7238J03265q7417J9955
985h299K3872m0684Q1128j17274P8537Q401n9928P6074j00639J00735k9414n8165
997d5656Q7348q2286Q3022m9159l9163R7801p3290L3287k5875l252O9192q4726
1009c2757K0922K9618k3042K5058n1548L1345L4659n9461L2626k4003K8378J7582
1021B9377p9175P2091k5127J6503j1784n4921J20177r3100K2213P011l2091J04965
1033G6139j50208R3206N16n2591R6583j52808J41812l6737o1018R4692j22442
$$ plain form
948 18369 -19626 13968 10862 -30537 24328 -11358 6135 7304 -30635 32621 -5920 -13572 13627
961 13627 -19210 31285 -15349 -22665 37659 -22539 13863 -12880 -10748 42608 -41556 15691
973 15691 -2575 -4399 30472 -50939 33486 -3699 -4432 13136 -44102 59163 -28254 -8299
985 -8299 15573 -25111 56017 -61257 17280 25681 -34247 41827 -58812 41923 12509 -45656
997 -45656 41692 -40594 42428 -6731 -45894 51907 -21383 11904 -13971 -17223 51969 -32757
1009 -32757 -11835 17783 -5259 19799 -31749 -404 34255 -25206 7420 -16583 11795 29377
1021 29377 -49798 22293 -2834 13669 1885 -53036 67141 -25959 -3746 3265 -28826 76139
1033 76139 -74069 19137 19653 -32938 63645 -89163 52649 15912 -45106 49586 -72856
1044g2856J49239r0473m0668J14358r9335Q7296r0426K9072P4821j06819O3886
1055A8095m0137L7028J1469p0488N9340j5465J4972j8695l0047O4624j9363l0801
1067a9468J3792L017L5728m9145j8213P6885n6999K3418k2468q904Q6634j17439
1079e3162O8776j5250k0186Q7759j55493J28229k5488m5391P5424j28223J63630
1090H0625r3936l3204J00072j06492J20889j17127L6885O4239j00988R8057j03325
1101e4305P6203R013p5659P5027o7597Q4008n6263l1492Q3671n9810L6177m5509
1113b6536K3166M1803o7563L1229k037K01J8105m0315J4238L4576m0131J8141
1125D877j7826J0188M6775r6762O8424l343k6755M3852q6977J08777n8091j9874
$$ plain form
1044 -72856 76383 -14090 -54758 59600 -39735 47561 -42865 -13793 61028 -45791 18095
1055 18095 -22042 14986 26455 -44033 15307 -158 14814 -3881 -33928 30696 11333 -19468
1067 -19468 -5676 -2659 33069 -16076 -34289 42596 -14403 9015 -13453 -22357 64277 -53162
1079 -53162 15614 364 -19822 67937 -87556 40673 15185 -30206 45218 -83005 80625
1090 80625 -13311 -46515 53557 -52935 67954 -49173 -12288 51951 -49037 49020 -54305
1101 -54305 21898 30911 -44748 30279 -37318 46690 -9573 -41065 42606 -17204 18973 -26536
1113 -26536 -3370 38433 -29130 2099 62 263 18368 -21947 -7709 26867 -13264 4877
1125 4877 -12949 -2761 44014 -52748 15676 12333 -14422 29430 -57547 51230 -6861 -26735
1137b6735O3393q6315J07675r0617K2874M0985p1348R7934j17392P9380O322o5718
1149c9562P9565r3617J05976o3338k3973Q2829r1261Q6373p2237K2480M1737p3074
1161c8102P2274o4011L7617J4462n0277M0431k0371K2669j9207r963K6139l339
1173H322j9598P373J4472j8131J9650l0886K9317m542k0119L4841n1519N8398
1185B7578l2439j1077L5966m4342O1101p1324M1600J4913n3750O6159p2665O9257
1197C0977l5092j9403O3039q5180Q6669o0186R432L7963o4494P8030p8417M8272
1209A1610P445n0960O0426n4469M9133l1881l052L4336m4377L9782l1463J8967
1221E497m185o906J6848k8303L2564k2882J1112q774N628J1735l2554L7081k7182
$$ plain form
1137 -26735 36658 -49657 58018 -32599 -9725 31260 -40088 57846 -59546 19834 26156 -39562
1149 -39562 40003 -53614 52362 -10976 -34949 47880 -43381 42992 -29245 -6765 34972 -38102
1161 -38102 34172 -29839 7778 22240 -28037 12394 -7977 14692 -4515 -14478 11661 8322
1173 8322 -11276 -3903 10569 -7562 12088 -18798 10519 5977 -14142 20699 -30820 27578
1185 27578 -4861 -15938 20028 -24314 36787 -34537 7063 21976 -31774 34385 -38280 30977
1197 30977 -4115 -23518 39521 -45659 41010 -19176 -9744 28219 -36275 41755 -36662 11610
1209 11610 19055 -31905 28521 -25948 23185 -8696 -11748 22588 -21789 17993 -13470 5497
1221 5497 1312 -5594 11254 -17049 15515 -7367 3745 -5029 599 12334 -20220 16861 -10321
1234a0321J8410j2124l081K6690m4372M7065l6166J5772Q545k9686M4834n3739
1246b8173M9042k3965j2784M0855n1279N1877m6075K6139Q714m2769N8943n5276
1258b4751L9628j7668q359L4526n3077N5871l9649J1724J3827k8935L7512m2634
1270b1985L7843j8298o922K3004k7783K9394l1293K7424j2546q373K5415l2688
1282a6808L2587k9273K1122m451j8537L7489m1240L1096j7433M731J0379k8738
1294a9076M0592l7118K1512m707p452J8677l1332L9616l4732J6300N915k2337
1306a4142L1872l7475L6998k4130j050K6763l9124L6526k7482J6881k564j6543
1318a3470L2850l6324K6462j2898L361M427j6889L0682l4511K4698q607m825J4517
$$ plain form
1234 -10321 8089 -4035 -7116 19574 -24798 22267 -13899 1873 10418 -19268 25566 -28173
1246 -28173 20869 -3096 -15880 24975 -26304 25573 -20502 5637 14351 -28418 30525 -24751
1258 -24751 14877 -2791 -11150 23376 -29701 26170 -13479 -1755 12072 -16863 20649 -21985
1270 -21985 15858 -2440 -9362 13642 -14141 15253 -16040 11384 -1162 -9535 15880 -16808
1282 -16808 15779 -13494 7628 3177 -15360 22129 -19111 11985 -5448 -717 9662 -19076
1294 -19076 21516 -15602 5910 1203 -6249 12428 -18904 20712 -14020 2280 8195 -14142
1306 -14142 17730 -19745 17253 -6877 -7927 18836 -20288 16238 -11244 5637 3073 -13470
1318 -13470 19380 -16944 9518 -3380 -19 4408 -12481 18201 -16310 8388 -219 -5044 9473
1331I473k4700L4169l3577J7569N356k1485K6583k6336K5163j8951K910J6454
1343A2628k6871K4824j8076J4290j0953K30J6740k8582K7463j8132R843k864q877
1356h337K4922l4316K7810j0292n377J3620j9278K5785k6562J5605K769j6879
1368a0530J9535j6613J6377j6913R649O339k0237K2523j6803J2304j0036K050
1380b355J3568k6162K5203j2878J194M256q278J5193k0308J5618k445q372Q750
1393B984l854N164j2073J3360m948l936N079l526Q194j6800J8338p604p457J5674
1407H595j5506J3836j3871J0132K583j8299K4044j6399N415j318m07Q708j9764
1420a2251K2078j2015n35O766r388J4039j9832J8179m654j3184K2765j9619J1192
$$ plain form
1331 9473 -15227 18942 -14635 2934 8290 -13195 13388 -12948 12215 -6736 -3826 12628
1343 12628 -14243 10581 -7495 6795 -4158 -3928 12812 -15770 11693 -6439 3404 540 -8337
1356 -8337 16585 -17731 10079 -213 -5590 8030 -11248 14537 -12025 3580 6349 -10530
1368 -10530 9005 -7608 8769 -8144 1505 7844 -12393 10130 -6673 5631 -4405 -2355
1380 -2355 11213 -14949 10254 -2624 -1430 2826 -5452 9741 -10567 5051 2606 -5766 2984
1393 2984 -870 4294 -7779 5581 633 -3303 1776 -1750 6444 -10356 7982 378 -7079 8595
1407 8595 -6911 6925 -6946 3186 5769 -12530 11514 -4885 530 -788 -1195 7513 -12251
1420 -12251 9827 -2188 -2723 4043 -5345 8694 -11138 7041 2387 -10797 11968 -7651 3541
1433C541m827j645J3119k3772K0951l697j2859J6630j1112N935l063l388J2833
1446H646j6017P557O958j5351J1569k652j908K207n651J2833j3465K240J1219
1459H185j4420Q763m871N369k933p079J7877j8929R382K313r128J2892j7568J9228
1473I081j0412q781K6275k9087J7361j804j0838K1541k8869K6126q333j7653L4328
1486A8935l2091J7422r69j3272K5746l2787K6065n195j7794K9953k8459J9204
1498F758p662m975J9225l0454L0186j5383n204J8596k3537K6180k4511J1063J2427
1511A2709l1444L4517k4254Q652Q598k4642L3086k8954J2439J1368l1427L5022
1523A5670k0429L88J4206k4664L0706k2255k471K6273l3401K5480j1092o863K5309
$$ plain form
1433 3541 -1286 -2931 10188 -13584 7367 3670 -9189 7441 -3671 2264 -799 -4187 8646
1446 8646 -7371 186 7144 -8207 3362 710 -1198 1009 -4642 8191 -5274 -3034 8185
1459 8185 -6235 2528 -2343 3026 93 -6986 10891 -8038 1344 3657 -5471 7421 -10147 9081
1473 9081 -1331 -10112 16163 -12924 4437 2633 -8205 13336 -15533 10593 2260 -15393 18935
1486 18935 -13156 4266 3297 -9975 15771 -17016 9049 3854 -13940 16013 -12446 6758
1498 6758 -904 -5879 13346 -17108 13078 -2305 -7509 11087 -12450 13730 -10781 282 12709
1511 12709 -18735 15782 -8472 180 8778 -15864 17222 -11732 707 12075 -19352 15670
1523 15670 -4759 -4371 9835 -14829 15877 -6378 -8849 17424 -15977 9503 -1589 -8452 16857
1536A6857l4367K8814j3864o091K7763m0179L3974j5374k469J8309l6570M6545
1548B3348l4207O440J8587l5534M7759m6750K4432Q747l6466N2686n5075L5929
1560I896J007l4417N0267n1703M0103j0189k8270N0060m5709K8932r014j6080
1572a5117L8191l9926K1666j849j2616K5644k9398J5002O391j6689J8398k0092
1584a0395J3174P404k5843K6827j8041R671N181k8535M1473l2001J2869N505k8785
1597b1496N1914n2640K6696N270l1027N3952o5268M6719n138l2396N4548o5228
1609c4094N7269k0961k4719N1135n7524N4214l4119n932M1952n1735M3253l1217
1621a2478J0854K0282m1617L8627k4640J1877N495k6195L1579j7894M354K438
$$ plain form
1536 16857 -17510 11304 -2560 -8651 19112 -21067 12907 -2467 -4936 13373 -23197 23348
1548 23348 -10859 -4419 14168 -21366 26393 -20357 4075 12822 -23644 29042 -26033 9896
1560 9896 10903 -23514 26753 -24950 15153 4964 -23306 26754 -18955 9977 963 -15117
1572 -15117 23074 -16852 4814 2965 -9651 15993 -13405 1597 7988 -8701 9697 -10395
1584 -10395 2779 10183 -15660 11167 -6874 2797 7978 -20557 20916 -11085 1784 7289 -21496
1597 -21496 30418 -22222 4474 9744 -21283 32669 -32599 14120 8982 -23414 31134 -34094
1609 -34094 23175 2214 -22505 28630 -28894 25320 -8799 -14731 27221 -24514 18739 -12478
1621 -12478 -1624 18658 -22959 15668 -8972 2905 8400 -17795 13784 -4110 244 2682
1633B682j3691K4819j6641o483J8703j5773J3493j0102p736L0495l4955K0428
1645E239k439j6247L8281m8647L3444n119j8766L9687n7583N2674j8393j9816
1657a7685M1105n1578N5539l9280N70L6227n2420N3672m4269J8347J6749m0939
1669b3962M8067m5828L2299k168k9592M1321l5354K8044j7167o852L0828l4218
1681a4582K0834q604k7J1369j8411J2494j543l854O778q901J599J2983j7741P891
1695B85K225o644J5361k8133K7201p113j4856K6783l2615L3256k1382j460K3541
1708A6449l8392M4711l6410J1023J7529l4441M0999m2519L1431k730k8276M2794
1720B2168m0299L1228j6594n647K7252l7499L4670k2861N038J2594k1741K2400
$$ plain form
1633 2682 -11009 13810 -2831 -9314 9389 -6384 7109 -2993 -10729 19766 -15189 5239
1645 5239 2800 -13447 24834 -23813 9631 4512 -14254 25433 -32150 20524 2131 -17685
1657 -17685 23420 -28158 27381 -11899 -11329 24898 -27522 26150 -18119 228 16977 -23962
1669 -23962 24105 -21723 10576 8408 -21184 20137 -15217 12827 -4340 -11192 19636 -14582
1681 -14582 6252 -2352 -2379 8990 -9421 3073 1530 -2324 4454 -4447 -2848 10135 -7606 285
1695 285 2510 -4134 11227 -16906 10295 3182 -11674 15109 -17506 15750 -5632 -7092 16449
1708 16449 -21943 22768 -13642 -2619 14910 -19531 21468 -21051 10380 7650 -20626 22168
1720 22168 -18131 13097 -3497 -9144 18108 -19391 15279 -7582 -2544 10050 -11691 10709
1732A0709k0960J6972n302r560J5431j1167Q078r774Q988k212l994M645m176O511
1746D189r551J1419j1038N573L853j1616J4844j7308J9947j4642j529J9393k7683
1759a4149K5979k0740J1680M401k2700L3483l2129K0455l479j2734K3475k8536
1771a4994K8307j9850L073J4631k4039K3826k0369J6078o680q240K1026k4470
1783a1701J9657j2257M702L727j2614J9126j9810J3353l840k872O049r585J5022
1796H957j7289J2213l287l166O761j1740J8071k0022J2980p4j1157J7212j8861
1809i402J7737j3663L803J0067k0011K0864j5438R550m595k860J3015k0262J9402
1822H207j2078M082J772q121J6786k2574J9933q291n240J3337j6137J7647j7435
$$ plain form
1732 10709 -10251 6721 1419 -8141 7290 -3877 4201 -5573 3415 1203 -2791 1854 -2322 4189
1746 4189 -5362 6057 -4981 592 4445 -7171 7673 -9635 10312 -4330 -5859 13534 -14149
1759 -14149 11830 -8910 2770 7171 -15529 17954 -14175 6280 2801 -9933 13542 -14994
1771 -14994 13313 -6537 -3464 11167 -12872 10954 -9415 6663 -17 -8257 12769 -11701
1783 -11701 7956 -4301 401 4128 -8486 10640 -9170 4183 343 -2529 3520 -6065 8957
1796 8957 -8332 3881 594 -2572 4189 -7551 10520 -9502 3478 3404 -7753 9459 -9402
1809 -9402 8335 -5328 -1525 8542 -11469 9395 -6043 3507 -1088 -3948 9067 -11195 8207
1822 8207 -3871 211 1983 -6138 10648 -11926 8007 -284 -5524 7813 -8324 9323 -8112
1835h112J0498K626j4400J7824j3850R469p501M197L923j2638J5617j2452Q091
1848C292o106K939N404j6015K0788j5626N867J979p030J2191j8282J8485r094
1861a208l704J1083j1326J0494j1920J1740n292n179J2277j2311J0206j0902J0942
1874D900l679r416J9190j8947J1830n397J77P601j7222K1544j4811J481Q105j0284
1888d928R659j0714J1610o365l648R647q194M344m915Q320o501k211R720r462
1902c638N350m477O019l446m065J0596j0562M754n55K054l896n37Q750j1995P973
1917B325l654L559l054m910J6690k0391J2265k57p853J2422j6158J7946j3324
1930d394o3J5414k2400J7459p050R67K493j0340J8927j7650N144O534q879P068
$$ plain form
1835 -8112 2386 5012 -9388 8436 -5414 4055 -3446 751 4674 -7964 7653 -4799 3292
1848 3292 -2814 125 5529 -10486 10302 -5324 543 2522 -4508 7683 -10599 7886 -1208
1861 -1208 -4912 6171 -5155 5339 -6581 5159 -133 -5312 6965 -5346 4860 -6042 4900
1874 4900 1221 -8195 10995 -7952 3878 -1519 -1342 6259 -10963 10581 -4230 -2749 5356 -4928
1888 -4928 4731 -5983 5627 -738 -4386 5261 -2933 1411 -3504 4816 -1685 -3896 5824 -3638
1902 -3638 1712 -2765 3254 -192 -4257 6339 -4223 531 -24 2030 -1866 -2403 6347 -5648 2325
1917 2325 -1329 2230 -824 -5734 10956 -9435 2830 2573 -5280 7142 -9016 8930 -4394
1930 -4394 -4457 10957 -11443 6016 -1034 -67 2426 -7914 11013 -6637 -1493 5041 -3838 3230
1944C230p818R712o676j761R730j1556O585Q2k245J055l719R131o946m200J1999
1959F603p765j455N257m938O442q608M881N445j5519J7864j0381k943J2929j4858
1973g046J3546j2845P038Q927k4004K3644j0686o71O007j2119J9398j9396R168
1986I61M571j5035J9149j5631Q077k064l807J4257k3049J8209j339j1586J3657
1999F370j3580J5362j1050l918J8612k1808J5104m043p801J6089j7210J3349p077
2012a601m689J9722k5065J3242L286j0194J1939j6354J6622m660j1588J9133j7050
2025g257J0933j724q763J4491j4949J3780q282n746J9811k0218J0219l309k27
2038a241J0136k1824K1125p947o028J4749j9891J9341j0075l186J3806k1926K5245
$$ plain form
1944 3230 -4588 5124 -1552 -3313 6417 -5139 1446 1528 -717 338 -3381 5750 -1196 -5396 6603
1959 6603 -1162 -2617 2640 -2298 4144 -4464 417 5862 -9657 8207 -2174 -5117 7812 -7046
1973 -7046 6500 -6345 693 9620 -14384 9260 -1426 -2097 3910 -8209 11189 -8207 961
1986 961 5532 -9503 9646 -5985 2092 28 -3779 10478 -12571 5638 4299 -7287 6370
1999 6370 -7210 8152 -2898 -6816 11796 -10012 5092 1049 -6752 9337 -7873 5476 -1601
2012 -1601 -6290 13432 -11633 1609 4895 -5299 6640 -9714 6908 2248 -9340 9793 -7257
2025 -7257 3676 1952 -6811 7680 -7269 6511 -1771 -7517 12294 -7924 2295 -1014 -1241
2038 -1241 8895 -12929 8196 249 -5779 8970 -10921 8420 -1655 -4841 8965 -12961 12284
2051A2284j4763n984K0429k1472J8314j4769K927J6346k7908K3051j0957l79J2428
2064I547k2218K2266j3645L425P713k0101K4510j4500J53O605j0715J8319j9886
2077h527P816P582j3976J4393j4261Q786L530j3114J4936j3647R053L349j6956
2090a1036J8244r180J964L109j3088K1802j6010N1J1234j5688J8170j5535L194
2103b769J1467j8123J9513j8487Q344R995k1870K0345j5285J1309n85j6658K6153
2116A3349k0852J0623k482q627K1164k3579J5481o186l494J6852k4952J8288n047
2129E38k953Q560j7156K0210r984m334J0443j0784J1669q589j468R215q927O978
2143C418n137k143J1212j0867J833L571l664P436j2473P971M211j1726J1905j1712
$$ plain form
2051 12284 -2479 -8463 11966 -9506 8808 -5961 -3034 13312 -14596 8455 -2502 -2881 9547
2064 9547 -12671 9595 -4050 -625 7088 -13013 11497 -3003 -2850 3755 -6960 11359 -8527
2077 -8527 -711 6871 -7105 7288 -6973 1813 5343 -7771 7165 -6482 2571 5920 -11036
2090 -11036 7208 -1972 -8 3101 -9987 11815 -4195 -4144 7090 -8598 9572 -5963 -2769
2103 -2769 8698 -9425 10088 -8399 -55 9940 -11930 8415 -6870 4439 3854 -12804 13349
2116 13349 -7503 3120 638 -7989 13175 -10404 5077 -1109 -4603 12249 -12703 5585 538
2129 538 -2415 6145 -11011 9199 -785 -5119 5324 -5460 6209 -2380 -3848 5367 -3560 3418
2143 3418 -1719 -3862 7350 -3517 -1684 1887 -1777 5659 -6814 1157 5368 -6358 5547 -6165
2157f165R813m53j0915J5313j5027J4037o523q491J8986j8519J3675r657R92J4064
2171A1130k3531J9780j0506K424O990j7019K0577j5108P127J219j1765J8598j5258
2184e342O192q39k040R132j4944J0561j191l214L544n560O930l602n89J559j889
2199a292K666k69m020L147K501m977L266l698O393l201n666J1491j0462O940l712
2214h93k480R960j3920J3193r529K109Q656j5463J4727j0850P300j328r368J7497
2228I611j6141R345l449k431R896j5012J4557r313K093N797j1680J2017q644O064
2242B710k685m112R926r508M934k179J931m3l799N525m908L828l048K400j415
2257d43k97L744p300P587m165J228p5k716P692j0211P457l156k72L690p543J0368
$$ plain form
2157 -6165 3648 3195 -7720 7593 -7434 6603 80 -8411 10575 -7944 5731 -3926 -2934 11130
2171 11130 -12401 7379 -3127 -703 6287 -10732 9845 -5263 1864 3083 -8682 9916 -5342
2184 -5342 850 11 -2029 7103 -7841 2720 1529 -1685 1859 -3701 3229 -373 -962 597 -1292
2199 -1292 1374 1105 -2915 232 2733 -2244 1022 -2676 3717 516 -5150 6341 -4121 2819 -893
2214 -893 -3373 6587 -7333 5860 -3669 -1560 7096 -8367 6360 -4490 2810 1482 -7886 9611
2228 9611 -6530 2815 -634 -3065 6831 -8181 6376 -2937 -844 4953 -6727 5290 -3354 2710
2242 2710 25 -4087 5839 -3669 1265 -914 1017 974 -2825 2700 -2208 1620 -1428 972 -443
2257 -443 -740 3004 -4296 3291 -874 354 279 -2437 5255 -4956 2501 -655 -927 2763 -4780 5588
2273E588j0591P216q90o034J0811j1602J0238p557J580P032j3369J3576r116L797
2287F79Q95o115J0702j1802Q793l014k329N213o245O903p653O252j890l051O047
2302C385o675P124p513N290J95o206Q980q329O747m174P59L095p137Q851p096
2317b704L897j436l62L194p088R396p861L456K55l018O533r751J0378o723j34
2332a968O081q762Q723p611N640j285m728Q686q713O217l561J864J005n201Q566
2347D953q806N485j796o03L396p152R643q356L060K588n835O419o348O616m797
2362a533r3M810o157N070m318M740m090N70M635p975P365n140L600j538k907Q066
2378E105j0019P180k022j600L486n409P409p333L946R85m066M291m392O064p430
$$ plain form
2273 5588 -5003 2213 1323 -4711 6100 -5502 4736 -2821 -1241 5791 -7578 5998 -3118 679
2287 679 1574 -4541 6161 -5641 3152 138 -2191 3022 -3223 3680 -3973 2279 389 -2662 3385
2302 3385 -3290 3834 -3679 1611 1806 -4400 4580 -3749 2998 -1176 -417 2678 -4459 4392 -2704
2317 -2704 1193 -243 -605 2589 -4499 4897 -2964 492 747 -2271 4262 -5489 4889 -1834 -1968
2332 -1968 4113 -4649 4074 -3537 2103 818 -3910 4776 -3937 2280 -1281 583 1588 -3613 4953
2347 4953 -3853 1632 -164 -767 2629 -4523 5120 -3236 -176 2412 -3423 2996 -3352 3264 -1533
2362 -1533 -1626 3184 -2973 2097 -2221 2519 -1571 -1001 3634 -4341 3024 -2116 1484 -54 -2961 5105
2378 5105 -4914 2266 244 -1356 2130 -3279 4130 -3203 743 1728 -2338 1953 -2439 3625 -3805
2393c805M599J909o584P399o736O211m376o71P242j0736Q790l622q75K859l843
2408b239N884o905M280R58m208K473n27J894m082L669n50j602J560j530L217n401
2424c109N103j611l027N329l839K524m048M632n70n008O649m750L705m633L209
2439E56K066p895J0449q585M164R21m670P705j0950J0907l905o131J0885q747
2453c230O443n526J340N789j0366Q890l906p56L906m975M225l759L231P8m889
2468c505N637j106k079mJ374J871m068Q77M100m969K109K82k402M428n083L923
2484A385k133j671Q817j2552P323J636n604O146r824J2684o365n307J2225j2373
2498e613J0183o150j172Q307j1628J2099r740J722R071j3079R109n932N044M79
$$ plain form
2393 -3805 794 2703 -3881 3518 -3218 2993 -1383 -2054 5188 -5548 3242 -380 -1255 1604 -2239
2408 -2239 3645 -3260 1020 1978 -2230 243 -284 1610 -2472 1197 647 -955 605 -925 2292 -3109
2424 -3109 1994 383 -2644 2685 -1154 1370 -2678 1954 1384 -3624 3025 -1725 1980 -2653 556
2439 556 2622 -5273 5176 -3409 755 1676 -2994 4711 -6239 4668 763 -5368 5517 -3230
2453 -3230 3213 -2313 -973 4816 -5550 3340 -566 -1322 2584 -2391 1834 -1925 1306 1384 -3505
2468 -3505 2132 1026 -1053 -1057 317 2188 -1880 -1003 3097 -1872 237 519 -1883 2545 -2538 1385
2484 1385 -748 -2419 6398 -6154 1169 2805 -2799 3347 -6477 6207 -158 -5465 6760 -5613
2498 -5613 4570 -1580 -2752 5555 -6073 6026 -3714 -1992 7079 -6000 3109 -2823 2221 2700
2512B700j0424J4927r039J432K159n825J0160j0137M287J720o465J1031j0757
2525d231K755N528p111O581q895P293L349j3390J2556n706J128L309j0102J3570
2539F634r222J694M863j1506J5455j0738J08O640q550J2159j4763P186O846j3972
2553g166J2326j0055P708N98j1239J5377j2804P851k82j0178J6173j2524O307
2566B092k302m927J5456j8343Q887K268p405J0781j4956J2558j268r202J3591
2579G230j4352J1301j923r446J3613j1665R911n494n988J6712j5510O874p70l463
2593b970J0879j6192J1262j211o068J1036j4361J1577k073o814J0164j2074J3031
2606F186o279o868J4602j2909R066n599k276J3138j6969J1379l729l338J1645
$$ plain form
2512 2700 -7724 7203 -1836 -404 1755 -4070 6090 -4047 240 1960 -4505 6526 -4231
2525 -4231 -1476 4052 -3059 3522 -5373 1920 5269 -8121 4435 -1271 -143 3166 -6936 6634
2539 6634 -2588 -894 3969 -7537 7918 -2820 -2712 3928 -4622 7537 -7226 -40 6806 -7166
2553 -7166 5160 -4895 2813 3411 -7828 7549 -5255 2596 2314 -7864 8309 -4215 2092
2566 2092 -210 -5137 10319 -8024 863 3131 -4274 6507 -8449 4109 2841 -6361 7230
2579 7230 -7122 4179 2256 -7190 6423 -5242 4669 -825 -6813 9899 -5611 1263 493 -2970
2593 -2970 7909 -8283 2979 1768 -4300 6736 -7625 3952 1879 -4935 5229 -6845 6186
2606 6186 -93 -6961 7641 -5268 3798 -1801 -4077 9061 -7908 3471 -258 -3596 8049
2619H049j6980J3252l680l857R852j6468J6944o563n922J1503j3081J4142j0380
2632c189j000J2330j5550J3110r034J203Q884j4067J2376q003K957N553j4221
2645h651J4615o908k55L971r198J3786j0275O79O539r422J0142q192J576O523
2659D930r756R378p735K329O733j2710J0434m407J02M553j1300J3501p363j127
2673b438P151j0740J2289r109J045O342j0531J2660j1511M139O040j1597J1611
2686E351j0108O949Q79j0139J3383j0348N642n67n602J0514j0624O541j583l707
2700c419Q885r863N252J5k519M945p282N910m00m663N563l964K309Q5l360N201
2716B695m308J679J502n394P544m955L66K723m950P327p878L535L428p611Q207
$$ plain form
2619 8049 -8931 4321 641 -3216 6636 -9832 7112 549 -5373 6130 -6951 7191 -3189
2632 -3189 -4189 8141 -7409 5701 -3333 -2130 6754 -7313 5063 -2940 17 5570 -8651
2645 -8651 5964 -944 -1199 2772 -6426 7360 -2915 -2236 4303 -5119 5023 -3169 -1593 4930
2659 4930 -4826 4552 -3183 -854 5879 -6831 3603 -804 -702 3851 -7449 6052 -1311 -2438
2673 -2438 4713 -6027 6262 -2847 -1802 4540 -5991 6669 -4842 -703 5337 -6260 5351
2686 5351 -4757 2192 3071 -7068 6315 -4033 1609 1042 -4560 5954 -4670 1871 288 -3419
2700 -3419 5466 -4397 855 870 -1649 3296 -3986 1924 1524 -3139 2424 -1540 769 854 -2506 2695
2716 2695 -1613 66 1568 -3826 3718 -1237 -871 1852 -3098 4229 -3649 -114 3314 -4297 3910
2731C910o984M539J97n996R352r205O258j086m797Q503q844P051l915n61O106
2746D528q770O860l487O56J857m728O286m868J849Q74l054M095l137J358p79J1
2762d49J799k396J119O85p20o23J057n99Q08j480M52J932l412L885l126P66K186
2779A884m430N088m772L076M30m359O467n566L352j331j309M276o091N621l167
2794h31K5K467l985M855m700L132o54k109M239m722L751k498R98J140l143M186
2810B151l554K058p38m04J398k316K724k227J188l73J9O93k029L448l668K410
2826G80l85j592L172m200M361l003L23K202l613L777l151K146p38j020K423l282
2842a800L355k518J312M2j736L703m650L959j871r62K901l833M238l531J648R18
$$ plain form
2731 3910 -3074 1465 1662 -4334 5018 -4187 2071 985 -3812 4691 -4153 2898 -1017 -1578 4528
2746 4528 -4242 2618 -869 -213 1644 -3084 3202 -1666 183 1057 -1997 2098 -1039 319 -460 -449
2762 -449 1350 -1046 73 758 38 -585 472 -127 681 -799 -347 1585 -1827 2058 -1068 -302 1884
2779 1884 -2546 2542 -2230 846 1276 -3083 3384 -2182 1170 -161 -1470 2806 -3285 2336 -831
2794 -831 -806 1661 -2324 2531 -2169 963 309 -1800 2439 -2283 1468 -1030 -32 1108 -2035 2151
2810 2151 -1403 655 -83 -487 911 -1405 1319 -908 280 -93 -74 619 -1410 2038 -1630 780
2826 780 395 -1197 1975 -2225 2136 -867 -544 1658 -1955 1822 -1329 817 79 -941 1482 -1800
2842 -1800 1555 -963 349 391 -1345 2358 -2292 1667 -204 -1166 1735 -2098 2140 -1391 257 1175
2858A175k900L531k853J925j292J9J462k432K737k297J889j608M64J270l108M051
2874B033l083J181L97j591K796l865L540j475o59J681k037K356k583K374j127
2889f2r69K476l062L223l145K467l72k512M508m599L307j554m69K404l808L947
2905A780k625L92J214j992K603k882K845j569o63K314k261J615j942K038q50j145
2921a128K338k477J927p68oN63j286K004k014Q42J49O63j282p3J857k520K241
2938A030k073J885j91k267M208m549L035o27k013L710m282L952k852J19L580n359
2954b694M000k442K055n14k790M822m183K724j036q05K530l648L790l080O53K480
2970A862l933K893j233J138q14j736L777k126p98J296o93R97n62j033J555o60
$$ plain form
2858 1175 -1725 1806 -1047 878 -414 -395 1067 -1365 1372 -925 964 -644 -180 1090 -2018 2033
2874 2033 -1050 131 528 -1063 1733 -2132 1408 -67 -726 955 -1082 1274 -1309 1065 -62
2889 -62 -1031 1445 -1617 1606 -1539 928 556 -1956 2552 -2047 1260 -294 -763 1641 -2167 1780
2905 1780 -845 -453 761 -1231 1372 -1510 1335 -234 -897 1417 -844 771 -1171 867 17 -1128
2921 -1128 1210 -1267 660 -108 -114 449 -837 1167 -847 -5 144 807 -475 -548 1309 -1211 1030
2938 1030 -1043 842 651 -1616 2592 -1957 1078 451 -1562 2148 -2134 1818 -1034 -915 2665 -2694
2954 -2694 1306 -1136 919 405 -2385 2437 -1746 978 -58 -863 1667 -1981 1809 -1271 -618 1862
2970 1862 -2071 822 -411 727 -87 -1823 1954 -172 -970 326 -367 630 68 -965 590 -70
2986g0j33M36k377M145j989j580K696j993K481l472J865K099m332L963l480K749
3002A008m6l111M254m373M395k205k421N325m410L485m146J984L684p059N104
3017A468k103J297P39m530N925l431P48P67l120M997l170p28J250n14K842m689
3033b252J298L316k991M03q94J838R78l819K360q3k0J471m428M196n42j648Q86
3050F9k241N748m420j648M522k987L197n026K585L440n743L895l633L514J106
3065B378n957N302k881L254k211l885Q296m652L38j088K32M742p271L137J311
3080A045j424K236n164M552K24k572J413k766N476k486l749M348r79J565l685
3095a966J96N369m964Q10Q7N74K938o061L268P54j018J368n418O250k10m156K521
$$ plain form
2986 -70 -203 233 -2144 2001 12 -1568 1128 -865 1616 -1856 9 2108 -2224 1739 -1741 1008
3002 1008 962 -2149 2105 -2268 2127 -78 -2499 2826 -1584 1901 -2245 -261 3423 -3636 1468
3017 1468 -635 662 1401 -3129 2796 -635 113 880 -2240 2757 -413 -1141 109 -405 2437 -2252
3033 -2252 -954 2362 -629 -226 -1120 718 1696 -2123 237 154 134 1605 -2823 1373 831 -817 69
3050 69 -2172 3576 -844 -2492 2030 -957 2240 -2786 -201 3239 -2504 1391 -2242 1272 2378
3065 2378 -3579 1723 -1158 2096 -115 -4000 4296 -356 -18 -1106 -874 3868 -3403 -266 1045
3080 1045 -379 1857 -3307 1245 1469 -1103 310 -2456 3020 534 -3215 1133 154 1719 -1966
3095 -1966 -1770 3599 -1365 -555 -468 106 3044 -3017 251 1005 -13 1355 -4063 2187 1977 -2179 342
3112C42k148N158m176k155N760l539K473l637J108M357n734K551j468J569K289
3127B750o669M747K50l88p86l424P372l843j853K195j198M163n530Q89L279k766
3143h12K486m484L406K093m566K316j701L317j186m523N757k027K75q66j431N372
3159C426m689M23J178r39L248n303J921K312k153J499l769M294M61m668L340r06
3175c25K004j940k554N214k995R05q88j091M831m729Q41J189r32K995n543L737
3191G19J000l074K216l264M432j668k689M098k988L013k229r98L987l548J866
3206H73k017R47K649m781K854o38O15N39l614M420j719q52J248j765K972k292
3222e61l85J524j001J711k242K6K725k327L30j94O65J140l304K211J47j188J617
$$ plain form
3112 342 -1806 3352 -824 -2979 2781 -758 1715 -1922 -814 3543 -2191 360 -1108 461 2750
3127 2750 -3919 828 1078 690 -96 -3520 3852 9 -1844 351 -847 3316 -2214 -1325 1954 -812
3143 -812 1674 -2810 596 2689 -1877 439 -1262 2055 869 -3654 2103 76 351 -515 -1946 3426
3159 3426 -1263 -840 338 -601 2647 -2656 -735 1577 -576 923 -2846 1448 1909 -2759 581 -325
3175 -325 1679 -261 -2815 2399 -596 309 -579 -1670 3161 -1568 -727 462 -470 2525 -3018 719
3191 719 1719 -1355 861 -2403 2029 361 -2328 1770 -1218 1795 -434 -1432 2555 -993 873
3206 873 -1144 -197 2452 -2329 525 -113 502 1041 -2573 1847 128 -724 524 -1241 1731 -561
3222 -561 -946 578 -423 1288 -954 -928 1797 -530 -200 -394 271 1411 -1893 318 465 -723 894
3239H94k513K832p99j309J838k620L383k185o18K633k606K412k841J325J510l239
3255a903L332k250J228M26k450L009k416J719o40j603K992k391J111m33KJ479
3271A212k295J418p7m63L8j27M91l2l58M48j00k3M18j107K23Q91o65M10q40J120
3291E82m44r06J838j623J135j043L30R91k382K807k231Q90J035k249K415k309
3307a164J653n79j068K337j975J009m47k0Q83j462J668j345L71M80p19Q70j299
3324h07J548j043K37O80j050O26r30J254o50k1O04q44Q75j063O47j58o9M21p25
3343d68Q04r87J222r19j54J478k069J784r25M5O68j446J942j540P63K91j087J179
3361E81j371J407q70J58O07j253J372j281J277j001J59R95j731J589j141O47R
$$ plain form
3239 894 -1619 1213 414 -895 943 -1677 1706 -479 -1097 1536 -1070 1342 -1499 -174 1336 -1903
3255 -1903 1429 -821 407 833 -1617 1392 -1024 695 55 -1548 1444 -947 164 -269 -267 1212
3271 1212 -1083 335 258 -205 -167 -294 197 165 -193 255 155 132 550 -557 -334 557 -108 302 -538 582
3291 582 138 -768 1070 -553 582 -461 -131 860 -1522 1285 -946 -56 979 -1270 1145 -1164
3307 -1164 489 -90 -1158 1179 -796 213 -234 -254 629 -833 835 -510 -139 341 -378 492 -807
3324 -807 741 -302 -65 615 -435 191 -739 515 -135 -156 448 -396 479 -584 63 -95 -164 257 -468
3343 -468 336 -651 571 -348 -502 976 -1093 691 -234 -189 479 -967 975 -565 198 489 -598 581
3361 581 -790 617 -253 -95 512 -741 631 -650 627 -374 -215 780 -951 638 -503 144 153
3378A53q27J489j339R87m88j27M14n09O17o53O17m81K96J45q19J367j490Q31o3
3397A20q90J302j493J436r80O38L35j083J231j176J126r04k6J094j550J720j791
3414h91J034j64o36J582k019J905r82n90J873k200K075j388Q2J050j745J795j310
3431e29J15Q10q47O58p91P03l6l17N05l86R7k00J64m8L35l17K45k71J45K32j101
3452h34J405n50l17R14j282J946k283J345N2j317K559l241K423m24j483K461l161
3469a787L134j547r54K280k578L100k354L56J749k925K716k178J126P63k336K628
3485A193k192J347J96j987K497j449P87M4j354K150j695j66J196j320J439j493
3501h07L19J788k361J695j256L08J963l500K846j017m89J707l775M537k521l61
$$ plain form
3378 153 -674 815 -524 463 -25 -152 262 -247 370 -283 334 -147 149 294 -525 842 -648 183 120
3397 120 -770 532 -961 475 -505 133 468 -615 616 -560 566 -338 -364 730 -820 900 -891
3414 -891 143 -21 -657 925 -1094 811 -171 -761 1112 -1088 987 -401 -319 731 -1014 781 -529
3431 -529 -414 396 -451 207 -584 119 83 -234 271 -115 -18 -218 -54 -102 233 -84 161 -110 35 267 -834
3452 -834 571 21 -296 618 -664 1282 -1001 344 396 -921 1638 -1603 820 396 -1087 1374 -1787
3469 -1787 1347 -200 -1154 1126 -1452 1648 -706 -350 1399 -1526 1190 -988 138 901 -1435 1193
3485 1193 -999 348 544 -1443 1054 -395 392 436 -918 1232 -463 -629 567 -753 686 -807
3501 -807 -488 1300 -1061 634 -622 -314 1649 -1851 995 -22 -511 1196 -2579 1958 -563 -924
3517i24K307l438M235l663J004K118l501M242m315K210J299l328L184l409L189
3532A210l92l052M339l160J821p98j596M051l808J820m2j493L111l628J774N88
3548G45j764K379l086K494M87l077K991k065J738l00k698M365l277J170L46k341
3564a893M384m289J903O55k341M262n521L402N99k939L876m343M155j321l044
3579b455M695m325L768k041j442M330m505L168j541q80L687m685L288j102m60
3594e00K098m306M613j689j349K468l260L784k246j009L135l541L650k526o91
3609a369L801m157K632j331k05K805n005L944r73r08K277l982M353k158p77K888
3625A835l997M114k792n26L365l662L220l213J176K951n086M004k070P10J505
$$ plain form
3517 -924 1383 -2055 2180 -1483 -479 1639 -1862 2380 -1935 275 1574 -1754 1430 -1979 1210
3532 1210 818 -2234 2105 -1055 766 -32 -1628 2423 -1385 435 393 -1100 2011 -1617 157 745
3548 745 -1019 1360 -1726 768 1255 -1822 1169 -896 842 542 -2156 2209 -1068 102 448 -1893
3564 -1893 2491 -1798 105 760 -1581 2681 -2840 562 1161 -1778 2098 -2245 1910 589 -2455
3579 -2455 2240 -2085 1683 -358 -1800 2530 -1975 1193 -348 -1228 2459 -2226 1062 -40 -500
3594 -500 1598 -2708 1905 216 -1133 1335 -1925 1859 -387 -1396 1739 -1802 1848 -678 -1369
3609 -1369 2432 -1725 907 -424 -629 2176 -2829 1115 142 -766 1511 -2471 1882 -276 -1053 1835
3625 1835 -2162 1952 -840 -1366 1999 -1663 1557 -1656 -480 2471 -2615 1389 -681 29 1534
3640A534m152M625k790P36J383l503M443l287M88J800k986M032l789J032K223
3655A789l383L019k719J607R96l388L522k402J134P42k931L874k506P99L74k070
3671a543L767l560R77J517k353K598k890J802Q22l123L360k499J804K12k736L179
3687A334k465J855l42k203L969l075O61M91j117K684l646K197K18j623K482l035
3703a615K290m59j297K430k655K471q57j699K658k054J476j071l18K183k744J507
3719B46l12k00J264k323J699k33o59J557k169J864n91j146J704j494J327q35l16
3736f17J953k097J015k83l60J264j852J391m26m41J454k165J704j91j052J105
3752D02j263J815j212j57J416j797J626j361J78J106j590J402j009L39O96j446
$$ plain form
3640 1534 -2618 2007 -783 -47 1336 -2167 2276 -1011 -523 1277 -1709 2323 -1466 -434 1789
3655 1789 -1594 1425 -1294 313 1309 -2079 1443 -959 175 917 -2014 1860 -646 153 527 -1543
3671 -1543 2224 -1336 -359 1158 -1195 1403 -1487 315 1137 -1986 1374 -1125 679 891 -1845 1334
3687 1334 -1131 724 382 -1821 2148 -927 -266 225 -892 1792 -1854 343 561 -1062 1420 -1615
3703 -1615 675 216 -1081 1349 -1306 1165 308 -1391 1267 -787 689 -382 -700 1483 -1261 246
3719 246 -66 -266 998 -1325 374 141 -518 1039 -1130 734 143 -1003 701 -793 534 -301 -617
3736 -617 1336 -761 254 -29 -389 875 -977 414 -12 -453 1001 -1164 540 349 -703 402
3752 402 -861 954 -258 -415 1001 -796 830 -531 -353 753 -837 565 -444 -105 591 -855
3768h55J166o29N07pj075J722j123j46M51o0M58r63N13K89o55O57m75K04K11l80
3788a90o3n1O56J00r14Q15k52o97R70m49L89m52J6O95r92P67k81m73P19o44P92
3809D61j003N35P26j242J068p81N22k38m07P41p10K60K36n33N68o13P49m22J91
3828A08J98l88J73k22L84m92J43Q31q85J71j5N6k12L58j56m04M08k02K32k98K27
3849A5L45p34N53k58n8J1J67K06o17P75m07j65K36q2L92q30P26r8l43M00l82K66
3871A18m27M05K12q72J058q33K45L57k51L32n75M47j6l21M02l15L55n63O45l75
3891B8l89K95j35M10p14R35o15J89K88n48J31Q7M12k06m15N08l93J88j50K45M9
3912B00m58N77p32N76k74P7M67p45Q45q11M7L94m40N56n36O98l90l67O07n40K49
$$ plain form
3768 -855 311 -318 189 182 -893 829 -294 -440 11 -49 409 -554 -41 248 -407 250 -225 -21 190 -190
3788 -190 -253 -304 352 452 -462 353 101 -596 374 -75 314 -138 -122 573 -419 348 67 -406 313 -331 461
3809 461 -542 -7 719 -523 545 -236 286 48 -359 382 -328 -68 168 -365 203 -410 339 -83 108
3828 108 306 -82 91 -131 253 -239 -96 735 -150 21 6 62 -150 208 52 -352 56 -146 86 -212 15
3849 15 360 -374 179 -79 -137 -126 41 247 -370 405 -2 -167 69 -13 379 -451 275 177 -166 234 -148 118
3871 118 -309 96 308 -564 494 -339 -94 263 12 344 -231 216 200 -121 281 -34 321 -242 403 28
3891 28 -361 -66 -201 209 -505 430 -185 4 292 -256 -125 -38 374 168 -247 261 -132 56 -94 151 200
3912 200 -258 319 -413 163 -111 -34 433 -312 533 -278 -231 163 -277 279 -257 441 51 -316 291 -249 0
3933@j63Q5J70l90Q18r02M60K25k43K85p74O71l87j52M05l80M70n06L65j12J72
3954A17q5j26J35lK07n76N03K6j45J41m88Q53p70J0N32p12Q95q42L28J33j89O34
3976E78j605J465l20l76P00j086J317j364O08L41p87J129j168O98j06n85R61j000
3994f00J021l19o03J020n57L34o91K80P58r30J55o2L53K05o62J30O13l03j4m21
4014b93M11L95r81M95P6J49p2q30J401j036J00J94m81J310j668Q06M29p37J149
4033H17k040J559l8o04O91j588K238j246n93J454j084J303j456R0J651j902J467
4050G19j367N58J207k049R20j42M62P0j480J674l64o26M87o76J232r50l42J055
4068C88o50J043j128O0J498j794O13l93K44J209k415J869k26k77L32j787K729
$$ plain form
3933 0 -163 -78 92 -298 520 -382 78 303 60 345 -429 242 -145 -297 108 -272 198 -308 57 -55 117
3954 117 32 -94 41 38 245 -331 172 198 53 194 -294 559 -211 -201 331 -381 514 -328 0 133 -56 578
3976 578 -1027 438 118 -258 442 -644 673 -691 -83 258 -529 600 -568 130 24 -561 400 -600
3994 -600 421 102 -501 519 -38 296 -395 -115 643 -287 -132 -194 159 364 -298 -168 445 142 128 -293
4014 -293 118 513 -468 27 103 252 180 -650 751 -285 -185 9 -472 838 -830 -24 405 -332 817
4033 817 -1223 336 298 -306 385 -1203 1035 -211 -804 650 -434 869 -587 -497 1154 -748 719
4050 719 -648 -90 1117 -932 -12 -154 308 378 -1102 572 208 -418 69 -607 625 -325 -667 388
4068 388 -262 781 -347 -287 1211 -583 30 -363 -119 1090 -1325 544 318 41 373 -1414 1315
4085A315j426m64R90j489K647k214l6J442j300J578k281J480J097k252J618j531
4101h26J642n15j682K460j517Q40n34p69K437k032L72JqJ471k586J269O69r99
4119c07N48j301J645l1j565J439q04J245m93j916K542j233M89k48r10K596k255
4136e59K34N50p92J943k986K282l8j707J716j976K445o11j551J912j611J757j530
4153e22n28K315j951J402j030J54J796l064J765o03K18O34j977K193n66o41Q03
4170C98j617K776j527r29J742j379J455j443qJ841k126R88l88M3J372k481J778
$$ plain form
4085 1315 -111 -575 415 -1074 1573 -641 -677 765 -535 1043 -1238 242 1339 -913 705 -826
4101 -826 816 301 -1381 1079 -438 402 -132 -901 1536 -496 -124 -123 -131 1340 -1246 23 692 -307
4119 -307 241 -1060 585 554 -1011 428 -376 869 376 -1540 1002 -231 258 10 -900 1696 -559
4136 -559 -325 225 -567 1376 -1610 672 634 -1073 643 -1333 1112 501 -1050 862 -749 1008 -522
4153 -522 -1050 1265 -686 716 -314 -160 1636 -1428 337 -266 -48 586 -1391 802 236 -405 398
4170 398 -1219 1557 30 -899 843 -536 919 -524 -532 1309 -817 171 -217 -174 1198 -1283 495
$$ [...]
8191A36
##END NTUPLES=NMR FID
##END=
