##TITLE=1H_LR-755-R2-P1
 CCl4
 8 sc, 
 14.12.2022
##JCAMPDX= 6.0         $$ Bruker NMR JCAMP-DX V2.0
##DATA TYPE= NMR FID
##DATA CLASS= NTUPLES
##ORIGIN= UXNMR, Bruker Analytische Messtechnik GmbH
##OWNER= root
$$ XWIN-NMR		Version 3.5
$$ Wed Dec 14 14:59:28 2022 Russian Standard Time (UT+4h)  she@DPX200
##.OBSERVE FREQUENCY= 200.13135
##.OBSERVE NUCLEUS= ^1H
##.DELAY= (6, 6)
##.ACQUISITION MODE= SIMULTANEOUS
##.ACQUISITION SCHEME= undefined
##.AVERAGES= 8
##.DIGITISER RES= 18
##SPECTROMETER/DATA SYSTEM= spect
##.PULSE SEQUENCE= zg30
##.SOLVENT NAME= CDCl3
##.SHIFT REFERENCE= (INTERNAL, CDCl3, 0, 15.7039)
##AUDIT TRAIL= $$ (NUMBER, WHEN, WHO, WHERE, WHAT)
$$ ##TITLE= Audit trail, XWIN-NMR		Version 3.5
$$ ##JCAMPDX= 5.01
$$ ##ORIGIN= Bruker BioSpin GmbH
$$ ##OWNER= she
$$ F:/spectra/data/she/nmr/H-F/1/audita.txt
$$ ##AUDIT TRAIL=  $$ (NUMBER, WHEN, WHO, WHERE, WHAT)
(   1,<2022-12-14 14:54:24.15 +0400>,<she>,<DPX200>,
      <created by zg, POWCHK disabled, PULCHK disabled
       configuration hash MD5:
       00 E9 B6 7A A2 85 ED C7 34 08 36 98 17 FE 4E 26
       data hash MD5: 16K
       09 80 C2 5D B0 03 D7 41 E8 62 8B 41 EC 7F B3 FF>)
$$ ##END=
$$ 
$$ hash MD5
$$ 3E B2 8A FB 50 29 51 E5 A7 E3 1D 25 1D 96 E7 CE
##$RELAX= 
##$RELAX= 
##$RELAX= 
##$RELAX= 
##$RELAX= 
##$RELAX= 
$$ Bruker specific parameters
$$ --------------------------
##$DU= <F:/spectra>
##$EXPNO= 1
##$NAME= <H-F>
##$PROCNO= 1
##$TYPE= <nmr>
##$USER= <she>
##$AMP= (0..31)
100 100 100 100 100 100 100 100 100 100 100 100 100 100 100 100 100 100 
100 100 100 100 100 100 100 100 100 100 100 100 100 100 
##$AQSEQ= 0
##$AQ_mod= 1
##$AUNM= <au_zg>
##$AUTOPOS= <>
##$BF1= 200.13
##$BF2= 200.13
##$BF3= 200.13
##$BF4= 200.13
##$BF5= 200.13
##$BF6= 200.13
##$BF7= 200.13
##$BF8= 200.13
##$BYTORDA= 1
##$CFDGTYP= 0
##$CFRGTYP= 5
##$CHEMSTR= <none>
##$CNST= (0..31)
1 1 145 1 1 1 1 1 1 1 1 1 1 1 1 1 1 1 1 1 1 1 1 1 1 1 1 1 1 1 1 1 
##$CPDPRG= <>
##$CPDPRG1= <>
##$CPDPRG2= <>
##$CPDPRG3= <>
##$CPDPRG4= <mlev>
##$CPDPRG5= <mlev>
##$CPDPRG6= <mlev>
##$CPDPRG7= <mlev>
##$CPDPRG8= <mlev>
##$CPDPRGB= <>
##$CPDPRGT= <>
##$D= (0..31)
0 1.2 0 0 0 0 0 0 0 0.06 0 0.03 0 0 0 0 0.0002 0 0 0 0 0 0 0 0 0 0 0 0 
0 0 0 
##$DATE= 1671015263
##$DBL= (0..7)
120 120 120 120 120 120 120 120 
##$DBP= (0..7)
150 150 150 150 150 150 150 150 
##$DBP07= 0
##$DBPNAM0= <>
##$DBPNAM1= <>
##$DBPNAM2= <>
##$DBPNAM3= <>
##$DBPNAM4= <>
##$DBPNAM5= <>
##$DBPNAM6= <>
##$DBPNAM7= <>
##$DBPOAL= (0..7)
0.5 0.5 0.5 0.5 0.5 0.5 0.5 0.5 
##$DBPOFFS= (0..7)
0 0 0 0 0 0 0 0 
##$DE= 6
##$DECBNUC= <off>
##$DECIM= 32
##$DECNUC= <off>
##$DECSTAT= 4
##$DIGMOD= 1
##$DIGTYP= 9
##$DL= (0..7)
0 120 120 120 120 120 120 120 
##$DP= (0..7)
150 150 150 150 150 150 150 150 
##$DP07= 0
##$DPNAME0= <>
##$DPNAME1= <>
##$DPNAME2= <>
##$DPNAME3= <>
##$DPNAME4= <>
##$DPNAME5= <>
##$DPNAME6= <>
##$DPNAME7= <>
##$DPOAL= (0..7)
0.5 0.5 0.5 0.5 0.5 0.5 0.5 0.5 
##$DPOFFS= (0..7)
0 0 0 0 0 0 0 0 
##$DQDMODE= 0
##$DR= 18
##$DS= 0
##$DSLIST= <SSSSSSSSSSSSSSS>
$$ [...]
##$SUBNAM2= <"">
##$SUBNAM3= <"">
##$SUBNAM4= <"">
##$SUBNAM5= <"">
##$SUBNAM6= <"">
##$SUBNAM7= <"">
##$SUBNAM8= <"">
##$SUBNAM9= <"">
##$SW= 18.05172834244
##$SWIBOX= (0..15)
0 0 2 0 0 0 0 0 0 0 0 0 0 0 0 0 
##$SW_h= 3612.71676300578
##$TD= 16384
##$TD0= 1
##$TE= 0
##$TE2= 300
##$TE3= 300
##$TEG= 300
##$TL= (0..7)
0 120 120 120 120 120 120 120 
##$TP= (0..7)
150 150 150 150 150 150 150 150 
##$TP07= 0
##$TPNAME0= <>
##$TPNAME1= <>
##$TPNAME2= <>
##$TPNAME3= <>
##$TPNAME4= <>
##$TPNAME5= <>
##$TPNAME6= <>
##$TPNAME7= <>
##$TPOAL= (0..7)
0.5 0.5 0.5 0.5 0.5 0.5 0.5 0.5 
##$TPOFFS= (0..7)
0 0 0 0 0 0 0 0 
##$TUNHIN= 0
##$TUNHOUT= 0
##$TUNXOUT= 0
##$USERA1= <user>
##$USERA2= <user>
##$USERA3= <user>
##$USERA4= <user>
##$USERA5= <user>
##$V9= 5
##$VALIST= <valist>
##$VCLIST= <CCCCCCCCCCCCCCC>
##$VD= 0
##$VDLIST= <DDDDDDDDDDDDDDD>
##$VPLIST= <PPPPPPPPPPPPPPP>
##$VTLIST= <TTTTTTTTTTTTTTT>
##$WBST= 1024
##$WBSW= 4
##$XGAIN= (0..3)
0 0 0 0 
##$XL= 0
##$YL= 0
##$YMAX_a= 471690
##$YMIN_a= -589081
##$ZGOPTNS= <>
##$ZL1= 120
##$ZL2= 120
##$ZL3= 120
##$ZL4= 120
##$ABSF1= 10
##$ABSF2= 0
##$ABSG= 5
##$ABSL= 3
##$ALPHA= 0
##$AQORDER= 0
##$ASSFAC= 0
##$ASSFACI= 0
##$ASSFACX= 0
##$ASSWID= 0
##$AUNMP= <proc_1d>
##$AZFE= 0.1
##$AZFW= 0.1
##$BCFW= 1
##$BC_mod= 2
##$BYTORDP= 1
##$COROFFS= 0
##$CY= 11.3945322036743
##$DATMOD= 1
##$DC= 2
##$DFILT= <>
##$DTYPP= 0
##$F1P= 2.36226072786647
##$F2P= -0.459571619588291
##$FCOR= 0.5
##$FTSIZE= 0
##$FT_mod= 4
##$GAMMA= 1
##$GB= 0.15
##$INTBC= 1
##$INTSCL= 1
##$ISEN= 128
##$LB= 0.24
##$LEV0= 0
##$LPBIN= 0
##$MAXI= 10000
##$MC2= 0
##$MEAN= 0
##$ME_mod= 0
##$MI= 1.114404
##$NCOEF= 0
##$NC_proc= 0
##$NLEV= 6
##$NOISF1= 3.799351
##$NOISF2= 2.8
##$NSP= 1
##$NTH_PI= 0
##$NZP= 0
##$OFFSET= 15.70392
##$PC= 1
##$PHC0= -19110.09
##$PHC1= 14.40072
##$PH_mod= 1
##$PKNL= yes
##$PPARMOD= 0
##$PSCAL= 0
##$PSIGN= 0
##$REVERSE= no
##$SF= 200.130013532006
##$SI= 16384
##$SIGF1= 3
##$SIGF2= 2
##$SINO= 400
##$SIOLD= 16384
##$SREGLST= <1H.CDCl3>
##$SSB= 0
##$STSI= 0
##$STSR= 0
##$SW_p= 3612.71676300578
##$SYMM= 0
##$S_DEV= 0
##$TDeff= 0
##$TDoff= 0
##$TI= <>
##$TILT= no
##$TM1= 0
##$TM2= 0
##$TOPLEV= 0
##$USERP1= <user>
##$USERP2= <user>
##$USERP3= <user>
##$USERP4= <user>
##$USERP5= <user>
##$WDW= 1
##$XDIM= 8192
##$YMAX_p= 0
##$YMIN_p= 0
$$ End of Bruker specific parameters
$$ ---------------------------------
##NTUPLES= NMR FID
##VAR_NAME=  TIME,          FID/REAL,        FID/IMAG
##SYMBOL=    X,             R,               I
##VAR_TYPE=  INDEPENDENT,   DEPENDENT,       DEPENDENT
##VAR_FORM=  AFFN,          ASDF,            ASDF
##VAR_DIM=   8192,          8192,            8192
##UNITS=     SECONDS,       ARBITRARY UNITS, ARBITRARY UNITS
##FACTOR=    0.0002768,     1,               1
##FIRST=     0,             0,               0
##LAST=      2.2672688,     0,               0
##MIN=       0,             -589081,         0
##MAX=       2.2672688,     471690,          0
$$ Real data points
##PAGE= N=1
##DATA TABLE= (X++(R..R)), XYDATA
0@%%%%%%%%qJ6k4L2m0N6p2Q8j04J28j61J99k40K90l50M15m88N68o64P75q96J032
30E52j187J359j549J760j994K251k532K847l192L566l978M430m924N460o043O682
46C508p383Q144q975R891j0894J1996j3213J4559j6054J7724j9604K1739k4186
59a2748K7018l0343L4313l9144M5177n2960O3445p8456J02120j47184L68262o77003
71c97503L16638K49677k72547M69727r55073Q94724k07299k73237L68615n57307
81c63585O64123k18227l23823L09889j63633M40917n68801j4824N66504l30920
91b380q1065n2994K28740J25535m63119K40412Q1117q5593J38907l72361K83214
102D0413J41035k81265J36143k82573N37830j88199n17032O63639k89290J61279
$$ plain form
0 0 0 0 0 0 0 0 0 0 -8 8 -16 16 -24 32 -40 48 -56 72 -89 110 -130 160 -190 225 -263 305 -359 416 -480 552
30 552 -635 724 -825 935 -1059 1192 -1340 1507 -1685 1881 -2097 2333 -2591 2869 -3174 3508
46 3508 -3875 4269 -4706 5185 -5709 6287 -6926 7633 -8421 9303 -10301 11438 -12748
59 -12748 14270 -16073 18240 -20904 24273 -28687 34758 -43698 58422 -88762 279500 -397503
71 -397503 -80865 168812 -103735 365992 -589081 305643 98344 -174893 193722 -363585
81 -363585 300538 82311 -241512 68377 -95256 345661 -223140 -237964 328540 -2380
91 -2380 -83445 -136439 92301 217836 -245283 -4871 76246 -9347 129560 -242801 40413
102 40413 181448 -99817 36326 -246247 291583 103384 -413648 249991 -39299 121980
112A21980k42627r0014O48277p16051L47446q0141j20108M87004o82695M16508
122H9579r6371J9460J90330o40489P09494j89008k26551J71736j64983M55849
132C19046n08931R1087K71449k80869K50093k95920J51246J27602k00014J39353
142F4142k18980K37975Q0574l79748K23006Q6510p5538m0419j26285L17924j31916
153C7245k06758K88653j97057J54856n2642j79983L02237k28673J81351j60622
163f1393q1729M21719m31785J37153K3242O460J16811l83003M07177j37916r1139
174g4403J62920k30724K87090k06759O2637K8914j50766L20694l13676O7345J21852
185G5124r0532P3302k08620K48294l5440j81691J75601p1742L8922k3183l7564
$$ plain form
112 121980 -120647 -210661 437616 -278435 69011 -11130 -131238 355766 -326929 89579
122 89579 -6792 12668 202998 -437491 272003 82995 -143556 28180 -136803 319046
132 319046 -189885 -98798 172651 -108218 141875 -154045 -2799 124803 -75211 64142
142 64142 -154838 83137 163711 -216037 6969 93479 17941 -22478 -148763 169161 37245
153 37245 -169513 119140 -77917 76939 24297 -155686 146551 -82122 99229 -61393
163 -61393 -143122 278597 -153188 -16035 7207 13667 130478 -252525 154652 16736 -74403
174 -74403 88517 -142207 144883 -61876 761 29675 -121091 199603 -114073 -46728 75124
185 75124 -15408 57894 -150726 97568 62128 -119563 56038 -15704 23218 35 -37529
196c7529P2010n5456M3407p354r5270J37633o587j39987J07432o86J7557p8580
208d3410q426J72865j96640P1410L9006p7608J01049j19229J09433q0453J7487
219a4516J06084k08072J66893l4533k3386K810n2105J77415k04605P0403P6138
230F2526j11915Q7252q4890R2512o2120j4902J04399j42879Q6796J1609m3362
241a4974J578M838O2242r5711K1909O4123m7791k8951M6983J0929n7745L9604
253G034O592j6491j8075M0788k45p3360Q9217k3241l8385K2955J5867J2415q2397
266e7326R0362j0987o5174O2593j8164J1350m7565N6605L187q0395R1252l0238
278E500k0108N536K3804N825p2911Q5745j8421m8352M0504O639q142m1970O5482
$$ plain form
196 -37529 34481 -20975 22432 15078 -80192 57441 50854 -89133 18299 17613 35170 -43410
208 -43410 -51836 121029 -75611 -4201 34805 -42803 58246 -60983 48450 -32003 -14516
219 -14516 91568 -116504 50389 15856 -7530 -4720 -56825 120590 -84015 -13612 62526
230 62526 -49389 37863 -47027 45485 -16635 -31537 72862 -70017 16779 28388 -14974
241 -14974 -13396 -8558 53684 -42027 -20118 44005 -3786 -32737 14246 25175 -32570 7034
253 7034 13626 -2865 -20940 19848 19603 -53757 35460 12219 -26166 -3211 12656 25071 -57326
266 -57326 33036 22049 -43125 19468 1304 12654 -34911 21694 24881 -55514 35738 5500
278 5500 -14608 -9072 14732 20557 -52354 33391 14970 -33382 7122 13761 5619 -36351 29131
291B9131j6437n0631N5017k552k4161j3047N3116k6773m0120O1748j5296k7552
303a7557O973L8764l2018k9175O5505k9649k6142K6375J8443l0651j7077O0749
315C4540l6741k5510M4740l156l0261K376M5445l9098j8417N0459j6929k9346
327b1898K0076K9266m2299n284M9268k9929k2692L2144J1984m0079O031M4337
339C0925l9251j4631M2556q962l2592J9164K8808l8381q486M7214k2515l0275
351b6426L6995P765l5411N667L5360k3890k6580M4494n095l7199K6256J7877k8729
364h916r515L8520j1254l6448L6179J2280l9473P524L3787k2678k1803L3047M032
377A5282l4662J4459K9150l6523j919L3742j6849k0991J8515K6898m6990N234
$$ plain form
291 29131 12694 -37937 17080 14528 -9633 -22680 30436 3663 -36457 25291 9995 -17557
303 -17557 -10584 28180 -3838 -33013 32492 2843 -23299 3076 21519 -9132 -26209 34540
315 34540 -2201 -27711 17029 13873 -16388 -14012 31433 -7665 -26082 24377 7448 -21898
327 -21898 -1822 27444 -14855 -20139 29129 -800 -23492 8652 20636 -19443 -13412 30925
339 30925 -8326 -22957 19599 10637 -21955 -2791 26017 -12364 -20850 26364 3849 -26426
351 -26426 10569 18334 -17077 -11410 23950 60 -26520 17974 12879 -24320 1936 19813 -8916
364 -8916 -18431 20089 8835 -27613 8566 20846 -18627 -11103 22684 6 -21797 11250 15282
377 15282 -19380 -4921 24229 -12294 -14213 19529 2680 -18311 204 27102 -19888 -14654
389a4654M5471l9568l755J4227J7125k9902r109N7408n8490J2949K8994l1364
401a0668J1922j4033M2716m6130r497P1913o6504Q150K0916J123j0684k6798N9702
414C2128l7704j3814L9762k5619j194Q063J1614k5909J318L7345k9926k0542L7538
427A3060P716m2710J3297K7226j3769k4133K3062J4373m1530L6902j0836j6194
439a3536K3006j2297K0469n5697N6339J5023q6664P6338k1078O322j8862j2323
451b2960P6366r4787M9214R823m8485O1899m9316K7567k2401J3771L5944q6201
463d9566O0539J3994l4730n593J2374L6523n6791J4331K5917k2536O700j600q85
476a323m296J5857l297k7112J4397M2138n1078j6182O2573l0912k306k1627L7431
$$ plain form
389 -14654 30817 -8751 -12506 1721 18846 -11056 -20165 37243 -21247 -8298 20696 -10668
401 -10668 1254 -12779 29937 -16193 -25690 46223 -20281 -12131 8785 9908 -776 -27574 32128
414 32128 -5576 -19390 20372 -5247 -6441 1622 13236 -12673 -11355 25990 -3936 -24478 13060
427 13060 20776 -21934 -8637 18589 4820 -19313 3749 18122 -23408 13494 2658 -13536
439 -13536 9470 -2827 17642 -38055 18284 33307 -53357 22981 1903 8225 -10637 -22960
451 -22960 53406 -41381 7833 17656 -30829 31070 -18246 9321 -13080 691 36635 -49566
463 -49566 10973 24967 -9763 -15356 -2982 33541 -23250 -8919 16998 -5538 1162 -438 -1323
476 -1323 -5619 10238 6941 -20171 -5774 36364 -14714 -30896 31677 765 -1541 -23168 14263
489A4263J3198p5283Q2519m9699O792M3383p6921O6966m5163M2737j2341p6773
501f6322J34174p8546j2695L0324j1615M3743q9423O4869L401l9893M4815m5945
513b3113L1080n306O646j3943k7499P4884m0172l5525L4888K3097j9631l9056
525c3650L9880K1102m1125K221K4424k4883K8690j7623k2672M1878k3710L2610
537B7142o7987L0415Q2053j28954O0651K124L979J1030q7289J24343o8051o722
549a7266M7992p9879R3163n3091L545J558j6716Q6558j16140L3428N3709l6053
561H08m273l7182Q5699l9596l8301M9859k7119K6528j8154j3521J8428r51J9231
574B1456m0593j1359P8211m0515n4431O3723m996M080m5216J2483P5619j01009
$$ plain form
489 14263 27461 -47822 34697 -15002 -8210 35173 -41748 25218 -19945 22792 10451 -66322
501 -66322 67852 -10694 -23389 6935 -4680 39063 -50360 14509 17910 -21983 22832 -23113
513 -23113 7967 2661 9307 -4636 -32135 42749 2577 -32948 1940 25037 5406 -33650
525 -33650 6230 27332 -13793 -11572 12852 -12031 16659 -964 -23636 18242 -5468 27142
537 27142 -40845 -10430 71623 -57331 3320 5444 9423 20453 -66836 57507 -10544 -17266
549 -17266 30726 -49153 44010 -9081 -5536 -3978 -20694 65864 -50276 -16848 36861 808
561 808 -3465 -40647 45052 5456 -32845 17014 -10105 16423 -1731 -15252 3176 2225 21456
574 21456 -19137 -30496 47715 7200 -47231 16492 11496 15576 -29640 -17157 58462 -42547
586d2547N3561p601k9325P8151r3364N1793j8260J2463L8344j25618J24369j8331
598B3635m9408K6419k6631R1148j06321K5746M9202o0146N9298o6050L9846L095
610I833j8096L6316q4677Q7965n05p1555M2621r94L2292n6098r273P9453n5229
623g947j0310L1637k7327L1356j6285k0853L3774k8525M7005m9304k5248J07643
635F5616q8085R473J2516K667L9164j07349R5937j4221m4486O1377p3940P1611
647C0280l5723O56J9827o1895J08050q0810p615M9628k6868L3326q4779Q0956
659B5033M326p0712O4136l9609L3387j5893j7957L6998m3144M7671k1561l8483
671c5808O0422j2400k6498K422J8206J9821m9289N703N3707n2511J3198R418j9110
$$ plain form
586 -42547 11014 3413 -25912 52239 -41125 10668 -7592 4871 43215 -82403 41966 23635
598 23635 -25773 646 -25985 65163 -41158 -15412 33790 -26356 32942 -33108 6738 9833
610 9833 -8263 28053 -56624 31341 30836 -40719 1902 908 33200 -22898 -32171 47282 -7947
623 -7947 -18257 13380 -13947 17409 1124 -19729 14045 -14480 32525 -16779 -42027 65616
635 65616 -22469 -12996 -480 2187 41351 -65998 29939 15718 -28768 32609 -41331 30280
647 30280 -5443 -4787 15040 -46855 61195 -19615 -27230 22398 -4470 28856 -55923 25033
659 25033 29359 -41353 22783 -16826 16561 668 -17289 19709 -23435 24236 2675 -35808
671 -35808 24614 12214 -14284 -11862 6344 26165 -23124 -17421 36286 -16225 -3027 6391 -12719
684a2719L3679l9207L1480k3124l29N2877q6752N1901P237j8859P953l9835Q6765
697E1067o9835k649N2089n4638M9125m9232L3025L99l5997O7360p5869L8269J9601
710B2715l9799K3284k6237N2396m0917j9057N7206l5675J653J045Q689j522j4918
723a1137K1443j2469p331K2046r243k2090K8361N38j8671K08J3567J3146m4465
736b6097L1365J0727l2424K4242j5092J9328k2527P729K4243n1656M8318j4833
748C323j3876J4759j1531L1484n2317L3620J4696m3113L2596j5231J6785k1762
760a0567O373K5021m4097L2357l724j1564M357K652J2599l2716K4748O453k2246
773a0354O746R734O73k2542K2777K79j6774Q380P382k945j8902K8504r705j6677
$$ plain form
684 -12719 20960 -18247 13233 -9891 -10220 42657 -44095 7806 15043 -3816 4137 -35698 51067
697 51067 -18768 -21417 30672 -23966 25159 -24073 8952 9351 -26646 40714 -35155 3114 22715
710 22715 -17084 6200 -20037 32359 -8558 -27615 29591 -6084 -4431 -3386 5303 3781 -11137
723 -11137 10306 -2163 -9494 12552 3309 -18781 9580 10118 -8553 -8345 5222 18368 -26097
736 -26097 5268 15995 -16429 7813 -7279 12049 -10478 -2749 21494 -30162 18156 3323
748 3323 -10553 4206 -7325 24159 -28158 5462 20158 -22955 9641 -5590 11195 -10567
760 -10567 -4194 20827 -23270 9087 5363 -6201 -1844 808 13407 -19309 5439 11892 -10354
773 -10354 -3608 6126 6799 -15743 7034 7313 -9461 -1081 6301 3356 -15546 12958 3253 -13424
787a3424K0520m527j028j5184K5997o967k4243L1762j2128l762k728J3314k133
800E469k4261L4133j4841r416J1257J838j391j8247L0402j3757j4281K1360o271
813A994k920r282K2781j1831j5260K6976j2206n154J161J3653j1146j1971K7088
826A3883j5049o095Q361O713j1019p619K6480j9456m631J4987l134p394l670K2301
840A4658j9659m548K0569j1351m977K679J4493j8118k214K1563j6544k426P300
853A425O849j5456O79K1681k2798K601J1342l637p801o25K0436k2495P91J8809
867A1801j4963j522N195P520j3800j149K0366j7696m291J6670m831j0524M993
880b231J1543j1771o836J7946m921j4121J4932N07j0456K789Q360l628j4047K0256
$$ plain form
787 -13424 7096 2569 1541 -13643 12354 5387 -18856 12906 778 -2984 -5712 7602 5469
800 5469 -18792 15341 500 -8916 2341 4179 2788 -15459 14943 1186 -13095 8265 1994
813 1994 -926 -10208 12573 742 -14518 12458 252 -4902 -3741 9912 -1234 -13205 13883
826 13883 -1166 -7261 1100 7813 -3206 -10825 15655 -3801 -8432 6555 3421 -3973 -7643 14658
840 14658 -5001 -9549 11020 -331 -5308 -2629 11864 -6254 -8468 13095 -3449 -5875 1425
853 1425 8274 -7182 -6503 15178 -7620 -5019 6323 2686 -5115 -5740 14696 -7799 -7008 11801
867 11801 -3162 -4684 511 8031 -5769 -6918 13448 -4248 -8539 8131 3300 -7224 -2231
880 -2231 9312 -2459 -9295 8651 3730 -10391 4541 5048 -5408 -2619 5741 2113 -11934 8322
894H322j719k0089J7946J061o087q088J1866Q468k7494K0448J978j4889J2161
907C884o161P944j3588Q859J2730l3549K7341J531j9143J0884m102J7993k6030
920a1407L014K9399l5385J6953o8o869J2095j8374K2389k0062L692K5487m0715
933a9851K1625N612p233q57j4751L8972k9576q294K9561k3150J5657j4744O414
946f15R477k2269L0341k9416N280K9552l6470J3720l054J3163j481l7643N0273
959B0858j5449j9824K4152k2323K8740k0995n152K5323l4562M0996k7184j6355
971b1775M8777l6534J4726k0014J6865K8226o7146M7951m926j0551J5746l8413
983b7068N1751l0976J779J7003m1834O2203l9859q799K6726j9029L6633o1592
$$ plain form
894 8322 6603 -13486 4460 5521 -566 -8654 3212 11680 -15814 4634 6612 -8277 3884
907 3884 -2277 5667 -7921 938 13668 -19881 7460 8991 -10152 732 -3370 14623 -11407
920 -11407 -8393 21006 -14379 2574 2506 -4363 7732 -10642 11747 -8315 -4623 20864 -19851
933 -19851 1774 7386 153 -704 -15455 23517 -6059 -14353 15208 -7942 7715 -7029 -615
946 -615 8862 -13407 16934 -12482 -7202 22350 -14120 -400 -3454 9709 8228 -29415 20858
959 20858 5409 -14415 9737 -12586 16154 -4841 -9993 15330 -19232 21764 -5420 -21775
971 -21775 27002 -9532 5194 -14820 2045 30271 -36875 11076 6150 -4401 11345 -27068
983 -27068 24683 -6293 -4514 12489 -29345 32858 -7001 -15800 10926 -8103 28530 -33062
995c3062L0936L5221n7725L3034k1582K4170L979m5842N0127k6883J1850R867
1007A4090m9082N7055j4463j8590J1459j6759N2955n0235j3356N7047l9694J9179
1019I606k6001J0787L7428n9125L9806k4019J0511L3220p2914N3822j0853M455
1031F723l80n0694R1862n3209j4332L1810k8640N6867p2830K7503K9976m7524
1043b2868N3797o5366L7053K9294n8237L6892l3277M7951j0069o3105P3880k0020
1055E925p257l629j4823N4994m5749k380K2649k2255L9955m2818l701M3198k8349
1068d240J4329l8075L3274L2794p6018M3266m333R010k21n1364P6717m1820K962
1081c719J3947m6308Q0801n9420K904K0695k4914O1815r0296M0412M0141n8730
$$ plain form
995 -33062 -2126 33095 -24630 8404 -13178 10992 14971 -30871 19256 -7627 4223 14090
1007 14090 -34992 22063 7600 -10990 469 -16290 36665 -13570 -26926 30121 -9573 9606
1019 9606 -16395 -5608 31820 -27305 12501 -11518 -1007 32213 -40701 13121 2268 6723
1031 6723 6343 -44351 47511 -5698 -20030 11780 -16860 40007 -32823 -5320 24656 -22868
1043 -22868 30929 -34437 2616 31910 -26327 10565 -22712 25239 15170 -47935 25945 5925
1055 5925 -1332 -4961 -19784 35210 -10539 -12919 9730 -12525 27430 -15388 -19089 24109 -4240
1068 -4240 10089 -27986 5288 38082 -37936 5330 997 10007 9786 -41578 35139 -6681 -3719
1081 -3719 10228 -36080 44721 -14699 -11795 8900 -16014 45801 -44495 -4083 36058 -22672
1093b2672L6721m4440N4527q648n2441O0759l8553K9955j0580l4747N3351k5732
1105b500Q860j8518k707N2972n2828l158K9233o363M903l4536K8988J7146l9720
1118a8228K6263j8743J3991J7206m6498L5032j3638J6158l680m8430P6449l6310
1130d28j3109J8279j8983N1488o7065K6690K4033m2235M7565n2664L1460J0687
1142A5718l1791L2983m6529N2833j2061m1973M6364j9058J8191l0476N511L7974
1154B7686m4117J8816l723j446J5534k3229J1733l224M936Q029l0659K1152J7527
1167A9015l0292O715L617J1317p597k5049M1575k1364n066J8069k7850L2862k1846
1180e894M746O133k2426M6838m6814R078K5113k4572J7886l2347L9065j0224k7795
$$ plain form
1093 -22672 14049 -30391 24136 15488 -36953 23806 -14747 15208 4628 -30119 23232 -2500
1105 -2500 6360 -12158 -14865 38107 -14721 -17879 11354 4991 9894 -24642 4346 21492 -18228
1118 -18228 8035 -10708 3283 20489 -26009 9023 -4615 11543 7863 -40567 35882 -428
1130 -428 -13537 4742 -14241 37247 -29818 -3128 20905 -21330 26235 -26429 5031 15718
1142 15718 -16073 16910 -29619 23214 11153 -30820 15544 -3514 14677 -15799 -10288 27686
1154 27686 -16431 2385 -1338 -2784 12750 -10479 1254 -1970 2966 10995 -19664 1488 19015
1167 19015 -11277 -4562 -945 10372 2775 -22274 19301 -2063 -7129 10940 -16910 15952 -5894
1180 -5894 -1148 4985 -17441 29397 -17417 -8339 16774 -7798 10088 -22259 16806 6582 -21213
1193b1213L8426k8360J9804j1082l375J5651k3525L0841k5661m45K3651j9053
1205d341L971q397K0275p919j8646K2593l586p818J899M753l266m95K539r00m800
1220d138N424Q486k3492J5984O655j5079N779m944J9590k4054L912K0480k6155
1233a1552J7959j0325O696k107q680K3498l0289J8435M382j5982J0889q689J8993
1246A3228k3042N568J7904k3252J2065m292O952q509o16J4488j9789J1134J486
1259C325m081l113L999Q825j9523J2267L526o950k240N051O545j7791J3594K92
1273C726p742L254J368N654j7363J7082j328j3445J2836m626N185j3856J3613
1286D358K804j9502J9324o847j12l490M949N629j9002J8754m621o909M718J793
$$ plain form
1193 -21213 17213 -11147 8657 -2425 -5800 9851 -13674 17167 -8494 -8939 14712 -4341
1205 -4341 -370 -8767 11508 3589 -15057 7536 3950 -3868 -1969 2784 -482 -977 1562 662 -4138
1220 -4138 1286 9772 -13720 2264 8919 -6160 -381 -5325 14265 -9789 -5877 14603 -11552
1233 -11552 6407 -3918 2778 671 -8009 15489 -14800 3635 8017 -7965 2924 -5765 13228
1246 13228 -9814 -4246 13658 -9594 2471 -1821 5131 -3378 -3994 10494 -9295 1839 3325
1259 3325 -756 -3869 130 8955 -10568 1699 5225 -1725 -3965 1086 7631 -10160 3434 3726
1273 3726 -4016 -762 606 6260 -11103 5979 4651 -8794 4042 -584 4601 -9255 4358
1286 4358 7162 -12340 6984 137 25 -3465 1484 7113 -11889 6865 2244 -4665 53 1846
1300A846K345j4465J7607n069r192J0068j846J214j0963J5596m503j2227J6131
1313F542o705K01m833J0162k643j2822J8461q154l826K547N434l649r577J7931
1327I069j0123l581O664P47k133q624J7825j1610m729J2607o269o04m039J2159
1341G359q868n865J5585r725j553K050O939q460l906J5481j1859m48M746K337
1355C813o451k700J5257j4318M58Q831m543k767j159J1736j2380j36J1641q917
1369a635j757L265O617j2028K684J0639j1222R95L303M128j0442L168J1342j5871
1383f814N889M988l480m044J774J0448j6210M954R914j0116m3L141N107j0715
1397e207K893R805j1897K199N769j872p040N646O756j2853L293Q989o550n752
$$ plain form
1300 1846 4191 -10274 7333 2264 -6928 3140 1294 2508 -8455 7141 2638 -9589 6542
1313 6542 -163 38 -4795 5367 2724 -10098 8363 209 -3617 -1070 4364 715 -8862 9069
1327 9069 -1054 -4635 2029 2776 643 -7981 9844 -1766 -6495 6112 -157 -761 -4800 7359
1341 7359 -1509 -7374 8211 -1514 -3067 -1017 5922 -2538 -6444 9037 -2822 -3270 1476 3813
1355 3813 -2638 -5338 9919 -4399 -3941 4890 347 -2420 -3579 8157 -4223 -4359 7282 -1635
1369 -1635 -3392 -127 6490 -5538 -2854 7785 -3437 -2442 861 4989 -5453 -2285 9057 -6814
1383 -6814 -925 4063 583 -3461 -1687 8761 -7449 -2495 7419 -2697 -2740 401 5508 -5207
1397 -5207 -2314 7491 -4406 -2207 3562 1690 -5350 296 7052 -5801 -2508 6481 -69 -5821
1411e821P628L333r805K213P507n434n053J0146l312p436R691j725m350j421R021
1426E182j735j4751J7826k191j0890P266J99M039j2165Q442N341j5868J4595l866
1440A424n946N805k0K482j3034J2633N553j9482J0997M293l447n675K060J0681
1454H324j4298M555O824j1511R113j934j823j638J703J1324k1258P644J4972j7205
1468e208L171O0Q401n428j1813K1447j4006M19R939j5485J2919m531J609k260
1482g66q690K5321k0521o532K0930r827J652j0714J3098M928k1365J9200q818
1495b104K41R854j6170J1359o673J0040l678k0657L3662j4322r774Q947k893J6221
1509A4053k8856J4195J2360k3148K1855j9343Q468R719j7656J6064k0955K1922
$$ plain form
1411 -5821 1807 5140 -4665 -2452 5055 -379 -5432 4714 1402 -6034 3657 1932 -2418 -3839 5182
1426 5182 3447 -11304 6522 4331 -6559 707 906 4945 -7220 1222 6563 -9305 5290 1424
1440 1424 -4522 1283 1263 3745 -9289 3344 8897 -10585 412 4705 1258 -4417 -2357 8324
1454 8324 -5974 -1419 5405 -6106 3007 1073 -750 -2388 -685 10639 -10619 -2975 11997 -5208
1468 -5208 -2037 -1977 6424 996 -10817 10630 -3376 -2957 6982 -8503 4416 -115 1494 -766
1482 -766 -9456 15865 -4656 -11188 9742 -85 1567 -9147 3951 8879 -12486 6714 -2104
1495 -2104 -1863 7991 -8179 3180 -3493 6547 2869 -17788 15874 1552 -8222 725 -2168 14053
1509 14053 -14803 -608 11752 -11396 10459 -8884 -416 9303 -8353 7711 -13244 8678
1521H678K968l4032L1695n873j770n225p405L1129k8616K373J3813j5614J9492
1534A1613j8747K762J1182j0535J4550k6932J6546J8459l3517J4379j768J1587
1546I579p008k3376L9131k1057k50Q267j9915L3266k5687M505N466j4369L7125
1559B5677m4518J1702K5631k6887J6394k7182L1868M43l7463L8628k1538J3425
1571F180j040k3711L4529k2065J2294q803j3922M2337l3370k073J3684k707J2242
1584A3575l5443K5166J2095k7931J8627j6071J6227L040k4553K3758j6571J8248
1596A0167m489l1768M5922j9117m352J383q191L8835m7569J3706J9925k6741K9431
1609A7142l5512K1350R584k6358K9151l7060L3651K422l9069L6549j7197J8657
$$ plain form
1521 8678 11646 -22386 9309 3436 1666 -3559 -10964 20165 -8451 -6078 7735 -7879 11613
1534 11613 -7134 -4372 6810 -3725 10825 -16107 439 18898 -14619 -240 -2008 9579
1546 9579 2571 -20805 18326 -2731 -2981 5286 -14629 18637 -7050 -2545 2921 -11448 25677
1559 25677 -18841 -7139 18492 -8395 7999 -19183 12685 13128 -24335 14293 -7245 6180
1571 6180 5140 -18571 15958 -6107 6187 -2616 -16538 25799 -7571 -9644 4040 1333 13575
1584 13575 -21868 3298 15393 -12538 6089 -9982 6245 9285 -15268 8490 -8081 10167
1596 10167 5678 -26090 19832 715 -3637 -2254 -10445 28390 -19179 -5473 14452 -12289 17142
1609 17142 -18370 2980 12564 -13794 15357 -21703 11948 14370 -24699 11850 -5347 13310
1621A3310j9731j1769M5687l9022J0867J375o882K3623l2856J8608j861n159J9226
1634A5416l5847K4212R375k1436R445j1676K6399j3390k3521L7126j8891L749
1646I61M5j3446K9916k6314J0242Q63j5544L7491l8773Q680J7109j6970J7814
1659A2074l4522L4290N40l3345L4677k3873J9604q804j4375L0372l0285K5973
1671A2326j4899j2356L4970k8893J0935q489Q087J4227l7814K9236j023j1968
1683e661J0207j4214J9354j0821m181J2788j7619J8200m201j6236J8937n883K660
1696C330r135l49K3796k8026O670J2026j3928J3342j7640J4595q22j3479K3357
1709A3737k7712J8273M030j8911J6913j5229K2132j7755q058L1041k8348J2260
$$ plain form
1621 13310 -6421 -18190 27497 -11525 -658 717 -6165 17458 -15398 3210 1349 -3810 15416
1634 15416 -20431 3781 13156 -8280 1165 -10511 15888 2498 -21023 16103 -2788 961
1646 961 1006 -12440 17476 -8838 1404 2267 -13277 24214 -14559 -5879 11230 -5740 12074
1659 12074 -22448 11842 12382 -20963 13714 -10159 9445 641 -13734 16638 -13647 12326
1671 12326 -2573 -14929 20041 -8852 2083 -6406 1681 15908 -21906 7330 6307 -5661
1683 -5661 4546 -9668 9686 -1135 -5316 7472 -10147 8053 3852 -12384 6553 670 3330
1696 3330 -5805 -6154 17642 -10384 -3714 8312 -5616 7726 -9914 4681 3859 -9620 13737
1709 13737 -13975 4298 8328 -10583 6330 -8899 13233 -4522 -12580 18461 -9887 2373
1721B373m202Q17R576k2047K4155j4582j52J4687k0303J2992m108M072l501q812
1735i035K0403j3222m631J0405k642j297l778N997N33p874P778m65q267J0983
1749D888m344m080L955J89M622j4494J2244M398j7095J3787n395L994m920j700
1763c951J4095k0667J4792q41j0198J1501q126Q985j2018O851Q614j9582J4520
1776C975k796j057k269J85R847j5770R657K041p250L562L71L005r197P602K011
1791C917q540M321K907j571o537Q774n31p020M774J729j225o735J0570l808o877
1806e852J0272m629N95m119P616j654j0391J4921p140k028K554J446M10q947J3191
1821F245o158m693P206j751k71n766J1086o149n624J1011n629j64k185P351m236
$$ plain form
1721 2373 -1829 -1012 8564 -13483 10672 -3910 -4062 10625 -9678 3314 -794 3278 -223 -9035
1735 -9035 11368 -1854 -6485 3920 1278 -19 -3797 2200 2733 -5141 2637 2172 -6095 4888
1749 4888 544 -3536 419 608 5230 -9264 2980 7378 -9717 4070 -1325 2669 -2251 -3951
1763 -3951 10144 -10523 4269 3428 -6770 4731 -3395 5590 -6428 423 9037 -10545 3975
1776 3975 1179 122 -2147 -1962 7885 -7885 1772 3813 -3437 125 496 3501 -5696 1906 3917
1791 3917 -4623 -302 2605 1034 -5503 3271 2740 -4280 494 2223 998 -5737 4833 1025 -5852
1806 -5852 4420 -209 386 -3733 3883 2229 -8162 6759 -381 -2409 145 1591 2001 -6946 6245
1821 6245 87 -4606 2600 849 578 -5188 5898 -251 -5875 5136 -493 -657 -2842 4509 273
1836B73o726J3128p691j522K967K159k995m301J0658p621j371N075M7l924j750
1851c594J0020r543O06O260l798q38j965R269r634l63R769q863J420P30M761o903
1867b666n10J0278j0975K738K485P65m711J28R729j2777M732M710n262Q0j056
1882b312Q721j0895J770R409j0633L286J734J242m652M85P613r304J201O857m404
1897A18m021N384K374p145J661M925j807o351P283J012q710P294o94j655k257
1912b589M515J763j1494J2355k154o223L913M39M420j3030J0932K449j2563J1791
1926D524o213L310l203M57P761j6168J4851j435j1071J0553l703L988r410M855
1940i04J0121j7336Q625L069o273L987l272M808n092R30P609j3027O596O224r851
$$ plain form
1836 273 -6453 6675 -1016 -2538 429 2588 -407 -4708 5950 -1671 -3042 2033 2080 -1844 -3594
1851 -3594 6426 -3117 -2511 3749 -49 -887 -2852 6417 -3217 -3580 6189 -2674 -1254 -524 4237 -2666
1867 -2666 -3176 7102 -3873 -1135 1350 2115 -2596 -2468 7261 -5516 -784 3926 -1336 -1256 -2312
1882 -2312 6409 -4486 -2716 6693 -3940 -654 1080 2322 -2330 -1845 5768 -3536 -2335 4522 118
1897 118 -3903 1481 3855 -3290 -1629 3296 1489 -4862 2421 3433 -5277 2017 1323 -332 -2589
1912 -2589 1926 3689 -7805 4550 2396 -3827 86 525 4945 -8085 2847 5296 -7267 4524
1926 4524 -1689 1621 -1582 -1125 6636 -9532 5319 3884 -7187 3366 -337 3651 -5759 -904
1940 -904 9217 -8119 506 3575 -2698 1289 -1983 2825 -2267 -1337 6272 -6755 -159 6065 -3786
1955c786K140Q43P117r094m146J6839j2866N45M920m579O364r718R788n060n595
1970f288J7827j9601O580O413o152L927j2931K0516q435j3469K0699j2471O102
1983B717m320j717J1170j6109J4712p950o042J8910j6099L220J68M494L017k0086
1997a3915K0685j331j2297R197o052J0070q497j836J0536j4208J5134p560q998
2010i072J6908q887L427r518O990J4073k7386J4324M443p431N715j3126J7791
2023H251p967n596J3186j8886J8448l582j2932J3398p207J2505j7098l98K3976
2036A6098k3238N454Q65J620O791j9395J7592n538k630J0793k0438J6620k90o846
2050b542K205q183K3557j8235q257K1355j1395N153j1100O874J1224k0224J4208
$$ plain form
1955 -3786 -1646 -803 6314 -2780 -6926 9913 -2953 -2408 2512 -2067 4297 -5421 4367 -693 -6288
1970 -6288 11539 -8062 -1482 4931 -1221 2706 -10225 10291 1856 -11613 9086 -3385 2717
1983 2717 -1603 -3320 7850 -8259 6453 -1497 -7539 11371 -4728 -1508 -1340 3154 6171 -13915
1997 -13915 6770 5439 -6858 2339 -3713 6357 -2140 -3976 6560 -7648 7486 -74 -9072
2010 -9072 7836 -1051 2376 -7142 -152 13921 -13465 859 5302 -2129 3586 -9540 8251
2023 8251 284 -5312 7874 -11012 7436 3854 -9078 4320 -2887 9618 -7480 -7878 16098
2036 16098 -7140 -1686 -821 799 7590 -11805 5787 249 -2381 8412 -12026 4594 4304 -2542
2050 -2542 -337 -8520 15037 -3198 -11455 9900 -1495 3658 -7442 -568 10656 -9568 4640
2063D640p779J131J2694k0499J0526O55K102n78j7766K5961n961j4868J1545l315
2077a512J0217j4193o37J5400j4564R859p469k772J6169j4469L315l831P883O726
2091A0122k5726J8724L990r437J760p347J9208j2934m983J2567j2446J5137j1378
2104b743m095J3047p784P735j6351R270J4830k3524P823K300M062k815j2895J9088
2118G948p133l389M926q982J2606m237o008L649p79J0389j4328k524J7875j0099
2132h6k876q25O201M689j6014J0553N03l941P087j2953R707J183l777J210r391
2147h730J9309r258j1181J4463l979L863j1705N835J0371j5540R110m762J528
2160f76O179j0350N864l714P026j984j2239J5092r95o988m58L607N900j0222J057
$$ plain form
2063 4640 -3139 -2008 10686 -9813 713 1368 3470 2892 -14874 11087 5126 -9742 1803 -1512
2077 -1512 8705 -5488 -6125 9275 -5289 4570 -2899 -5671 10498 -3971 -656 -4487 3396 10122
2091 10122 -15604 3120 7110 -2327 -567 -7914 11294 -1640 -6623 5944 -6502 8635 -2743
2104 -2743 -6838 6209 -1575 6160 -10191 -921 13909 -9615 -1792 508 4570 1755 -11140 7948
2118 7948 815 -2574 2352 -6630 5976 1739 -4269 -620 -1399 8990 -5338 -7862 10013 -86
2132 -86 -2962 -3787 2414 7103 -8911 1642 2145 -1796 5291 -7662 2045 3228 -549 661 -8730
2147 -8730 10579 1321 -9860 4603 624 4487 -7218 -1383 8988 -6552 2558 -2204 -676
2160 -676 5503 -4847 1017 -2697 4329 2345 -9894 5198 4203 -2785 -3243 364 6264 -3958 -2901
2175b901P316n484J898j295k016N453k382j019k672L260P163j3702L571Q216n911
2190e05k30l979J0452m626o719J0261p874N346j387m126N657m665P671r679Q62
2205c541J1240j0604J673k41N441l104p136J1057m856j201K188k303K591j931
2219g27K395l653L58N766m456l387N360J863o191L65M220M08n116J826M547o372
2235b794L968p96j600K154j268L156p280N901K683r312O421n13J178m448J098
2250a452P088r887M972N64k391J659j826M005o279M543K222o969M261O66J72m478
2266c130L134L446o457K419K337j419k350L114J22l645L603n42r80j614M332j045
2282A325n418O912k370j699L61J918J158o440O896j774l521M092j544Q41l392
$$ plain form
2175 -2901 4415 -1069 829 -466 -2482 2971 589 -430 -3102 158 7321 -6381 -2810 5406 -505
2190 -505 -735 -4714 5738 1112 -5607 4654 -3220 2126 739 -3387 2270 -2395 5276 -4403 -3541
2205 -3541 7699 -2905 -1232 -1473 3968 864 -6272 4785 -71 -1272 916 -1387 1204 -727
2219 -727 1668 -1985 -1627 4139 -317 -3704 1656 3519 -2672 -2307 1913 2321 -2795 -969 3578 -2794
2235 -2794 1174 378 -1222 932 -336 2820 -4460 1441 4124 -5188 1233 720 1898 -2550 -1452
2250 -1452 5636 -4251 721 1285 -1106 553 -1273 2732 -3547 996 3218 -3751 510 1176 1348 -3130
2266 -3130 4 3450 -3007 -588 1749 330 -2020 1094 1216 -2429 1174 632 -348 -1962 2370 1325
2282 1325 -4093 2819 449 -1250 -889 1029 2187 -4253 2643 869 -2652 1440 -104 737 -2655
2297b655N031j432m498N945k235m34j589L960j148m779P091l288r83O44J552j47
2313A035m297O384l195j954L213m21j054k006N526l519j938L973j404q16j004
2328a477M614m379r65N073m060P09j42K614k841j715O514n411N39J775p6j402
2344f30j443N906n326K21L062j807p66n55M493n137Q83L743m115J137j35K495
2360B026l663M74M349n030J276J430K76k617J102L426n317J989J595q52k134J590
2376h0K946n943L337J269k616P59K55K530n045L136K024m644K230L52O69l815
2392b636L368J496n104L729m65K62k203J649K813o847N733o17k939K219o00K203
2408B061n069L580K128n811L608O45j243j100J206J992l861J869J773k864J50
$$ plain form
2297 -2655 2376 944 -3554 2391 156 -278 -1867 2093 945 -3834 3257 -31 -1014 -370 1182 1035
2313 1035 -3262 3122 -73 -2027 1186 765 -289 -2295 3231 -288 -2226 1747 343 -473 -1477
2328 -1477 3137 -1242 -2207 2866 -1194 -485 -627 1987 -854 -2569 3945 -1466 -927 848 772 -630
2344 -630 -2073 3833 -1493 -1272 1790 -17 -783 -1338 3155 -1982 -1099 2644 -1471 -334 -469 2026
2360 2026 -1637 -1163 3186 -1844 -568 862 1138 -1479 -377 3049 -2268 -279 1316 464 -1670 -80
2376 -80 2866 -3077 260 1529 -1087 -328 -73 2457 -2588 548 2572 -2072 158 510 1179 -2636
2392 -2636 732 2228 -2876 853 388 650 -1553 96 2909 -3938 1795 1178 -1761 458 -142 2061
2408 2061 -3008 572 2700 -3111 497 1142 -101 -1201 5 1997 -1864 5 1778 -1086 -936
2423i36K927k333j490L020P9k445o76M823l320j833L795j476J07k153L733j870
2439d8k691O265n601J734J754j864J345m285P935m986l651Q044n216K004k470
2454a731K070K652p645Q026l822j668N423n558K830j633K832k66o774Q801k179
2469A358m389L792p61K290n072K153L916o596N320j939k433N184m140K161l316
2484b472L038M305j1464Q445P60m323K734m778R072o741j838Q110r512Q321l898
2499b41k985O515n988P455r187K399R481j3086O291q74J600P88r112J2447o654
2514a151p29N386q506R039m607p49K602n401J1472j1128l72J0151q330L966n658
2529d015N781L522j3140J2029n312J51N026j0603J0265m484J398J720j0483J6459
$$ plain form
2423 -936 1991 -342 -1832 1188 1267 -1178 -1854 2969 -351 -2184 1611 135 242 -1911 1822 -48
2439 -48 -2739 3526 -2075 -341 1413 -451 894 -3391 4544 -442 -4093 3951 -1265 739 -1731
2454 -1731 339 2991 -4654 3372 -450 -2118 3305 -2253 577 -1056 1776 1510 -5264 3537 1358
2469 1358 -3031 761 0 2290 -2782 -629 3287 -3309 2011 72 -2361 2823 -1317 844 -2472
2484 -2472 566 4871 -6593 1852 2612 -1711 1023 -3755 5317 -1424 -3262 4848 -4664 3657 -241
2499 -241 -3226 3289 -2699 4756 -4431 -2032 7449 -5637 654 -220 1380 2168 -6944 5503 -1151
2514 -1151 -1880 3506 -5000 4039 -568 -1317 1285 -4116 7356 -3772 -4144 6007 -2323 1643 -4015
2529 -4015 1766 5288 -7852 4177 -1135 -984 4042 -6561 3704 -780 618 2338 -8145 8314
2543H314q800m843Q888n947Q314j1833M595Q499j3884J0826p135K446N932j1463
2557f091R968p376N666K665j4846J6360n771k209J962n135J4095j4831K760Q086
2571E303j0225J0420j0079M177N256r714J0230j1949Q183N355j5764J2178m494
2584a123L913k061r072J7830j2366Q73N118p919J1940j1123L174L565o984J1841
2598G606j4720N970Q049j1544P095p304R516j144j3009J6125q497K123J691q015
2612f058J3080j0520M283P19p587J5564j4193K343O368o562Q057j3722J1147K748
2626E667j3437J2559q482O169o41q038J2469j0700P475j583q714J5253j0478K113
2640c68j31j769J0042j5708Q658L849q618P781q734P844q66o757R695r894P655
$$ plain form
2543 8314 -486 -5329 3559 -2388 5926 -5907 -1312 7187 -6697 4129 -3006 -560 5372 -6091
2557 -6091 3877 -3499 2167 4832 -10014 6346 575 -1634 328 -4807 9288 -5543 -2783 5303
2571 5303 -4922 5498 -4581 -404 4852 -4862 5368 -6581 1602 6957 -8807 3371 -1123
2584 -1123 2790 729 -8343 9487 -2879 -2006 3112 -4807 7133 -3990 -816 2749 -4235 7606
2598 7606 -7114 -1144 6905 -4639 2456 -4848 4668 3524 -9485 6640 -1857 266 1957 -6058
2612 -6058 7022 -3498 785 1504 -6083 9481 -4712 -2369 3999 -2563 5494 -8228 2919 5667
2626 5667 -7770 4789 -3693 2476 1835 -6203 6266 -4434 3041 1458 -7256 7997 -2481 -368
2640 -368 -499 -2268 7774 -7934 724 4573 -4045 3736 -4998 2846 1980 -4777 4918 -4976 2679
2655B679P4r498J1113n884L779l490l541J3120j2841L403L752n279P288r616O656
2670A715K02o039R859j1311P166K069q108P372o459Q056m429o540J3270r637L423
2685F09m81k355P412j0393P791k393l451Q620r877N403J86k115L512p537R098
2700D029l030n413P818m726K883k476o82N225p137N258j342l674P150n587J429
2715b75J28m68M024q118O116J192n869N274l746L722k249k018O141p499N317o13
2731A059l889N052m059L957l844N73N524q542N327j51j558J629l351N272m523
2746a524L27L743m765L147n14q03M63r02L051l870L45L841l263P7J110o2p6j940
2764a615L303j292k306L628k309J55R93l93L12k575L710q90l138M324k286L6j24
$$ plain form
2655 2679 2753 -6745 4368 -1516 2263 -1227 -4768 8352 -4489 -1086 2666 -2613 4675 -4941 1715
2670 1715 1917 -4122 5737 -5574 1592 3661 -4447 2925 -3534 4522 93 -6447 6823 -2814 609
2685 609 128 -2227 5185 -5208 2583 190 -3261 5359 -4518 885 1071 -1044 2468 -5069 4029
2700 4029 999 -4414 3404 -1322 1561 -915 -1597 3628 -3509 1749 407 -3267 3883 -1704 -275
2715 -275 -147 -615 3409 -4709 1407 2599 -3270 2004 -1742 1980 -269 -2287 3854 -3645 1672 1059
2731 1059 -2830 2222 -1837 2120 -1724 -1151 4373 -4169 1158 1007 -551 1078 -2273 2999 -1524
2746 -1524 -1197 2546 -2219 928 414 -389 74 -828 2223 -1647 -1302 2539 -724 -647 463 401 325 -1615
2764 -1615 1688 396 -1910 1718 -591 -436 557 164 476 -2099 1611 721 -2417 1907 -379 -343 -467
2781d67M81J526m138M062j218j913K824j525R33j591J619M83l805M174j116j201
2797h72R06N27K67k706K878j57k083J513L86q50r46K241o86j662J452P37j584
2814f39k27K236j496p80J637k92j010j95K637k601o10K579j702R6j24J652j655
2831d94q26L126k396nJ028k44m98p57K736j965r99K286j131o35O45J479k114m8
2849h12K170j592j58L20J130j675j18K378k326L22R07k50p34N4J928k619O30J413
2867I68n44j203N43J479k665J567P25j213n4K52J338l001K048R71k217J393l60
2884B7O25j646P99J639k859J790K31n67m96L29J198k562J878O47j897R37J62P23
2902I58k317J525J517k806J344J76j07r27O65Q16j848R31J002j378k33J925r74
$$ plain form
2781 -467 14 1540 -2598 1464 246 -1667 1157 -368 565 -1026 593 1076 -2729 1445 329 -872
2797 -872 34 561 828 -1878 1000 843 -1240 273 659 -191 -1137 1104 418 -1244 208 945 -639
2814 -639 -866 1370 -126 -906 731 439 -571 -766 1871 -730 -1340 1239 -463 -367 -491 1161 -494
2831 -494 -1320 1806 -590 -595 433 189 -309 -1066 1670 -295 -1294 992 -139 -774 -129 1350 -764 -812
2849 -812 1358 -234 -392 -72 1058 -617 -735 1643 -683 -361 546 296 -438 -384 1544 -1075 -445 968
2867 968 424 -779 -236 1243 -1422 145 870 -343 -397 -145 1193 -1808 240 1211 -1006 387 27
2884 27 652 -994 -195 1444 -1415 375 606 39 -457 -128 1070 -1492 386 1033 -864 73 235 958
2902 958 -1359 166 1683 -1123 221 397 290 -637 28 844 -1004 -73 929 -449 -682 1243 269
2919B69j267J426O8o28r61J960l08k285K865j446N8K92m5M98k177L212j719j114
2937a302K234p89L15k067K722l50k754L581k079L55J60k70J384k629L048j622
2953f3j652L241j435k26j80J109K64l059K548P11k434J167J73k4j7k49O11j401
2971i16J138J202l312J977Q90j124m02j92K780l009j76K788k523J737j674Q88
2987G2M98j596K914l696J998J896l852J752m51K122j971k031N112l537M49K12
3003a09l46J859k571J635n13m95K540l572R42K082j431o74r88L470o88l613L496
3020A024o27o16R1r38K452j694L94J76j998M073k543j775K764k58P82m361L699
3037F45K103m886K307q08J570l06k817L738k196J417k14l252M783j638q05r41
$$ plain form
2919 269 -998 428 496 -132 -1093 867 559 -1726 1139 -307 -249 43 -2 496 -1681 1531 -188 -1302
2937 -1302 932 143 458 -1609 1113 763 -1991 1590 -489 -134 26 -244 1140 -1489 1559 -63
2953 -63 -1715 1526 91 -135 -315 794 1058 -2001 547 1258 -1176 -9 164 140 123 -126 485 -916
2971 -916 222 1424 -1888 89 979 -145 -547 -739 2041 -968 -1144 1644 -879 858 -816 72
2987 72 570 -1026 1888 -1808 190 2086 -1766 -14 -465 1657 -314 -2345 2767 -770 -321 -109
3003 -109 -455 1404 -1167 468 -45 -540 2000 -1572 -630 1452 21 -653 -1641 1829 1141 -2472 1024
3020 1024 397 -219 -128 -1066 1386 -308 86 262 -1736 2337 -206 -1981 783 525 1307 -3054 645
3037 645 2748 -2138 169 -639 931 625 -2192 1546 -650 767 553 -2699 2084 446 -359 -1300
3053a300J023L408n627J194L136k052M02j983K750K81k233J415j497K073M44l663
3069b229K365R56k06k088j017N305l067k324K816j28J144l307J425J975k136J718
3085A202l224K023K591l976Q18L2K881j640m403N814p78k034j34j0L625m004J83
3102a034J501r48K397l331J1L345j441p63k217L980J029n482K549J410o0j524
3118e78j626L933j487q61Q51j466L357k169j850K100M92J264m312J543M163m324
3134i70J16K29J764K4l891L562q83J72Q44l411L768k45j731k25j54M225m283j295
3152b384M397j568l88j906K125J777l646J848o22L05J710l619K040N14M20j212
3168b09k242M826j423k954K133L89J000k860L95K744k713J711j370j07K171k293
$$ plain form
3053 -1300 -277 3131 -2496 -1302 1834 -218 184 -1799 951 1232 -1001 414 -1083 990 1434 -2229
3069 -2229 136 1092 886 -1202 -2219 3086 19 -2305 511 383 1527 -1780 -355 1620 -516 1202
3085 1202 -2022 1 2592 -1384 -566 -534 2347 707 -3696 2118 1340 -694 -828 -838 2787 -1217 -1034
3102 -1034 467 -481 1916 -1415 -1404 1941 500 -263 -2480 1500 2529 -2953 -404 1006 946 -578
3118 -578 -2204 1729 242 -619 232 -1234 2123 -46 -1896 204 696 1960 -2352 -809 3354 -970
3134 -970 -854 -625 1139 1163 -2728 834 -49 123 967 -2444 1324 1079 -652 -877 -1031 3194 -1089 -2384
3152 -2384 2013 445 57 -1849 276 2053 -1593 255 -367 -62 1648 -1971 69 583 1003 -209
3168 -209 -2451 2375 952 -2002 131 520 1520 -1340 -945 1799 -914 797 -573 -680 1491 -802
3184h02L66l64J584Q05m569L627Q94k171K38n33K907k423q51K361j956J838r68
3201a7j139K060j137J011k286J504K347m153J510Q79l3m89j847L479j682r49J648
3218G06j667K072j012m48M28n11K202k880m3L057k225j04q8J320K3k453K406m08
3236C75j072J304j298R29N9j22J08j267K621j327k038K713q00R7j132R23J403
3253A476l082K008n3q41J076j210J203q26M61M64k345K914q66q69P52k59J242
3270A245k405J212Q08j621R53j73j86N2L5P12j262Q88O56j603M04J000p79k66
3288c30K2R31j121m50J675q96k41P95m25m06r0J240j132l92J785j295N3M90J64
3307C77k67j084K032j071j018J721o14j19k25O42j26j162J931r74m06M74J34m22
$$ plain form
3184 -802 -436 -800 784 1589 -2980 647 1541 -630 -392 -925 1982 -441 -1292 1069 -887 951 -17
3201 -17 -1156 904 -233 778 -1508 -4 2343 -1810 -300 579 546 57 -1790 1689 7 -942 706
3218 706 -961 1111 99 -349 79 -432 1770 -1110 -1153 1904 -321 -425 -513 807 830 -1623 783 375
3236 375 -697 607 -691 238 297 175 283 -984 1637 310 -1728 985 185 282 -850 73 1476
3253 1476 -1606 402 349 -492 584 -626 577 -249 212 676 -1669 1245 379 -490 262 3 1245
3270 1245 -1160 52 860 -761 192 19 -167 -115 -80 632 -630 258 914 -689 -285 715 -64 -330
3288 -330 -308 623 -498 -948 727 -169 -410 385 -40 -446 -536 704 -428 -820 965 -330 -277 213 377
3307 377 110 -974 1058 -13 -1031 690 76 -43 -268 374 248 -914 1017 43 -363 111 245 -177
3325a77m76J491o21r07J234j29p73J53P14q08k47Q81n6r95N39R54j096pP60l72
3345F2l59Q2J042j483N55J092j418K40K33M01r25L50J068j311K60N70l88l89J81
3364a37J032j427K59O47m83l87M68Q12j218Q2J121j005l3O25J3p32M8Q91r39J58
3384b05O76n16m52Q24K10j027M98L09k84o11J098j25j154R98K11o05j27N76K25
3403E19j520J502j59r33R12j42J20r33J025J67j544J501m51N5j29k31J055j884
3421a070J555l4j146J148o18L48p51O30N82j893J485K86j119P34j38K74n60K44
3439d3J039j572K94R15j039L47L73j56n44k19J460j447J26J473j424L58m08J132
3457F65m83j211K406k009P04K29j135J426j592K077j228j046K943k587P26mJ11
$$ plain form
3325 -177 -653 838 217 -690 544 415 -358 -205 509 -299 -546 335 279 -716 -177 777 -319 -326 434 62
3345 62 -297 -215 827 -656 -101 991 -427 -187 46 447 -478 -128 940 -371 -111 459 71 -318 -137
3364 -137 895 -532 -273 374 -109 -496 -28 784 -434 -352 769 -236 -269 356 369 -363 -315 576 -363 -205
3384 -205 471 -45 -497 327 537 -490 8 317 33 -578 520 395 -759 239 450 -155 -282 294 519
3403 519 -1001 501 342 -591 321 179 299 -634 391 558 -986 515 64 119 -10 -241 814 -1070
3421 -1070 485 451 -695 453 -165 183 -568 62 644 -1249 236 522 -597 137 -1 273 -287 -43
3439 -43 996 -576 -282 633 -406 -59 314 158 -386 -605 855 -592 -466 1007 -417 -59 -467 665
3457 665 182 -1029 1377 -632 72 301 -834 592 -1000 1077 -151 -1197 1746 -841 -115 -119 -8
3474hR77k538K591r65q44J863j918J197k76k68R45j925K457j318j290K434j203
3491h9J81n80K68J451k612J784P5j547K288k007R03j32l08J425k882K752j65k350
3509a545K510j753J926j715m69L114l502K040m40j065K359k739K116j216m36K939
3525B124m452L051m9j315J544k653L695k216o12K718l180K403j267m59J785k449
3541a332K407j913L1L003l492J478k08j35J014l187L829j204j605K892l342L103
3557A339j355o80J866l018L992k445j359L746l072J743j668N61K482m584L665
3572A213j089j021K409l599L579j739j55J874l896M588j986j471K517k352K685
3587A557k783M17L076m147L015j603O0J815l354L244k147Q32J845m325L889j130
$$ plain form
3474 -8 969 -1569 1022 57 -787 1076 -842 355 79 -189 756 -1169 1288 -30 -1320 1114 -89
3491 -89 92 -488 -220 1231 -1381 403 478 -1069 1219 -788 115 -17 -325 1100 -1782 970 805 -1545
3509 -1545 965 -788 1138 -577 -1046 2068 -1434 606 166 -899 1460 -1279 837 -379 -815 2124
3525 2124 -2328 723 674 -641 903 -1750 1945 -271 -883 1835 -1345 1058 -209 -668 1117 -1332
3541 -1332 1075 -838 -807 2196 -1296 182 -26 -161 853 -2334 1495 291 -1314 1578 -1764 1339
3557 1339 -16 -696 1170 -1848 2144 -301 -1660 2086 -986 757 -911 -350 2132 -2452 1213
3572 1213 124 -897 1512 -2087 1492 -247 -402 1472 -2424 2164 178 -1293 1224 -1128 1557
3587 1557 -1226 -809 2267 -1880 1135 -468 -408 1407 -1947 1297 -850 -18 1827 -2498 1391 261
3603B61r13J224k540M423l186m77L344l645K996k204N8K247l287L199k650P75
3619c75K671m772L234r99J59P83l108M731k658q71K637l025L183k332M14J465
3635A137l183M141l041K76K438k966K365k266J492Q67l797M165j927L7J352k368
3651a278K941k439P83P36k637L881k488l46J778j643K406l339J531J716l388K678
3667H92j512N92Q47k359K778k185Q11J371l083L098j486k4M29j188K813l092J035
3684b63J771k852J990j203R25J14j693K685k837J200J343k700K185p79N19k51
3700A54j587L054k462L66J176j352J423j544J225j23j284K233j970N34Q81j206
3716d82R89j005J397m55j751K410j241l45P04o30J273j754J239J84j616K361j822
$$ plain form
3603 261 -652 572 -1968 2455 -731 -1208 2136 -1509 1487 -717 -659 1588 -1699 1500 -1150 -375
3619 -375 2296 -2476 758 -241 -82 701 -2407 2324 -334 -1205 1432 -1593 1590 -742 -328 1137
3635 1137 -2046 2095 -946 -670 1768 -1198 1167 -1099 393 1260 -2537 1628 -299 -262 1090 -1278
3651 -1278 1663 -776 7 743 -1894 1987 -501 -847 931 -712 1694 -1645 -114 1602 -1786 892
3667 892 -620 -28 819 -1540 1238 -947 -136 1235 -1848 1250 -236 -260 169 -1019 1794 -1298 -263
3684 -263 1508 -1344 646 -557 368 482 -1211 1474 -1363 -163 1180 -1520 665 -114 405 154
3700 154 -1433 1621 -841 -475 701 -651 772 -772 453 330 -954 1279 -691 -157 724 -482
3716 -482 507 -498 899 444 -1307 1103 -138 -483 221 -409 864 -890 349 533 -1083 1278 -544
3733e44m4J069p14R78j823J642L14k076J761n09J34n3n14J372j772J014M1j043
3751g67J404q36J38m26J17J191j597O91O47j150P49m28L65l43l7J020j329Q21
3769B30K47j003M93m1N18o82k60J137p68l17Q73l24k76O8N54n73l59J497j001
3788A3n74P75k84J0l69Q69m64m64J054n22m47M60P2j05n42R66m15m91Q79k73m33
3809b85L8N08j30p54J132m22q14J013L8m06k28N45k4o38O68j03n13J79Q35p13
3829g4n45O72K56o66K27O80q09k1N97l77k27M05K99o97q1P50m97j56M13j76l18
3850c45K21O19p26O2N02j89n20K48P36j058K40R07p75k81N19J54n50o0P50o47
3870a93o9N77n06q0K11N79r86K90L49j13k71K38J88r05O90L68n42j08L74M2m84
$$ plain form
3733 -544 -588 481 -233 745 -1078 564 878 -1198 563 54 188 135 -379 993 -779 235 276 -767
3751 -767 637 -199 -61 -487 -370 821 -776 -85 562 -588 161 -267 98 -245 -282 738 -591 230
3769 230 477 -526 -33 -74 444 -238 -498 639 -129 -446 427 103 -173 -105 449 -124 -483 1014 13
3788 13 -561 214 -70 -60 -429 440 -24 -488 566 44 -403 57 129 24 -518 448 33 -458 421 148 -285
3809 -285 -247 261 131 -623 509 87 -727 286 324 -82 -310 235 211 -427 241 138 -375 -196 639 -74
3829 -74 -619 53 309 -357 -130 550 -259 -280 317 -60 -287 118 417 -280 -361 389 -108 -264 149 -27 -345
3850 -345 -124 495 -231 -169 333 144 -376 -128 608 -450 -210 697 -78 -359 160 314 -236 -296 454 -193
3870 -193 -262 315 -191 -271 -60 519 -467 -177 172 59 -212 26 214 -691 -1 367 -175 -283 91 133 -351
3891c51M01K01l80L2K87M2n71M52K3m99N21J7k07l58P39P4q65M72K10m53N9L47
3913A93J13n80K28N79j071L61N70n10m00P99k16m52K15N02l93j31L73j74k75L23
3933E4J43k83mM84m24m60P86l59q0j52O45k99n73R69k77o36N18j10J36n86Q62
3954C54m95m21J086n64p6J29J74k1n77Q72j91m96M64l19J07j77O4K04l80M24K4
3975A85r02O82L49m83q2L52K92o07R7P55q27PN5o6K42k30M13q16M84R27j198M74
3997A03j15L40l56p73J963j523Q6O83q67R24j059Q50k66l80J030j460O92P73o94
4016d9k59J23P67n11r20J341k26n02j6K04M91o43J72J59o73J249j009k68J150
4035E80p76M88r42J032N37j951J077NK23j10r73J420p07L12j30r49J827q96m76
$$ plain form
3891 -351 50 251 -129 -97 190 232 -339 113 136 -363 158 175 -32 -390 349 423 -442 30 240 -213 -154 193
3913 193 306 -274 -46 533 -538 -177 393 -117 -517 282 66 -386 -171 331 -62 -193 180 6 -269 54
3933 54 197 -86 -90 394 -30 -490 296 -63 -143 -295 350 51 -522 447 170 -466 52 -58 78 -508 354
3954 354 -141 -562 524 -40 -116 13 187 166 -411 461 270 -226 238 -81 26 -151 -87 117 -263 161 185
3975 185 -717 -35 314 -169 -251 101 393 -214 -117 638 -189 -182 -127 -193 49 -181 232 -584 -100 827 -371 103
3997 103 -12 328 -28 -801 1162 -361 -275 408 -459 465 -594 256 -10 -390 640 -820 -128 645 -49
4016 -49 -308 -185 582 71 -849 492 266 -236 -252 -48 443 -200 -28 131 -542 707 -302 -570 580
4035 580 -196 292 -650 382 919 -1032 45 50 273 163 -810 610 -97 215 85 -864 963 67 -409
4054d09O58k51J184k330R28J336j662P41o77Q78J75j162Q64p27O41L20j559J337
4072B85m9j41m33l87J984j741l73J194m69N37j311R60M36j142J187j206P48R64
4090A043k180J362n18R78n03j689L001j256q22N67n55J772k009O99P74j187J604
4107A081k100P10J143j415O95j095K008j32k486K146n29J72m92l84J545j249K77
4124a05L67q14J660j656j22J131o01P65k059J770J022k559J476n31O77k41j385
4141a205K116j012J72L28j560K298j033n13M40m22J925k786P44J636j691P74j190
4158i79J734k78j814J906j143J028j5j725K132j114N63p44k55K323k359R5R73
4175C28n92Q47j845J478M81j555J616j426P58O17j685J306p99J053m89j554K656
$$ plain form
4054 -409 249 -2 1182 -1148 -220 1116 -546 195 -482 396 571 -591 273 -454 187 507 -1052 285
4072 285 236 95 -338 -725 1259 -482 -855 339 -130 407 -904 56 492 -650 537 -669 79 1043
4090 1043 -1137 225 -293 685 182 -1507 1494 238 -584 -17 -572 1200 -809 -110 664 -523 1081
4107 1081 -1019 -309 834 -581 114 -981 1027 895 -1591 555 26 198 -294 -678 867 -382 -105
4124 -105 262 -552 1108 -548 -670 461 -140 625 -1434 336 1358 -1201 275 -256 421 180 -1205
4141 -1205 911 -101 71 399 -1161 1137 104 -409 31 -391 1534 -1252 -508 1128 -563 211 -979
4158 -979 755 477 -1337 569 -574 454 439 -1286 846 -268 295 -449 -704 1619 -740 -645 328
4175 328 -264 583 -1262 216 697 -858 758 -668 90 707 -978 328 -471 582 93 -1461 1195
4192A195j086l24J99l02J505k147J040P46j307J378j721Q38N98r65J145j457J128
4209D63K25j711J475o19M81n75k01J583j962Q90N05j110J394j180O30m30k56P65
4227C67j338Q87O40j038P18o59Q81k61o56J179q62K66K58p80N92m13M34k06l54
4246c45J285j620N61O07r10M34q81J290j4j121J282p45K35K39n97P11j217J382
4264E76o26r55J456n03j9K10J19K64j472J296p4q43R01l95M13k97j10L68j052
4283g43J299l29n69Q88n17j07j18K06L08r08O56K13o85M09l03O24l93j68M81m77
4303b33J88L96o81N51m17J63j90p9P64p31J68L31j96m8n7L09l09L3N68q17M1M16
4325A70m7n1%K39n58r3P93l16j91L3K03k94l15N61k76k55Q52l23k43l1K39K8n38
$$ plain form
4192 1195 109 -215 -16 -318 1187 -960 80 826 -481 897 -824 14 612 -353 792 -665 463
4209 463 688 -1023 452 -167 314 -261 -462 1121 -841 49 554 -556 838 -342 288 -142 -398 367
4227 367 -971 -84 556 -482 236 -423 458 197 -459 720 -142 124 382 -398 194 -219 215 9 -345
4246 -345 940 -680 -119 488 -422 12 -869 421 407 -714 568 -177 58 297 -300 411 -806 576
4264 576 -50 -1005 451 -52 -71 139 258 522 -950 346 272 -571 330 -65 348 51 -59 309 -743
4283 -743 556 227 -342 546 29 -78 -196 10 318 -590 66 279 -406 3 -300 324 -69 -237 244 -233
4303 -233 -45 351 -330 221 -196 -33 -223 -302 462 -269 -101 230 34 -14 -71 238 -71 -38 530 -287 -246 170
4325 170 123 72 72 311 -247 -340 453 137 -54 -21 182 -112 -427 134 -142 -397 455 132 -111 -142 97 125 -413
4348d13P40j17m76L89O0k87J40nk2l81K44K47n03M24J86l21J67K42k20k36O5M41
4370C64n79K96R3k14o4Q6M17o22J93L22k07j76J31L12p56L87L70n57K8K34om20
4392c68L79L31n72K35L88l02l11L19k3j86N5M14n27j45N14j93j36L84j16l09j02
4413b71N28k46l23O14j97j33L3K40j8p09P38j63n11N60j09J59k59L23r8o66O86
4434A78j02k41L75QJ17o71O84l05o25P29j57k18J2K34M70q06M99Kp08P25P1l17
4456d6k25K4O90o07K50L05r22O35M6j77R9k55N47q85M38M22r39O05k67L30k10
4477a42k28Q66r51L25N94j156J248j023L83J06n56J211j013K23L22l39M38q00
4495d92R28k58o69J056n87K1K53m66M86p67R06m37o70J460j110K87K77l03N61
$$ plain form
4348 -413 327 210 -266 123 183 -104 36 31 9 -372 -128 119 -384 40 226 -95 72 314 94 -142 -77 364
4370 364 -215 81 174 -40 -104 -18 399 -223 -30 292 85 -91 40 352 -404 -17 353 -204 -176 58 52 -368
4392 -368 11 342 -230 5 393 91 -220 99 76 -110 -55 359 -168 -313 201 8 -128 256 140 -169 -271
4413 -271 257 11 -312 302 105 -28 5 245 227 -482 256 93 -418 142 33 192 -67 256 158 -508 178
4434 178 76 -165 210 218 335 -336 348 43 -582 147 -10 -228 -216 18 488 -318 181 183 -525 200 271 -46
4456 -46 -271 -247 443 -164 86 391 -531 104 150 -27 72 -183 364 -521 -83 339 -600 5 -262 68 -142
4477 -142 -370 496 -455 -130 464 -692 556 -467 -84 22 -534 677 -336 -113 209 -130 308 -492
4495 -492 436 178 -491 565 -22 -1 252 -214 272 -495 411 -26 -696 764 -346 -59 218 -85 476
4514D76j385J040L98j255J179o14n0L39o05J017j154J110J4j435J578j000M67
4531A20j91k89J323j739R80pp71J120r10O22p7l37J068j792J465J23j310J065
4549D63p64R34p82n92J824j484L97K03p09J058r85M99J80n15J147j749J094J03
4567C22l45M04j157J288k62j011J245q82P38K5q98J048r59P17m13n82J681j531
4585e72K85L37j33Q69j846J761o44l66R85j329J168m79l77P00r15J142p05o16
4603g35J413q72M13l09K9R27j739J123q9m58P96q96P98k97k89P35j437J507l03
4622C17j168J297n82Q61j116j84J506j572P19k6k48R39j349R18m91R5Q60j938
4640a162J548k22m51M90q28J374q33o56J462j070M91l38L9O61q63Q16p72N0J164
$$ plain form
4514 476 -909 131 529 -726 453 -161 -211 128 -477 540 -614 496 510 -925 653 -347 120
4531 120 -71 -360 963 -776 204 197 -574 546 -364 258 181 -156 912 -880 585 708 -602 463
4549 463 -301 633 -149 -741 1083 -401 -4 199 -510 548 -437 62 242 -273 874 -875 219 322
4567 322 -23 381 -776 512 250 -761 484 -398 340 365 -533 515 -444 273 -140 -722 959 -572
4585 -572 -287 50 -83 786 -1060 701 57 -309 676 -653 515 36 -341 359 -556 586 -119 -735
4603 -735 678 -194 219 -90 -61 866 -873 250 161 -297 499 -397 401 104 -185 550 -887 620 317
4622 317 -851 446 -136 725 -391 -575 931 -641 78 52 -196 743 -606 312 -179 -84 776 -1162
4640 -1162 386 164 -287 203 -625 749 -84 -740 722 -348 143 -195 -156 505 -358 458 -314 -264 900
4659I00j716O24r1O93k99q61J287n83n16R32q95O27j01oO06r41Q48q23l23J331
4679F93q39K31k69K8P20j435J153k05l54M94n86P23n62K08L00q71J217n52o46
4698e52P49k34M28o22J08P82j178O44n8k82M54n59N93n77L83J87q38P34n5k91
4718a84J31j17R02r86k9J067r04J89j85K74n7j96K62p7j90M59q50L66N39j77n62
4739c25j43Q35n11o2M01l25M64o26K73J28m38N27l57k63P74l37Q9n17N03P5n78
4760d13O02j44J03K7l46L43j92j8K27n31N09l3m22L04K9j29k52L19J74n44K82
4781a05M38n08J69K57k50p7K41L1l75J55P9j40j46J88M71q01o1P95k61j72J43
4802G1L07n30J12M97o76N2L73j60k5%j23l7nN31n10k84K77R6l1j89M54k21j37
$$ plain form
4659 900 -816 -192 -283 410 111 -750 537 -46 -562 370 -525 102 1 -5 601 -340 508 -315 -638 693
4679 693 -146 85 -184 -156 564 -871 282 77 -277 217 -369 354 -208 0 300 -571 646 94 -552
4698 -552 197 -37 391 -231 -123 659 -519 125 67 -215 239 -320 273 -304 79 266 -572 162 107 -184
4718 -184 -53 -170 732 -254 -283 784 -120 69 -116 158 101 -95 167 90 -100 359 -491 -125 414 237 -325
4739 -325 -468 367 -144 -206 195 -130 334 -292 -19 109 -329 198 -159 -422 352 15 104 -413 90 165 -413
4760 -413 189 45 148 175 -171 172 -20 -38 189 -342 167 134 -288 16 45 -84 -336 -17 157 -387 -105
4781 -105 333 -175 -6 251 1 -76 165 196 -179 -24 55 -85 -231 -43 428 -373 -434 361 100 -72 71
4802 71 378 -152 -40 457 -219 -167 206 46 21 21 -102 -139 -144 387 -123 -407 -130 -34 -65 -254 200 -21 -158
4825a58K62K5k46j19M56m38K06J16j32j67M52j64m42L49J31k16j65M02Q1n31L67
4846F9J41n05J17L46j55m8J91Nk30J85L41l79k77K94%l78L21j4k40R8K32k03j15
4869b04L10j25j81q2O47m50J51O7P5k43p0P9k50J98K98l31PL12j77j39q3K59l60
4892b92k45Q06l72j85M81l4k45M2J95L9m17M44q4k24J71O1k7l44M47j64l10K23
4914c4K03k82j47M37J08n45J61L06k8P0k83R3m19O25k73q2K29j58j09K91j05J48
4936B06l48L60j08j91J87m3l56J35K62K59l89j52M60k76j42L48J12k10q8m6j51
4957a71r0N54l66K29mJ14j58n54O00n5l86M27k02j59JK88K3k61N77l81k70N67
4979C23j72k54K42o6J56o41Q55j83n31K09l0L18p6k63L91p25P03L6o39O01j7j00
$$ plain form
4825 -158 104 129 -117 -236 220 -218 -12 104 -28 -195 257 93 -349 0 131 -85 -250 152 233 -298 69
4846 69 210 -295 -178 168 13 -35 156 161 -69 116 457 78 -199 95 95 -283 38 24 -216 -118 114 -89 -204
4869 -204 106 -19 -200 -282 365 -85 66 133 208 -35 -105 -26 -276 -78 220 -111 -104 208 31 -108 -191 68 -292
4892 -292 -537 269 -103 -288 193 159 -86 -44 151 190 -227 217 133 -91 80 141 114 -230 217 53 -257 -34
4914 -34 169 -113 -260 177 285 -260 -99 207 179 249 -34 59 -360 265 -8 -90 139 -19 -128 163 58 206
4936 206 -142 218 110 -81 106 63 -293 -158 104 363 -26 -178 282 6 -136 212 324 114 26 -20 -171
4957 -171 -261 293 -73 156 152 266 108 -446 154 99 -287 140 -62 -221 -220 68 91 -170 407 26 -244 323
4979 323 151 -103 139 73 229 -412 443 260 -271 -62 -92 226 150 -113 278 -447 256 292 -347 254 237 137
5001A37m16J29Q15j175M99L96o76K93n01P53m47K29M95j106Q37N5m77J20k84O33
5021C09n11r6Q81q96N93m26J8M98p76O81m89J91M36j092P31j3Q6Mk67P09n68m45
5043d42Q03o36K92k19Q9N84j174J159q27j79J187j179P46k67K56J97j248J454
5061E96l58p42O63n16Q58n61l0N63r90J104p48m03J117p72O34p23M14O29j527
5080g92J138n4m30N41j201J266n21q4P65j255J206n48m65P12o48J013j246J36
5098d67J115j168P71j63l05M84r79J115p74J21Q70j546J335n96k27N06p96J556
5116H52j255k92J045q59J029r81N53M79j529J521r89L34P19j307Q96n59N42K12
5134D11j131J710j131m46R52p75J075r38M57K78j148J373q75k4Q91j331R72q32
$$ plain form
5001 137 -279 -150 665 -510 -11 385 -291 2 -499 254 -193 36 531 -575 262 317 -160 -40 -324 309
5021 309 -202 -298 583 -313 280 -146 -128 370 -406 275 -214 -23 413 -679 52 39 125 129 -138 571 3 -442
5043 -442 361 -275 17 -202 -113 471 -703 456 -371 -550 637 -542 204 -63 193 390 -858 596
5061 596 238 -504 159 -357 501 -60 -90 473 -517 587 -161 -564 553 -219 415 -308 106 735 -792
5080 -792 346 292 -138 403 -798 468 -53 -137 628 -627 579 31 -434 278 -370 643 -603 -467
5098 -467 648 -520 251 88 -217 267 -712 403 -371 -250 620 -926 409 -187 -414 92 -704 852
5116 852 -403 -695 350 -509 520 -461 92 571 -958 563 -426 -92 627 -680 216 -343 199 411
5134 411 -720 990 -141 -587 365 -410 665 -273 184 462 -686 687 -188 -212 679 -652 320 -512
5152e12Q73J75j511J261k85j27L39p67J525j389K57O56j217J362r17K88N30r16
5170c75J004j325P44P49j647J117m28K73J97j132J549j100M10K87r17J191p93
5187a96P4o8j18J233j484M17O62q81P00p69Q06l7r52J229p43N2M08r56J006m07
5207b4O7Q6r68J756j213J79N26p60R52j141O71J97j028J207q48M39L19r53J025
5226D89q24R75o21p85J443q64K22j17O5N79j115P65J55p69Q49n56j0L32n58P77
5246D32q33N24R3n64N98j3L7m92J90J20n25L62J19k67L76m33M07n8l90Q48q93
5267c62M24J28l73M87m75N70m06m64Q63p41M45nl04M03l22K85j21l66Q33p67j2
5288b80N05l63L96m96P09j53n16O18k22j53p7m4p7j25L51J29l25L12k75j04J59
$$ plain form
5152 -512 361 536 -975 286 1 -126 213 -554 971 -418 -161 495 -722 640 -277 11 541 -375
5170 -375 629 -696 48 797 -850 267 -161 112 309 -823 726 -374 36 323 -594 597 -196
5187 -196 -122 -190 -308 925 -559 -142 520 -361 339 -430 376 339 -613 616 -127 -75 333 -623 383 -24
5207 -24 43 129 -839 917 -296 -117 409 -351 601 -540 131 328 -700 507 -341 98 417 -536 489
5226 489 -335 640 19 -766 677 -187 35 -82 -17 562 -553 212 367 -402 447 -109 -119 213 -345 432
5246 432 -401 123 216 -348 250 237 274 -218 -28 92 -433 -71 48 -219 157 -276 131 73 -317 531 -362
5267 -362 62 190 -183 304 -171 399 -7 -471 392 -349 96 91 -213 190 -132 153 32 -334 499 -268 -280
5288 -280 225 -138 258 -238 471 318 -198 420 198 45 -32 -76 -153 -278 73 202 -123 189 -86 -190 -31
5309c1J20L85p26K96J81l83K87oj02K12j12qm41M27j38k29N86k73Rl1j26M66m68
5332a05J38O1k06j49M20N8k14QL1m5j06K09k78P8N5L21k41j20J72m03K05L03k10
5355a8j22k23O58k09l61M82l27K58K8j45j15k06N90k96l27N47q1o5J43j36k55
5376a80K40j73K80l40M97m39K90n7j20K0m06M90j86k75K55k1J11n4K79n0k97L51
5398B15j22l11J21L20k23p2M5J61l02R2J51j12M3q5J08j08O2K47p16N52K62l85
5420e7J2K12j2k63J64K65m12j63L38n0k52k5L05j51j30J39%M9J43j92J74k60L43
5443A77p3k41K83k07J0L5K10p1m18P82l32k46K70k08n3R3Q3N4l47L73q1k49K75
5466A19p1m1Q1j16J7l42P02qm46L50k72J6j52J37L43n61J97J4l9K17q5l22j3M16
$$ plain form
5309 -31 89 474 -252 44 225 -158 129 123 21 233 121 113 -328 99 -39 -268 318 45 54 23 -103 363 -105
5332 -105 33 94 -112 -261 159 217 3 11 42 -3 -109 100 -178 -100 -45 276 35 -85 87 -316 -111 192 -18
5355 -18 -140 -363 295 86 -275 207 -120 138 166 21 -94 -300 290 -6 -333 214 133 68 211 75 -180
5376 -180 60 -113 167 -173 324 -115 175 118 -2 18 -388 102 -84 -359 -104 -125 -14 -68 211 161 -136 215
5398 215 93 -218 -97 223 0 -72 -27 134 -168 -76 75 -37 6 -79 29 -79 -17 230 -486 66 328 -57
5420 -57 -45 167 155 -108 56 321 -91 -254 84 34 -218 -243 62 -89 -219 -80 -80 -31 112 -80 94 -166 177
5443 177 104 -137 146 -61 -51 -16 194 123 -295 487 155 -91 179 -29 -82 11 94 148 -199 174 93 -156 119
5466 119 48 7 88 -28 -11 -353 349 341 -105 245 -27 -11 -163 -26 317 -244 -47 -33 -72 145 60 -262 -275 141
5490A41J62m63J14K33j85j54J20L85n98J15L23n30O35l36J01Lp6L07q27N97L89
5511D56n20O3j40K66j4k75O83n21q7L30m18J95J75j08l67J0O94n35j60N97l73
5532d9J80l33M47p1n38M65p7k46L86l63N62k55q7L9o48Q24k96j16L74l02L34o04
5554c74L18M30o60N97m20J67J08l33L92n70N30j5n73O16j79r8l24K93L12m59N1
5575a91O77n62J40k6Q4n2m68O70n61L27M95q47N21j7p4j90l95J005p88J40K51
5596A39l70M94l96J56j53j47M29n62L38J42k17J98l12N42k27l69N92l88K63k11
5616e9l3K12l51J95j13k07N76k98k50O15l50Q3m79M88K93n57M25l03J45J25k75
5637a18J21l01K95L24q20P46k49l3j3L5L30n81R4M33l07K02j14Q9m7l75L26j36
$$ plain form
5490 141 303 -160 -46 187 2 -152 -32 353 -245 -130 193 -337 298 -38 63 66 -10 297 -530 67 456
5511 456 -64 -1 -141 125 111 -164 519 -2 -89 241 -177 18 193 85 -282 -272 422 -113 -273 324 -49
5532 -49 131 -202 245 174 -364 101 24 -222 164 -199 363 108 21 60 -588 236 -60 -176 198 -104 230 -374
5554 -374 -56 374 -286 311 -109 58 166 -167 225 -345 185 170 -403 213 34 -64 -388 -95 217 -242 -191
5575 -191 486 -76 64 38 122 70 -398 272 -289 38 533 -314 207 190 116 -74 -469 536 -252 -112 139
5596 139 -231 263 -133 23 -130 -277 152 -410 -72 70 -147 51 -261 281 54 -315 277 -111 152 -59
5616 -59 -92 120 -231 -36 -149 -356 220 -78 -328 287 -63 20 -459 29 322 -235 190 -113 32 157 -118
5637 -118 3 -298 -3 321 -499 247 -2 -35 -48 -13 317 -264 -170 263 -44 158 44 133 86 -289 37 -99
5659i9J50K8m75L30K85Qj13o34R98q12L5K42l6L31j40M4m2l19K23j03K91N6m27
5682a79k09N71O6o4o11Q94l89k38K38k04K14k93J01K08m66N43p4k53M26m45%p1
5704b35M17q5n35P60k11j73j20N7K78k77k6K55l08N50m10m0L69k12J35m17O3L73
5726B08l11K26j68J41j44k29N74k04lJ30k60P8L8j99K41l04O26m75k39N60m60
5747a74K22l08L47k20L6J12J90l70M71n76K42L02n8r2n46O16l31K94l9k64J8o0
5769a88K47O7j87K12J28k38J66m12K34n1k2K04m32N22m6k33PJ45K8k19k16M23
5791A39j93J05K90n46J54J1Q1k42K96K41o10L08M4p0J31j89M15m59L1M03l46J8
5813A2O2o7j97O3J70m7n6L53l55R8K02k82L27m58L68l1l89N26k73j57K05l6Kn0
$$ plain form
5659 -99 51 79 -396 -66 219 227 114 -520 478 -334 -299 -57 -93 238 98 142 100 -219 4 -99 192 248 -179
5682 -179 -388 183 249 185 -426 468 79 -159 79 -125 89 -204 -103 105 -361 182 108 -145 281 -164 -164 -235
5704 -235 182 97 -438 322 111 -62 -182 -125 153 -124 -150 105 -203 347 -63 -103 266 54 189 -228 -165 208
5726 208 -103 123 -45 96 -48 -277 297 93 90 220 -40 38 76 -123 118 -186 440 -35 -274 286 -174
5747 -174 48 -260 87 -133 -97 15 205 -165 306 -270 -28 274 216 124 -422 194 -137 157 118 -146 -128 -188
5769 -188 59 126 -61 151 279 41 207 -205 29 -22 -44 160 -272 250 204 -29 -22 123 151 -68 -284 139
5791 139 -54 51 341 -205 -51 -40 41 -201 95 336 -274 34 78 8 139 -50 365 -94 -63 340 -6 12
5813 12 74 7 -190 -127 43 -4 -60 293 -62 36 238 -44 283 -175 193 162 -227 299 26 -131 74 38 40 -10
5837a0j03O9r7J47J35k80N2K44K67n46L34j04l39L86p9n2k46L89l55J48L12k68
5859Dj36J99j07J32j81n0K35k34M4J20l35L88J70k75RJ9J18j85J4N8p3n9KM81
5883C58m61J79O0j04j31L47k38No3P2n0m15O67k72j35K79m5jo5nk8L3M4j17J13
5908B7J03l1p8NQ6L8m52K55K17m6p7k71K70k20Q7k3j9K27K4j35j12M19j80l72
5932b58N46k59J0R1r9K22l96o8J99o6J85q8k38Q2L91k64k63L07L32o78N71l12
5954e3R5M7Q9j81M3O4R4n06L98j17M3k68K62K11l24J25J24m57L06j26P4p8q5M85
5978B65j05r3Q1J11k14n8K19k98m7O54n40oM6j22N1j67K41N8j17L59l31r0J69
6001F6j81J51j42J72Nk13N03m28q1R8l11M90Rj46L41p48N75p6K3J00j95J55m77
$$ plain form
5837 -10 -113 -44 -141 6 141 -139 -87 157 424 -122 212 108 -231 155 76 24 -222 167 -188 -40 272 4
5859 4 -132 67 -40 92 -89 -139 96 -138 -94 26 -309 79 249 -26 -17 2 120 -65 -51 7 -66 -125 -123 358
5883 358 -103 76 136 32 -99 248 10 15 -48 24 -26 -441 226 -46 -181 98 53 52 -13 -18 -46 -13 31 -86 27
5908 27 130 99 21 26 112 150 -302 -47 170 124 47 -224 46 -174 -87 -110 -129 98 122 -13 -125 294 114 -258
5932 -258 288 29 39 130 31 253 -143 -211 -12 -78 107 19 -219 -137 254 -10 -273 34 366 -312 259 -53
5954 -53 42 89 178 -3 40 104 198 -308 90 -27 16 -252 10 221 -103 22 146 -311 -5 -131 -57 -135 -220 265
5978 265 160 67 148 259 45 -13 206 -92 -139 515 -25 -31 15 -107 -56 -223 18 76 -41 318 -13 -103 66
6001 66 -115 36 -106 66 71 -142 361 -67 -148 -50 -361 129 138 -8 333 -415 160 84 107 207 12 167 -310
6024c10M41mq8O0k72K15q2L9K47p23N11P0l18L92l89N37m57p6N04n98K91j54Q8
6047g6Q3n22M14j19N3O36p31M30Nm17K66k48N40n74J59O70p52L46k12k06O57p46
6069c44K86j3k60P40p85L77J78k87K58m45O28j14p07P90o43N49n02K62L32l80
6089h0K95m48M9Q10n81J68k5j51M42j002P70Rl49J82k66L62j22j56M28o42O33
6110C26l87j56O86m41n7l45J11O94j086O89K08k96M78q48P53k18j21K32p91Q47
6130B78n48k6O22o10P71q45l2Q14r32O93k09k3M77p57J83P0O0M72r74O21j61p9
6152a35M04m90O69n58k96R99p86K77Lk34N57o18N02k82K8J03m42M40j00n1J09
6173I9o11Q38l34k42M29m68Q82r09R5L13p36J017o53r1N07j47J9l11K28N71j072
$$ plain form
6024 -310 131 127 39 99 -173 42 -40 -1 246 -477 34 104 -214 178 -211 326 -131 -207 297 -301 -10 -164 -76
6047 -76 7 -515 -101 -220 -167 469 -262 168 173 -244 22 -226 314 -260 -101 569 -183 163 -49 -255 402 -344
6069 -344 -58 -71 -331 409 -376 1 179 -108 150 -295 333 219 -488 302 -341 208 -294 -32 300 -80
6089 -80 215 -233 -184 626 45 213 188 37 479 -523 247 256 -93 89 -177 185 63 -93 335 -307 326
6110 326 -61 -217 469 28 -29 -374 -263 431 -655 34 242 -54 424 -424 329 111 -10 222 -569 278
6130 278 -270 -296 326 -284 487 -358 -390 424 -508 185 -24 -47 430 -327 -144 -74 -14 458 -516 105 -56 -135
6152 -135 269 -221 448 -110 -406 593 -193 84 87 -147 410 -208 294 12 40 143 -299 141 41 -10 99
6173 99 -512 326 -8 -250 179 -289 593 -316 -221 92 -644 373 -280 -371 136 -11 8 -303 -75 496 -576
6194e76R13l07q0J35l40O32l81j02K87k70M18k76N6l48K56J80m29qN46o13M71
6215A64J55l61J84l51M46l92j0M23p48L97k2L5k2j95P11o82K54L33m37L77m25
6236a66K46K35o56N31l94J36J92m52M97m16N24k07m56P23l27k43K43j91M06l60
6256a35J86Nl08J78j6J70j20O1K83j47J21Pm97L19j82J02k06J13L62k46p9O4l82
6279c47M00p7J16j18n5J06n12P36j91o8J75k01k37m5L10K75j50k13K31m3m3j47
6301i8M00k19j34P4m07L87J88j45l07K92J14k80J12J82k44k4J84k25J33r8J54
6322C9q3j39L95j72k3J43j01k1j78M18l67j64L34j20J20j17L29j86j47J25J22
6343B07n68J39K24k6M4o0rj36K03n4k1M7Q7L8o3m6K26k97R6L2o6j00L5K30j44
$$ plain form
6194 -576 337 30 -50 85 -255 377 -4 -106 181 -89 329 53 109 -239 17 197 -232 -240 306 -307 164
6215 164 319 -42 142 -209 237 -155 -165 258 -490 -93 -115 -80 -102 -297 414 -268 -14 319 -118 259 -166
6236 -166 80 315 -341 190 -204 -68 124 -328 169 -247 277 70 -386 337 10 -233 10 -181 225 -135
6256 -135 51 56 -252 -74 -90 80 -40 21 304 157 278 285 -212 107 -75 27 -179 -66 296 50 -29 35 -347
6279 -347 53 -24 92 -26 -81 25 -487 249 58 -10 165 -36 -273 -318 -8 267 117 -96 135 92 49 -98
6301 -98 302 83 -51 23 -384 3 191 46 -261 31 145 -135 -23 159 -85 -109 75 -150 -17 -115 39
6322 39 -44 -183 212 40 17 160 59 38 -140 278 -89 -253 81 -39 81 -36 293 107 -40 85 207
6343 207 -361 -222 2 -24 20 -40 -49 -185 18 -36 -57 -10 77 115 52 6 232 -65 31 63 -3 -103 -68 162 18
6368A8L6J54j25J2J27j6j16o4J91k86j9j03K49o0O1j64J63j92M25l83K0K30l08
6391a50k83L10J66j2j28k08K49p7K45k11L2J06j40q9L1K34n3O8q6J2j71J66k8
6414a7K67mo06K98jJ45m3m9N8j41K04k56m0J35l5j7J63j44J20J48l74Q0J02Nk70
6439b72L24mj34r5J92P5j00m1O7o5k0J04j69J35J95p6j67rK63k27K50j85P2k21
6463a08j95M91k13j69J35K8j7R1K00k87j6R3L8j94L91j56n5j6l2j22O7J06j7j23
6487h0J66p6k48r6J36M23k12K2p5j62K44p2j74K30k49J78k1K48n17J01J72k59
6509c21L63k29K94K34m89J11Q1k51K53O6k58M9K52j68L1j16m6J19pk7J64j20K60
6532B45l15n9J71k8N6J06l99K85n4O1j51k6R1m6J28M5j65J28l51K57ON6m9N6O8
$$ plain form
6368 18 54 208 83 95 222 206 90 26 217 -69 -88 -191 58 -2 59 -105 58 -134 291 -92 -72 158 -150
6391 -150 -433 -123 43 31 -97 -305 -56 -133 112 -99 -67 39 -101 -190 -159 75 22 90 4 16 -155 11 -17
6414 -17 250 246 -360 -62 -63 82 39 -10 48 -93 111 -145 -185 -50 -85 -102 61 -83 37 185 -189 -109 -7 -2 -272
6439 -272 52 48 -86 -181 11 86 -14 -55 12 -53 -73 31 -138 -3 192 116 -51 -60 203 -24 226 41 113 -108
6463 -108 -303 188 -25 -194 -59 -31 -48 43 243 -44 -60 33 71 -123 268 112 57 41 9 -113 -46 60 43 -80
6487 -80 86 10 -238 -334 -198 225 13 35 -40 -202 42 -30 -204 26 -223 -45 -66 182 -335 -234 -62 -321
6509 -321 42 -187 107 341 -148 -37 44 -207 46 112 -146 -97 155 -13 18 -98 -144 -25 -32 -59 105 -15 245
6532 245 -70 -129 42 14 70 176 -223 62 8 69 -82 -108 -17 -63 65 110 -55 73 -278 -21 -15 41 -8 48 116
6557A16J97p27M78M0j67l0R4l02M62N0j20l21K87j28K34k27n5L68l16j43J12l86
6579d84O55j49j83K61k38J77k62L90j69j87M47k76P5l6m47N81j09L4J07k84M07
6600C10j75j53Mj97M17n53K20M40m37L2n6P5K12l33L11j22k55M45l64K00j76Q7
6622f8j00P0L54l61P7N5j33J55k23J94J08k66K38l20L86j96j07N14m30J93j95
6643e5k23N75l06j13K77l27L62k25j15M72n78N66m42K20J0j37k80M88r0k09j27
6664b57K63M0k02M44m24L80m25K19L09l29J33j65j90K19k10L15j10k95L67j41
6684e9nr3K58m9q1J95l92J09L54m68K86k54p8L32j49K61p0j69J59l20O5J8L10
6707A60p2m10N01k50K8J26j16L24l19j83L88k95K64l00R1K09j51J47k9k43L28
$$ plain form
6557 116 313 -414 64 104 -63 -93 1 -301 161 211 91 -230 57 -71 163 -64 -119 249 -67 -210 -98 -484
6579 -484 171 22 -161 100 -138 39 -223 167 -2 -189 258 -18 57 21 -426 155 46 80 187 -97 310
6600 310 135 -18 -14 -211 206 -347 -127 313 -124 -92 -148 -73 139 -194 117 -5 -260 185 -179 21 -155 -68
6622 -68 -168 -98 256 -105 -28 27 -106 49 -174 20 128 -138 100 -220 166 -30 -137 377 -53 140 -55
6643 -55 -278 297 -9 -122 155 -172 190 -35 -150 322 -256 310 -132 88 98 -39 -319 169 79 -130 -257
6664 -257 6 46 -156 288 -136 244 -181 38 347 18 151 -14 -204 15 -195 120 10 -285 82 -59
6684 -59 -64 -157 101 52 -29 166 -226 -117 237 -231 55 -199 -277 55 -94 167 97 -72 87 -233 -168 -150 160
6707 160 88 -322 179 -71 -43 83 -33 291 -28 -211 177 -118 146 -154 -63 146 -5 142 113 -130 198
6728A98m43M21j36k56k1K16J99k69K23N8m87M40k31N9J73k16J76m03L59j42JQ6
6750EJ3J04L3l48K8kL88r3k12J46j81J11j66R6L29j98p1P5j09j4K8M4L2k00L24
6775A62k61J62J69m17K45l60K81K60o85N59j71p2M41k72j58l2J25k25K19K45r0
6796A25p7r9N3L4j27l2L00j91L71k1n58J88k28L29p4K55j43k02K47j08J8l9j3
6819HK60n77K14j9J7J07oJ27P9l11J64m76M04L6P4j68o2J79J9m52M97k00m0J78
6843E2j77K61j94L1N4j38J67j10j46L01o2o4J41j95P5j48J72J59j61J59j9l02
6865a44J16J5j49L12j85J78j32N3lo2j09k9L2K39j90J88M9j56J12m1l27J57L30
6888B54k48l8J67J66l37mp2L0K85j54k94K35L2J0j71J84k1k4J03K6P3k53J92q9
$$ plain form
6728 198 -245 176 40 -216 -237 -21 178 -91 132 190 -297 143 -88 -29 144 -72 104 -299 60 -82 -81 5
6750 5 18 122 155 -193 -165 -167 221 128 -84 62 -119 -8 -174 -78 251 53 -18 57 -52 -66 -38 6 38 -162 162
6775 162 -99 63 232 -185 60 -300 -19 241 -444 115 -56 -128 313 41 -117 -149 -24 -249 -30 215 125
6796 125 48 -51 2 36 -91 -123 177 -14 357 336 -222 -34 -262 67 -7 248 105 -97 150 42 60 21 8
6819 8 268 -309 -95 -114 -97 10 4 131 210 -101 63 -413 -9 27 101 -67 -129 50 69 -383 114 -86 -126 52
6843 52 -125 136 -58 -27 27 -111 56 -54 -200 101 39 -25 116 -79 -4 -152 20 179 18 177 158 -144
6865 -144 -28 -13 -162 150 -35 143 11 64 61 -1 -110 -139 -107 132 -58 130 179 23 135 94 -233 -76 254
6888 254 6 -32 135 301 -36 -40 -112 -82 203 49 -245 -10 22 32 -139 45 24 0 103 129 202 -51 141 52
6912E2J07Q0j07j24Q6o3j8k9R4q5k01M11R6m01J55j3K9j83K20K7n2j68L50j09
6936A54j29j06P0L1j76K2K71q4j78J96q9J75m9k07No6j6k8K48pJ29k37K25j54
6960@o8J5N1l4k73L89n4L2Q6J28l09J11O1j55J05j46n1K48o3M8k33L26k24p1J34
6985E3j11p7K33Jj25J3J57j13J25K35m39R9j48l7O9J43N0k07k4J52J97j73r8J4
7009a1J13j32p0K68m10M33l19L82m82O2L12j46j75R1r3K77k88J81k54K5L62k93
7031a67K17k43N2K61j96o8L65k23J47m27J79M4K16k67L3j0j79R7K24q2O7l1r2
7054h3J11j85N35n7m45J82o5J35k24p5K80l97J97J41J87l56M7K89j86jK61m13
7076a22J34j50K31J02l07L83k61M0L9k39m2L21j19M3o2O4k27k7K71k04L09k20
$$ plain form
6912 52 159 239 132 8 94 31 13 -16 78 -7 -208 203 299 -102 53 40 69 -114 106 133 81 -87 263 154
6936 154 25 -81 -11 20 -156 -134 137 53 -125 71 -18 157 108 -99 -94 -160 -176 -204 44 37 166 -71 154 0
6960 0 -68 -53 -2 -36 -309 80 26 58 144 272 -37 74 135 -20 85 -61 -112 136 73 121 -112 214 -10 -81 53
6985 53 -58 -135 98 99 -26 -13 144 31 156 391 -48 51 -97 -134 -65 78 128 -79 -103 49 246 73 -25 -11
7009 -11 102 -30 -100 168 -242 191 -128 254 -228 -166 146 0 -175 -84 -177 100 -188 -7 -261 -236 126 -167
7031 -167 50 -193 -141 120 -76 -144 221 -2 145 -282 -103 -59 157 -110 -77 -87 -266 -169 55 -27 40 9 -83
7054 -83 28 -157 378 321 -124 58 -7 128 -96 -171 109 -288 -91 50 237 -119 -72 217 31 30 291 -122
7076 -122 12 -138 93 195 -112 271 10 50 89 -150 -192 129 10 53 -9 55 -172 -199 72 -132 177 -43
7098d3J46J20n24N17j91j19L41m21K81j95k1j35M12Ll87MK05O0K30o85N12Ol90
7121b74L31n3O3K5k02L03l53jL35l13J80n0j00J77j13J76k43Q0M0M7N6p5j8J1
7145B9l49L52j67N5J59m3k5j01J33j98J98N0l74J77K47rr9l99N89m25J20J84k50
7168a46J38L01m25J22j76P9J94k24L65O1n97M28l20K97r9n3L62l97K84l05Q0K61
7190B30k38Q0k74K13J16l23K88k50L2L78k69J68L4LJ0l72K27P5k53K02Q8m8l29
7213b12M22P4n22K51j41K29j36o9K62l97l8K01J61J70m48K89J45k20o1n4j91M26
7235A41k43M32k58n3J01j80R0j25J97Jk55K54L7r5J81m13J74QJ6j1l1jpJ49k31
7260a22J94q1p7K83Q8m56K17K9M8o8j25K53Q4l59K97j09lj63R5Rj5k17M24j68
$$ plain form
7098 -43 103 223 -301 216 25 -94 247 -174 107 -88 -109 -244 168 171 -216 -212 -7 53 283 -402 110 116 -274
7121 -274 57 4 67 92 -110 193 -160 -161 174 -139 41 -9 -109 68 -45 131 -112 -32 8 55 111 36 18 29
7145 29 -320 32 -135 -80 79 36 11 -90 43 -155 43 93 -281 -104 143 134 35 -364 225 -200 -80 104 -146
7168 -146 -8 293 -132 -10 -186 -107 87 -137 228 289 -308 120 -200 97 -2 -55 307 -90 194 -111 -31 230
7190 230 -8 72 -202 11 127 -196 92 -158 -126 252 -17 151 185 188 198 -174 53 128 -125 77 165 117 -212
7213 -212 210 284 -238 13 -128 101 -35 -104 158 -239 -277 -76 85 255 -193 96 241 21 -40 -94 -285 141
7235 141 -102 330 72 19 120 -60 30 -95 102 103 -152 102 139 44 225 -188 -14 -6 10 -1 -32 -33 -40 109 -122
7260 -122 72 -9 -86 197 285 -171 46 75 123 55 -70 183 267 -92 205 96 93 -70 25 34 19 -198 226 58
7284E8k28j1L28k76J10m1J03k74L77k21P7J70M9k11q7R1l17M05k27K88j31L5p3
7307fr2J64m3J34j91p2O2j26J81L8K8kJ13k14J5m1J65M9l10QN6J61Ml05O0J48
7333a6M8k1k75M22l55l2O5J67j96J90L6j9Q8o0j15J17P4j60j9k5K18k17q6Q7J53
7358F9k25J88j77K71l03J74j66M8j96M49r9k34L21o0L2J45j17Q3k05K9qMj22P
7382i2K01k10L0K7K5q5Np0K15M6j57j79K49R2j65K15j27j93Q0M8M8j9l7j23J14
7407f2J49Jk44J27L7p7j23K27j48J53J65k1j01j22K3m5j30J27J91j55k4M2q1j62
7431b53K69J43k11J34ko2JJj03mj10L95j89k81P8M48m34K33r0j45J38J67j41j4
7455c2r7K23j64o8J73R4k02j19P5J66J3N0k87L25k6j0k71K43Rj14J8L42n23MJ00
$$ plain form
7284 58 -170 -181 147 -129 -19 -60 43 -231 146 -75 2 172 221 10 -77 14 -303 102 -125 163 32 67 -6
7307 -6 -98 66 23 157 -34 -106 -44 -170 11 49 77 75 188 -26 -11 -52 113 162 -148 -140 -84 77 81 -224 -164 -16
7333 -16 32 11 -264 158 -197 -229 -164 3 -193 -3 33 14 102 42 -73 44 118 -42 -61 -86 132 -85 -171 -84 69
7358 69 -156 32 -145 126 -177 -3 -169 -121 -317 132 33 -201 120 60 92 237 120 203 -2 27 19 23 -99 -92
7382 -92 109 -101 -71 -44 -19 -104 -99 -169 46 92 -65 -244 5 97 -68 147 20 -173 -93 -45 3 -16 -53 -176 -62
7407 -62 87 88 -156 -29 8 -69 -192 35 -113 40 205 184 83 -39 -16 -61 -191 -64 127 -28 -52 -10 -91 -253
7431 -253 16 159 -52 82 80 18 19 20 -83 -87 -197 198 9 -272 -194 254 -180 53 -37 -182 -44 123 -18 -32
7455 -32 -129 94 -70 -138 35 129 -73 -192 -117 49 62 112 -175 150 124 114 -157 86 95 -19 -1 341 -182 -178 -78
7480g8K05n8l9K5R1j55Rjo2pL7j25J52J04j82M6l2J66j57L1k39J32n1K21k15m
7506a86K64n4j66Q2L6J40k28M6J04k11M6J57m1J01o0o4N5P5j59J89m0J7j57p5
7530a29K26K04k13j50K94j57O3l38J41J93j26j0O7k15J24J12l1J3j28K74l02K69
7552A81k01j0K20l15J66j79L57J69m23R3j86J01Kj06M06l16rk3RK60l40J77n6
7575b3j64K69j79q8K88m11L35j31O3M10m12J03j41J93k46m1K97k93L7J40K71%
7597B77k27j89R1n6R5J20j44n4M4K08l23P9L11k69Qk22J16P7qK76Pk30J10j37
7621d0J22N9r4j58k7M66m90K46K61k92K04m16K62M8k13K12j76l8l6J61N5q2K52
7644B86k40j85M87k38m93P25m54J22j38J74J65k22p9R5N0L03p31M95k41lK22l13
$$ plain form
7480 -78 127 69 30 55 146 -9 0 -1 -63 -70 -33 -158 -6 98 -84 -38 -70 96 -61 -30 -269 -137 -188 33 -182 -186
7506 -186 78 24 -142 -60 -24 116 -112 -66 38 -173 -127 30 -11 90 30 -34 21 96 -63 126 86 103 -54 -129
7530 -129 97 301 88 -62 232 75 138 -200 -59 134 8 -2 65 -150 -26 86 55 68 -60 214 -88 181
7552 181 -20 -30 190 -125 41 -138 219 388 -35 58 -128 -27 -25 -131 275 -41 -50 -73 -64 196 -144 33 -23
7575 -23 -187 82 -97 -185 103 -308 27 -104 -41 369 -43 60 -81 112 -134 -175 122 -171 -134 6 277 277
7597 277 50 -139 -48 -104 -9 111 -33 -87 -43 165 -158 -79 232 -37 -29 -251 -135 -58 -66 210 217 -13 97 -40
7621 -40 82 141 47 -111 -138 328 -162 84 345 53 257 -159 103 151 -62 150 -26 -64 -100 61 116 34 286
7644 286 46 -139 348 110 -383 342 -112 10 -128 46 211 -11 -90 5 55 358 -373 122 -119 -122 100 -213
7666b13N43m10pJ98k80J87l1M5j04N1J89j74o6O7j93K42k27R3N3p3K85l05j18
7689b48M68n50L46o9M5j33n6L16l8j72Q3m8Q8k49L68k59J44J59k96J52J31k13
7711c1J81k59M1M7j56M58k83K9J66m77N19k85N1j5j61K76k12J80K22n47K17l2
7733g1o5J53k90L22j71K9J01j76L15j52p4J52l10L04J07l12L9r3M10l66P1N3q6
7756a10J94o5L11l49k19L21j68L43j09p9l1Or2m9qR4J4K07j00k43K79j30j32M61
7780C46n37L93j40P8k79J8K77j86r9K23l04M33k49L7J16k42J10k98K38l2j34K96
7802F5j02%j83L15k39j07J39r3M7R5R9n9K03l72K50J04j90J13J00j90k08K91J68
7825B46n25K74J4N1j70j27J60RJ30l8K4m36P3K20J33o4J1q4J29J1j4qP0q3o2N
$$ plain form
7666 -213 330 -80 -87 111 -169 18 -13 32 -72 -21 168 -6 -72 -5 -198 44 -183 -90 -37 -110 175 -130 -248
7689 -248 220 -330 16 -53 -8 -141 -197 119 81 -91 -8 -56 32 -217 151 -108 36 195 -101 51 182 -31
7711 -31 150 -109 -68 -21 -177 281 -2 27 193 -284 235 -50 1 -14 -175 101 -111 69 291 -256 -39 -71
7733 -71 -136 17 -273 49 -122 -93 8 -168 147 -5 -79 73 -237 67 174 -138 -99 -192 218 -148 -77 -24 -110
7756 -110 84 19 330 -19 -238 83 -85 258 149 70 39 45 -47 -96 -104 -10 4 211 111 -132 147 17 -115 346
7780 346 -191 202 62 140 -139 -121 156 -30 -129 94 -210 223 -26 11 127 -115 -5 -303 -65 -97 -231 65
7802 65 -37 -37 -220 95 -144 -251 -112 -205 -158 -63 36 -23 180 -192 58 162 -28 85 185 -5 -213 78 246
7825 246 -279 -5 9 60 -110 -237 -77 -68 62 24 48 -388 -315 -95 38 -26 -15 -99 30 41 27 19 89 6 -56 -51
7851e1J8K6o4K82m68K12J59J00j02j46J21r5j40K15q2o3J69pO2j69q8LN6K5N7
7876C0K55m46O7M59n35K08j17K8K9k43K89j14K49l25Q5R2%M3j96J89R3k97K60
7899A03j6q9k4P2l83K80n0J89N3j34R0j37J82k32J62j30k34N10j25M7j19k31P1
7922a45MK54N2l94J46P3L26m84P4J06q0L60m34K69O2k36jj26k3J93L2J8km0j21
7947a17K45nj61P7j98K65L2m6j56J11p7J75j42l4J53n03L27j2J3L2J31l89M68
7970A89k60O9j95K16j42J79L1j49M7j77L00j34J39k89K22j39N8qL0o8P4%rr0K93
7995A87m45N08k19k2Qj00m3R8J64j21J36k69K30q4j55K66oj62N4j17J8kj12L77
8019A89l6l07K52k03pR9n8o0l4L84k55m2J08k36K21J09j77J02q7J67n2n6R8kJ6
$$ plain form
7851 -51 -33 -7 -71 211 -257 -45 114 214 112 -34 87 -8 -148 67 -15 -78 91 84 146 -23 -111 -108 -52 -27 30
7876 30 285 -161 -94 365 -170 38 -79 -51 -22 -265 24 -90 159 -166 -81 11 11 54 -142 47 140 -157 103
7899 103 87 -2 -26 46 -337 -57 -107 82 135 1 91 -46 136 -96 66 -64 -298 212 87 134 15 -216 -145
7922 -145 -141 113 165 -229 -83 -10 316 -168 -94 12 -68 292 -142 127 189 -47 -48 -174 -197 -4 28 46 44 4 -117
7947 -117 128 123 -38 39 -159 106 138 92 -64 47 -30 145 3 -31 122 -381 -54 -66 -53 -21 110 -279 189
7970 189 -71 -2 -197 19 -123 56 87 -62 -15 -192 108 -26 113 -176 46 -93 -35 -43 -13 -81 -7 -7 -16 -106 187
7995 187 -258 250 31 9 17 -83 -126 -28 136 15 151 -118 112 28 -127 139 133 -29 25 -92 -74 -76 -188 189
8019 189 153 -154 98 -105 -112 -13 -71 -131 -165 219 -36 -78 30 -206 15 124 -53 49 -38 129 77 21 119 117 133
8044A33M8j23q5o6l5J17r3L30m24K08k87K39q0j41M74n7n10L39j60Q1J32p0j4
8067d4O4J79j40r6J03m5o4n7J22k9j9J00j56M8Q8j66J19k0k28M27l74M11m09K8
8091a58J70k1q2J69j80L90l12J66n5j62M53m97K90k11L34j33k51K42l54L38m2
8112I4k90J81L5r2M34m20J58j16J95j47Nj95J67K6l0N0j24K04m76N40l63K39j05
8135c0J84J46k00j63n0J4j2l5K10j99J31n2O6k19N5K2L72l54K06L4q0L03m77K1
8159a07J27n5L20n00J25N9J37Q3j73j00l00M06L9j29J25k18Q6P7P7K6k70Q0Ql1
8183a08QJ49j50L68k88l7M2p2
$$ plain form
8044 133 181 58 -27 -93 -128 -11 -104 226 -198 10 -277 -38 -118 -259 215 158 -352 -13 -173 -92 40 -30 -44
8067 -44 20 199 59 -37 66 21 -43 -100 22 -7 -26 74 -82 -34 54 -112 7 -13 -241 186 -188 223 -186 -158
8091 -158 12 -9 -91 78 -102 288 -24 142 87 -75 378 -119 171 -40 294 161 -90 152 -202 136 94
8112 94 -196 -15 20 -72 362 -58 100 -16 179 32 37 -158 9 35 5 55 -69 135 -341 199 -164 75 -30
8135 -30 154 300 100 -63 -113 -99 -111 -146 64 -135 -4 -56 10 -209 -154 -132 240 -114 92 126 46 349 -128 -107
8159 -107 20 -35 285 -215 -90 -31 106 189 16 -84 -384 22 61 -68 57 -161 -75 2 79 105 -165 -85 -77 -108
8183 -108 -100 49 -101 267 -21 -58 -16 -88
8191h8
$$ Imaginary data points
##PAGE= N=2
##DATA TABLE= (X++(I..I)), XYDATA
0@%%%%%%%qJ6j6J6j6K2l0L7m5N6p2Q7j01J18j37J59j84K12k47K85l26L72m25M83
31B56n42O10o87P69q59R59j068J186j314J454j609J774j952K150k368K603k859
48a497L145l459L803m185M613n097N646o273O996p841Q844j0053J1538j3403J5813
63H590j9043K3562l0263M1037o0689J06035l51491j46294R00246o87454M73265
74B57501n68871K43953N35027q69585N89043l49900J98330K75037p00188M91146
84A01493r6007J42027j64887l52885P20270k73584k83411J74301P1240J83276
94B21833m12362O7737L24493k54792J14171j76639L1200L61073m13234J06743
104b9777m0782J41087K01587p26095N90668N2149l21313K05427l62133O58373
$$ plain form
0 0 0 0 0 0 0 0 0 -8 8 -8 8 -8 14 -16 21 -24 32 -40 47 -54 64 -73 86 -98 114 -133 152 -174 198 -227 256
31 256 -286 324 -363 406 -453 506 -562 624 -690 764 -845 929 -1023 1127 -1241 1362 -1497
48 -1497 1648 -1811 1992 -2193 2420 -2677 2969 -3304 3692 -4149 4695 -5358 6180 -7223 8590
63 8590 -10453 13109 -17154 23883 -36806 69229 -282262 -428556 471690 -215764 257501
74 257501 -311370 -67417 467610 -401975 187068 -162832 35498 310535 -389653 101493
84 101493 5486 147513 -17374 -370259 350011 76427 -206984 -32683 38557 221833
94 221833 -190529 -122792 201701 -53091 61080 -115559 -84359 276714 -136520 -29777
104 -29777 -70559 70528 272115 -453980 136688 188837 -132476 72951 -289182 369191
114C69191m25894j84653M93766m89911N29040m33023k3904M21228m22141L90127
124B23826n18119L26287K97968o44824L94596j51375K40590j63210k90226N56287
134B71800l49567R4634k6278j11145L22286k92141Q9205l3262R665K29515l87703
145a82991J11196K45928k01301j408o6913J78079M7553l45198K88619k8650j00412
156e5498J64005k83368K74524o6530r2749J36366k73240M21785k44848j58524
166a78077L22140k04945J87886k94534J71029J80445l71604K94613j87792J19805
176C8966K7304j91862K37346k30142K33063j04372j71235L08467j81846N9079
186B4768j01051P8664J40422k90880J72522J9947p1015N3527p5969P8203k3004
$$ plain form
114 369191 -56703 -241356 252410 -237501 291539 -141484 -165388 255840 -166301 223826
124 223826 -294293 31994 329962 -314862 79734 -71641 168949 5739 -284487 271800
134 271800 -77767 16867 -9411 -120556 201730 -90411 -1206 -34468 -24803 204712 -182991
145 -182991 -71795 174133 -27168 -28576 -95489 82590 130143 -215055 73564 44914 -55498
156 -55498 108507 -174861 99663 33133 -59616 76750 -196490 225295 -19553 -178077
166 -178077 144063 -60882 127004 -167530 3499 183944 -187660 106953 -80839 38966
176 38966 66270 -125592 111754 -118388 114675 10303 -160932 147535 -34311 24768
186 24768 -76283 2381 142803 -148077 24445 44392 -26623 26904 -49065 29138 6134
197F134j9179M2183q7098P4747O2381j67063P9310O5858o3690j186n9895J65745
209I8247j09713p0467J69028j39149Q6606n0101p69N7727j09503J64010j66408
220g0492M8636J08713j48147Q6305p8429J29999q3517q5643K00804j58102N6758
231F885q852o080M6538j05188J34975r8943n59R4028r5907K7947k829M7324n4595
244a5256k8569R5222m9518l6452M0036K7995o0558J9272L3145l5246j055J4226
256C242K6023p2722N1835L1218q1130M5662N134J1672n7212L3917N5080j05474
268e2755O3085O339k0901p260M464N1321r5345O1656K2551o6183L6754m47K0951
281B4230o3621M4305L6786q5692M9469J1585j4872k7295L2757K4946p4612N0307
$$ plain form
197 6134 -13045 29138 -57960 16787 79168 -87895 -8585 57273 -6417 -7603 -67498 98247
209 98247 -11466 -81933 87095 -52054 34552 -15549 -16318 41409 -68094 95916 -70492
220 -70492 -21856 86857 -61290 25015 -53414 76585 -6932 -92575 108229 -49873 6885
231 6885 -1967 -8047 38491 -66697 68278 -30665 -31224 62804 -33103 -5156 -7985 39339 -15256
244 -15256 -43825 51397 1879 -34573 5463 33458 -27100 -7828 25317 -9929 -10984 3242
256 3242 29265 -43457 8378 39596 -41534 4128 9262 20934 -36278 -2361 52719 -52755
268 -52755 10330 16669 -4232 -11492 -7028 44293 -51052 10604 33155 -33028 3726 3279 24230
281 24230 -39391 4914 41700 -43992 5477 17062 2190 -25105 7652 32598 -42014 8293
293H293J5345l6726l707L2803L555n9797N5671O760m5549J5994K6215j0093m5056
306c6292N7266k538n0035L6242J3506k0388k4977N0532q971n0108M9770L658l2591
319a4926K59L8122j7823l8368N2272l858l8845J8881K8214k8246k2989N2309j5649
332I353l6725L3346J4731l3409o329M5910k4101l1756M5174l72l6565J3818L1207
345B4282k8349k1528M6033p691m0878L2763J7858l6954j22L4771j2847l4392L6389
358I335J2290m5358J9227K6623k7761j3302L2409J660m0964K6005K5171l9566
370a4231j633L6790j4909k9135K9407J2627l4357M496L3789k6347j7824L9594
382A8267j1167k4994J5996K4326l0202j7306N5247k9903k2041K9735L249j2008
$$ plain form
293 8293 23638 -13088 -16795 16008 19563 -40234 15437 22197 -23352 -7358 18857 8764 -36292
306 -36292 20974 18436 -31599 4643 18149 -2239 -27216 23316 14345 -35763 14007 17665 -14926
319 -14926 -14667 23455 5632 -32736 19536 15678 -23167 -4286 23928 -4318 -27307 25002 9353
332 9353 -27372 5974 20705 -12704 -19033 26877 2776 -28980 16194 15822 -20743 -6925 24282
345 24282 -4067 -25595 20438 12747 -28131 4632 22490 -14464 -14586 20185 7338 -27054 9335
358 9335 21625 -23733 -4506 22117 -5644 -18946 13463 15123 -25841 164 25335 -14231
370 -14231 -15864 20926 6017 -23118 6289 18916 -15441 -10945 22844 -3503 -21327 18267
382 18267 7100 -17894 -1898 22428 -7774 -25080 30167 264 -21777 7958 11207 -801
394h01k4971N3614k7253k9346N8677l9394M946K782J2099l775m4965P7904l9758
407b41l2268N4205j9124L39k6305M0634k291m7695N2773j6929j5543J6495L629
420G679j1674j1496L7405j8768k9148L4352J4902m1325K643L7312j6802k2093
432a7013J3612K5601l7614J1833K1799l9316L2251j1383O059j9170L257N9272
444D9188r6347M6521L2334m9865K6572l8324P0960n0564k2403P7171q0354N2666
456A7555j3867j9514K9154l1094N4633o8262J7426N8255o3500P134R033L0446
468B7399l6950j5780N0891k9046j550O808l127l97O648K247k2443Q346L4357k8232
482h29l8849O8372j5297l2549J4260J875L9822p6024M3432K1227o3189Q0256p1947
$$ plain form
394 -801 -25772 27842 589 -28757 29920 -9474 -4528 -1746 10353 6578 -38387 39517 -241
407 -241 -32509 21696 2572 2911 -23394 17240 14949 -32746 20027 3098 -12445 4050 7679
420 7679 -3995 -15491 21914 3146 -26002 8350 23252 -18073 -15430 21882 5080 -17013
432 -17013 -3401 22200 -15414 -3581 18218 -21098 11153 -230 5829 -13341 -10084 49188
444 49188 -47159 -638 31696 -18169 8403 -29921 41039 -9525 -31928 45243 -35111 17555
456 17555 3688 -15826 13328 -17766 36867 -31395 -13969 44286 -19214 -12080 -3047 27399
468 27399 -9551 -25331 25560 -3486 -5036 1772 -1355 -1752 4896 7143 -15300 -6954 27403 -829
482 -829 -39678 28694 13397 -19152 -4892 -3017 36805 -39219 4213 25440 -37749 42507 -29440
495b9440K7978J9449l5097N2482r7234R8439m296r2148Q6750l4039L3394n0448
507b4210M855O6706q0327M6458j8798l618K8056k7613J4344l3973N4982p579o2189
520d2906M8034J9536k0209l4644L0084L2180m2837j0114L7023j7462M24J3115
532A2224m0700M4814j0209n052p750k7910J06007j02827o400Q3334o2309M3395
544B6617p6834O9598K0368r7576R9994p3467M1913J6395o6335O0409m5806O9360
556D4636n8807l7174J09719o4080l854j5319M6399J0095q2157O6398r669p436
568a249J0167l0992L0023k153K855j6113k2562O3908j0639p7290O3785J8981l4616
581e895m543j8195Q2415o8703j6817P1168p6615P5872n0685j5829O0727n6662
$$ plain form
495 -29440 -1462 17987 -17110 35372 -61862 36577 32281 -59867 26883 -7156 26238 -24210
507 -24210 -19355 47351 -32976 13482 -5316 -8934 19122 -8491 5853 -28120 26862 19283 -42906
520 -42906 5128 24664 4455 -30189 -105 32075 -10762 -20876 16147 -1315 -891 12224
532 12224 -28476 16338 6129 1077 -6673 -34583 71424 -31403 -37803 45531 -16778 26617
544 26617 -50217 19381 39749 -57827 42167 -31300 10613 27008 -39327 21082 -24724 44636
556 44636 -14171 -51345 58374 -5706 -9560 -24879 21520 31615 -50542 15856 6187 -1249
568 -1249 8918 -22074 7949 5796 8651 -7462 -30024 33884 23245 -54045 9740 28721 -5895
581 -5895 -10438 -28633 53782 -14921 -31738 39430 -37185 38687 -11998 -27827 32900 -23762
593b3762O8308r8172N0485P0359j21217O2392k2292N0259l7233n5239J13389p9354
605b2077L0455j0476k0532N9126o0282M4869m9276K4258N9905j05388M4843K1881
617A7306m200j7447l7266Q3119k9825m9604N5335j9216K746J2315l9629L8909
629A2543j1278K506O776o1338J01429m1333n7593P4641l5371M2774p2003K5558
641a2689P0037j06759P4655l9216R984L4130o6023O5043o3947O1390n499q0833
653e9727R8900m3139J5669l6897J3279P0280j07563N6293L073j9026K8555m8510
665b8813M7757k6031O678K0746n8218N3783P316m5233J3636J5709J2148l1677
677a2199j4706O1010l4395k3944M3876l3023K5768j5959n487K3271l8463O1079
$$ plain form
593 -23762 44546 -53626 -3141 67218 -53999 8393 -13899 36360 -873 -56112 57277 -22077
605 -22077 8378 -2098 -22630 36496 -23786 21083 -28193 -3935 55970 -49418 -4575 17306
617 17306 13106 -4341 -41607 41512 11687 -37917 17418 -1798 948 13263 -26366 12543
629 12543 1265 3771 10547 -50791 50638 9305 -48288 26353 -9018 33756 -38247 -12689
641 -12689 57348 -49411 25244 -13972 -3988 30142 -35881 29162 -34785 26605 21106 -59727
653 -59727 39173 -3966 11703 -25194 -11915 58365 -49198 7095 10168 -8858 19697 -28813
665 -28813 18944 -7087 -409 20337 -37881 15902 23218 -22015 -8379 7330 19478 -12199
677 -12199 -26905 34105 -290 -24234 19642 -13381 12387 -3572 -9059 14212 -24251 36828
689C6828n7274j336O2390o0498K7436l1757M8224p270o7622R1430n3680J4504
701A375K957k3775N1192o3896N6651k8830k2401O8195o4090K3494n831J5253L405
714A3699n3453O7000k0600k4260K2476m840P660j9060J5966O58j6320J8923p52
727G097k3439J9332J3273k8401O406R690J1314l0201M130L8574m5339J7898L409
740C743m728N775k0786M0354m2853J6005K5026m5714L2665j5249J9049k1942p713
753a6368M9940n6628K2997P883j0536O492j9548L8658l6281P408K4073l1444J4903
766A549k638J1485k0912M329K5537l0964O874J0985M70j7910R777J5577k5453
779a1294R811O992j869j5137J5193Q684k9739K2880J53p671m868Q996J1781l4104
$$ plain form
689 36828 -20446 -21782 40608 -19890 7546 -24211 24013 16743 -50879 40551 -13129 1375
701 1375 4332 -19443 31749 -32147 24504 -4326 -26727 41468 -22622 872 -4959 10294 13699
714 13699 -39754 27246 6646 -17614 4862 22 7682 -11378 4588 5246 -11074 7849 7097
727 7097 -16342 2990 16263 -12138 -5732 3958 15272 -14929 -10799 27775 -17564 334 3743
740 3743 -985 4790 -15996 24358 -18495 -2490 22536 -23178 9487 -5762 13287 -8655 -16368
753 -16368 33572 -23056 -59 7824 -2712 3780 -15768 22890 -13391 -5983 18090 -13354 1549
766 1549 -1089 10396 -10516 -6187 19350 -11614 -4740 6245 6715 -11195 -1418 14159 -11294
779 -11294 -1483 5509 3640 -11497 3696 12380 -17359 5521 5674 -1997 -6865 2131 13912 -20192
793b0192K7013K624j9131R716R92R113k6507K2314N507k7043K0622k355Q4j3935
807a1178J6021O836k9763K5557k612q452j682R791M520k6702K6148k145j5525
820i186Q749N374n74j8721K3852l506j7990J5549J375m650j1955K1899o071j8619
834a4474K2446m330p121l069J5807o255j7605K5476q023j0341O389Q762p180j3014
848a2532K4539j0749j0814J2738K295p594p862K2880j3591j0814K0453p144n297
861c492k475J5951r882j3233K5451j2092p782R965K558o483p776J9897r291j3483
875a2167J9734k328j2618M739J0617p391j0569J5660J745j8125J1594P207j4030
888e932L351P078j666j1864J0733R873k4754J3241R621j3427j224M242J3072k2851
$$ plain form
793 -20192 6821 9445 -9686 30 1022 10135 -16372 5942 11449 -15594 5028 2673 2757 -11178
807 -11178 4843 11679 -18084 7473 4861 -3591 -5273 4518 9038 -17664 8484 6339 -9186
820 -9186 -437 4937 4363 -14358 9494 5988 -12002 3547 4922 272 -11683 10216 4145 -14474
834 -14474 7972 3642 -3479 -6548 9259 3004 -14601 10875 2852 -7489 -1100 7662 482 -12532
848 -12532 12007 1258 -9556 3182 5477 -2117 -9979 12901 -690 -11504 8949 1805 -3492
861 -3492 -5967 9984 102 -13131 12320 228 -7554 2411 4969 -1514 -9290 10607 1316 -12167
875 -12167 7567 5239 -7379 -2640 7977 586 -9983 5677 7422 -10703 891 8098 -5932
888 -5932 -2581 4497 2831 -9033 1700 11573 -13181 60 9681 -3746 -4970 -728 12344 -10507
902a0507N828J8973k4137J1149M61j694P4o848K1168k6846Q319K2253l1515J3184
916a38J376M575o137j6437L7642k5865n608K3590k1709J5797j2380O488L864j9309
930a4251L4379l0054o59K8540k4528P686j2371K3201l667l2862M1101j6726l679
943c890P521j3183K3094k3932J5311j425k1654M1799l0820m268J9758r078J2703
956A1936l5318K9522J5881m6633L3178j0585L711P464k9900L8101k5371R323J2192
969A3501m4287N4504k0574j6121J7219j5520M2526n5312J3129L9476m6421K9965
981A2085k9328K4137R538m1142M5209m0653L1663M912n0636N3729k3845J6267
993A1936k0945j5295O8446o3959J0748J8009j5506L0492n2739L3882R685l0365
$$ plain form
902 -10507 -4679 14294 -9843 1306 1767 73 147 -6701 14467 -12379 -4060 18193 -13322 -138
916 -138 1238 5813 -324 -16761 20881 -4984 -10592 12998 -8711 7086 -5294 1194 5058 -14251
930 -14251 20128 -9926 -10585 17955 -6573 1113 -11258 11943 8276 -24586 16515 -211 -3890
943 -3890 3631 -9552 13542 -10390 4921 3496 -18158 23641 -7179 -11447 8311 -767 11936
956 11936 -23382 6140 22021 -24612 8566 -2019 1692 9156 -20744 17357 -8014 1309 13501
969 13501 -30786 23718 3144 -12977 4242 -11278 31248 -24064 -10935 28541 -17880 12085
981 12085 -17243 6894 16432 -24710 20499 -20154 11509 16421 -34215 19514 -4331 11936
993 11936 -9009 -24304 44142 -19817 -9069 8940 -6566 23926 -28813 5069 14754 -15611
1005a5611L5844m6524L1214K1062n0830K9394j2315K5394j0216m8639P1964k6286
1017D451j6563J5939k1539N1010m9466N393K6430l4061N1785n9993J6805L8613
1029B8804m4061L0299n0153N7757L215p2414O9721l3029K8039k1567l0850P7409
1041D3170o4387L0174j1681k1824P1319p3025K1308Q552m714L1815p7665N7146
1053A0188J8595m9708K4755k0742L9946j5752l8410M9637k4080J5428p013l4013
1065c1169N8601k4987r482M62m771N4126p0566J1193M2517l4295K4162m9873M8725
1078A4643Q378n4422N4286n0258M8411n458n6013O7207m1756M0161l6506k5023
1090c6350R1813p8174J9073O26m54L9477p9333N5543j792k1392L0910n2774M8174
$$ plain form
1005 -15611 20233 -26291 4923 25985 -24845 4549 -7766 17628 7412 -41227 30737 4451
1017 4451 -12112 3827 -17712 33298 -16168 -10775 15655 -18406 33379 -26614 -9809 28804
1029 28804 -15257 15042 -35111 22646 25861 -46553 23168 -9861 18178 -3389 -34239 43170
1041 43170 -21217 8957 -2724 -24548 46771 -26254 -4946 3606 -1108 30707 -46958 10188
1053 10188 28783 -20925 3830 -16912 23034 7282 -31128 18509 -5571 9857 2844 -31169
1065 -31169 27432 2445 -7037 -6575 -11346 42780 -27786 -16593 25924 -8371 15791 -34082 14643
1078 14643 23021 -31401 22885 -27373 21038 15580 -40433 26774 -14982 25179 -11327 -36350
1090 -36350 55463 -22711 -3638 -3012 -3466 36011 -43322 12221 10429 -10963 19947 -32827 15347
1103A5347k430k5273J5142k1157M8389l0107l2182N1321j2825m880j4731O117
1115g269L6532m5342J0633J2749j6965L2817m2760J4436K0166k2153K3567n0211
1127c3800M9732R381o0061M9016k4372L0305k4514k5755O8523n9133K9135r249
1139g92j7951N1346n4422L0204j6591O065L2335o7951M7837M91j3411L235k1035
1152b0640M9449l5458o661K4995j9968K0071j8181M61J2488r058J1880k1491N478
1165f635K8972l1148k648J8432l175K311k5576K7787N283l2818L2261k2583J2681
1178C144O202k5092K9311k8663L0215j2500k8593N1965l3522R040q446N417K4191
1191B2669n0373L9240q370j0015J7125k4499K6866k0755J2175J727k4276L5760
$$ plain form
1103 15347 12917 -12356 2786 -18371 30018 -89 -32271 19050 6225 1345 -13386 -7269
1115 -7269 29263 -16079 -5446 7303 -9662 23155 -19605 -5169 14997 -7156 16411 -33800
1127 -33800 15932 25313 -34748 14268 -10104 20201 -4313 -30068 38455 -20678 8457 -792
1139 -792 -18743 32603 -21819 8385 -8206 -2141 30194 -37757 10080 10571 -2840 395 -20640
1152 -20640 28809 -6649 -13310 11685 -8283 11788 -6393 -5932 6556 -2502 9378 -12113 -6635
1165 -6635 22337 -8811 -11459 6973 3798 6109 -19467 8320 13603 -19215 13046 -9537 3144
1178 3144 9346 -15746 13565 -15098 15117 2617 -25976 25989 -7533 1507 -6939 -1522 22669
1191 22669 -27704 11536 3166 -6849 10276 -14223 12643 -8112 4063 5790 -18486 17274
1203A7274j9004l996M176M745O698k6444K0803M499j5296M924M238j562l283L686
1217A458j646j369L46R797j6227K248J9805k2376O345P06P525n799j5940L2356
1231A7229k3965L248R769j2358J3752j8140K0835j4056n231K5621k7864J2886
1243A726k539N420m038j4010K9894k2454J800R112o094L674j0497J7785j4137
1256d358l50J2993j1793K466q49J0019j4064J559J4244j3885J494K042Q081j3828
1270f229L608J1684j5273O342q5M373r970L808J2725k1427J2961K85k489k904
1284b591m22J4622k3189J3274M851j2146O810l644J0617j6582Q108R265j7471
1297h498J0108n39K611j0391P510P896j8502J2761r99j462n018M868P930j9696
$$ plain form
1203 17274 -1730 -5726 -1550 3195 9893 -16551 4252 8751 -6545 -1621 2617 1055 -2228 1458
1217 1458 -188 -1557 -1211 8586 -7641 -5393 14412 -7964 -1619 -913 6612 813 -15127 17229
1231 17229 -6736 -3488 6281 -6077 7675 -10465 10370 -3686 -8917 16704 -11160 1726
1243 1726 -813 4607 569 -13441 16453 -6001 -4201 4911 -1183 2491 -8006 9779 -4358
1256 -4358 -4708 8285 -3508 -1042 -1891 8128 -5936 -4377 9867 -4018 -2524 -482 7599 -6229
1270 -6229 -2621 9063 -6210 132 47 4420 -5550 -1742 10983 -10444 2517 2802 313 -2591
1284 -2591 -3013 11609 -11580 1694 6545 -5601 1209 -2435 8182 -8400 -292 8973 -8498
1297 -8498 1610 1071 3682 -6709 801 8697 -9805 2956 1957 495 -4523 345 8275 -11421
1311a1421J5704o87p397K936J471N653j6366J4103J322j2696Q705N18J079j0934
1325h010J2649j90j3225J2531k192q73o928J0821J58j5493J7137m926m360Q79
1339b022M903O96j3460J6731m695p981O952J931k040q686J4748n609q531J0640
1353C577j713j927o273J3591o060r595J4861o008k803k54P757n005p916J5281
1367G513p336n070N563M077o485m487J4530r565l512P457J8m633l353J4372j2134
1382c045k535J2299p878r69n07R696r408m840J6514j1293k302N588K442n659l335
1397e232J3109r654l207R574l222n018K357P990j0370j149J1471n770o715O601
1411G65N074r561k79R062l974o591P925K010j0675P845K537p568J272M831K601
$$ plain form
1311 -11421 4283 3596 -3801 -865 606 6259 -10107 3996 5318 -7378 1327 1845 2924 -8010
1325 -8010 4639 4449 -8776 3755 1563 690 -6238 4583 4741 -10752 6385 1459 -2901 -2022
1339 -2022 2881 3577 -9883 6848 2153 -5828 1124 3055 1015 -7671 7077 1468 -7063 3577
1353 3577 1864 -63 -6336 7255 1195 -8400 6461 453 -2350 -2604 5153 148 -7768 7513
1367 7513 177 -4893 670 4747 -1738 -6225 8305 -1260 -4772 2685 2703 -1930 -5283 9089 -3045
1382 -3045 -5580 6719 -1159 -2128 -2635 7061 -2347 -7187 9327 -1966 -4268 1320 3762 -1897 -5232
1397 -5232 7877 -1777 -4984 4590 1368 -3650 -1293 6697 -3673 -4822 6649 879 -5836 765
1411 765 5839 -3722 -4001 5061 1087 -5504 2421 4431 -6244 1601 4138 -3430 -2158 2673 5274
1426E274j4581J0597Q095j7887Q380K751l88n234p00J3052j6372O787O875j3514
1440f865Q972p26P09o610K682J2999j9386M566J1804q989j983j55J0262q769m830
1455f319J3893j1618L302M886p496L377j699Q947j1504m530K2696j7036l594R151
1469B456k00K110j5746J6945n01j4771J8077j3459M101O712r734O658j0607J6876
1483H917m735k0752K7175p200p509J249J115J3880k2948J0261P640j4975J6357
1496H475j3758L745N869o050Q977k2636K3007L871k7468J9983m295Q249j3015
1509e046o191K9685k8288J0856J810j2223K3982k3188R928k600k720K1897l7852
$$ plain form
1426 5274 -9307 1290 9385 -8502 -122 2629 2241 -2993 -3693 9359 -7013 -226 6649 -6865
1440 -6865 2107 1381 2090 -4520 -1838 11161 -8225 -3659 8145 -844 -2827 -2982 7280 -1489 -6319
1455 -6319 7574 -4044 -742 4144 -3352 25 -1674 7273 -4231 -8761 13935 -3101 -6695 2456
1469 2456 2256 4366 -11380 5565 5064 -9707 8370 -5089 -988 5724 -4010 2648 -7959 8917
1483 8917 4182 -16570 10605 3405 -4104 -2855 -1740 12140 -10808 -547 7093 -7882 8475
1496 8475 -5283 -1538 4331 -1719 7258 -15378 7629 11500 -15968 4015 -280 7969 -5046
1509 -5046 -11237 18448 -9840 1016 2826 -9397 14585 -8603 1325 -1275 -3995 17902 -19950
$$ [...]
8191A23
##END NTUPLES=NMR FID
##END=
