##TITLE=1H_LR-755-R2-3
 CCl4
 8 sc, 
 23.12.2022
##JCAMPDX= 6.0         $$ Bruker NMR JCAMP-DX V2.0
##DATA TYPE= NMR FID
##DATA CLASS= NTUPLES
##ORIGIN= UXNMR, Bruker Analytische Messtechnik GmbH
##OWNER= root
$$ XWIN-NMR		Version 3.5
$$ Fri Dec 23 16:07:54 2022 Russian Standard Time (UT+4h)  she@DPX200
##.OBSERVE FREQUENCY= 200.13135
##.OBSERVE NUCLEUS= ^1H
##.DELAY= (6, 6)
##.ACQUISITION MODE= SIMULTANEOUS
##.ACQUISITION SCHEME= undefined
##.AVERAGES= 8
##.DIGITISER RES= 18
##SPECTROMETER/DATA SYSTEM= spect
##.PULSE SEQUENCE= zg30
##.SOLVENT NAME= CDCl3
##.SHIFT REFERENCE= (INTERNAL, CDCl3, 0, 15.7039)
##AUDIT TRAIL= $$ (NUMBER, WHEN, WHO, WHERE, WHAT)
$$ ##TITLE= Audit trail, XWIN-NMR		Version 3.5
$$ ##JCAMPDX= 5.01
$$ ##ORIGIN= Bruker BioSpin GmbH
$$ ##OWNER= she
$$ F:/spectra/data/she/nmr/H-F/1/audita.txt
$$ ##AUDIT TRAIL=  $$ (NUMBER, WHEN, WHO, WHERE, WHAT)
(   1,<2022-12-23 16:06:59.62 +0400>,<she>,<DPX200>,
      <created by zg, POWCHK disabled, PULCHK disabled
       configuration hash MD5:
       00 E9 B6 7A A2 85 ED C7 34 08 36 98 17 FE 4E 26
       data hash MD5: 16K
       DB 6F E1 37 B3 EF 13 BD 0C 58 98 CF DD 02 77 0A>)
$$ ##END=
$$ 
$$ hash MD5
$$ E0 62 B0 00 70 66 47 A8 67 2B AE 0E 62 10 08 ED
##$RELAX= 
##$RELAX= 
##$RELAX= 
##$RELAX= 
##$RELAX= 
##$RELAX= 
$$ Bruker specific parameters
$$ --------------------------
##$DU= <F:/spectra>
##$EXPNO= 1
##$NAME= <H-F>
##$PROCNO= 1
##$TYPE= <nmr>
##$USER= <she>
##$AMP= (0..31)
100 100 100 100 100 100 100 100 100 100 100 100 100 100 100 100 100 100 
100 100 100 100 100 100 100 100 100 100 100 100 100 100 
##$AQSEQ= 0
##$AQ_mod= 1
##$AUNM= <au_zg>
##$AUTOPOS= <>
##$BF1= 200.13
##$BF2= 200.13
##$BF3= 200.13
##$BF4= 200.13
##$BF5= 200.13
##$BF6= 200.13
##$BF7= 200.13
##$BF8= 200.13
##$BYTORDA= 1
##$CFDGTYP= 0
##$CFRGTYP= 5
##$CHEMSTR= <none>
##$CNST= (0..31)
1 1 145 1 1 1 1 1 1 1 1 1 1 1 1 1 1 1 1 1 1 1 1 1 1 1 1 1 1 1 1 1 
##$CPDPRG= <>
##$CPDPRG1= <>
##$CPDPRG2= <>
##$CPDPRG3= <>
##$CPDPRG4= <mlev>
##$CPDPRG5= <mlev>
##$CPDPRG6= <mlev>
##$CPDPRG7= <mlev>
##$CPDPRG8= <mlev>
##$CPDPRGB= <>
##$CPDPRGT= <>
##$D= (0..31)
0 1.2 0 0 0 0 0 0 0 0.06 0 0.03 0 0 0 0 0.0002 0 0 0 0 0 0 0 0 0 0 0 0 
0 0 0 
##$DATE= 1671797218
##$DBL= (0..7)
120 120 120 120 120 120 120 120 
##$DBP= (0..7)
150 150 150 150 150 150 150 150 
##$DBP07= 0
##$DBPNAM0= <>
##$DBPNAM1= <>
##$DBPNAM2= <>
##$DBPNAM3= <>
##$DBPNAM4= <>
##$DBPNAM5= <>
##$DBPNAM6= <>
##$DBPNAM7= <>
##$DBPOAL= (0..7)
0.5 0.5 0.5 0.5 0.5 0.5 0.5 0.5 
##$DBPOFFS= (0..7)
0 0 0 0 0 0 0 0 
##$DE= 6
##$DECBNUC= <off>
##$DECIM= 32
##$DECNUC= <off>
##$DECSTAT= 4
##$DIGMOD= 1
##$DIGTYP= 9
##$DL= (0..7)
0 120 120 120 120 120 120 120 
##$DP= (0..7)
150 150 150 150 150 150 150 150 
##$DP07= 0
##$DPNAME0= <>
##$DPNAME1= <>
##$DPNAME2= <>
##$DPNAME3= <>
##$DPNAME4= <>
##$DPNAME5= <>
##$DPNAME6= <>
##$DPNAME7= <>
##$DPOAL= (0..7)
0.5 0.5 0.5 0.5 0.5 0.5 0.5 0.5 
##$DPOFFS= (0..7)
0 0 0 0 0 0 0 0 
##$DQDMODE= 0
##$DR= 18
##$DS= 0
##$DSLIST= <SSSSSSSSSSSSSSS>
$$ [...]
##$SUBNAM2= <"">
##$SUBNAM3= <"">
##$SUBNAM4= <"">
##$SUBNAM5= <"">
##$SUBNAM6= <"">
##$SUBNAM7= <"">
##$SUBNAM8= <"">
##$SUBNAM9= <"">
##$SW= 18.05172834244
##$SWIBOX= (0..15)
0 0 2 0 0 0 0 0 0 0 0 0 0 0 0 0 
##$SW_h= 3612.71676300578
##$TD= 16384
##$TD0= 1
##$TE= 0
##$TE2= 300
##$TE3= 300
##$TEG= 300
##$TL= (0..7)
0 120 120 120 120 120 120 120 
##$TP= (0..7)
150 150 150 150 150 150 150 150 
##$TP07= 0
##$TPNAME0= <>
##$TPNAME1= <>
##$TPNAME2= <>
##$TPNAME3= <>
##$TPNAME4= <>
##$TPNAME5= <>
##$TPNAME6= <>
##$TPNAME7= <>
##$TPOAL= (0..7)
0.5 0.5 0.5 0.5 0.5 0.5 0.5 0.5 
##$TPOFFS= (0..7)
0 0 0 0 0 0 0 0 
##$TUNHIN= 0
##$TUNHOUT= 0
##$TUNXOUT= 0
##$USERA1= <user>
##$USERA2= <user>
##$USERA3= <user>
##$USERA4= <user>
##$USERA5= <user>
##$V9= 5
##$VALIST= <valist>
##$VCLIST= <CCCCCCCCCCCCCCC>
##$VD= 0
##$VDLIST= <DDDDDDDDDDDDDDD>
##$VPLIST= <PPPPPPPPPPPPPPP>
##$VTLIST= <TTTTTTTTTTTTTTT>
##$WBST= 1024
##$WBSW= 4
##$XGAIN= (0..3)
0 0 0 0 
##$XL= 0
##$YL= 0
##$YMAX_a= 719565
##$YMIN_a= -916293
##$ZGOPTNS= <>
##$ZL1= 120
##$ZL2= 120
##$ZL3= 120
##$ZL4= 120
##$ABSF1= 10
##$ABSF2= 0
##$ABSG= 5
##$ABSL= 3
##$ALPHA= 0
##$AQORDER= 0
##$ASSFAC= 0
##$ASSFACI= 0
##$ASSFACX= 0
##$ASSWID= 0
##$AUNMP= <proc_1d>
##$AZFE= 0.1
##$AZFW= 0.1
##$BCFW= 1
##$BC_mod= 2
##$BYTORDP= 1
##$COROFFS= 0
##$CY= 11.3945322036743
##$DATMOD= 1
##$DC= 2
##$DFILT= <>
##$DTYPP= 0
##$F1P= 2.36226072786647
##$F2P= -0.459571619588291
##$FCOR= 0.5
##$FTSIZE= 0
##$FT_mod= 4
##$GAMMA= 1
##$GB= 0.15
##$INTBC= 1
##$INTSCL= 1
##$ISEN= 128
##$LB= 0.24
##$LEV0= 0
##$LPBIN= 0
##$MAXI= 10000
##$MC2= 0
##$MEAN= 0
##$ME_mod= 0
##$MI= 1.114404
##$NCOEF= 0
##$NC_proc= 0
##$NLEV= 6
##$NOISF1= 3.799351
##$NOISF2= 2.8
##$NSP= 1
##$NTH_PI= 0
##$NZP= 0
##$OFFSET= 15.70392
##$PC= 1
##$PHC0= -19109.4
##$PHC1= 10.40073
##$PH_mod= 1
##$PKNL= yes
##$PPARMOD= 0
##$PSCAL= 0
##$PSIGN= 0
##$REVERSE= no
##$SF= 200.130013532006
##$SI= 16384
##$SIGF1= 3
##$SIGF2= 2
##$SINO= 400
##$SIOLD= 16384
##$SREGLST= <1H.CDCl3>
##$SSB= 0
##$STSI= 0
##$STSR= 0
##$SW_p= 3612.71676300578
##$SYMM= 0
##$S_DEV= 0
##$TDeff= 0
##$TDoff= 0
##$TI= <>
##$TILT= no
##$TM1= 0
##$TM2= 0
##$TOPLEV= 0
##$USERP1= <user>
##$USERP2= <user>
##$USERP3= <user>
##$USERP4= <user>
##$USERP5= <user>
##$WDW= 1
##$XDIM= 8192
##$YMAX_p= 0
##$YMIN_p= 0
$$ End of Bruker specific parameters
$$ ---------------------------------
##NTUPLES= NMR FID
##VAR_NAME=  TIME,          FID/REAL,        FID/IMAG
##SYMBOL=    X,             R,               I
##VAR_TYPE=  INDEPENDENT,   DEPENDENT,       DEPENDENT
##VAR_FORM=  AFFN,          ASDF,            ASDF
##VAR_DIM=   8192,          8192,            8192
##UNITS=     SECONDS,       ARBITRARY UNITS, ARBITRARY UNITS
##FACTOR=    0.0002768,     1,               1
##FIRST=     0,             0,               0
##LAST=      2.2672688,     0,               0
##MIN=       0,             -916293,         0
##MAX=       2.2672688,     719565,          0
$$ Real data points
##PAGE= N=1
##DATA TABLE= (X++(R..R)), XYDATA
0 0 0 0 0 0 0 0 0 8 -8 16 -16 24 -32 48 -56 72 -89 112 -141 173 -208 249 -299 355 -419 491 -574 666
28 666 -770 885 -1018 1163 -1327 1506 -1703 1923 -2163 2430 -2722 3041 -3391 3774 -4191 4644
44 4644 -5142 5684 -6274 6920 -7628 8401 -9252 10185 -11217 12358 -13628 15048 -16650
57 -16650 18466 -20552 22971 -25815 29217 -33370 38570 -45302 54411 -67540 88484 -129571
69 -129571 374968 -699890 162012 117315 -233028 598453 -916293 598945 -82822 -127912
79 -127912 158837 -377161 480981 -174519 -57137 -27047 71520 235676 -376225 116702
89 116702 23475 174696 -243056 -117062 311361 -108048 -45066 -110837 165079 71922 -122966
100 -122966 -74182 120432 122255 -196082 61821 -127198 313428 -182345 -252528 395593 -257107
111 -257107 241006 -324045 92024 371155 -509614 361671 -258949 218092 67561 -409873
121 -409873 428391 -286186 249352 -211966 -114733 406697 -350905 187790 -216924 238072
131 238072 74164 -374016 348246 -169027 153399 -139398 -102401 298444 -251542 101925
141 101925 -83597 23336 147624 -187970 37451 64329 29843 -38450 -70849 57972 128909
152 128909 -183066 -5791 121168 -85561 79208 -188246 158044 40023 -163843 161207
162 161207 -164497 211079 -95064 -94171 170869 -143180 176751 -232366 97501 99258 -180122
173 -180122 142758 -181521 229639 -111984 -72875 179104 -179330 222171 -209873 69419
183 69419 97218 -173380 178784 -221486 166443 -4361 -145849 153808 -111954 133021
193 133021 -96713 -12352 118172 -89562 40787 -47246 43572 -7402 -29779 -7267 4743
204 4743 29942 -48630 31787 -32852 72706 -32632 -37363 79073 -50718 50852 -82143
215 -82143 51184 14910 -72173 62320 -77978 93492 -69490 11391 48387 -73231 122729
226 122729 -128490 85696 -3462 -56370 91998 -143293 139573 -83373 -19735 76532 -104622
237 -104622 122616 -104507 56281 23228 -57131 81551 -85182 72189 -40451 -426
247 -426 12448 -42821 60740 -71595 46752 -21210 8961 19912 -43583 66545 -48473
258 -48473 33320 -15831 -3775 23525 -44416 38536 -42502 30246 -20330 -2947 22310 -32937
270 -32937 52224 -50580 45383 -11566 -13615 40059 -59247 59952 -51430 15694 7686 -40031
282 -40031 53420 -58729 47953 -20513 1038 30085 -40990 54550 -43667 27744 -8479 -16845
294 -16845 28494 -46942 40059 -35225 13721 5868 -21079 37236 -33334 35343 -15498 5143
306 5143 12174 -23103 26479 -33231 20374 -16277 -5528 13780 -25453 29271 -21837 17908
318 17908 3374 -7626 22071 -19283 19094 -14392 1841 962 -15687 10605 -16828 10345
330 10345 -8000 4155 7822 -6655 17574 -8982 11946 -2846 -3760 7447 -16980 8342 -10962
343 -10962 -3797 3951 -9457 10525 -5132 7781 6520 -4050 12966 -6660 3835 -425 -9012
356 -9012 5151 -13543 4275 -6106 -4811 10703 -9883 12322 -4096 9802 4283 -10939 20579
369 20579 -17802 7463 -5848 -9586 13346 -25370 17886 -10735 -422 16545 -18209 20419
381 20419 -5803 7235 1445 -10755 16257 -10679 -7502 318 3498 -10206 1373 -1821 4055
394 4055 7891 -14908 24137 -14693 13473 3867 -24528 32251 -26234 12577 -18159 -745 27292
407 27292 -47569 33891 -15285 17218 -2619 -22079 52177 -46461 37050 -24957 -4360 38958
419 38958 -62727 50695 -47003 27401 16131 -68550 78078 -40813 23082 -7824 -21370
430 -21370 69363 -67527 25566 1118 -11602 21838 -45202 26975 -3990 -1065 -3001 -11975
442 -11975 28575 2220 -17152 -3296 33501 -9137 -20114 -2761 23221 -4582 -36548 21540
454 21540 -4393 18380 -29133 3202 32908 -25575 38327 -61681 51295 18035 -65193 50760
466 50760 -60170 83448 -60225 -46035 110148 -92020 68536 -60299 22392 74612 -114310
477 -114310 90137 -58031 37972 16499 -92248 85686 -43052 30908 -45918 -6725 82636
488 82636 -69261 15160 -10166 51721 -14284 -55252 58904 -16894 12405 -36651 -4896 44668
500 44668 -25814 -14634 -2930 22812 23477 -35444 -29536 89201 -34026 -30888 20537 -20067
512 -20067 84172 -126755 39863 56772 -84731 90924 -122257 102347 12271 -90157
522 -90157 99169 -102778 131921 -77802 -53519 109282 -78687 69510 -119331 83334
532 83334 34863 -97589 74658 -72070 115713 -77785 -22907 80556 -74514 95094
542 95094 -116545 40545 61624 -79877 37899 -60290 84105 -9660 -82242 61084 23501
553 23501 -16381 -25764 6389 33837 12616 -78133 48455 7529 -18230 22531 -90853 114551
565 114551 -34745 -36789 30976 -31589 113414 -134811 44515 42547 -38066 39979 -118560
576 -118560 143786 -70532 -16236 38643 -81159 155327 -147931 56217 23459 -44865 108459
587 108459 -176905 135193 -6314 -67763 55042 -83723 126896 -86550 -26445 70321
597 70321 -34946 35787 -56551 30406 30133 -16954 -21978 1225 32880 -9408 -27158 -22986 68580
610 68580 -30357 -29735 11666 22898 26939 -76249 54054 -1606 12397 -18339 -40237 87940
622 87940 -75351 42867 -50432 10731 81396 -131959 96412 -50788 46903 11750 -113285
633 -113285 160819 -101028 32975 -8545 -44710 115708 -135893 69135 -14380 -9780 53815
644 53815 -98368 87306 -22087 2987 -5215 -25726 71055 -56071 66 659 19609 -4220
656 -4220 -39971 32159 1980 3929 -23512 14058 14022 1325 -13750 -9725 35472 -24057 8049
669 8049 -32445 33338 11307 -58295 51828 -35646 46567 -32003 -23487 78139 -74604 57429
681 57429 -45292 11355 46407 -85280 71178 -56028 38721 -510 -58346 81893 -58223
692 -58223 42417 -31276 3040 50837 -69473 51677 -36928 27035 -2965 -41727 53711
703 53711 -44831 33472 -23869 -3969 37737 -36128 24542 -17512 19003 1325 -21051 13462
715 13462 -1278 2321 -18685 13554 -8493 11111 -11801 -3664 27573 -29331 30916 -26140
727 -26140 15421 14188 -37401 37898 -37033 29416 -17419 -16172 37026 -41309 39042 -32869
739 -32869 21087 11756 -32141 44812 -44123 38893 -21271 -10988 30211 -44486 42844 -39761
751 -39761 17994 9654 -26397 36850 -34319 34537 -16246 -1410 16042 -23416 25278 -30221
763 -30221 19101 -11163 -3331 10954 -21062 28406 -23457 19240 -5991 -816 16152 -23588
775 -23588 25587 -23689 15030 -9075 -8426 18169 -28316 28665 -24363 15787 2789 -15095
787 -15095 29759 -30966 29707 -18001 1149 12558 -26627 28081 -29610 18061 -6930 -6873 18210
800 18210 -22929 28018 -21424 15586 -430 -10849 21348 -27682 24451 -19665 4356 5981
812 5981 -19307 23689 -23158 18746 -7719 396 12028 -16078 21166 -18215 13022 -7219
824 -7219 -3337 9257 -19679 20111 -19655 11151 -1015 -7688 17758 -19140 20845 -11385 3556
837 3556 6691 -12815 14062 -16498 11399 -8910 -1010 6560 -11582 13586 -11851 12574 -4713
850 -4713 -122 10914 -13895 14764 -12345 5571 -1822 -9031 12128 -16385 10900 -4308 -839
863 -839 6501 -6378 12206 -8593 6357 1379 -4806 3529 -6367 4229 -7160 1134 512 -3364
877 -3364 3494 -868 3598 -2097 5954 -360 -1912 3357 -1781 -308 -6432 4696 -3577 -3854 2570
892 2570 -1497 4437 -5478 8217 -595 -1358 8194 -8895 6700 -4850 482 -319 -11594 15188
906 15188 -12504 -1057 8831 -7260 11723 -11479 9917 6032 -14468 15416 -11196 2818
918 2818 3051 -12874 10963 -11497 8342 -1422 -11040 20381 -10081 2565 614 1970 9042 -19610
932 -19610 14128 -3120 -5819 4580 -12683 15651 -11971 3682 4912 -12447 24259 -16940
944 -16940 1587 10988 -9213 11629 -22265 14630 7405 -26074 17122 -7426 4167 1984 -15123
957 -15123 22871 -10517 1212 8244 -16992 23611 -11649 -10149 12176 -8981 13531 -24105
969 -24105 7534 19435 -24818 13550 -8754 17065 -3211 -18202 28544 -22879 19081 -13582
981 -13582 -11673 30101 -32280 23197 -24568 11560 26463 -51287 41279 -13699 7625 3978
993 3978 -32763 53282 -36766 2884 10486 -21937 33414 -34714 10231 9049 -8545 16555 -27512
1006 -27512 21193 11275 -19242 1952 2536 12980 -14832 -13451 20056 -3854 -8105 -449 -1341
1019 -1341 19452 -16518 1985 7612 -6339 24872 -40628 19499 13937 -27347 21436 -38961
1031 -38961 48088 -16636 -34316 54028 -41493 40378 -30108 -4491 47936 -56660 43028 -35421
1043 -35421 13302 25365 -54773 40843 -24135 25086 -13125 -24523 51653 -31497 12123 -13912
1055 -13912 12593 17404 -39758 25682 -11147 7316 -542 -23536 26093 -5015 -3719 -359 -5678
1068 -5678 25469 -10706 -22729 31516 -9918 -2310 -3573 -15047 42450 -43287 9743 14798 -24537
1081 -24537 42665 -51693 32399 7103 -24464 33759 -51447 55248 -22291 -21970 31759 -32454
1093 -32454 45094 -51516 20294 21678 -34223 35879 -42208 42531 -11637 -19774 29829 -34865
1105 -34865 41907 -33089 -4351 26463 -23784 19524 -27766 19599 13417 -26856 13666 1665
1117 1665 3669 -1514 -11735 10384 6971 -18524 9758 -8529 6801 8862 -30836 31460 -11558
1130 -11558 5024 803 -18861 43696 -39401 14461 -119 -9476 25911 -47463 40701 -18926
1142 -18926 644 15888 -36784 52262 -37311 15183 3003 -19380 43656 -53531 31165 -4621
1154 -4621 -12922 21821 -39126 41459 -19750 -4235 16624 -18929 27458 -21236 5230 7506
1166 7506 -7556 6540 -13608 7577 2060 -5749 -4858 7108 1414 -1516 -2074 1516 12065 -14043
1180 -14043 8059 -4255 2884 3158 -17733 18598 -15755 11073 -6694 -8536 26147 -27375 22111
1193 22111 -13242 4903 16047 -33907 34129 -23467 8842 3140 -23548 34547 -31585 17872
1205 17872 -4067 -7606 24151 -28809 23729 -10803 3310 5438 -18238 21854 -17499 7813
1217 7813 -5187 -1947 10768 -15464 12890 -6820 6698 -864 -4244 8528 -6287 5341 -8109
1230 -8109 5930 -3405 -481 -314 -4961 11453 -13631 11412 -6073 3257 6866 -15072 19706
1243 19706 -16401 10431 -3895 -8489 17033 -22473 18425 -13540 4540 7990 -17634 23232
1255 23232 -19658 15788 -5162 -6830 18020 -22896 19415 -15310 4608 4906 -15514 18099
1267 18099 -16533 13409 -5816 -283 9145 -11202 14070 -13447 10629 -5695 -2559 6310 -13228
1280 -13228 14646 -15363 9502 -1656 -4605 11935 -13638 15741 -10437 5625 877 -7138
1292 -7138 10567 -14276 12069 -11356 5154 1265 -8975 15335 -15874 15740 -8301 1554
1304 1554 9209 -15521 17817 -15926 8173 -1914 -7524 11432 -15132 13588 -9163 4493
1316 4493 3055 -5777 11328 -12104 12885 -9480 2649 2879 -10327 12266 -14876 11127 -6291
1329 -6291 -1578 9191 -11667 13563 -9491 7524 -1201 -3968 8636 -11699 9490 -8896 4036
1342 4036 -1648 -4546 9346 -11820 11740 -6720 3720 2854 -6847 11850 -12692 9009 -4188
1355 -4188 -2622 5017 -9155 9833 -10005 6329 -378 -3693 7698 -7202 9055 -7542 4874
1368 4874 830 -6318 7764 -8964 6736 -6292 1333 3326 -8070 10027 -6878 4552 -116
1381 -116 -1081 5023 -7318 7133 -4289 -507 439 -1763 1463 -4661 5188 -3344 1902 -46 1117
1396 1117 2348 -4145 7530 -6531 2935 351 -4278 3853 -7105 7551 -6112 -224 5901 -5681
1410 -5681 5864 -4552 6321 -2279 -2300 6740 -8076 5847 -5328 1251 353 -5762 9171 -10166
1424 -10166 5760 2522 -5364 7396 -6300 8124 -3833 -4303 9259 -9287 2723 -341 -3296
1437 -3296 4101 -5285 4374 -333 -2328 7357 -4784 820 3933 -3285 938 -3445 3292 -1629 -6127
1452 -6127 6398 -3296 378 8 288 4535 -5739 7241 -3462 -1362 6613 -8974 5499 -5078
1466 -5078 2225 1960 -11386 14443 -7321 -1231 7217 -7272 11272 -10003 4212 5899 -13111
1479 -13111 12587 -9461 544 5754 -10400 9821 -8928 6536 3158 -11491 14561 -6722
1491 -6722 1872 -176 -3521 10064 -14325 8032 -1430 -5507 8707 -11508 10522 -5746 1128
1504 1128 7120 -13804 17003 -8380 -1849 7123 -10090 12511 -14586 4788 7743 -15329 13049
1517 13049 -7850 2723 5278 -10470 12883 -8103 2663 5811 -13339 12250 -5279 -3371
1529 -3371 4118 -7777 11864 -11263 1329 9849 -11493 10870 -8369 6188 2508 -10985 14950
1542 14950 -15908 10395 -1845 -11086 15998 -16795 15353 -10077 -2337 19104 -23551 18675
1554 18675 -8771 1135 9519 -20861 22229 -15268 1948 7318 -16321 18455 -12630 4385
1566 4385 3338 -7574 14532 -13104 4680 5435 -7662 4647 -6365 4671 239 -8735 8584
1579 8584 -4150 979 4066 -7742 11387 -6532 1958 3435 -10394 16678 -16262 4193 5163
1592 5163 -11856 16210 -20843 16469 -810 -13177 21550 -21548 19918 -9109 -6470 18198
1604 18198 -23399 21344 -15980 1129 13161 -19845 18375 -14817 10469 2535 -13976 18519
1616 18519 -12911 8054 -3961 -4176 10882 -12993 7196 -4071 -732 6114 -8866 5703 499
1629 499 -1391 3775 -6088 6078 1893 -9492 8552 -5537 2172 1491 -10805 15479 -12347 4432
1643 4432 3753 -10660 18717 -17764 10009 1020 -8823 15915 -21606 17070 -5760 -6736 12200
1656 12200 -17034 19244 -13885 2431 9003 -13056 16690 -15902 9875 870 -9382 12023
1668 12023 -14762 12451 -5777 -4781 9396 -9570 9558 -7196 1479 6861 -7578 5245 -2634
1681 -2634 622 2330 -5735 2441 914 -3908 3084 -3135 2028 3787 -7199 7897 -3660 2001
1695 2001 2293 -7869 11198 -9879 3787 -178 -6000 10833 -14029 10420 -3268 -2046 9130
1708 9130 -13602 15227 -9232 1596 4898 -11436 14269 -14205 6136 584 -6968 10603 -12512
1721 -12512 10590 -3421 -1545 6208 -7602 9478 -7520 2520 601 -3864 4634 -6630 4932
1734 4932 -2556 294 1371 -1654 3939 -2487 2186 -1281 2182 -1995 -253 306 -2509 3401 -6091
1749 -6091 5618 -3300 204 4120 -6681 9625 -7653 4437 686 -5216 8706 -10957 7850
1762 7850 -4262 -981 4699 -8697 10290 -8344 5204 180 -3729 8290 -9444 8946 -5592
1775 -5592 894 2972 -7855 8756 -8550 4800 -1641 -1716 5481 -6468 6759 -4224 3039 -528
1789 -528 -1551 3584 -5500 5268 -5701 3381 -1624 -2037 4770 -6793 7780 -5434 2649 1771
1803 1771 -4038 6697 -7116 5880 -3935 -70 2199 -5243 5690 -6461 5655 -3228 511
1816 511 4415 -6206 8186 -6685 5235 -1388 -3461 6595 -8763 6954 -5052 997 1891
1829 1891 -4798 7031 -6327 5096 -1545 -191 2437 -3920 5335 -6397 4120 -2502 -1186 2450
1843 2450 -4906 6519 -6304 4685 -267 -2581 5595 -5732 5967 -4607 1926 1229 -5100 4731
1857 4731 -5097 3559 -2885 1409 1503 -3408 5758 -4419 4150 -2636 951 2048 -5943 6525 -6176
1872 -6176 2731 -512 -2374 4522 -6133 6495 -3125 313 3081 -3436 3943 -4082 3632 -2402
1886 -2402 -1113 2293 -3393 2999 -3624 3486 -1445 -823 4126 -4056 3860 -1984 1272 -214 -2386
1901 -2386 3459 -3822 786 -84 9 -804 -51 1974 -1908 2377 -1499 2461 -1580 -343 3503 -5762
1917 -5762 4709 -2789 -464 1533 -3753 5532 -5541 3375 1432 -3546 4440 -3411 3658 -2991
1931 -2991 306 2101 -4877 3933 -3379 1523 -625 -1223 4005 -5466 5118 -870 -1665 3222 -2948
1946 -2948 3618 -3537 71 2916 -5096 2893 -423 -1600 2232 -1721 1838 -324 -757 3666 -3350
1961 -3350 1091 2207 -4070 2218 -1976 1039 -119 -3210 5210 -4013 1631 1590 -1883 3603 -3871
1976 -3871 4253 -2752 -1075 3923 -6203 4538 -3094 801 1010 -4753 7948 -6082 2251 3244
1990 3244 -4641 6066 -5800 3961 -257 -5018 6788 -7322 3253 999 -3955 4935 -4763 5036
2004 5036 -1115 -3141 6672 -5351 2258 -363 -1846 3338 -5742 4089 -1669 -2107 4600 -4870 4229
2019 4229 -1288 -116 2811 -5121 6524 -4034 -1322 3787 -5150 4710 -4873 1958 2882 -6466 7505
2034 7505 -4685 1517 3427 -5753 6845 -5450 2569 1596 -7056 8237 -6088 1033 2089 -4523
2048 -4523 7275 -7234 4052 1985 -5419 7130 -6585 4154 -486 -3964 5858 -7787 6423
2061 6423 -2654 -2936 6387 -6333 6808 -4585 1121 5313 -8076 7732 -4996 1071 2444 -6838
2075 -6838 7559 -6215 2123 1976 -5820 7743 -4793 1545 1821 -3770 5991 -5516 1498 2653
2089 2653 -5518 4636 -3859 1339 2170 -5042 5902 -4145 2199 2310 -5500 6967 -5192 2512
2103 2512 59 -4617 7538 -8693 4377 -716 -3259 6968 -8545 8102 -3225 -1402 6282
2116 6282 -8736 8988 -5722 -27 3902 -7560 8380 -7592 2455 3011 -5639 6774 -6011
2129 -6011 4068 890 -4066 5507 -4753 2609 -508 -3187 3763 -3643 1558 -74 -1976 4166
2143 4166 -3066 1165 1683 -2521 3911 -3870 1709 1323 -4533 4724 -5328 2849 691 -4392 6472
2158 6472 -6171 5093 -1141 -3177 7182 -7568 5707 -3200 -1294 5222 -8098 6921 -4393
2171 -4393 997 2971 -6015 7400 -5208 2633 610 -3400 5854 -5912 3123 -810 -1654 3375
2185 3375 -4925 3670 -1071 -548 2232 -2689 3296 -875 -894 1832 -1675 1062 -623 -1610 2148 -1932
2201 -1932 -14 1016 -2003 3328 -2757 772 1944 -2684 3774 -3880 2425 341 -3325 4109 -4669
2216 -4669 3764 -1829 -1711 4186 -4942 5166 -3403 988 2861 -4830 5417 -4678 2711 21
2230 21 -3910 4750 -4914 3379 -1566 -876 3338 -3493 3562 -1984 1061 902 -2017 1808 -2071 1276
2246 1276 -1484 -120 519 -841 716 -929 1634 -599 854 -222 308 721 -1327 1382 -2196 1862
2262 1862 -1551 -410 1471 -2624 3501 -3351 2639 405 -2225 3837 -4211 3760 -2279 -835 2521
2277 2521 -4399 4233 -3693 1457 650 -2115 3513 -3442 3423 -1535 -77 1457 -2360 2740 -3511
2292 -3511 2229 -1307 -704 1687 -2752 3123 -2348 2049 -262 -549 2328 -2813 2353 -2062 961
2307 961 -569 -1341 1887 -2748 2418 -1862 1547 128 -1048 2914 -3198 3293 -2070 517 867 -2514
2323 -2514 3445 -3951 2358 -995 -916 2094 -2741 3576 -2699 2044 71 -1585 2476 -2933 2782
2338 2782 -2737 1102 415 -2266 3060 -2997 2539 -1463 546 1670 -2699 3346 -2313 1187 -436
2353 -436 -511 1170 -2537 2445 -2257 1056 -288 -258 1563 -2313 3353 -2321 1281 538 -1425 2195
2369 2195 -3203 2722 -1947 -404 1615 -2340 2246 -1749 1961 -838 101 1675 -2067 1924 -1931
2384 -1931 1734 -1479 -927 2226 -3321 2634 -1830 767 791 -1714 3459 -2683 1644 171 -1266 1323
2400 1323 -1642 1379 -1715 462 372 -801 604 -332 1628 -1477 1331 117 -644 1099 -1263 1227
2416 1227 -1554 625 -10 -1396 1376 -770 753 -905 1496 -12 -742 1489 -1453 1651 -2098
2431 -2098 974 272 -2240 2948 -3146 1681 119 -1135 2452 -2921 3496 -1459 -1008 2562 -2304
2446 -2304 1695 -2349 889 505 -2277 2175 -1711 1175 -24 -393 1276 -1229 2157 -1296 -321 1203
2462 1203 -1259 137 -971 703 361 -1756 1158 369 -887 1166 -973 954 639 -1383 1704 -1892
2478 -1892 1330 202 -3081 3212 -1910 646 -205 -1241 3687 -3926 2112 368 -1230 2447 -3627
2493 -3627 3072 -1538 -541 1706 -3610 3726 -2410 23 1377 -1539 3590 -3883 2325 1010 -2654
2508 -2654 2488 -2965 2567 -957 -2194 2861 -3034 2409 -939 -1502 3516 -2085 1785 -843 -503
2523 -503 3134 -4001 1521 459 -1486 1822 -3275 3006 -401 -1828 3233 -2815 3194 -1070 -1677
2538 -1677 2991 -3064 2625 -2786 -220 3007 -4419 2888 -1838 1231 1455 -3772 4912 -2458 1105
2553 1105 705 -3224 4905 -4107 1268 69 -2193 4349 -4910 2460 1127 -2125 3264 -3955 3740
2568 3740 -437 -2749 3565 -3444 2869 -1750 -1714 3656 -3605 3174 -1914 -243 3532 -4215 3038
2583 3038 -1116 441 1649 -4415 4196 -2186 -301 1292 -3166 4310 -2989 470 1763 -2721 4044
2598 4044 -3449 1249 1943 -3316 2940 -3515 1980 863 -3978 4121 -2890 1908 22 -2623 4896
2613 4896 -3721 1860 -104 -1813 4183 -4874 2603 -423 -1391 2828 -4923 4205 -1127 -1055 2853 -3568
2629 -3568 4523 -3124 -291 2610 -3518 3639 -3802 973 1854 -3499 3093 -2829 1900 740 -3032
2644 -3032 3563 -2183 1259 -241 -2297 3604 -2801 375 286 -1478 2795 -3256 1415 1211 -1870 2427
2660 2427 -2730 2497 438 -2572 2879 -2861 2091 -916 -2278 3710 -3180 2151 -1376 -473 3482
2675 3482 -3836 3038 -1253 124 1787 -4097 3866 -2073 -40 892 -2830 4116 -3115 942 1103
2690 1103 -1549 3057 -3362 1875 528 -1766 1632 -2454 2196 -649 -1657 1878 -1309 1757 -789
2705 -789 -432 2137 -1398 782 -399 -131 1284 -2194 563 298 -880 1180 -1871 1676 234 -1384
2721 -1384 1889 -1380 1684 -710 -1297 2324 -2145 1505 -1503 -213 2115 -2745 2158 -1291 661
2736 661 932 -2226 2801 -1885 939 -123 -1332 2419 -2633 1210 -665 -223 1267 -2176 1868 -654
2752 -654 339 672 -1063 1594 -1094 224 82 -417 399 -804 183 175 42 -166 306 73 552 -125 -253
2771 -253 946 -926 637 -886 57 384 -1482 1337 -1200 868 -172 -700 1634 -1418 1709 -1041
2787 -1041 148 931 -1940 1711 -1728 846 -371 -1011 1640 -1818 1654 -731 87 881 -1135 1512
2803 1512 -1307 843 -326 -595 512 -1032 1021 -1346 667 -146 -234 746 -707 1347 -1118 852
2819 852 -95 -785 794 -1418 800 -1077 415 86 -694 1160 -809 1036 -854 740 316 -793
2835 -793 1416 -1609 1109 -983 152 775 -1581 2021 -1438 844 422 -653 1355 -1360 1412 -699
2851 -699 56 397 -624 696 -1225 1136 -825 228 562 -669 1040 -1032 1147 -712 -142 820
2867 820 -1477 1062 -1063 489 -222 -518 967 -881 894 -319 558 -150 -111 840 -1346 1059 -997
2884 -997 220 29 -929 1078 -1606 1212 -285 -217 796 -806 1390 -1122 832 -59 -694 671 -998
2901 -998 855 -995 723 -51 -1002 1508 -1007 1107 -614 58 767 -1349 1265 -841 -74 175 -523
2918 -523 285 -782 682 -205 -120 154 351 -124 -208 836 -616 483 -377 -149 171 -895 1039 -785
2936 -785 626 114 -439 651 -489 1053 -952 211 668 -1049 609 -1100 1081 -722 -408 1383
2952 1383 -1349 1442 -716 252 565 -1038 1483 -1698 639 438 -1531 962 -1011 1042 -620 -644
2968 -644 1509 -1009 707 87 207 434 -575 288 -305 -129 194 -924 205 380 -390 169 -102 620
2986 620 -63 -847 1180 -495 83 -114 -814 1331 -1427 748 -238 -582 1673 -2188 1368 146 -294
3003 -294 898 -2050 2358 -1194 -565 1126 -1557 2050 -2052 501 921 -1225 1728 -1775 1294 413
3019 413 -1269 1239 -1217 1718 -742 -1079 1374 -1082 633 -884 220 1412 -1610 781 -33 52
3035 52 853 -1419 1164 146 -621 645 -1489 1606 -321 -1526 1560 -1160 1449 -1066 -361 2302
3051 2302 -1923 1389 -940 180 1483 -2850 1905 -973 569 266 -2155 2911 -1369 354 93
3066 93 -743 2612 -2654 799 420 -758 1399 -2659 1810 92 -1346 1096 -1476 2355 -657 -1145
3082 -1145 2038 -962 1176 -1430 -337 1820 -2255 607 -523 383 1293 -2384 1954 -90 -264 734
3098 734 -1812 2490 -1138 -877 984 -1269 1993 -2018 57 1761 -1520 1381 -1767 1418 1050 -2316
3114 -2316 1796 -1071 1324 -412 -2088 2636 -1499 659 -546 -561 2626 -2627 1002 117 -233 1204
3130 1204 -2832 1956 -81 -1035 743 -1712 2298 -1223 -932 1759 -1020 1755 -1682 148 2036
3145 2036 -1878 974 -1174 726 671 -2477 1818 -535 294 -85 -1469 2471 -993 -112 440 -507 1826
3162 1826 -2122 540 642 -1106 909 -1963 1368 361 -1510 1310 -962 1718 -469 -1245 2202
3177 2202 -1233 713 -829 -327 1751 -2442 1057 -371 -113 1041 -1997 1965 -188 -212 560 -1226
3193 -1226 2178 -1261 -284 744 -953 1317 -1704 487 890 -1224 916 -1087 1187 206 -1211 1302
3209 1302 -764 649 -544 -896 1442 -1024 314 -213 -175 1106 -1531 534 425 -366 559 -1192 948
3226 948 -17 -958 731 -806 871 -582 -634 1396 -610 671 -467 60 1125 -1286 798 -437
3242 -437 -97 430 -1414 1145 -640 152 256 -734 1545 -1051 400 239 -520 888 -1133 681 -148
3259 -148 -477 628 -968 887 -366 -141 563 -358 568 -393 189 330 -472 84 -210 -5 137 -266 -31
3278 -31 104 -165 359 -288 294 115 -351 434 -671 401 -62 -599 726 -779 409 -401 -242 695 -872
3297 -872 922 -254 100 428 -767 784 -668 362 -146 -373 529 -502 651 -325 446 74 -394
3314 -394 847 -444 286 -28 -171 443 -537 376 -483 115 7 -288 196 -122 334 -289 431 9 -50 46
3334 46 -123 506 -891 286 -272 -189 299 -588 798 -466 414 369 -327 427 -527 510 -518 -43 -75
3353 -75 -677 513 -640 494 -297 102 790 -598 779 -480 332 87 -400 345 -773 364 -339 -263
3371 -263 82 -39 364 -353 572 71 215 118 -169 365 -552 537 -408 -180 382 -291 504 -323 485 -127
3391 -127 -70 402 -292 455 -393 291 -272 -345 406 -769 531 -604 249 -5 -528 1026 -694 504 -246
3410 -246 -108 285 -722 761 -572 -56 212 -358 413 -387 517 -387 2 395 -465 142 -120 225 -105
3429 -105 -199 169 -443 -1 -11 -113 -148 -27 134 38 -14 29 77 -262 534 -198 -393 336 -455 396 -473 93
3451 93 635 -741 954 -613 282 166 -545 636 -893 762 -428 -589 507 -677 644 -673 427
3468 427 339 -903 834 -671 710 -18 -512 734 -858 488 -489 -361 781 -752 489 -140 218
3485 218 410 -797 412 161 -172 268 -507 482 -101 -393 471 -325 468 -126 -543 1076 -444 179 -156
3504 -156 -147 901 -1425 363 -37 -356 748 -1341 1209 -399 -178 761 -1020 1672 -1108 108 742
3521 742 -771 1204 -1601 442 572 -1040 849 -1051 1239 -203 -830 1234 -886 957 -569 -426
3537 -426 1082 -1001 318 -555 186 861 -1244 759 49 -63 317 -928 1209 -126 -606 607 -670
3554 -670 891 -805 -456 1096 -916 855 -791 232 1244 -1660 1110 -515 432 346 -1588 1711
3570 1711 -881 345 0 -982 2150 -1666 504 137 -371 1426 -1867 1170 110 -707 670 -1539
3586 -1539 1518 -549 -971 995 -871 1187 -996 -128 1380 -1128 594 -633 338 710 -1692 978
3602 978 -133 -23 211 -1288 1702 -343 -452 478 -601 1572 -1219 -322 946 -743 834 -1597
3618 -1597 851 898 -1791 1099 -886 1099 -30 -1510 1888 -841 844 -379 -633 1921 -1861 335
3634 335 -79 53 826 -1849 1506 93 -541 392 -1075 1834 -735 -704 784 -609 1123 -1509 -36
3651 -36 1036 -965 765 -886 681 591 -1322 981 -330 446 -35 -1334 1533 -680 52 -163 -555
3668 -555 1464 -1245 365 730 -418 904 -1335 949 503 -1084 666 -880 1039 -372 -961 1134
3684 1134 -735 661 -799 -75 1405 -1264 677 -321 192 629 -1445 927 -326 -18 132 -1043
3700 -1043 1414 -526 -164 427 -423 1080 -1051 255 629 -703 462 -896 528 214 -974 757
3716 757 -256 538 -219 -509 1008 -577 116 -201 -174 766 -1051 245 -28 80 283 -905 835 28
3734 28 -315 488 -527 785 -439 -422 615 -560 415 -516 26 563 -655 494 -31 287 514 -763
3752 -763 654 -227 19 -169 -458 667 -766 8 133 -195 506 -627 374 70 -54 441 -520 675
3770 675 -122 -364 362 -456 371 -243 -247 454 -214 216 -78 298 355 -443 175 -42 -75 65 -281 191 80
3791 80 -363 205 -22 214 15 -267 423 -105 164 28 -173 108 -340 229 -393 -92 312 -426 369 -144
3811 -144 280 49 -312 506 -497 229 -208 -173 166 -483 341 -210 -84 316 -237 288 -60 145 53 -38 162
3832 162 -128 75 -238 -141 -313 3 -86 -265 10 77 31 -135 253 54 -51 231 -15 237 -300 181 177 -335
3854 -335 296 -291 170 -203 115 398 -425 355 51 -27 -36 -114 252 -248 342 -165 -155 54 -270 183 -293 425
3876 425 -118 -207 397 -244 243 -195 164 -163 -174 172 -246 41 -130 345 -47 53 372 -218 110 -158 21
3897 21 -130 -67 151 -426 279 -76 68 103 -94 300 -361 178 -12 -81 140 -310 294 -409 -12 52 -251 453
3919 453 -241 270 -228 -21 348 -367 481 -185 -83 -102 -434 269 -246 241 5 -191 108 11 301 33 102
3940 102 6 -78 96 -84 -233 -98 101 -23 -26 -37 221 75 -125 246 -141 241 4 -75 120 -188 90 -573
3962 -573 -34 307 -342 324 -323 424 -49 -259 631 -420 502 -193 -16 171 -589 311 -379 174 414 -450
3982 -450 429 -82 170 86 -122 715 -515 28 -69 -169 439 -599 208 60 80 214 -458 283 228 -86 255
4003 255 -254 356 -216 -415 347 -224 -130 -127 -308 794 -448 191 142 -29 606 -852 351 34 -249 191
4023 191 -688 890 -368 -389 594 -508 866 -777 298 615 -554 453 -678 625 309 -791 532
4040 532 -570 407 -353 -359 918 -503 345 -153 150 776 -837 219 -154 -50 195 -763 608 47 -315
4059 -315 97 -352 757 -288 -474 723 -423 359 -491 -188 854 -970 337 -271 209 716 -1165
4076 -1165 974 -165 -2 190 -851 1414 -871 -208 384 -431 832 -1230 265 349 -528 498 -989
4093 -989 958 -75 -616 672 -588 1097 -675 -304 899 -574 305 -415 168 696 -991 485 -87
4110 -87 189 279 -1073 839 114 -506 49 -469 881 -714 -494 827 -445 677 -695 88 937 -859
4128 -859 567 -496 670 193 -1136 924 -592 309 -253 -518 1342 -882 286 1 -292 953 -1242
4145 -1242 690 97 -191 371 -1050 865 -238 -497 462 -378 859 -495 -182 967 -631 313 -606
4162 -606 131 396 -918 468 -285 194 5 -538 944 -300 43 78 -607 812 -822 115 288 -405
4180 -405 511 -902 429 512 -563 521 -531 673 -22 -646 825 -628 429 -325 -360 755 -769
4197 -769 426 -193 166 551 -848 571 64 -92 321 -713 673 -291 -251 145 -368 639 -740 133
4215 133 335 -440 423 -599 344 292 -592 518 -444 148 -96 -541 314 -310 -34 98 -226 768 -611
4234 -611 -39 204 -276 356 -549 425 135 -312 305 -468 464 -85 -170 446 -227 492 -214 -74 403 -477
4254 -477 153 -221 40 208 -655 521 -130 91 139 -373 613 -262 170 233 -274 323 -260 33 94 -277 405
4275 405 -371 110 -73 -184 372 -297 179 -115 -351 210 -247 203 -144 -60 162 -257 -45 -127 -125 -2 -173
4296 -173 395 45 -94 32 -144 132 18 -144 94 -209 36 -175 26 217 -209 167 29 215 191 -233
4316 -233 196 -155 -292 -96 -146 239 -86 125 22 39 347 -110 187 -190 -149 90 -211 236 -242 -32 64
4337 64 -89 212 49 -3 -163 5 162 27 62 96 -16 31 -94 -176 80 -170 -119 -41 -187 71 11 166 98
4360 98 -28 225 -204 47 -214 -122 -75 -186 283 -99 117 72 -271 217 -118 228 -25 43 207 -243 229 -154
4382 -154 92 128 -194 194 -155 241 98 -33 111 -200 -95 -85 -22 -47 -135 12 -104 -83 -87 177 -44 77 24
4405 24 -161 124 -194 133 -21 -62 -66 -121 107 -160 106 -24 43 195 -216 220 -4 132 151 -265 94 -408
4427 -408 -42 9 -114 101 -357 315 29 -67 168 -126 86 -207 -48 -71 -111 169 -214 -86 -166 -147 -59 -79 198
4450 198 -77 -105 30 -56 144 -82 26 -2 -141 23 -325 -60 179 5 139 159 74 179 -149 84 -27 -147
4472 -147 181 -99 196 -45 -311 164 -358 389 -26 -85 229 -330 442 -242 -145 308 -401 156 -304 172 -21
4493 -21 -325 275 -310 200 -22 -269 344 -368 160 -129 13 185 -572 169 -151 -223 43 -411 394 125 -90
4514 -90 169 -250 136 33 -127 232 -262 -85 -223 -108 481 -687 324 84 -78 291 -264 442 -87 -65
4534 -65 209 -605 364 -681 44 293 -346 528 -552 374 235 -482 491 -397 518 -50 -441 687 -447
4553 -447 284 -410 -129 498 -498 198 -134 -8 235 -659 456 -178 -74 1 -402 363 -240 -226 371 -81
4573 -81 382 -249 -109 621 -328 447 -251 140 234 -688 378 -356 55 163 -508 648 -371 87 219 -65
4593 -65 735 -698 310 344 -313 329 -656 446 -65 -509 462 -377 643 -214 -207 552 -368 424 -349 7
4613 7 307 -466 350 -237 192 187 -490 462 -8 -22 54 -230 440 -232 -50 375 -356 480 -531 -69 460 -419
4635 -419 381 -154 205 158 -556 593 -216 264 12 -303 764 -586 196 34 -119 601 -662 392 65
4654 65 -139 420 -612 521 -275 -201 150 -449 393 -453 -117 443 -356 476 -260 238 289 -436 371 -86
4674 -86 222 187 -628 513 -243 183 -60 -252 644 -148 150 154 -46 379 -346 9 313 -382 282 -418 255
4695 255 87 -396 332 -464 516 -304 -378 542 -322 395 -225 -23 427 -592 329 -161 115 35 -398 661
4715 661 -133 61 236 -274 413 -209 44 94 -350 257 -352 68 128 -263 314 -151 137 10 -280 495 -340
4736 -340 65 -101 -38 251 -425 120 40 -12 130 -435 229 52 -169 207 -376 199 -105 -312 151 -125 214
4757 214 -196 48 319 -197 249 10 182 109 -158 242 -30 42 47 -216 165 -136 32 82 -115 294 -188 266
4779 266 116 -85 53 -128 -43 112 -366 133 -155 -3 67 -25 235 29 277 -106 -137 155 -20 92 -16
4800 -16 -26 11 -210 129 145 -142 116 -173 204 196 4 122 -77 -11 -41 -72 118 -126 114 -183 108 122 -195
4823 -195 188 -182 152 -4 -19 44 -87 -29 -127 -236 -42 -23 -78 -10 -42 70 -148 -11 -26 -26 123 -81 14 22 37
4848 37 -122 43 106 96 29 32 25 -30 6 22 162 27 -39 34 -70 55 -156 -140 3 48 194 -83 45 160 12
4873 12 246 -87 -8 -14 -109 123 -75 44 22 -4 19 0 138 -112 0 41 -19 94 -100 -1 -182 59 28 -190
4897 -190 -64 137 120 150 10 212 -107 -81 -70 -40 7 -152 -104 -101 -87 142 -5 -84 160 39 -31 -38 -120 141 50
4922 50 41 -7 -178 63 -207 75 -154 -27 -59 61 9 -111 126 213 -36 93 -50 -68 -26 44 -77 -125 174 -44
4946 -44 70 41 -54 165 -20 187 1 -89 132 -85 157 86 -16 74 -80 -11 78 -117 -186 -49 199 62 -90
4969 -90 34 -127 192 -103 -251 -108 -222 -69 51 -119 138 -115 168 150 20 219 -121 148 -40 -83 166
4990 166 -192 109 -135 -2 290 -397 236 -172 121 -43 -375 309 -137 8 -50 -239 325 -209 111 53 -4
5011 -4 224 -237 210 103 98 217 -154 308 -13 -265 147 -175 307 17 -101 84 -173 315 2 -29 242 -131
5033 -131 97 -161 -134 45 -423 230 -174 -53 146 -260 379 -132 -190 389 -376 231 -436 61 271 -175 319
5054 319 -396 197 109 -360 289 -137 220 -71 -117 397 -526 243 -20 31 122 -400 293 -194 -178 173 -365 352
5076 352 11 -170 253 -217 213 -287 -282 240 -177 217 -157 50 365 -306 174 -152 116 143 -361 328 -257
5097 -257 9 1 -289 353 -347 109 175 -307 305 -426 251 13 -158 256 -428 461 -100 -94 295 -385 229 -138
5119 -138 71 371 -235 390 -74 -51 268 -351 285 -160 -58 277 -409 506 -154 -20 194 -129 374 -165
5139 -165 94 143 -316 182 -298 76 310 -138 398 -232 321 78 -266 499 -363 268 121 -206 508 -381
5159 -381 189 -171 14 375 -528 353 -169 -175 300 -343 253 -128 -77 377 -377 401 -262 44 -98 -377 350
5180 350 -105 133 53 -211 204 -220 215 99 -198 331 -199 84 175 -364 427 -185 38 99 -49 318 -317
5201 -317 188 69 -285 133 -308 96 -22 -138 336 -250 133 -148 -123 230 -342 191 -37 48 119 -392 69
5222 69 -320 -47 215 -159 323 -281 158 115 -132 367 -189 188 115 -293 176 -195 -45 89 -140 275 -48
5243 -48 26 -77 -157 243 -322 159 139 -299 233 -136 128 -215 6 114 -274 177 -120 -222 214 -127 149
5264 149 -133 -58 228 -194 160 -271 -44 112 -150 169 -194 143 201 -75 327 -93 38 69 -108 124 -235
5285 -235 25 -135 -139 266 -90 23 -128 -79 160 -156 121 -3 48 -12 -204 26 -129 -89 163 -288 -21 5
5307 5 130 249 -58 -26 -167 -39 77 -84 125 -76 27 252 -68 112 -31 -6 335 22 -101 37 22 -141
5329 -141 -109 68 -113 -50 105 -30 9 1 -16 -29 147 160 -186 69 -49 96 133 -43 -41 -93 -105 93 -138 -48 -25
5354 -25 16 -3 69 80 62 35 63 -137 -72 -158 -119 -5 -28 -93 -8 47 37 65 43 195 66 35 -211 -86 -67 -105 8
5381 8 31 99 67 139 -7 -35 64 -147 -97 19 -40 66 -242 -95 40 -85 57 -178 53 76 30 55 11 -53 92
5406 92 107 202 -98 -137 120 -72 9 103 88 -78 113 18 6 26 -31 -40 83 -173 -119 48 -36 123 87 -40 -27 104
5432 104 152 -24 94 -131 62 -32 -127 73 -54 -52 -100 -216 203 7 50 7 -118 142 32 112 -102 98 67
5455 67 -59 -61 17 2 7 106 181 -124 -60 -46 102 104 21 15 -68 -137 16 -231 -205 109 6 -23 50 79 -38 23 -2 -19
5483 -19 -39 174 -102 184 -280 49 -176 13 74 -316 -19 -19 -109 45 -97 190 -134 -129 177 -185 72 -144 64
5506 64 97 -88 122 -22 155 -117 -179 177 -93 147 -115 -165 229 -312 -61 -105 -60 38 -87 -60 -29 31 6 -70
5530 -70 98 126 -132 47 -182 23 21 87 209 -104 289 74 -79 145 50 67 11 -9 97 -412 49 -106 -18
5553 -18 86 -117 266 -168 -38 145 -128 20 -145 -21 79 -330 215 -153 41 -96 -15 242 -167 50 -103
5574 -103 36 311 -145 149 -153 -137 212 -196 22 -89 -68 137 -191 120 -96 98 235 -338 53 -104 -72
5595 -72 67 -122 56 -266 183 113 -100 328 -112 -48 -1 -215 254 -170 152 72 -119 177 -153 153 97 -140
5617 -140 331 -180 152 146 -222 170 -168 206 -63 -102 243 -244 92 -74 12 139 -30 382 -42 128 195 -276
5639 -276 289 -307 -123 75 -349 210 -131 -116 151 -85 345 -151 -73 61 -166 58 -270 48 172 -99 186
5660 186 -185 -42 15 -218 69 -278 149 35 -120 272 -216 180 23 -99 119 -285 218 -236 -99 144
5680 144 -135 152 -95 -51 -88 -71 142 -160 37 25 -231 86 -287 149 67 -98 34 12 53 -37 -57 115 -85
5703 -85 69 46 -139 8 0 -5 -54 -134 -37 -152 4 10 -131 256 -169 285 -119 -84 48 -307 164 -51 13 307
5727 307 -78 191 -99 -44 171 -182 240 -194 -58 -33 -181 110 -304 93 81 -117 103 -126 110 67 -177
5748 -177 175 -139 -5 -113 -230 106 -244 32 -62 -88 34 -193 67 7 -116 102 -72 10 67 -181 50 45
5770 45 34 12 46 42 -30 216 24 -38 108 43 49 0 -49 119 -115 199 -107 -7 116 -13 233 -165 53 19 -101
5795 -101 260 -175 151 -49 -84 109 -210 27 -8 -33 194 -80 55 -92 52 155 58 6 -119 35 98 -202
5817 -202 28 20 -130 33 -83 13 94 0 16 52 79 53 73 9 -39 35 -28 -9 84 -34 168 105 -69 -3 -62 48
5843 48 -92 -70 -14 -69 44 -131 -22 -53 -37 78 -22 120 90 3 160 -106 53 -127 -36 -3 126 15 109 64
5867 64 -40 59 -63 27 109 -94 -180 -73 6 -36 -82 -66 -101 -201 3 14 79 79 111 73 9 -12 -59 -190 -127 1 12
5894 12 -73 -64 39 12 -17 24 -159 -19 -25 -61 -9 99 46 10 -284 -91 -117 46 42 110 162 61 -13 10 94 88 -35 121
5922 121 -77 -104 8 -80 0 22 -57 19 12 -106 73 14 -51 -140 -32 -28 -45 -130 -140 -161 -25 -1 -21 -15 51 -20 90 190
5950 190 -154 97 -93 93 126 -135 95 -99 144 58 59 26 75 121 14 104 195 -99 138 -40 19 21 52 140 -160
5975 -160 100 1 -27 172 13 70 -85 11 2 90 50 190 16 9 -92 -13 54 159 98 -10 118 -34 17 -60 -156
6000 -156 101 25 -42 -23 -21 115 -31 69 110 -82 160 -53 139 141 -207 -28 -99 -55 -72 -24 66 -102 80 -146
6024 -146 -102 166 24 99 -11 -37 64 -82 117 142 -17 14 -139 -86 -85 -61 148 -154 132 83 -69 -17 -59 23
6048 23 -253 99 -41 -197 75 -2 4 173 -275 -83 -116 -18 -70 -81 140 -233 7 -149 -193 141 -321 111 -15
6071 -15 -106 197 -28 126 3 -99 170 1 194 -96 -139 122 -255 246 -86 10 99 -22 90 -114 -44 142
6093 142 -237 35 -144 53 -60 -37 34 -57 31 -80 -53 287 -265 29 1 -156 257 -91 -45 213 -122 76
6115 76 -318 89 58 -81 204 -11 177 15 -112 122 -77 78 -251 -91 125 -112 294 -99 130 122 -220
6136 -220 246 -159 -98 83 -82 39 -193 -1 60 -184 170 -100 70 183 -162 191 18 25 -58 -75 48 -237
6158 -237 108 49 -216 202 -177 66 -126 -213 203 -156 46 -18 -59 23 -121 77 -77 -149 21 -256 191 -123
6180 -123 -21 193 -250 175 -154 98 -10 -67 214 -235 -2 1 -139 93 -23 71 -39 -249 240 -137 160
6201 160 81 -151 193 -193 5 24 -72 212 -115 136 -101 -204 241 -50 38 -172 117 -100 -132 142 -172 2
6223 2 100 -196 44 51 -21 -30 100 219 -34 -55 25 -131 -74 -290 -95 92 -39 201 -158 -7 -27 -113 77 -62
6247 -62 -8 -122 -84 77 -117 48 -52 -129 50 -132 74 79 -29 163 -127 29 60 -35 -95 -164 -87 -137 -202 -18
6271 -18 -20 54 -68 76 113 167 74 -44 -37 53 -52 156 64 -72 153 -100 248 83 72 111 35 228 -43 19 76
6296 76 47 27 -37 72 31 -42 45 55 76 -115 -99 6 -34 -35 15 29 54 -92 284 -213 -64 197 15 58 -38 -2
6322 -2 -40 -105 268 58 -183 97 25 12 -117 -180 -1 -212 -28 -4 -164 73 -56 43 -43 153 114 -208 99 38
6346 38 -73 178 20 7 75 85 -46 -16 10 -176 64 132 -58 -21 -10 62 -4 6 -63 -52 91 -47 44 119 -49
6371 -49 -86 -68 201 55 6 -46 -41 170 143 -8 -48 -41 83 43 -147 -188 -36 -57 -94 -40 -113 58 72 85 -91 -97 -201
6398 -201 -33 83 -122 43 -145 -10 -129 -28 142 -12 36 -29 -17 -47 -82 88 -19 -68 -121 -56 142 34 1
6421 1 95 88 84 35 97 18 -34 -116 185 82 23 99 -34 -70 -37 -4 -88 -20 66 103 5 -132 124 -58 30 -50 88 89 -3
6450 -3 -18 -111 -172 -27 34 76 47 -123 5 70 101 -17 -78 -46 -170 -157 -113 -71 -14 -98 -8 -4 64 -59 -72 137 -56
6477 -56 3 -70 -93 125 108 -47 -96 181 -81 -266 113 64 -206 -239 -141 -37 -55 117 13 24 -8 96 191 11
6501 11 -58 -36 63 -34 -33 38 155 25 84 110 -66 174 9 -19 99 -56 45 59 44 -10 10 -63 -52 -71 60 -59
6527 -59 -132 -189 121 4 -62 -1 -9 58 -11 46 21 -8 70 -120 15 259 -236 -15 52 5 -23 -173 19 -87 -32 128
6553 128 96 132 -38 8 -8 -124 262 -249 39 97 80 145 -101 57 20 -139 -105 75 24 -53 -144 269 -98 27
6577 27 -200 43 214 -72 140 -101 -6 226 -89 14 122 -186 174 -33 45 -118 -38 212 -67 76 99 70
6599 70 46 -187 97 -149 -53 13 -145 154 104 67 40 111 113 -199 -60 127 83 151 -94 101 30 41 113 -43 140
6624 140 -125 -91 -85 -79 -54 21 25 241 42 167 13 -6 251 -54 197 -115 -125 5 -200 -36 -102 -152 126 38 170
6649 170 147 -100 194 -44 138 -217 30 -82 -203 57 -68 131 -33 -62 161 -1 -36 -9 -247 111 42 -38
6671 -38 4 -128 235 -44 3 -47 58 53 -87 -132 -14 42 -6 -67 119 52 -137 66 -58 108 13 -83 124 -79
6695 -79 142 -44 10 111 -143 187 -178 21 -27 -121 229 -131 -43 -25 136 24 -90 88 113 -173 29 -140
6717 -140 87 50 -111 96 -169 28 -85 67 231 -90 -35 87 -112 218 -178 181 40 -96 39 -212 51
6738 51 33 -18 225 -7 23 117 130 -1 -171 57 -81 -67 154 3 122 -131 111 46 96 11 -96 -157 -73 -18
6762 -18 134 11 -4 0 70 -101 -104 -22 -20 66 172 -130 115 -3 -62 78 -131 79 3 -21 102 -158 23 -67 -23
6787 -23 71 28 139 -13 -5 86 -29 146 -106 146 28 -136 -77 -153 93 88 -59 71 -273 138 90 -76 86 -18
6811 -18 139 46 -75 63 -13 -9 71 -210 111 5 77 -3 0 141 78 -66 -192 -177 28 2 66 50 -120 -56 155
6836 155 134 46 -1 29 147 -31 -92 45 -7 -106 -20 -53 -100 -90 -31 176 68 186 -7 34 58 -128 -150 113 13
6861 13 33 82 -53 116 61 -12 111 -98 -39 -73 -158 -128 -26 -36 -49 47 -20 19 38 17 -88 -104 -37 55 -104 -107 95
6888 95 184 -46 -16 69 -58 130 -20 26 14 45 109 126 54 45 35 95 142 -21 -3 -134 194 49 -6 60 -112 181
6914 181 -139 43 -8 -10 18 76 23 56 7 8 -31 3 21 20 88 -36 78 -96 -86 -93 51 -38 -4 -14 14 25 -67 -52 -242
6943 -242 19 36 117 -91 26 -9 -26 -37 -113 120 70 -107 13 -141 184 53 -84 50 24 84 31 -17 0 -99
6967 -99 24 123 -38 -72 110 -28 -46 8 31 -51 31 125 84 39 10 2 -21 135 -69 -17 113 -81 125 42 -37 -49
6993 -49 29 -124 -42 -151 -40 -87 5 -111 -112 129 41 126 113 -71 65 1 32 -82 -31 37 131 2 -94 -91 112 5
7019 5 -107 92 7 79 -139 -54 28 -56 23 5 113 -25 55 31 83 -93 13 -60 73 113 -150 -179 181 -70 -17
7044 -17 -4 77 5 84 -1 35 -204 -91 -87 -66 -24 67 -8 -5 73 -13 12 120 -141 34 -49 -5 164 17 10 79 -6 22
7072 22 -60 81 24 -87 -7 -215 -11 -103 -96 280 -220 -62 15 0 -25 -73 228 41 -57 -56 -134 33 52 -53 81
7097 81 -197 131 -57 -4 32 -64 60 40 -182 27 -105 134 -97 -49 124 -58 231 -168 15 26 19 -102 -54
7120 -54 -57 -54 31 40 -40 2 -50 -197 24 -84 32 -50 62 -67 -20 16 -191 -216 59 -200 106 219 -50 174 -82
7145 -82 125 33 -32 8 3 158 58 -20 195 -52 -40 -23 233 33 -58 72 -103 51 30 -67 -25 -174 6 -177
7169 -177 -141 123 -127 -2 51 -80 -67 77 -72 63 -87 92 -112 -70 -47 -36 235 -29 100 66 1 66 -116
7192 -116 51 -17 148 8 -93 372 88 57 203 -35 -133 -84 27 18 124 45 18 -48 23 18 157 22 6 22 20
7217 20 3 56 -6 -28 39 187 -118 200 -107 -109 -281 -92 166 41 34 202 2 28 70 -52 150 -18 111 12
7241 12 39 83 -71 99 -15 132 82 -100 47 -94 -21 125 -19 -50 -20 13 -120 -62 -52 -7 68 85 19 171 69
7266 69 28 69 -46 87 -53 108 129 1 65 -167 98 -119 -125 92 5 214 114 -41 98 -111 107 20 -48
7289 -48 92 -84 -76 69 201 -123 -104 -61 -75 52 145 21 -29 67 5 54 25 -165 -69 1 -70 -58 230 -74 -22 -43
7315 -43 69 -117 -168 -30 130 -11 86 9 -19 62 -53 26 37 189 -29 45 -126 -18 -180 -74 -93 159 60 -29
7339 -29 43 -190 292 -15 25 -40 -76 -12 42 95 -149 -20 96 -12 44 5 -131 105 -72 10 -22 -7 10 31 136
7364 136 -56 42 88 17 -81 -126 29 -8 -33 78 -10 35 127 46 11 -137 -160 65 19 -6 54 75 -21 -10 -5 -39 51 172
7392 172 72 3 -106 -82 98 208 66 -110 5 -24 -93 -11 -81 -23 -34 -122 10 -49 41 47 39 32 4 168 -104 52
7418 52 15 -102 -73 -139 68 -23 -123 -73 -52 -122 61 39 -164 117 61 29 -23 -122 -53 -98 -30 60 -40 25 66 136 -67
7445 -67 2 0 -27 106 -165 -60 -115 152 156 31 -2 56 70 -172 83 117 165 169 -116 -105 -59 -88 32 -179 -1 45
7471 45 19 35 -132 39 16 -106 115 -145 -15 13 40 36 39 86 -102 23 -23 2 73 -30 3 68 75 30 -91 -64 -14
7498 -14 93 14 -112 78 142 -64 -42 -44 -37 -172 14 12 -209 -12 -117 22 -50 -7 115 -34 -163 43 -114 -70
7522 -70 -67 146 64 13 -98 40 145 136 18 -5 -60 260 6 -63 100 -17 -22 60 -5 89 14 -16 93 37 92 -125
7548 -125 64 203 92 6 -64 118 -93 3 111 -79 63 26 38 36 -28 138 -75 -35 86 47 78 -60 37 136
7572 136 -270 -64 42 7 -130 -54 33 34 -37 -28 -144 -55 3 53 78 28 53 19 206 -62 51 53 -230 106 -93 -120
7598 -120 152 17 -49 92 99 -22 40 157 -113 153 50 72 -178 -4 22 199 97 45 35 -71 -24 -126 33
7621 33 -138 -22 8 -52 132 -174 -62 -71 130 57 -92 -93 168 84 137 5 8 -120 -116 -17 -135 -39 51 -110 33 -9
7647 -9 50 32 -75 148 -77 63 -240 -42 -15 -12 78 -160 -107 6 -40 -45 -32 120 63 45 67 -48 45 161 -125 -33
7673 -33 -11 -165 112 -84 148 -48 130 162 -12 -91 -69 126 -98 -44 76 104 171 66 -206 -27 -20 78 115 29
7697 29 159 50 81 75 6 78 -148 98 18 6 -34 -52 133 99 -206 -4 111 45 -14 -160 40 -151 -19 23 -39
7722 -39 -34 -69 93 -58 36 84 -71 -155 -16 38 7 -118 121 -1 -24 -38 -51 100 -150 85 -160 37 55 35 52
7747 52 46 -21 99 -135 90 59 -55 -15 -200 131 -80 61 -23 -90 142 -39 -38 57 -63 -65 -51 157 -1 24 -25
7772 -25 87 157 -74 -13 83 -100 -164 -21 40 -164 -160 27 -61 62 61 65 -148 25 -5 12 7 50 83 89 -43 8 -90 -83
7800 -83 -62 -100 6 37 -48 -26 191 -53 70 40 -110 8 -16 22 14 32 -16 -251 -26 122 31 -51 -20 112 -174
7825 -174 -73 136 -64 -65 141 72 151 -56 -118 -130 13 148 -41 -43 -65 101 42 48 -38 15 113 -42 20 -75 -28 -56
7851 -56 76 -38 -180 -184 83 120 28 54 -35 -69 -169 101 104 -151 -48 -87 184 19 72 7 74 136 -73 -156 41
7876 41 31 -14 -57 -62 55 -48 66 -33 60 -34 -25 66 -63 22 43 -5 59 -56 24 42 -61 -29 63 48 -113 -35 70
7903 70 79 -2 94 -15 82 -160 54 31 66 56 -21 -75 12 49 -90 -73 19 -47 -132 16 -70 -67 0 58 143 115 67 51 157
7932 157 -74 81 122 -133 -58 27 -87 13 -47 -30 -22 -132 -94 -97 41 143 87 54 71 -92 123 42 17 28 -1 -151
7958 -151 124 76 -5 23 192 -24 -156 12 -57 -2 49 64 -55 6 17 -72 -101 -116 -62 8 15 -5 35 55 -3 -166 139
7985 139 22 -139 30 16 -114 -33 -43 35 -165 -3 38 -10 5 74 8 6 -11 -81 142 -31 -27 13 -177 -22 108
8010 108 77 34 -160 -5 190 -174 -100 77 -173 -89 111 164 -68 82 79 40 55 129 -61 -190 2 -148 22
8033 22 47 56 24 32 28 173 -92 96 -127 31 -115 -54 12 60 -78 19 -94 68 -60 42 152 -61 -7 44 -4
8058 -4 92 -34 28 164 24 -41 -77 25 188 130 55 -62 153 129 -6 -80 -205 80 -97 74 41 -19 19 48 37
8083 37 23 -37 -12 -114 21 -7 -11 -13 38 49 -84 -102 14 55 42 113 -18 -7 -4 -100 -117 -238 -83 -82 38 138 -262
8110 -262 33 24 19 35 8 66 -150 62 1 70 85 -35 201 -91 -71 -26 -172 64 -58 12 -57 39 53 -32 -82 22
8136 22 21 32 -55 -55 94 37 46 -12 -22 127 74 33 25 -73 -29 28 -33 88 -12 33 -82 53 -116 -25 60 3 -39 -203
8164 -203 66 100 -38 31 -9 103 -2 -99 27 66 -3 41 11 -64 13 14 -45 137 -113 41 -38 87 -54 160 -35
8189 -35 -40 -123
8191a23
$$ Imaginary data points
##PAGE= N=2
##DATA TABLE= (X++(I..I)), XYDATA
0 0 0 0 0 0 0 0 8 -8 8 -16 16 -24 24 -32 40 -48 56 -72 88 -104 124 -144 172 -196 228 -263 302 -346 394
29 394 -449 510 -574 646 -726 812 -907 1011 -1125 1250 -1384 1532 -1693 1866 -2054 2262
45 2262 -2489 2736 -3007 3309 -3638 4001 -4407 4860 -5371 5949 -6613 7381 -8280 9350
59 9350 -10643 12237 -14249 16862 -20382 25349 -32795 44962 -67729 122856 -469877 -477774
71 -477774 719565 -580495 564607 -541372 18470 557468 -597738 377302 -311347
80 -311347 260566 113733 -352446 206205 -81827 256925 -321173 -19299 197966 -20190
90 -20190 -56966 -240523 367898 -55052 -149276 13737 74853 138884 -189356 -24893 70150
101 70150 148070 -212726 729 30983 69739 79121 -426299 426502 -81554 -79517 73241
112 73241 -247691 553737 -466481 73128 161958 -217784 363314 -523549 326447 3875
122 3875 -141899 177539 -367924 495059 -243742 -58830 113592 -91438 307732 -466623
132 -466623 248247 61103 -143967 115765 -262269 336447 -149489 -83416 128599 -111221
142 -111221 196316 -157279 -29156 130287 -19121 -37945 -57364 41592 99541 -112157 -103517
153 -103517 201941 -92513 12247 -45484 -2790 195178 -248150 138357 -33807 6749
163 6749 102297 -253959 232614 -106554 33119 -25638 -113241 269715 -245419 107720 -34433
174 -34433 27934 109694 -255023 259601 -141715 57384 5453 -157050 258326 -232810 115617
185 115617 -49114 -38599 188284 -248221 166357 -29442 -891 41301 -128534 167264
195 167264 -90010 -14533 12882 -13689 38406 -61785 23709 -3474 40621 -39235 13580
206 13580 11665 8885 27867 -90894 89298 -35407 -7593 -9505 -30413 87645 -107073 62378
218 62378 -22500 17466 31984 -82087 115666 -92793 72137 -35119 -46105 111452 -139375
229 -139375 105839 -84365 27756 60656 -135561 149079 -96669 58149 2739 -61230
239 -61230 113781 -111399 72707 -42284 -4402 37182 -70771 63414 -58413 52173
249 52173 -25916 -7839 45422 -44615 54782 -54083 43930 -9914 -25439 33182 -46925 44301
261 44301 -44957 20688 -2690 -10785 29497 -37820 49336 -35881 31829 -11245 -13151 40856
273 40856 -60374 53337 -47760 17039 8526 -43716 59399 -58146 49054 -19527 -3157
284 -3157 37837 -47435 54736 -45586 26198 -5371 -25813 35334 -49098 40558 -33108 13081
296 13081 11138 -25691 43319 -36474 35512 -14759 346 16817 -31250 29553 -33246 16819
308 16819 -12360 -7069 17801 -26693 32141 -21081 17781 3527 -9941 24979 -25561 20304
320 20304 -15041 -1328 2965 -18325 15262 -19072 11838 -3286 1741 10217 -6852 17692 -10722
333 -10722 10526 -3310 -5643 5819 -16905 9004 -13271 168 4437 -9655 14504 -5289
345 -5289 8338 4709 -2101 10972 -9732 5422 -3440 -9062 4231 -13054 4711 -4362 -1736
358 -1736 8744 -7909 15739 -3677 3818 6559 -5677 10726 -18697 11296 -6555 -12351 11738
371 11738 -19269 17997 -12612 3895 14341 -16092 25796 -15275 6769 7223 -12373 9436
383 9436 -17884 10431 -3977 -13448 6095 4008 -3084 -1971 9827 -1999 12488 -13157 11030
396 11030 2748 -14123 19893 -33258 21708 -5638 -15761 15358 -22979 40352 -34706 9546
408 9546 22927 -20433 27026 -39988 43996 -21273 -13149 25483 -47506 57213 -51248 13901
420 13901 15489 -32618 63446 -76071 51842 12170 -40091 42241 -51647 61236 -36124 -26477
432 -26477 47914 -41300 29363 -30154 7649 25064 -21306 12632 -12771 23101 4847 -21099
444 -21099 -4105 24424 -3460 -31937 6136 13937 5828 -37716 19493 15648 -3838 -643 -20519
457 -20519 49821 -29734 11339 -15727 -11981 65987 -92008 40751 -9794 6353 30449 -106527
469 -106527 129484 -49151 -15516 40254 -64271 116370 -109379 25683 33277 -58335 78634
480 78634 -108394 63154 14597 -35974 25199 -49692 97609 -51640 -24078 35078 2033
491 2033 19490 -78236 53483 7892 -26298 -617 -23653 55054 -19568 -23950 13740 18355
503 18355 14465 -24183 -32146 63264 4467 -80786 51762 -21195 44009 -47777 -50909 138053
515 138053 -109331 52879 -23644 -17674 118318 -156410 95924 -35867 10525 46933 -150724
526 -150724 152225 -60741 2560 -13805 -25138 129522 -144872 67817 -11165 18901 26012
537 26012 -117569 132465 -72633 30167 -18327 -57993 132499 -104822 20403 -1358 16076
548 16076 48921 -108140 57187 43049 -36488 -23871 11152 24702 6889 -58997 9799 60883
560 60883 -61118 36549 -54697 48442 49633 -110941 78043 -36206 65042 -52287 -60607
571 -60607 131865 -95529 44736 -71141 55264 49265 -129098 118274 -88812 96006
581 96006 -35322 -80086 144056 -118969 99917 -98215 5980 122886 -161292 88706
591 88706 -49944 51538 12272 -108455 120579 -38082 5254 -15750 -9264 55766 -39295
602 -39295 -14614 -2417 34420 -13958 -23610 -12021 49231 3498 -60728 40352 8427 25507
614 25507 -59691 14261 47649 -44457 19382 -57995 75701 -28381 -32106 41968 -58851 113964
626 113964 -105245 21748 57642 -65650 87906 -135235 109338 -896 -92223 94734
636 94734 -97725 109681 -70559 -26541 92230 -83317 81863 -76982 31602 45083
646 45083 -65191 37953 -45256 58573 -26993 -38045 38047 -5662 14103 -43249 29640
657 29640 17416 -12685 -8435 -369 26115 -15505 -4844 -16632 31965 -13441 -15004 3096 -2894
670 -2894 43496 -66684 36919 8728 -12635 27350 -66857 86053 -45967 -9193 31479
681 31479 -57263 83165 -82224 29750 17264 -37646 63664 -85142 72278 -12926 -23725
692 -23725 34886 -51026 73449 -63332 11977 18456 -30828 42598 -62644 51050 -12326
703 -12326 -10927 25271 -38288 53342 -32213 2294 9708 -10905 20019 -33152 14641 2003
715 2003 -1718 -11193 5951 8630 -6181 9348 -18480 32793 -21043 4229 7405 -23035 38234
728 38234 -46514 23849 -4588 -11958 26403 -44154 49721 -26976 7914 11301 -24228 45429
740 45429 -50126 33929 -15058 -8393 25516 -48998 49193 -36173 16018 6276 -25279 46755
752 46755 -43208 32388 -12739 -1604 18203 -34613 32735 -28329 14242 -8042 -7057 19278
764 19278 -24342 26845 -20579 18387 -2240 -8490 19038 -23960 24541 -24258 10467 -1739
776 -1739 -12567 18257 -26643 28333 -20323 11586 5462 -14892 29097 -31483 27677 -16658
788 -16658 -521 13288 -29384 30610 -29653 17268 -3936 -9618 23238 -26004 28166 -18536
800 -18536 11413 2083 -13880 22348 -28465 22959 -17981 2960 8089 -20516 26602 -24334
812 -24334 19629 -5318 -3417 15890 -19467 21856 -18972 10582 -3645 -8296 12270 -19252
824 -19252 18417 -17203 10767 498 -9123 19662 -19409 20145 -11811 3459 7073 -16771
836 -16771 17728 -18450 9683 -5640 -2858 8411 -13114 16465 -11574 9431 -835 -1901
848 -1901 9254 -13887 15183 -13863 4183 392 -9651 11369 -15346 13362 -6922 204 10533
861 10533 -10481 12487 -7548 6336 -2012 -5522 7936 -11027 3909 -4206 896 -236 -2987
874 -2987 6947 -4068 4910 600 1768 -183 409 2030 -6776 2831 -2485 -1747 -3540 1541 2916
889 2916 -5964 6481 -142 3597 -1464 1381 5193 -8488 7412 -7023 -1492 2997 -7910 6555
903 6555 -10555 10277 1205 -11260 17288 -7278 4981 -1439 -4405 14287 -18906 7421 433
916 433 -10888 12342 -13992 8014 714 -3527 11415 -14919 16371 -460 -10874 9862 -6598
929 -6598 8902 -15045 1679 11003 -16348 10405 -8176 7952 2761 -10466 16532 -14301 14321
942 14321 -1840 -16416 21231 -13626 4528 -7643 -3258 22053 -28252 9915 9986 -10462 12541
955 12541 -15438 14685 3668 -15849 16407 -15775 9384 4612 -24020 18795 -5866 2979
967 2979 -4641 -9256 31620 -23491 2064 9412 -4222 12442 -28699 24172 -6692 -9036 14273
980 14273 -29660 35131 -19080 -1998 12273 -19974 43993 -45380 14110 23525 -30809 26759
992 26759 -38182 34310 -2986 -35786 39388 -29025 23113 -8882 -15882 33086 -20756 14351
1004 14351 -13692 1227 24780 -27772 131 7323 4628 -7053 -16651 19791 4773 -15432
1016 -15432 6382 643 12346 -5655 -13457 19866 -13375 13485 -17922 -11250 40386 -39783
1028 -39783 16475 -10159 7842 28496 -62765 57009 -15087 -7894 20392 -46515 63682 -45838
1040 -45838 3322 17685 -34765 54546 -56022 21347 14377 -16874 23848 -44239 49968 -12610
1052 -12610 -20122 16801 -14241 29948 -39252 9802 14846 -16343 15855 -24554 20003 8694
1064 8694 -17135 7918 -4672 13902 -54 -29695 24059 6562 -24181 13080 -17404 29763
1076 29763 -12421 -26250 46969 -35071 27964 -16394 -14039 48357 -51910 33381 -25761 8750
1088 8750 28002 -61493 51333 -24794 16292 -5425 -26845 59693 -50343 25293 -11170 -1441
1100 -1441 29900 -52507 40844 -22940 10477 6654 -37290 47099 -24535 5903 -2264 -5553 31039
1113 31039 -32600 6896 12171 -6947 581 -10118 5096 10787 -16912 1597 8603 -8414 18392
1126 18392 -25934 14885 13637 -23050 20454 -26578 31019 -12973 -22421 33777 -31038 29950
1138 29950 -29671 8765 24157 -36815 39509 -36740 29325 472 -30502 39326 -39829 37179
1150 37179 -26220 -9947 37737 -41568 32466 -26198 14855 15695 -34727 34266 -20373 13144
1162 13144 -2648 -16229 21560 -15609 5592 -7076 1088 9055 -7970 -1181 5702 5557 -6189
1175 -6189 1795 -1795 9839 -9609 -3357 7993 -9396 10471 -17524 11860 1269 -8391 14361
1188 14361 -20520 27421 -15287 -1760 14304 -21693 28885 -32498 14648 6567 -23413 28414
1200 28414 -31544 27685 -7655 -11913 25430 -26681 28096 -19449 1870 13032 -19930 19190
1212 19190 -22065 14834 -2472 -9742 12715 -12742 16844 -12688 4888 5007 -6079 8347
1224 8347 -11461 9642 -5082 18 -1572 -1572 5070 -7441 6788 -7032 10707 -5850 -422 8208
1238 8208 -10622 14672 -16811 10676 -1389 -9762 14200 -19997 19546 -13153 2062 9208
1250 9208 -15338 22343 -21071 15371 -2765 -7753 15654 -23160 22045 -16415 2677 6557
1262 6557 -15228 20516 -20094 14633 -3455 -3243 11286 -14638 16124 -12976 7014 -3156
1274 -3156 -4675 8821 -14625 13645 -12083 8449 -1063 -5527 14018 -14582 15026 -10064 4287
1287 4287 2965 -10279 12212 -14854 10986 -8377 1629 4118 -8702 14372 -14556 14299
1299 14299 -6631 160 8707 -15105 17344 -17280 8694 -1264 -9299 13932 -16430 14785 -8691
1312 -8691 3436 5652 -9186 13560 -12073 10226 -7035 882 3399 -11319 12715 -14121 10029
1325 10029 -4544 -1492 9382 -12743 15468 -10516 5716 1337 -6329 9180 -12444 10294
1337 10294 -8612 1901 2364 -6389 9268 -10055 11329 -6653 2738 4854 -8263 10850 -11653
1350 -11653 8827 -5541 -2769 7276 -11714 10463 -8247 5496 -60 -3447 9491 -9942
1362 -9942 9306 -5387 2142 528 -5618 8163 -11163 7262 -3954 -727 3462 -6300 9848
1375 9848 -8942 6419 304 -3936 6615 -6783 6150 -6054 1820 1510 -6017 4965 -3400
1388 -3400 2909 -2891 3064 1161 -2077 3956 -2616 3841 -5089 3799 -1603 -4599 6170 -7520
1402 -7520 4556 -3378 1954 2534 -6594 10206 -5640 2468 449 -1036 3776 -8353 7609 -5645
1416 -5645 -197 2263 -5199 6682 -6948 7635 -2396 -2919 10347 -9475 6100 -2367 -582
1429 -582 3288 -10539 9536 -4660 -3708 6373 -5518 4970 -1768 453 4367 -5023 5530 -1680
1443 -1680 -4133 5644 -4306 -1145 -540 -83 2494 -6722 5558 1579 -3407 4003 -1912 4566 -4131
1458 -4131 1009 2722 -7793 7675 -6433 -337 3274 -4962 7922 -10051 8192 3633 -11294
1471 -11294 12630 -7167 3967 -790 -7568 12814 -13793 5593 2140 -9945 12919 -9952
1483 -9952 4958 1501 -4398 11438 -13649 8807 1935 -9045 7485 -8169 8523 -7238 -2247
1496 -2247 10159 -12114 10330 -5773 1712 6044 -9485 12545 -12354 6542 4148 -14527 13674
1509 13674 -9926 5227 -1816 -8245 17402 -15257 6159 4648 -8397 12017 -11324 6352
1521 6352 1590 -8532 11432 -12631 4493 4947 -11566 9327 -5918 5678 174 -8871 16326
1534 16326 -10707 3120 2429 -6619 11083 -15287 10270 -3824 -5777 13533 -18608 16099 -6055
1547 -6055 -1100 9484 -17354 24053 -17179 1118 11141 -17368 18546 -19622 10153 4282
1559 4282 -16281 20335 -17107 10954 1900 -10325 14424 -12208 10216 -4409 -6977 12724
1571 12724 -10624 1942 -585 -1347 6090 -9215 5831 3328 -5766 7868 -6943 4857 1841
1584 1841 -8758 9741 -11715 9062 -2405 -11149 18107 -15729 11487 -5716 -3201 18666
1596 18666 -24995 20235 -8854 -2262 12760 -24152 24366 -16704 3738 7215 -18818 25465
1608 25465 -19435 8365 2945 -8661 16970 -21037 14568 -2334 -7155 8702 -12886 13031
1620 13031 -8186 -767 6729 -7485 9297 -6500 991 5781 -5360 3353 -3259 163 5741
1633 5741 -10466 4430 2668 -6649 8098 -10607 9785 246 -9761 15123 -14553 12601 -4693
1646 -4693 -8040 16494 -18445 14824 -10766 -645 13729 -20567 18206 -11503 6127 4623
1658 4623 -14829 20458 -16013 9071 -2745 -6939 14611 -17734 11924 -6561 -101 8115 -14332
1671 -14332 13941 -6507 2166 2548 -7298 11192 -8118 716 2254 -3946 3961 -4649 393 3851
1685 3851 -3905 1728 1189 -1760 6026 -6108 2847 2806 -5997 6828 -8966 6391 -1126 -6765 9413
1700 9413 -10172 10395 -5813 -1017 9728 -12052 13010 -10321 4586 3948 -12291 13672 -13293
1713 -13293 8474 -2085 -6952 13018 -12735 11050 -5574 313 7607 -10754 10325 -7578
1725 -7578 3582 -110 -5894 7356 -7198 4987 -3354 849 3356 -3889 4540 -3098 3103 -1597
1739 -1597 -558 678 -1012 424 -2898 2765 -3137 3117 -2746 969 3794 -5611 7673 -6397
1753 -6397 4739 -233 -5299 7899 -9852 7834 -5240 -1037 5918 -8907 9790 -7990 5617
1766 5617 393 -4861 8795 -9408 8458 -5987 738 3628 -8293 9029 -9129 5673 -1186
1779 -1186 -3163 6969 -7255 7760 -5022 2115 1591 -3799 4500 -5678 4850 -4511 2006 -239
1793 -239 -2588 4830 -6036 6757 -4684 2643 1739 -4932 7099 -7379 5178 -3433 -646 3097
1807 3097 -6479 6614 -5870 4110 -1453 -373 4271 -5899 7746 -6295 3966 -605 -3434
1820 -3434 5762 -8823 7845 -5812 909 3314 -5791 7505 -6426 5647 -1572 -1351 4450 -5718
1834 -5718 5123 -5108 3007 -2025 -1616 3755 -5496 5916 -4583 3981 -627 -1947 6228 -6920
1848 -6920 6100 -3908 674 1105 -4806 5875 -6638 4281 -1458 -655 2848 -3036 5310 -4953
1862 -4953 4188 -1372 -1139 2444 -4515 5089 -6405 3540 -589 -3138 5467 -5387 5784 -3392
1876 -3392 1706 2765 -5360 5879 -4555 1908 -1471 -852 2191 -4668 4390 -2979 1551 -230 -299
1891 -299 2877 -3817 5001 -3057 410 1318 -2568 2485 -3781 3087 -1457 -1233 2642 -1210 883 -868
1907 -868 2704 -1644 746 415 -816 1005 -3554 3926 -4287 751 2319 -4633 4954 -3733 3365
1922 3365 -793 -2042 5879 -6049 3572 -1152 -539 1067 -3880 4713 -4851 1907 582 -2306 3440
1937 3440 -3210 4480 -3108 700 3495 -5567 4106 -2295 437 365 -3377 4658 -3918 445 3033
1952 3033 -3012 2681 -577 -123 1680 -2506 2405 -1507 -2422 3847 -3919 400 1197 -1671 2583 -3584
1968 -3584 4059 -148 -2747 4760 -3619 2675 -1795 -261 1877 -5061 5339 -4533 635 2706 -3733
1983 -3733 5032 -5025 5197 -410 -4684 7323 -6432 3304 -1506 -2595 5183 -7647 5986
1996 5986 -2025 -2564 6448 -5911 4653 -1112 -566 3697 -6576 5995 -2310 -3089 3888 -4253 3738
2011 3738 -3191 227 3719 -5053 5486 -2568 -170 3203 -4239 4042 -4274 2214 1230 -6288 6511
2026 6511 -4002 1189 850 -3173 6938 -6574 3532 1484 -4995 6875 -6487 3076 221 -4309
2040 -4309 6180 -7960 5065 768 -5646 7053 -5551 4839 -1381 -3169 7518 -8065 4875
2053 4875 -1586 -2805 5543 -7728 5967 -3507 -35 4990 -7866 8105 -3877 923 2446 -5815
2067 -5815 8636 -7771 2395 2081 -5873 6919 -7250 4190 511 -4207 7148 -6866 4912
2080 4912 455 -4651 5929 -5186 3591 -1284 -3692 6123 -5653 2081 895 -3132 5448 -4753
2094 -4753 3312 904 -3579 5926 -6131 3607 312 -4203 5259 -6847 6172 -2789 -2805 7126 -7550
2109 -7550 7371 -4444 468 5195 -8647 8756 -7032 2076 2760 -8085 8771 -7325 4430
2122 4430 353 -5093 8879 -7132 4545 -556 -2591 5587 -6929 4215 -1381 -2056 3451 -4969
2136 -4969 3606 -714 -1161 3140 -2918 3405 -603 -2118 3662 -3324 1850 -985 -2499 4433 -5139
2151 -5139 2896 -170 -2176 5657 -6349 5282 -1179 -1861 5140 -7352 6976 -4027 -1001 4072
2165 4072 -6999 7606 -6112 1795 2914 -5520 7185 -6252 4185 427 -3842 5490 -6187
2178 -6187 4709 -2367 -2018 3929 -4804 4163 -3053 591 2823 -3532 3322 -2020 1096 1295 -2675
2193 -2675 2082 -1169 -523 912 -2214 1622 36 -1602 2400 -1730 1592 242 -2323 3951 -3211
2208 -3211 1720 -547 -2029 3775 -5084 3328 -1436 -754 3220 -4971 5636 -3124 1026 1903 -4221
2223 -4221 5802 -5347 2518 -170 -2831 4374 -5699 4362 -1293 -853 3167 -4100 4843 -2751
2237 -2751 634 1081 -2312 2762 -3163 1619 -622 -495 719 -1619 1960 -966 845 -250 561 271
2253 271 -574 721 -990 1061 -1807 792 -716 -238 1042 -2130 3197 -2014 1875 -4 -1383 3554
2269 3554 -4136 3381 -2136 -466 2180 -4641 4436 -3517 1597 702 -2401 4496 -3661 3220 -1467
2284 -1467 38 1710 -3424 3305 -3144 1665 -903 -685 2309 -2815 3313 -2129 1585 140 -1097
2299 -1097 2423 -3071 2794 -2222 149 558 -1627 1900 -2630 2656 -1621 725 716 -1227 2802 -2757
2315 -2757 2855 -2149 223 1084 -2955 3104 -3457 2421 -1219 -885 2904 -3154 3235 -2026 1486
2330 1486 133 -1455 2857 -3456 2460 -2020 448 436 -1975 2940 -3387 2920 -943 -238 1960 -2375
2346 -2375 3419 -2820 1627 -193 -1706 1768 -2554 2144 -2278 1225 237 -1096 2045 -1815 2289
2361 2289 -1961 1518 243 -2288 2773 -3010 2088 -1681 84 1423 -2868 3468 -2008 1460 24
2376 24 -369 1422 -2097 2424 -2209 646 -423 -734 1095 -2719 3285 -2240 803 1338 -1728 2937
2392 2937 -2823 2593 -785 -1434 2289 -2843 1520 -1092 217 91 -1009 1815 -1192 931 -109
2407 -109 887 -506 -362 1310 -1860 992 -1091 229 -232 -664 1528 -1760 1377 207 -150 59 16
2424 16 1225 -2017 1474 -1002 -38 -302 -1446 2376 -2985 2158 -324 -1085 3048 -2682 2582 -1807
2440 -1807 635 1559 -3723 3233 -1902 -24 74 -1154 2647 -2836 1755 183 -495 1517 -1552 1595
2456 1595 -1063 528 -20 -1845 1750 -1056 -570 200 108 1009 -1543 414 1599 -1309 643 -46 -553
2473 -553 1215 -1795 735 -171 -1095 1996 -3100 2175 539 -1892 2294 -2397 3170 -1843 -1183 3414
2489 3414 -3576 2494 -2008 133 1901 -3305 3517 -2697 1794 1055 -2952 3523 -2260 2356 -1442
2504 -1442 -1472 3887 -4144 1674 -913 -281 1900 -3696 3284 -1055 -174 2075 -3236 3473 -976 -847
2520 -847 1445 -2333 2925 -2377 -1194 3223 -2713 1706 -1215 446 2589 -3728 2981 -1185 -181
2535 -181 2024 -4020 3265 -1759 -180 923 -2978 4642 -3226 323 2045 -1899 3539 -4308 2586
2550 2586 842 -3200 3359 -4191 2928 -590 -2693 3774 -3703 3594 -1595 -1650 4802 -4195 2672
2565 2672 -1584 -208 3006 -5265 3681 -1449 -646 2213 -4186 4588 -1865 -132 1940 -2966 4539
2580 4539 -3095 145 2105 -3033 3082 -3938 1695 1434 -3459 3309 -2734 2414 294 -3019 4179
2595 4179 -3022 1856 -551 -2436 4457 -4151 1480 -89 -1462 3656 -4811 2875 571 -1795 3181
2610 3181 -3956 3925 -728 -2274 3297 -3728 3642 -2430 -1318 3702 -3896 3662 -2675 736 2879
2625 2879 -4359 3948 -2550 1358 821 -3988 4518 -3428 1155 -26 -2423 4500 -3974 1746 351
2640 351 -1238 3346 -3851 2373 222 -1890 2049 -3218 2792 -458 -2163 2805 -2251 2234 -831
2655 -831 -1141 3445 -2687 1578 -672 -748 2678 -4081 2188 -587 -858 2036 -3783 3822 -944 -788
2671 -788 2159 -2707 4008 -2850 -244 2125 -3144 3118 -3753 1326 1427 -3111 3064 -2750 2635
2686 2635 -99 -2380 3402 -2621 2021 -1349 -1285 2802 -3276 1628 -973 71 1481 -2665 2112
2701 2112 -313 37 866 -1825 2128 -926 -819 725 -1212 1336 -1293 -435 1724 -1450 954 -461
2717 -461 -62 1752 -2230 1419 -315 -331 1080 -2684 2201 -1037 -510 1078 -1965 2860 -2172 447
2733 447 1173 -1379 2409 -2708 1790 103 -1605 1717 -2463 2058 -1186 -744 1617 -1678 1974 -1717
2749 -1717 622 1010 -1442 1439 -1311 1056 -92 -1077 932 -870 500 -376 -168 560 122 -92 78
2766 78 202 36 -12 -704 982 -630 -397 288 -655 1198 -1298 762 176 -374 1399 -1488 1707 -756
2784 -756 -9 774 -1669 1936 -1913 871 -54 -787 1544 -1875 1927 -979 92 835 -1476 1722
2800 1722 -1453 658 -386 -670 919 -1313 1026 -652 403 -46 -72 1219 -954 1144 -626 438
2816 438 -1 -719 935 -1369 1000 -862 67 410 -498 1189 -990 1304 -337 22 246 -836 1040
2833 1040 -1822 1018 -715 -246 836 -1277 1693 -1295 1373 136 -816 1674 -1540 1230 -946
2848 -946 83 611 -1309 1228 -1101 651 -395 318 397 -874 1290 -1204 826 -351 -29 757 -1409
2865 -1409 1472 -1149 211 142 -618 972 -995 1207 -547 167 600 -415 494 -732 1026 -1269
2881 -1269 408 254 -894 946 -1043 1339 -700 -196 977 -1215 1329 -983 615 -238 -464 925
2897 925 -1449 1064 -630 326 26 -185 1169 -1383 1301 -217 -176 706 -958 1335 -1272 256 228
2914 228 -1022 821 -607 464 -253 210 518 -460 606 97 76 -681 650 -431 -455 350 -509 620
2932 620 -787 518 11 -504 1218 -982 762 -341 146 -93 -813 1240 -1332 402 -381 95 728
2949 728 -1311 1841 -860 265 720 -1223 1622 -1406 835 -395 -1003 1694 -1827 880 -12 -74
2965 -74 745 -1067 1521 -339 -364 504 -582 600 -834 -47 200 -319 408 -473 42 800 -355 -68
2983 -68 274 200 221 -1072 712 102 -1040 604 -963 1058 -315 -516 1236 -1170 1673 -1072 -119
3000 -119 1466 -1676 1392 -1590 865 759 -2411 1910 -1347 810 84 -1282 2504 -1888 1118 -369
3016 -369 -667 1980 -2149 1040 -355 47 641 -2130 1713 -382 -506 376 -627 1615 -1139 -243 982
3033 982 -986 998 -1209 -20 1226 -1388 862 -665 587 943 -2029 1706 -107 -172 459 -1742
3049 -1742 2476 -1392 -406 917 -1417 2324 -2189 447 1285 -1232 1804 -2200 1728 572 -1930
3064 -1930 1613 -1656 2011 -1288 -1378 2273 -1865 1154 -1203 202 2010 -2309 1501 -407 666
3079 666 826 -2523 2134 -533 -326 305 -1542 2586 -1442 -576 1125 -892 1752 -1946 550 1625
3095 1625 -1809 999 -1446 1107 576 -2570 1691 -952 1016 -158 -1660 2983 -1626 338 62
3110 62 -560 2224 -2885 772 318 -704 1293 -2655 2283 -55 -1339 1399 -1388 2402 -1256 -702
3126 -702 2122 -1497 1445 -1838 425 1736 -2296 1062 -983 1094 631 -2246 2385 -714 420
3141 420 -86 -1332 2510 -1911 -141 381 -846 1555 -2269 858 1119 -1116 1173 -1727 1748 160
3157 160 -1838 1465 -987 1123 -997 -1051 2103 -1562 542 -557 72 1927 -2275 1004 -33 -4
3173 -4 794 -2285 2132 -491 -828 723 -1460 1983 -1372 -416 1525 -1119 1507 -1616 634 1233 -1680
3190 -1680 1087 -1195 1129 89 -1695 1705 -689 631 -405 -628 1763 -1129 460 -164 -170 1075
3206 1075 -1860 1008 76 -560 368 -1356 1576 -319 -596 843 -664 1227 -789 -420 1248 -967
3222 -967 552 -795 32 1011 -1232 808 -11 99 500 -1188 1174 -323 -239 360 -967 1182 -1101
3239 -1101 -197 635 -732 995 -1207 448 543 -898 1013 -960 925 -87 -816 1107 -1065 715
3255 715 -702 -430 892 -1195 712 -503 235 642 -602 837 -293 89 -220 -519 487 -381 -163
3272 -163 -171 -60 308 -207 87 218 -190 75 -75 -31 518 -699 150 -202 -468 400 -1071 597 -167 -233
3292 -233 594 -675 829 -526 84 412 -756 765 -709 533 -30 -448 665 -720 709 -268 127
3309 127 296 -73 682 -769 518 57 -153 287 -603 446 -510 94 179 -337 467 -33 297 -36 334
3328 334 -78 -132 257 -250 159 -551 350 -194 -136 509 -597 677 -262 342 220 -510 669 -611 536
3347 536 -338 -127 72 -593 648 -751 456 -149 -48 358 -464 903 -699 216 272 -475 387 -660
3365 -660 406 -421 -210 519 -532 373 -132 365 -189 63 296 -419 335 -399 274 -294 4 387 -570
3384 -570 606 -293 298 53 -33 486 -570 363 -396 94 -93 -185 254 -693 589 -500 109 440 -179
3403 -179 690 -751 844 -282 -346 454 -677 423 -571 122 131 -439 585 -462 351 92 24 93 -313
3422 -313 653 -434 90 -75 -218 108 -352 411 -161 -188 62 -64 109 43 26 3 94 -33 -20 -363 136 227
3444 227 -690 213 -147 140 24 -459 902 -492 291 124 -392 626 -748 503 -340 -133 339 -1006
3462 -1006 894 -454 111 162 -542 1058 -921 421 138 -321 622 -1129 710 -440 -255 500 -799
3479 -799 918 -316 -224 411 -459 524 -627 -61 560 -615 154 -195 29 217 -722 490 201 -33 438
3498 438 -822 673 44 -608 239 -502 796 -737 -449 1065 -792 814 -767 413 897 -1253 1249
3515 1249 -787 659 150 -1309 1362 -1192 588 -342 -571 1635 -1270 844 -86 14 979 -1540
3531 -1540 1239 -302 -141 319 -961 1348 -604 -479 536 -449 1109 -894 152 792 -632 484
3547 484 -615 351 575 -1223 675 -258 183 262 -1103 1489 -586 -331 452 -753 1511 -1198 -30
3564 -30 771 -890 1137 -1685 953 565 -1322 1145 -1089 1463 -291 -1046 1671 -1212 1168 -1048
3580 -1048 -469 1744 -1700 782 -790 393 688 -1894 1373 -293 270 56 -1071 1668 -735 -346
3596 -346 381 -529 1163 -1451 141 1012 -754 681 -1103 797 805 -1475 1119 -705 597 -193 -1263
3613 -1263 1626 -1011 176 -303 -362 1727 -1811 534 264 -364 1003 -1879 1352 124 -844 779
3629 779 -1455 1820 -795 -939 1137 -802 1354 -1166 241 1426 -1383 876 -860 590 395 -1751
3645 -1751 1193 -468 406 2 -1012 1672 -1022 80 105 -288 1199 -1438 201 295 -622 562 -1222
3662 -1222 849 111 -1198 870 -766 1120 -328 -927 1336 -971 206 -421 -50 1281 -1464 526
3678 526 -1 136 507 -1344 1346 -26 -281 375 -752 1517 -732 -263 691 -801 1038 -1214 467
3695 467 763 -887 597 -795 733 135 -1175 1074 -558 533 -372 -880 1113 -815 187 74
3711 74 -109 847 -1063 554 119 -56 458 -917 792 -261 -520 313 -424 729 -642 -303 771 -359
3729 -359 567 -607 178 547 -742 458 -277 176 214 -950 885 -148 -132 179 -654 914 -361 -61
3747 -61 342 -238 535 -632 261 231 -681 449 -521 454 27 -443 553 -283 617 -131 -182 770 -536 373
3767 373 -295 119 395 -636 454 -196 -66 23 -282 493 -139 -39 263 -51 373 -234 150 70 -282 146
3787 146 -238 -129 323 -213 47 133 174 39 -336 207 -195 -259 99 -397 274 -286 -64 141 -333 375 -351
3808 -351 280 100 -51 395 -465 455 -122 -202 326 -426 241 -318 63 291 -166 474 -339 96 -40 -96 37
3829 37 -347 154 -331 105 -27 -17 113 -272 304 -44 49 -15 31 52 -48 82 -148 141 -146 -185 -128 -218 327
3852 327 -249 366 19 69 373 -206 497 -214 66 76 -512 391 -348 160 4 34 305 -316 302 -123 21
3873 21 4 -7 180 -274 176 -141 87 20 -227 290 -311 229 -89 -6 163 67 190 -40 129 44 30 -25 -79
3896 -79 219 -170 437 -262 20 258 -133 422 -99 339 -59 -69 261 -444 146 -272 146 -5 -227 214 -271
3917 -271 408 -56 -99 129 -260 418 -485 98 -30 -212 267 -427 247 -92 -49 252 -328 276 -23 154 31
3938 31 -107 124 -277 -115 35 -89 5 52 -3 5 202 244 49 -184 50 1 -41 -5 -256 399 -232 -59 -96 -309
3962 -309 360 -242 204 74 -11 217 -635 447 -191 -237 68 -604 477 -418 5 240 -398 673 -538
3981 -538 333 165 -196 338 -595 607 11 -383 415 -236 366 -227 -72 392 -269 290 -358 23 291 -352
4001 -352 91 -65 91 82 -558 363 186 -309 232 -307 455 -169 -357 609 -356 343 -307 -116 593 -727
4021 -727 424 -442 406 418 -866 881 -473 342 14 -685 1044 -844 137 -83 -258 713 -1151 467
4039 467 -60 -218 559 -868 970 -275 -370 371 -392 527 -827 -258 625 -495 162 -413 176 637 -686
4058 -686 517 -65 189 232 -899 682 -37 -189 75 -675 1029 -733 -206 433 -207 732 -875 310
4076 310 636 -910 598 -715 772 288 -1086 1046 -559 592 -362 -523 1216 -780 326 -311
4092 -311 214 778 -1253 658 -319 10 189 -980 1080 -385 -352 338 -253 935 -818 -72 768 -584
4110 -584 246 -884 426 453 -865 440 -315 545 297 -952 1106 -299 -66 158 -573 964 -861
4127 -861 -84 245 -371 772 -1150 647 350 -394 531 -831 940 -215 -691 754 -766 759 -625
4144 -625 -174 873 -946 570 -644 392 554 -1213 706 -149 223 22 -874 1044 -377 -320 -23
4161 -23 -286 895 -728 -52 482 -343 432 -651 435 358 -703 352 -361 453 -148 -650 749 -533
4179 -533 252 -281 -199 955 -824 375 95 -66 642 -1235 671 22 -293 312 -876 876 -319 -252
4197 -252 615 -393 777 -606 147 538 -669 437 -630 398 160 -682 528 -402 367 -25 -405
4214 -405 603 -548 156 -47 -132 633 -778 302 177 -147 294 -638 380 -9 -221 615 -357 506 -189
4233 -189 -294 533 -595 185 -267 -150 411 -587 441 -28 -98 193 -726 455 -149 -26 134 -295 386
4252 386 -330 -80 236 -158 290 -483 162 269 -479 412 -362 205 -47 -464 404 -320 196 -74 -370 475
4272 475 -369 112 -61 -35 340 -417 117 135 -24 66 -232 207 -241 -118 88 -234 226 -43 -94 50 -230
4293 -230 229 -137 202 28 -303 129 -234 -32 26 -189 150 -86 -7 79 -174 303 -130 127 198 -262 115
4314 115 -221 -67 161 -275 230 -302 170 74 -27 388 -94 219 -251 99 -76 -66 230 -275 73 103 -65
4335 -65 326 -73 57 27 -51 97 -227 -7 65 -207 -39 -52 -44 54 -88 -6 80 -53 348 36 -75 54 -70
4358 -70 -17 -149 -17 0 -207 67 -97 97 -92 39 195 -178 381 6 105 -182 -150 152 -159 220 -104 -96
4380 -96 245 15 295 -104 157 18 -110 113 -84 -35 -221 56 87 -15 24 -65 -32 -85 27 -51 -17 255 30
4403 30 46 125 74 -53 42 -106 -31 121 -133 40 15 -120 98 -225 -13 116 -61 -6 -92 23 -220 146 -95
4426 -95 -244 171 -149 140 -74 257 132 -205 181 -62 18 -8 -191 58 -166 234 -24 -123 80 -29 131
4447 131 -39 -57 -35 -12 36 -45 -61 -12 -199 88 8 -5 70 -15 227 101 38 122 76 286 -115 64 88 -208 -68
4472 -68 -96 142 191 -259 251 -95 116 107 -415 338 -57 -75 124 -319 468 -452 193 218 -228 223 -265 348
4494 348 75 -299 277 -352 270 29 -276 240 -250 290 -319 11 425 -299 176 -18 64 80 -225 92 -142
4515 -142 -20 8 -245 377 17 -212 293 -339 295 -300 42 363 -229 268 -256 105 275 -537 415 -220
4535 -220 87 -89 -380 580 -341 266 -69 -141 568 -516 322 -8 -137 294 -503 485 -188 -163 217 -290
4555 -290 606 -363 70 439 -368 268 -513 29 293 -428 291 -340 131 141 -275 362 -179 -61 172 -347
4575 -347 597 -277 -76 140 -153 321 -417 203 327 -322 512 -688 492 46 -551 536 -648 433
4593 433 -288 -498 797 -756 181 -313 95 558 -636 481 -114 73 220 -692 769 -309 -129 24
4611 24 -391 755 -455 152 100 -204 293 -463 351 379 -447 302 -183 329 207 -491 565 -172 247 61
4631 61 -413 835 -527 76 180 -151 497 -784 232 235 -355 381 -614 497 -6 -386 409 -440 427
4650 427 -486 -135 375 -530 261 -306 95 391 -606 437 -249 266 135 -380 611 -228 250 -13 -155 477
4670 477 -524 155 89 -262 368 -550 266 63 -424 279 -316 411 -42 -317 302 -265 128 -192 -211 258
4690 258 -539 50 -147 -117 426 -612 164 4 -27 246 -384 499 -279 -222 225 -379 433 -408 13 320 -310
4711 -310 388 -203 310 120 -402 538 -261 144 97 -311 438 -308 150 22 -135 459 -276 213 204 1 286
4732 286 -290 167 -129 -160 28 -163 333 -82 -168 179 -274 281 -228 -15 421 -391 240 -9 -108 31 -266
4753 -266 172 -115 -87 182 -250 541 -135 118 175 -221 157 -230 56 116 -132 242 -277 300 56 -197 67
4774 67 -202 277 -108 -7 330 -223 56 -208 -231 68 -271 97 -69 -8 125 -134 238 19 -10 78 -118 282
4796 282 -207 34 81 -85 -35 -111 -63 14 -99 -9 -25 -33 110 -225 44 16 78 -67 -207 187 -50 13 -74 -38 -68
4821 -68 -113 -12 30 -224 131 -138 108 40 -93 209 -193 116 18 36 173 52 -47 35 -42 225 -332 -57 -90
4844 -90 5 -74 -218 36 -65 18 161 -225 27 -1 106 19 -102 72 -58 56 10 -340 87 -177 -58 30 38
4867 38 137 71 55 -134 -208 180 -92 -20 -65 -221 23 -111 135 144 49 143 -73 225 -35 54 65 -191 -114 -151 94
4892 94 12 -45 -97 -232 79 -79 -207 43 -65 112 139 -108 -20 -63 -107 46 -67 177 -13 -1 7 78 160 -29
4916 -29 62 74 -92 -62 -44 -34 39 -259 76 25 111 -64 -90 15 -73 85 42 -136 221 -150 103 -84 51 44 -156
4941 -156 86 -19 -19 100 -22 170 -126 259 153 -98 124 -123 105 -16 29 160 -121 -53 44 -66 226 -105
4963 -105 99 -38 51 84 -181 126 -11 -65 42 -50 83 -112 -115 129 -145 182 -25 -48 198 -149 -57 -31 1
4986 1 218 -252 91 4 -45 181 -189 154 -192 -70 112 -140 234 -223 -75 11 -203 259 -137 200 -3 -58
5008 -58 416 -130 143 106 70 272 -265 -75 -189 -162 177 -201 292 119 92 -56 -141 117 -121 -144 -48 -206 137
5031 137 -248 -144 189 -89 137 -325 62 287 -40 327 -17 89 30 -334 428 -324 91 59 -266 233 -203
5052 -203 137 155 -95 268 -372 109 -150 -265 251 -293 241 -90 -57 151 -128 498 -312 -88 253 -65 366
5073 366 -174 42 272 -423 255 -119 138 42 -277 367 -262 43 167 -260 373 -173 156 104 -282 301 -258
5094 -258 177 122 -402 201 -239 225 -30 -229 426 -322 295 -200 -100 350 -303 234 -161 38 369 -541
5114 -541 343 -255 -116 251 -407 509 -329 73 189 -255 190 -520 115 151 -286 258 -345 167 235 -275 391
5135 391 -202 234 -35 -136 284 -293 50 18 -110 179 -406 293 39 -141 260 -398 266 124 -194 249
5155 249 -504 194 -242 -207 287 -411 303 -22 -69 382 -533 553 -87 90 161 -377 298 -299 216 112 -243
5176 -243 413 -276 37 209 -103 279 -155 225 -168 -208 289 -270 70 19 -417 231 -171 106 -100 -194 276
5197 276 -258 132 -3 -149 181 -215 158 -74 -218 266 -343 51 -152 119 361 -221 298 -161 25 208
5217 208 -342 114 -289 66 -98 -237 348 -222 271 59 -158 145 -296 190 56 -244 403 -291 185 -2
5237 -2 -182 196 -212 159 -84 -136 109 -175 135 -39 -247 199 -204 95 -137 -182 56 -186 73 -126 38
5258 38 348 -274 287 -83 -49 -39 -234 282 -124 -41 69 -72 370 -78 77 22 -134 177 -158 151 72 -198
5280 -198 152 -310 31 -66 -65 268 -99 152 -23 112 320 -153 177 -102 -113 39 -168 156 -39 -187 34
5301 34 -135 215 -68 58 54 -38 151 -100 -82 46 -218 137 -62 -194 40 -167 155 7 101 96 -49 82 -82
5324 -82 -171 -5 -132 -74 -89 24 -42 -13 199 -210 -115 103 -59 231 -98 121 -98 -95 126 -163 106 -59 -13
5347 -13 90 46 149 87 41 121 -195 -2 -38 -12 -83 -13 17 100 -97 101 -167 -20 -24 13 -75 -32 -46 -37 -113 19 -82
5374 -82 -52 -28 -7 11 -32 -10 -68 -76 -40 -40 71 37 52 -51 -215 76 -46 -18 -143 -11 6 35 66 160 -115 -82 -85 -93
5402 -93 -4 -54 -29 -12 58 -183 81 -98 97 202 -16 -65 -64 83 -61 -6 -41 -62 -124 -86 -31 -26 75 -92 123 71
5428 71 93 73 119 -115 -2 -23 -59 -153 -212 -1 56 44 -77 62 -109 131 -42 83 92 -77 -47 -250 -105 86
5452 86 -40 19 -103 127 48 27 133 -83 117 88 25 29 -22 26 -25 -61 34 -169 -38 -64 -16 159 -90 123 -85
5477 -85 68 34 -157 2 -16 -101 27 13 -45 -155 -209 91 93 116 -15 -82 9 -121 -36 -8 -233 49 -149 166 -135
5502 -135 39 71 -242 166 -78 54 157 -15 139 -228 62 -62 -296 125 -165 -17 -139 -84 197 -44 50
5523 50 17 -19 189 -103 76 -48 -136 153 -106 46 107 37 159 -91 247 -145 109 299 -209 106 -185 23
5545 23 -28 -203 -109 -132 132 13 -149 180 -19 15 72 -229 242 -107 94 -86 -300 205 -159 197 -15 -134
5567 -134 218 -238 38 -66 -7 194 -235 165 -71 -107 34 -213 112 -226 33 25 -231 132 -85 195 177 -224
5589 -224 141 -73 -179 89 -125 283 -107 24 219 -257 307 -69 136 62 -170 271 -306 207 91 -185
5609 -185 313 -335 46 -163 -60 316 -128 269 -248 73 120 -264 284 -86 55 127 -365 19 -77 62 100
5630 100 -272 145 -82 81 38 -130 220 -149 -63 70 -167 56 -125 114 -30 -100 269 -158 76 145 -64
5651 -64 156 -222 34 -145 -114 374 -336 236 20 -131 268 -235 139 -61 36 207 -187 81 -66 -55 14 -207
5673 -207 266 -112 -12 132 -202 239 -57 135 185 -118 211 -108 142 67 -157 101 -98 64 200 -221 245
5694 245 -164 25 232 62 350 -140 256 -60 -197 258 -187 113 -58 -80 -3 -65 52 -6 -92 320 -318 -18
5716 -18 -124 -77 192 -280 65 12 -91 70 -238 48 -289 -44 124 -173 193 -201 129 51 -190 136 -228
5737 -228 72 -85 -97 338 37 150 73 -139 146 -207 2 31 -34 242 -113 59 -31 62 50 -226 105 85 1
5760 1 226 4 -50 -75 -16 209 -127 114 47 33 -53 -64 144 -52 9 -6 31 138 -219 39 68 -224 -9 -163
5784 -163 193 65 -68 319 -89 45 -34 5 -38 -138 -1 -148 -127 37 -209 -18 128 122 87 -169 146 102 -68
5807 -68 229 -57 -16 76 97 118 -77 44 19 97 25 -40 44 154 -112 48 -48 147 -148 66 7 47 -13 14 206
5832 206 20 -149 139 50 84 -33 -71 -74 -127 35 23 -105 107 -99 -86 -34 -157 100 -54 69 33 4 -12 6
5856 6 -119 -128 15 -14 8 134 -67 -200 -132 96 8 47 106 93 -60 -145 -37 66 45 -38 -135 -80 148 92 -67 -44
5882 -44 62 107 -35 -114 68 -32 26 -77 -120 107 80 53 -59 150 104 122 -83 -16 31 -113 50 -104 91 88
5906 88 -21 -59 -51 -98 230 91 -133 -28 98 126 -70 -6 -2 87 -117 49 -23 135 174 79 7 81 -158 119 26
5931 26 146 -60 102 -108 -73 102 -102 57 28 -3 61 -81 -27 131 15 32 -50 109 -185 16 31 -184 49
5954 49 -278 33 -30 15 -64 28 255 -71 -35 21 -40 -73 -115 40 13 -207 -43 -56 79 -1 -76 94 -64 -10 85
5979 85 -111 144 -173 22 -84 11 -142 -71 -24 75 -80 43 130 -102 55 -25 175 -15 120 116 -18 -86 -164 -8
6003 -8 -208 223 7 -10 127 -89 143 230 23 148 -54 90 136 -16 167 -89 103 79 144 102 2 44 120
6026 120 22 -10 7 74 13 -117 116 48 242 -91 68 146 -105 113 -35 37 211 -91 11 42 191 -55 -163
6049 -163 68 -31 51 26 -125 131 -104 108 -15 -118 82 -197 106 224 -75 152 -121 112 -147 -154 5 -36
6071 -36 118 -26 -14 168 -216 118 -81 -73 110 -192 113 -144 102 53 -66 239 -246 37 7 -163 178 -58
6093 -58 137 35 -130 49 -81 119 135 -55 207 151 134 206 -129 149 -97 87 -18 -73 135 -97 13 -80
6115 -80 -62 219 -145 156 -55 -132 234 -255 152 74 2 149 -119 129 -128 49 89 -266 138 -47 105 24
6137 24 -223 68 -100 71 -51 -125 253 -199 99 79 -160 272 -160 97 -112 -170 84 -51 121 2 -82 122
6159 122 -138 305 -115 -40 105 -345 108 30 91 122 -88 116 -157 23 82 -205 177 -44 103 -42 -210 146
6181 146 -128 -72 87 -9 -127 -197 -3 75 69 180 -128 113 37 -92 33 -257 46 -76 -103 53 -189 43 -85
6204 -85 -78 113 -247 55 30 22 -25 -129 36 -19 -135 -75 -53 51 -238 0 59 -101 100 -133 54 127 -186 91
6228 91 -153 143 58 -179 165 -50 47 198 -180 154 -9 14 50 -43 181 -218 -4 60 53 166 -224 -44 -116
6251 -116 17 2 -179 207 43 -54 46 -145 74 -35 -125 198 -182 -17 -99 152 -141 -77 24 -32 6 70 -22
6274 -22 1 -13 174 97 -1 62 -48 31 29 -98 -14 29 -20 24 -13 201 -32 123 8 41 -32 -107 123 -47 23 -74
6300 -74 -135 22 170 154 -199 -99 93 -60 1 200 -219 -13 -31 123 166 -36 131 38 12 -10 82 -32 -8 -98
6324 -98 -13 33 -24 -73 142 -5 -32 183 -27 94 65 -5 -11 -67 26 -67 51 64 45 36 -81 -72 -81 44 -47 10 -87 -44
6352 -44 -98 107 51 -15 22 16 -39 -138 -51 0 -37 57 120 -63 139 4 -128 -11 46 58 -66 -31 76 -117 -20 54
6378 54 59 11 -64 82 65 83 -27 44 -48 -75 -118 -50 16 -95 18 146 -3 71 72 -68 -219 9 91 55 111 22 -93
6405 -93 -56 127 -44 144 -6 82 -42 -143 -52 -81 -145 8 17 -150 26 10 30 105 127 124 -76 -94 54 -68 1
6430 1 -25 -12 198 50 93 -98 43 -89 -208 -74 -117 73 -83 37 104 2 -138 -104 -8 -222 52 -44 -99 -34
6454 -34 -4 147 39 175 -64 -90 44 0 9 -127 -11 -63 1 39 66 -116 -27 83 8 -59 -50 -18 -54 89 -185 -85
6480 -85 57 -22 28 -41 -9 -106 184 -9 107 24 58 -43 159 -29 48 78 -67 -11 -91 -96 -10 -104 -47 11 76 -137
6506 -137 -78 -7 -59 136 -50 14 -68 -138 78 -40 85 87 42 40 3 95 -221 39 -191 -185 -3 77 -73 16 -53 177
6532 177 -198 -138 121 -86 305 121 43 32 -19 211 -70 -189 19 -60 -28 -105 119 40 -31 -31 37 139 -173 -11
6556 -11 78 -74 -3 -107 -8 179 -43 29 -35 -88 21 -62 -55 -89 28 106 -42 51 -94 -13 -27 45 127 33 110 164 62
6583 62 150 -114 -79 122 -59 180 -101 -154 65 -151 223 67 -45 -8 -215 131 -39 -151 -55 -226 61 -49
6605 -49 155 142 -119 -75 -235 168 -48 -115 -20 -57 74 -190 -2 115 -5 10 -44 -45 110 -76 54 -38 93 183
6629 183 -115 79 -7 -128 66 -62 58 -157 31 22 -247 163 -1 20 178 -118 108 46 -66 -57 -91 56 -75
6652 -75 20 -201 -172 96 -160 50 55 45 -113 -8 32 24 -57 36 -208 164 -61 -113 5 -280 115 -91 -35 110
6676 110 12 87 -49 32 182 -53 143 -183 -6 -92 -128 168 -108 -61 -38 -83 52 -211 -90 -100 33 -74 -156
6699 -156 96 -44 -11 151 -112 175 -112 58 279 -89 168 -134 -158 119 -142 6 -50 56 113 -90 117
6720 117 -2 74 128 -106 197 -86 -48 115 -140 54 -88 35 68 -274 11 -106 120 37 -116 204 -166 103
6742 103 62 40 -22 260 16 -52 52 266 -96 14 29 68 205 1 58 -4 61 14 -154 48 -33 -43 86 -151
6766 -151 30 -94 -70 -31 -187 103 160 -39 -89 18 -66 -111 42 -63 -62 41 -52 106 190 85 38 -186 58 102
6790 102 70 71 -37 -51 -6 -203 71 -38 197 20 61 78 61 131 39 64 -63 -5 3 -21 29 84 -160 15 55 79
6816 79 52 30 21 26 22 -10 -62 17 -79 -20 -41 70 40 -19 -17 144 -50 113 -149 -66 123 -30 -46 -64 11 18 -27 92 55
6845 55 62 46 52 41 -78 9 -89 -80 43 -94 30 -47 -55 156 64 35 42 -29 -84 77 -81 87 43 10 11 30 66 126 -72
6874 -72 -68 88 -81 23 20 -138 29 118 -46 99 -12 -140 108 67 92 -117 88 61 8 138 9 36 -94 26
6898 26 51 -153 189 -91 36 -16 -138 35 -102 10 122 -109 43 -91 32 120 -190 -93 -39 -10 -2 188 124
6921 124 48 18 153 43 -50 147 14 97 -66 -52 42 -71 1 -223 -59 -117 -102 69 -34 10 25 32 -53 89 -46
6946 -46 -48 73 -62 28 -194 -27 64 -50 -124 17 102 -120 94 13 133 46 -82 -43 51 56 -144 38 -74 73
6970 73 -116 -36 17 -101 -147 -46 -3 148 -73 131 136 6 111 -29 -89 -9 74 4 -79 -62 4 32 -135 -199 63
6995 63 -83 -82 -68 63 82 -126 73 -38 -37 178 -131 122 77 -11 109 -5 -58 -32 -43 -10 -41 10 -54 -23 -65 33
7021 33 17 -94 37 -194 -32 74 -33 26 44 85 98 -121 53 -42 -44 179 -153 26 -16 -11 33 2 203 -140 8
7046 8 -16 -30 206 33 -56 78 -59 154 119 95 -38 -48 64 -74 37 -37 -71 180 -77 -56 -94 -149 163 2
7070 2 20 -143 24 122 -52 121 211 -5 -98 -181 69 -35 -85 84 -53 101 -67 101 343 30 205 -101 109
7093 109 116 -92 7 -118 102 68 31 19 -112 -53 51 124 4 -32 117 -4 -100 -58 -188 -2 93 130 -11 -167
7117 -167 -36 -20 -138 -10 61 -73 -165 58 82 -70 8 -43 80 90 -60 74 -27 21 -89 -213 34 52 59 28
7141 28 -78 178 -80 -45 6 -105 47 -137 20 106 -220 68 32 68 -149 79 285 -100 -46 91 -139 223
7163 223 -25 42 -14 -84 31 -207 -69 60 69 -60 51 -114 -23 -51 75 -72 137 4 171 -26 -60 39 -173
7186 -173 -54 -4 33 90 -51 130 139 -225 107 -143 -102 -4 -183 75 6 92 107 53 -34 -91 114 126 -22 58 -53
7211 -53 91 25 -163 146 -118 70 -111 -39 95 -49 99 -38 -24 -35 -55 176 21 84 30 -119 10 -40 74
7234 74 188 -57 69 -85 63 -2 -49 53 -196 -27 34 2 -37 -19 -8 -147 -290 -128 -51 -99 -101 99 190 -237
7258 -237 -98 -3 -127 -25 -22 -49 -132 -33 20 -44 41 -97 -88 118 10 -75 -53 7 45 120 104 -189 -10 -16 -38 65 20
7285 20 11 -62 -63 41 -91 -112 -4 -12 78 50 -58 -45 2 9 -26 89 32 50 130 -100 89 105 6 21 -15 -59 106 -60
7313 -60 -126 26 -44 -12 -24 50 -15 140 -87 -154 42 -198 18 -142 10 117 -210 91 5 65 31 16 21 32 56
7338 56 80 45 -10 85 102 -63 77 -10 7 187 28 -104 42 -207 -15 -20 60 -128 -161 67 56 208 39 -65
7362 -65 -123 -26 -118 -14 -15 111 7 84 -54 -9 15 -69 105 -123 -184 53 45 7 2 27 -21 -59 -62 -23 -25 26 1 -60 89
7391 89 96 24 83 -96 -39 29 -87 20 58 82 -215 144 -84 -104 -6 43 149 95 241 7 -21 38 -247 99 39
7416 39 54 112 42 35 -41 30 -120 -53 63 80 -96 -21 -42 61 14 -36 25 1 -55 -19 16 -50 121 16 -80 35 -112
7443 -112 -115 10 -19 1 -22 -202 39 83 -35 33 -59 -55 161 5 13 -87 -119 42 16 134 39 167 -11 115 -60
7468 -60 -51 -116 103 98 -100 127 -32 0 -71 92 -110 114 -132 117 9 111 31 -50 125 -65 -74 -150 73 65 -37
7493 -37 -8 54 42 155 87 69 20 -29 190 -37 -69 80 38 -126 -106 97 78 -104 -18 115 75 -21 36 24 -148 35
7519 35 28 -49 -69 96 42 -111 22 -154 -79 72 -16 35 -58 -15 22 88 -21 99 -20 -20 -32 69 -214 101 -92
7544 -92 35 71 -113 -67 30 59 -4 -21 252 116 -47 185 18 -62 68 -110 61 60 -131 156 -83 51 84 -190
7568 -190 30 -201 -25 -115 -34 75 161 49 -169 28 35 154 105 10 37 -79 -5 271 -72 22 66 -90 16 -145
7592 -145 110 -42 36 -18 57 -93 -24 63 -86 11 57 6 3 -104 -139 152 -50 8 30 -7 105 -65 -179 -19 -37
7617 -37 -49 64 -132 -58 45 91 72 -38 33 -106 92 -128 21 98 -81 21 -51 -72 -67 80 95 -124 67 -109
7641 -109 -129 118 -77 -88 -19 -115 -85 -25 158 -99 137 -64 120 129 28 251 2 -119 91 -88 115 74 -95
7664 -95 226 -56 212 43 -83 53 -20 24 67 53 89 -36 -93 -68 -131 -73 26 110 -97 197 67 -23 32 -78 -63
7689 -63 4 -27 -6 106 -189 3 47 -115 -87 -102 -56 -98 -4 17 -70 -46 57 -25 -147 -129 -38 20 66 -61 -113 86
7715 86 -62 58 -116 -3 -59 68 202 143 53 135 -38 -143 -34 -117 35 68 161 -29 -30 -41 75 -130 -18 73
7739 73 -185 -93 38 -159 20 31 -49 -27 -132 -4 -53 35 156 -50 70 -16 -21 53 -101 70 -115 22 166 10
7763 10 102 27 38 -78 88 40 35 -65 -122 96 158 -6 8 84 4 -44 41 88 -2 76 -12 19 161 97 -54 192 -88
7790 -88 -27 -97 -26 -31 -8 77 -94 -44 -28 -114 47 118 59 19 -33 -38 -98 117 -198 -84 -4 -86 35 -22 -94 138 -64
7817 -64 -113 58 32 36 25 -32 -167 -35 133 -17 81 -111 62 101 -176 63 95 -57 28 80 70 -17 -47 -134 38
7842 38 33 -86 60 -14 0 76 76 -51 27 29 66 -117 45 90 -5 -24 21 -128 -3 -67 23 81 18 -95 76 -22 -115
7869 -115 -97 -113 24 -34 57 -180 21 165 41 69 39 90 -6 7 5 104 16 -100 -45 33 33 49 -63 -3 31 21 -16
7896 -16 77 64 -20 -38 -6 40 -105 21 -63 38 49 -24 -91 -57 67 15 -43 26 76 -47 29 4 76 82 -66 136 -54
7923 -54 143 65 60 71 -33 -89 -67 -11 100 -17 -65 163 -145 96 86 219 -36 -120 57 -78 63 -16 139 80
7947 80 93 20 -110 109 95 -6 -162 63 71 86 30 205 184 39 -74 -66 160 68 66 115 -127 -16 41 -25 125 -23
7973 -23 -92 -97 -4 78 -46 107 43 99 94 72 145 -116 -9 -25 37 6 42 9 55 27 26 123 -94 11 0 19 44 41 34 -100
8003 -100 99 -26 -125 -143 -106 -41 -71 -57 258 -223 22 -11 -11 121 20 153 -34 7 7 -29 -69 46 2 21 -153
8028 -153 -127 186 200 -55 -7 63 -142 32 40 43 -151 9 -38 40 22 102 39 -27 -2 44 -140 -9 -34 -111 -36 28 52
8055 52 38 -89 -47 -8 16 -20 -112 209 0 -181 -44 -125 -133 -93 -6 -136 -73 244 -127 227 7 94 -36 -35 42 104
8081 104 19 -60 53 -125 18 -106 -96 3 -147 21 -112 19 -64 24 6 -1 -202 -38 -36 -29 18 -142 -4 -116 27
8106 27 13 142 -82 -111 24 -159 33 24 57 40 -95 144 -46 191 234 6 61 165 -142 -17 68 -51 -68 -59
8130 -59 -131 23 -97 -32 67 50 -78 46 -198 -25 176 29 89 -73 61 -100 18 18 52 -61 14 11 -167 -139
8154 -139 100 -106 71 -37 20 -71 -54 81 37 77 39 97 36 -13 108 99 -162 79 -110 140 -15 33 -82 58
8178 58 48 132 50 -66 -138 -2 240 24 84 -106 92 -71 -3
8191c
##END NTUPLES=NMR FID
##END=
