##TITLE=1H_LR-754-P2-OSN
 CCl4
 8 sc, 
 21.10.2022
##JCAMPDX= 6.0         $$ Bruker NMR JCAMP-DX V2.0
##DATA TYPE= NMR FID
##DATA CLASS= NTUPLES
##ORIGIN= UXNMR, Bruker Analytische Messtechnik GmbH
##OWNER= root
$$ XWIN-NMR		Version 3.5
$$ Fri Oct 21 16:19:14 2022 Russian Standard Time (UT+4h)  she@DPX200
##.OBSERVE FREQUENCY= 200.1313499994
##.OBSERVE NUCLEUS= ^1H
##.DELAY= (6, 6)
##.ACQUISITION MODE= SIMULTANEOUS
##.ACQUISITION SCHEME= undefined
##.AVERAGES= 8
##.DIGITISER RES= 18
##SPECTROMETER/DATA SYSTEM= spect
##.PULSE SEQUENCE= zg30
##.SOLVENT NAME= CDCl3
##.SHIFT REFERENCE= (INTERNAL, CDCl3, 0, 15.7039)
##AUDIT TRAIL= $$ (NUMBER, WHEN, WHO, WHERE, WHAT)
$$ ##TITLE= Audit trail, XWIN-NMR		Version 3.5
$$ ##JCAMPDX= 5.01
$$ ##ORIGIN= Bruker BioSpin GmbH
$$ ##OWNER= she
$$ F:/spectra/data/she/nmr/H-F/1/audita.txt
$$ ##AUDIT TRAIL=  $$ (NUMBER, WHEN, WHO, WHERE, WHAT)
(   1,<2022-10-21 16:18:08.51 +0400>,<she>,<DPX200>,
      <created by zg, POWCHK disabled, PULCHK disabled
       configuration hash MD5:
       00 E9 B6 7A A2 85 ED C7 34 08 36 98 17 FE 4E 26
       data hash MD5: 16K
       8B 2B FC 97 70 FD C3 8C B9 B4 D6 92 A5 37 7A 94>)
$$ ##END=
$$ 
$$ hash MD5
$$ C9 BA 11 2A B8 67 E5 CB 45 C7 AF DA 53 45 4C C1
##$RELAX= 
##$RELAX= 
##$RELAX= 
##$RELAX= 
##$RELAX= 
##$RELAX= 
$$ Bruker specific parameters
$$ --------------------------
##$DU= <F:/spectra>
##$EXPNO= 1
##$NAME= <H-F>
##$PROCNO= 1
##$TYPE= <nmr>
##$USER= <she>
##$AMP= (0..31)
100 100 100 100 100 100 100 100 100 100 100 100 100 100 100 100 100 100 
100 100 100 100 100 100 100 100 100 100 100 100 100 100 
##$AQSEQ= 0
##$AQ_mod= 1
##$AUNM= <au_zg>
##$AUTOPOS= <>
##$BF1= 200.13
##$BF2= 200.13
##$BF3= 200.13
##$BF4= 200.13
##$BF5= 200.13
##$BF6= 200.13
##$BF7= 200.13
##$BF8= 200.13
##$BYTORDA= 1
##$CFDGTYP= 0
##$CFRGTYP= 5
##$CHEMSTR= <none>
##$CNST= (0..31)
1 1 145 1 1 1 1 1 1 1 1 1 1 1 1 1 1 1 1 1 1 1 1 1 1 1 1 1 1 1 1 1 
##$CPDPRG= <>
##$CPDPRG1= <>
##$CPDPRG2= <>
##$CPDPRG3= <>
##$CPDPRG4= <mlev>
##$CPDPRG5= <mlev>
##$CPDPRG6= <mlev>
##$CPDPRG7= <mlev>
##$CPDPRG8= <mlev>
##$CPDPRGB= <>
##$CPDPRGT= <>
##$D= (0..31)
0 1.2 0 0 0 0 0 0 0 0.06 0 0.03 0 0 0 0 0.0002 0 0 0 0 0 0 0 0 0 0 0 0 
0 0 0 
##$DATE= 1666354688
##$DBL= (0..7)
120 120 120 120 120 120 120 120 
##$DBP= (0..7)
150 150 150 150 150 150 150 150 
##$DBP07= 0
##$DBPNAM0= <>
##$DBPNAM1= <>
##$DBPNAM2= <>
##$DBPNAM3= <>
##$DBPNAM4= <>
##$DBPNAM5= <>
##$DBPNAM6= <>
##$DBPNAM7= <>
##$DBPOAL= (0..7)
0.5 0.5 0.5 0.5 0.5 0.5 0.5 0.5 
##$DBPOFFS= (0..7)
0 0 0 0 0 0 0 0 
##$DE= 6
##$DECBNUC= <off>
##$DECIM= 32
##$DECNUC= <off>
##$DECSTAT= 4
##$DIGMOD= 1
##$DIGTYP= 9
##$DL= (0..7)
0 120 120 120 120 120 120 120 
##$DP= (0..7)
150 150 150 150 150 150 150 150 
##$DP07= 0
##$DPNAME0= <>
##$DPNAME1= <>
##$DPNAME2= <>
##$DPNAME3= <>
##$DPNAME4= <>
##$DPNAME5= <>
##$DPNAME6= <>
##$DPNAME7= <>
##$DPOAL= (0..7)
0.5 0.5 0.5 0.5 0.5 0.5 0.5 0.5 
##$DPOFFS= (0..7)
0 0 0 0 0 0 0 0 
##$DQDMODE= 0
##$DR= 18
##$DS= 0
$$ [...]
##$SUBNAM2= <"">
##$SUBNAM3= <"">
##$SUBNAM4= <"">
##$SUBNAM5= <"">
##$SUBNAM6= <"">
##$SUBNAM7= <"">
##$SUBNAM8= <"">
##$SUBNAM9= <"">
##$SW= 18.0517283424941
##$SWIBOX= (0..15)
0 0 2 0 0 0 0 0 0 0 0 0 0 0 0 0 
##$SW_h= 3612.71676300578
##$TD= 16384
##$TD0= 1
##$TE= 0
##$TE2= 300
##$TE3= 300
##$TEG= 300
##$TL= (0..7)
0 120 120 120 120 120 120 120 
##$TP= (0..7)
150 150 150 150 150 150 150 150 
##$TP07= 0
##$TPNAME0= <>
##$TPNAME1= <>
##$TPNAME2= <>
##$TPNAME3= <>
##$TPNAME4= <>
##$TPNAME5= <>
##$TPNAME6= <>
##$TPNAME7= <>
##$TPOAL= (0..7)
0.5 0.5 0.5 0.5 0.5 0.5 0.5 0.5 
##$TPOFFS= (0..7)
0 0 0 0 0 0 0 0 
##$TUNHIN= 0
##$TUNHOUT= 0
##$TUNXOUT= 0
##$USERA1= <user>
##$USERA2= <user>
##$USERA3= <user>
##$USERA4= <user>
##$USERA5= <user>
##$V9= 5
##$VALIST= <valist>
##$VCLIST= <CCCCCCCCCCCCCCC>
##$VD= 0
##$VDLIST= <DDDDDDDDDDDDDDD>
##$VPLIST= <PPPPPPPPPPPPPPP>
##$VTLIST= <TTTTTTTTTTTTTTT>
##$WBST= 1024
##$WBSW= 4
##$XGAIN= (0..3)
0 0 0 0 
##$XL= 0
##$YL= 0
##$YMAX_a= 844726
##$YMIN_a= -1073213
##$ZGOPTNS= <>
##$ZL1= 120
##$ZL2= 120
##$ZL3= 120
##$ZL4= 120
##$ABSF1= 10
##$ABSF2= 0
##$ABSG= 5
##$ABSL= 3
##$ALPHA= 0
##$AQORDER= 0
##$ASSFAC= 0
##$ASSFACI= 0
##$ASSFACX= 0
##$ASSWID= 0
##$AUNMP= <proc_1d>
##$AZFE= 0.1
##$AZFW= 0.1
##$BCFW= 1
##$BC_mod= 2
##$BYTORDP= 1
##$COROFFS= 0
##$CY= 11.3945322036743
##$DATMOD= 1
##$DC= 2
##$DFILT= <>
##$DTYPP= 0
##$F1P= 2.36226072786647
##$F2P= -0.459571619588291
##$FCOR= 0.5
##$FTSIZE= 0
##$FT_mod= 4
##$GAMMA= 1
##$GB= 0.15
##$INTBC= 1
##$INTSCL= 1
##$ISEN= 128
##$LB= 0.24
##$LEV0= 0
##$LPBIN= 0
##$MAXI= 10000
##$MC2= 0
##$MEAN= 0
##$ME_mod= 0
##$MI= 1.114404
##$NCOEF= 0
##$NC_proc= 0
##$NLEV= 6
##$NOISF1= 3.799351
##$NOISF2= 2.8
##$NSP= 1
##$NTH_PI= 0
##$NZP= 0
##$OFFSET= 15.70392
##$PC= 1
##$PHC0= -18039.52
##$PHC1= 18.0007
##$PH_mod= 1
##$PKNL= yes
##$PPARMOD= 0
##$PSCAL= 0
##$PSIGN= 0
##$REVERSE= no
##$SF= 200.130013532006
##$SI= 16384
##$SIGF1= 3
##$SIGF2= 2
##$SINO= 400
##$SIOLD= 16384
##$SREGLST= <1H.CDCl3>
##$SSB= 0
##$STSI= 0
##$STSR= 0
##$SW_p= 3612.71676300578
##$SYMM= 0
##$S_DEV= 0
##$TDeff= 0
##$TDoff= 0
##$TI= <>
##$TILT= no
##$TM1= 0
##$TM2= 0
##$TOPLEV= 0
##$USERP1= <user>
##$USERP2= <user>
##$USERP3= <user>
##$USERP4= <user>
##$USERP5= <user>
##$WDW= 1
##$XDIM= 8192
##$YMAX_p= 0
##$YMIN_p= 0
$$ End of Bruker specific parameters
$$ ---------------------------------
##NTUPLES= NMR FID
##VAR_NAME=  TIME,          FID/REAL,        FID/IMAG
##SYMBOL=    X,             R,               I
##VAR_TYPE=  INDEPENDENT,   DEPENDENT,       DEPENDENT
##VAR_FORM=  AFFN,          ASDF,            ASDF
##VAR_DIM=   8192,          8192,            8192
##UNITS=     SECONDS,       ARBITRARY UNITS, ARBITRARY UNITS
##FACTOR=    0.0002768,     1,               1
##FIRST=     0,             0,               0
##LAST=      2.2672688,     0,               0
##MIN=       0,             -1073213,        0
##MAX=       2.2672688,     844726,          0
$$ Real data points
##PAGE= N=1
##DATA TABLE= (X++(R..R)), XYDATA
$$ plain form
0 0 0 0 0 0 0 0 0 8 -8 16 -24 32 -40 48 -64 80 -97 121 -152 185 -225 271 -326 386 -454 534 -623 724
28 724 -836 964 -1106 1265 -1441 1637 -1854 2091 -2354 2643 -2962 3307 -3688 4104 -4558 5051
44 5051 -5592 6183 -6828 7530 -8299 9145 -10069 11087 -12206 13447 -14831 16377
56 16377 -18117 20098 -22366 24997 -28090 31791 -36303 41951 -49255 59132 -73335 95904
68 95904 -139866 403329 -826337 174093 145592 -255169 728371 -1073213 646236 10279
78 10279 -190381 234841 -528671 571900 -107981 -178299 -431 -20322 417519 -451316
88 -451316 3468 123497 188637 -157606 -288752 366658 -3632 -87904 -135956 82786 171775
99 171775 -85129 -148988 308 272900 -181540 29994 -204328 249693 218834 -617322
$$ packed form
0@%%%%%%%Qj6K4m0N6p2Q8j12J44j77K18k73L37m10M96n97P12q40R88j157J347
28G24j560J800k070K371k706L078l491L945m445M997n605O269o995P792q662R609
44E051j0643J1775j3011J4358j5829J7444j9214K1156k3293K5653k8278L1208
56A6377l4494L8215m2464M7363n3087N9881o8094P8254r1206J08387j32467J69239
68I5904k35770N43195j229666J000430k8501m00761R83540j801584J719449o35957
78A0279k00660M25222p63512J100571o79881p0318J77868j9891M37841q68835
88d51316M54784J20029O5140l46243j31146O55410l70290q4272m8052K18742Q8989
99A71775k56904o3859J49296K72592m54440K11534k34322M54021l0859q36156
$$ plain form
109 -617322 426332 -120301 137399 -34238 -472399 777151 -482803 86267 54827 -271231
119 -271231 635638 -656156 268107 14656 -102933 364437 -662127 506046 -65795
128 -65795 -94530 66659 -303825 596378 -435003 17265 135632 -126963 305723 -462410
138 -462410 262672 47339 -129162 149470 -287007 278461 -6981 -156243 40044 15416
148 15416 120184 -110936 -103442 123835 123942 -228146 66855 32142 5228 87633 -284823
159 -284823 276029 -74583 -45265 100780 -259677 369612 -213395 -22881 84991 -116753
169 -116753 288978 -380766 190446 52138 -110484 140160 -289925 357353 -189457 -23333
179 -23333 126367 -227525 350656 -312795 101196 73165 -153989 262582 -341780 215693
$$ packed form
109f17322J043654n46633K57700j71637m38161J249550j259954N69070l1440l26058
119b71231R06869j291794R24263k53451j17589M67370j026564J168173n71841
128f5795k8735J61189l70484R00203j031381M52268J18367k62595M32686p68133
138d62410P25082k15333j76501K78632m36477N65468k85442j49262J96287k4628
148A5416J04768k31120P494K27277J07l52088K95001l4713k6914Q2405l72456
159b84823N60852l50612K9318J46045l60457O29289n83007J90514J07872k01744
169a16753M05731o69744N71212j38308j62622K50644m30085O47278n46810J66124
179b3333J49700l53892N78181o63451M13991k8031k27154M16571o04362N57473
$$ plain form
189 215693 30551 -148932 139093 -172761 211263 -103288 -68635 111940 -61742 63989
199 63989 -85907 36519 11455 19992 -40519 -22499 72483 -49869 50498 -106092 92088
210 92088 23943 -100246 81131 -75706 117949 -98908 -3431 79770 -95870 118533 -145013
221 -145013 102640 -6290 -65054 113328 -172252 187707 -100348 -24178 99867 -143621
231 -143621 187592 -176666 68711 62507 -133083 153019 -152907 111294 -20775 -63116
241 -63116 102043 -115629 113273 -72048 6859 34855 -51124 73117 -92312 72550 -24585
252 -24585 -10100 27775 -52828 76787 -71433 40986 -10798 -15237 44912 -63829 59473
263 59473 -45544 31644 -7826 -28633 56447 -62302 57256 -48608 24953 17592 -57112
$$ packed form
189B15693j85142j79483K88025l11854L84024l14551L4653J80575j73682J25731
199F3989j49896J22426k5064Q537o0511J8020R4982j22352J00367j56590J98180
210I2088o8145j24189J81377j56837J93655k16857R5477Q3201j75640K14403k63546
221a45013K47653j08930n8764J78382k85580L59959k88055P6170J24045k43488
231a43621L31213l64258K45377o204j95590K86102l05926K64201j32069m2341
241f3116J65159k17672K28902j85321P8907K7996q5979J24241j65429J64862r7135
252b4585J4485L7875q0603J29615j48220J12419n1784m439O0149j08741J23302
263E9473j05017P7188l9470k0807Q5080j18749J19558j05864P3561p361p4704
$$ plain form
274 -57112 76230 -73612 54899 -19859 -22304 57437 -76076 75079 -53320 14522 27473
285 27473 -56009 66686 -63487 46171 -14875 -21631 48656 -58457 53045 -36846 15059
296 15059 10217 -34666 49395 -49216 35266 -14533 -5848 22611 -36048 42507 -36791 19884
308 19884 1293 -18767 29897 -35289 34071 -23138 2938 17149 -29193 30646 -25610 16972
320 16972 -4421 -10156 22095 -25715 20937 -11889 2630 5089 -12550 18424 -19503 13136
332 13136 -4120 -3702 8888 -13400 16563 -14661 6493 4981 -12157 14444 -13044 8451 -809
345 -809 -7174 12642 -13843 9165 -610 -6922 10973 -11541 9439 -3296 -5200 12820 -14041
358 -14041 10415 -4941 -2947 12228 -17112 14653 -9728 4077 5426 -17406 24206 -19520
$$ packed form
274e7112J33342j49842J28511p4758k445P9741j33513J51155j28399O7842J2951
285B7473q3482J22695j30173J09658o1046o756P0287j07113J11502q9891N1905
296A5059m842m4883Q4061r8611Q4482m9799Q685K8459n8659P8555p9298N6675
308A9884j8591k0060M8664o5186O9360n7209K6076J4211m6342N9839n6256M2582
320A6972k1393n735L2251m7810M6652l2826J4519K459j7639L0974l7927L2639
332A3136j7256M18J2590k2288K9963l1224K1154j512j7138K6601k7488K1495r260
345h09o365J9816k6485K3008r775o312J7895k2514K0980j2735j904J8020k6861
358a4041K4456j5356J994J5175k9340L1765k4381J3805J349k2832M1612m3726
$$ plain form
370 -19520 9988 -356 -12280 25853 -29722 20219 -6318 -7803 23102 -31531 23995 -8102
382 -8102 -2823 10195 -21315 25506 -10733 -7588 8041 1096 -1153 -3315 -216 797 12363 -23928
396 -23928 18987 -7351 -3219 23235 -45175 42033 -14828 -5182 12969 -34714 61778 -53452
408 -53452 12028 15683 -23190 42333 -67435 59226 -21751 -9290 35081 -70548 89706
419 89706 -61147 14044 17472 -55030 105679 -110842 43347 29292 -54412 68665 -96195
430 -96195 81649 -5991 -57956 64091 -55224 54952 -26507 -24167 38213 -17985 20088
441 20088 -33891 7242 27009 -2454 -37425 12142 38366 -27914 -5773 -15978 51600 -23026
453 -23026 -26531 25962 -15357 46694 -66706 29960 4785 -7977 44782 -116972 118506 -32178
$$ packed form
370a9520K9508j0344j1924L8133n5575M9941k6537j485L0905n4633N5526l2097
382h102N279J3018l1510M6821l6239L145J5629o945k249k162L099J013J1566l6291
396b3928M2915k6338M132K6454o8410Q7208n6861R646J8151m7683R6492j15230
408e3452O5480L655l8873O5523j09768J26661q0977J2461M4371j05629J60254
419H9706j50853P5191L428p2502J60709k16521J54189j4055q3704J23077j64860
430i6195J77844q7640n1965J22047j19315J10176q1459K340O2380n6198L8073
441B0088n3979M1133J9767k9463l4971M9567K6224o6280K2141j0205O7578p4626
453b3026l505N2493m1319O2051j13400R6666k5175j2762N2759j61754K35478j50684
$$ plain form
465 -32178 -29819 41873 -93414 170927 -142504 6495 92753 -114734 139691 -157838 79298
476 79298 55473 -124136 128449 -137436 110523 3077 -104110 97612 -67325 96263
486 96263 -91004 -18675 103696 -68312 24360 -63219 77729 6334 -73606 48705 -27367
497 -27367 55382 -37443 -37717 50143 4329 -5630 -35475 968 60808 -5715 -103407 89593
509 89593 10745 -36192 18707 -86493 165085 -101057 -40653 107698 -126806 170172 -150374
520 -150374 5850 125089 -142957 145053 -175491 103867 81914 -181849 129235 -94056
530 -94056 129807 -78790 -81228 163324 -119237 97363 -117297 46295 91382 -139614 111748
541 111748 -120531 110730 20679 -151742 127374 -50456 65462 -66939 -58402 155624
$$ packed form
465c2178K359P1692j35287K64341l13431J48999Q6258k07487K54425k97529K37136
476G9298k3825j79609K52585k65885K47959j07446j07187K01722j64937J63588
486I6263j87267P2329J22371j72008R2672q7579J40948p1395p9940J22311p6072
497b7367Q2749r2825k74Q7860m5814r959k9845L6443N9840o6523r7692J93000
509H9593p8848m6937N4899j05200K51578k66142O0404J48351k34504K96978l20546
520a50374J56224J19239k68046K88010l20544K79358k1953k63763L11084k23291
530i4056K23863k08597k438K44552k82561K16600k14660J63592M5087k30996K51362
541A11748k32279K31261r0051j72421K79116j77830J15918j32401Q537K14026
$$ plain form
551 155624 -75450 -37208 22540 15230 31764 -46643 -43376 89342 -15300 -42200 28827 -63940
563 -63940 134839 -78783 -73733 120223 -64262 82541 -141015 56515 114305 -157909 95764
574 95764 -96942 120799 -23447 -121857 157706 -133598 147917 -112228 -44750 174955
584 174955 -166791 137180 -154970 78944 122707 -237748 168890 -83683 70367 488
594 488 -149400 196026 -97248 17225 -7340 -41197 112072 -80830 -5809 3234 39987
605 39987 5508 -66005 12890 54667 4977 -87177 43671 29251 3176 -47096 -14794 82255
617 82255 -51229 15721 -50630 52236 32216 -85374 64043 -75616 121235 -64362 -84950
628 -84950 154943 -119421 109645 -118336 16233 154284 -213901 150301 -90936 41507
$$ packed form
551A55624k31074L8242N9748p310J6534p8407L267J32718j04642k6900P1027r2767
563f3940J98779k13622N050J93956j84485J46803k23556J97530N7790k72214K53673
574I5764j92706K17741j44246r8410K79563k91304K81515k60145O7478K19705
584A74955l41746L03971k92150K33914M3763l60455M06638k52573J54050o9879
594D88j49888L45426k93274J14473k4565l3857J53269j92902P5021R043L6753
605C9987l4479p1513P8895M1777m9690r2154J30848j4420k6075n0272L2302R7049
617H2255j33484O6950o6351J02866k0020j17590J49417j39659J96851j85597k0588
628h4950K39893k74364K29066k27981J34569J38051l68185L64202k41237J32443
$$ plain form
638 41507 75547 -191161 184090 -99809 45002 12247 -117954 173620 -106200 23587
648 23587 -15647 -2569 87562 -127233 58857 3112 13207 -13582 -49982 78498 -32715
659 -32715 5853 -26000 12206 36370 -33798 -7890 -3279 45223 -29010 -12141 -8861 44123
671 44123 1031 -75317 77408 -39240 37798 -31870 -40436 113421 -109399 67785 -40413
682 -40413 -10468 97019 -139375 101037 -51462 22533 38673 -123539 141215 -79088 23575
693 23575 -514 -47619 113271 -119928 64287 -17589 -9017 56575 -101973 91610 -45614
704 -45614 15709 11876 -60424 88539 -58827 15995 -6225 -1847 36488 -55297 30160 -4824
716 -4824 11751 -16885 -2088 16046 -12314 19438 -40670 42206 -19313 640 12932 -42836
$$ packed form
638D1507L4040k66708L75251k83899J44811l2755j30201K91574k79820J29787
648B3587l9234J3078R0131k14795J86090n5745J0095k6789l6400J28480j11213
659c2715L8568l1853L8206K4164p0168K5908M611M8502p4233J6869L280N2984
671D4123m3092p6348J52725j16648P7038o9668q566J53857k22820J77184j08198
682d0413K9945J07487k36394K40412j52499P3995J6140j62212K64754k20303J02663
693B3575k4089m7105J60890k33199J84215q1876Q572O5592j58548J93583j37224
704d5614O1323l833p2300J48963j47366P4822k2220M378L8335r1785Q5457l4984
716d824J6575k8636J4797J8134k8360L1752o0108Q2876o1519J9953J2292n5768
$$ plain form
728 -42836 70722 -60152 22558 5159 -25029 55716 -78450 64251 -25300 -8567 36037
739 36037 -65471 78967 -60893 25551 8397 -42622 73483 -78584 53030 -18178 -11821
750 -11821 43050 -70328 71837 -45212 11439 15498 -39454 56727 -55474 36566 -13312
761 -13312 -8165 29010 -42837 42035 -32058 20520 -5092 -16105 32867 -37281 32568 -25766
773 -25766 14818 3641 -22628 34241 -37263 34128 -22504 3545 17016 -33340 42757 -41826
785 -41826 28065 -5234 -17343 34194 -43951 43457 -29561 5681 17857 -34481 41066 -38578
797 -38578 26925 -7974 -12432 28921 -37460 36928 -27510 11731 6905 -24103 35843 -38288
809 -38288 29203 -13024 -5330 21164 -32230 35017 -28280 13528 3718 -17170 25878 -29016
$$ packed form
728d2836J13558j30874Q2710j7399l0188Q0745j34166J42701q9551J6733M4604
739C6037j01508J44438j39860Q6444j7154n1019J16105j52067J31614p1208O357
750a1821N4871j13378J42165j17049N6651M059n4952R6181j12201R2040m9878
761a3312N147L7175p1847Q4872p4093N2578k5612j1013M8972p0148O9849n8334
773b5766M0584j1177k6269N6869p1504P1391n6632K6049J3471n0356P6097q4583
785d1826O9891l3299j2109N1537p8145Q7408p3018L5242J2176n2338P5547p9644
797c8578O5503l4899m458M1353o6381P4388o4438L9241m826l1008N9946p4131
809c8288O7491m2227P694K6494n3394O7247o3297M1808r810k0888M3048n4894
$$ plain form
821 -29016 25973 -16556 2642 10764 -21220 26247 -26186 20804 -9001 -6346 20075 -27992
833 -27992 27275 -20164 8929 5120 -18357 26044 -25245 17871 -6854 -3564 12834 -19722
845 -19722 21820 -18078 9292 304 -8512 14952 -19766 20277 -14565 2959 8824 -16952 19858
858 19858 -19503 14590 -3323 -10165 19465 -19860 14718 -7626 -177 8911 -15241 15294 -9707
871 -9707 2084 2806 -5403 6370 -6688 6284 -4204 -213 2899 -1133 -261 -3266 7660 -6148
885 -6148 637 1395 546 786 -5786 8423 -5473 2177 -46 -2323 5184 -7292 9914 -10281 2869
900 2869 9137 -14400 11007 -8644 9312 -802 -16638 25383 -15857 2165 5901 -13670 21932
913 21932 -20520 6977 8543 -19883 26366 -21345 2354 16488 -20032 17516 -19459 13519
$$ packed form
821b9016N4989m2529J9198Q122l1984M7467n2433M6990k9805K655K6421m8067
833b7992N5267m7439K9093l809k3477M4401n1289M3116k4725L290J6398l2556
845a9722M1542l9898K7370q988q816K3464l4718M0043l4842J7524N865k5776L6810
858A9858l9361L4093j7913o842K9630l9325L4578k2344P449R088k4152L0535k5001
871i707J1791P22q209J1773j3058J2972j0488L991L112m032Q72l005J0926j3808
885f148O785P58q49K40o572J4209j3896P650k223k277P507j2476J7206k0195J3150
900B869O268k3537K5407j9651J7956j0114j5836M2021m1240J8022L736j9571L5602
913B1932m2452K7497J566k8426M6249m7711K3699J4134l6520L7548l6975L2978
$$ plain form
925 13519 10909 -31304 26391 -10259 4591 -432 -15183 29183 -24674 11094 -486 -11987
937 -11987 27278 -28252 15381 -6442 319 21013 -42880 33307 -1325 -15126 14264 -24025
949 -24025 37327 -20546 -16382 33486 -26112 18772 -8773 -14633 32173 -22758 6828 -1289 -12329
962 -12329 36976 -34653 -3876 30003 -20767 14031 -26619 18606 22063 -46733 32260 -15054
974 -15054 10906 6758 -37471 44251 -29220 21241 -10515 -29127 64967 -52835 19767 -10473
986 -10473 -964 48899 -87232 60848 -4501 -22212 36051 -65776 74937 -31857 -21411
997 -21411 43593 -54994 64947 -37325 -21303 47517 -31132 27908 -39466 10381 44632 -49643
1009 -49643 6651 9231 6693 3459 -32728 23465 12764 -19722 8386 -18988 24596 8711
$$ packed form
925A3519k610m2213N7695l6650J4850n023j4751M4366n3857L5768j1580j1501
937a1987L9265n5530M3633k1823O761K0694o3893P6187l4632j3801K9390l8289
949b4025O1352n7873M164M9868n9598M4884k7545n860M6806n4931K9586q117j1040
962a2329M9305p1629L0777L3879n0770L4798m0650M5225L457o8796P8993m7314
974a5054K5960m148m4229Q1722p3471N0461l1756j8612R4094j17802P2602l0240
986a0473R509M9863j36131J48080o5349j7711N8263j01827J40713j06794J0446
997b1411O5004r8587J19941j02272J6022O8820p8649N9040o7374M9847L4251r4275
1009d9643N6294K580k538l234l6187N6193j0701l2486K8108k7374M3584j5885
$$ plain form
1021 8711 -37704 23402 -11165 31119 -24395 -36137 75850 -47897 14181 -14605 -7141 70889
1033 70889 -99258 55669 -3547 -22740 61781 -102802 84206 -16471 -28205 47114 -84691
1044 -84691 105441 -48411 -36202 59542 -45645 61634 -72389 17368 51333 -57272 33319
1055 33319 -38532 38617 5930 -42871 32076 -21131 34947 -19902 -32286 45723 -7666 -5919
1067 -5919 -15632 1613 43842 -37777 -20014 43448 -21096 16176 -24666 -9930 63077 -65524
1079 -65524 30594 -9494 -15517 71230 -100173 55334 6150 -27093 46648 -92768 97939
1090 97939 -27954 -42331 56432 -59761 82042 -68004 2109 50024 -58227 64768 -74083
1101 -74083 39883 23367 -51338 46772 -59381 67142 -20199 -46350 59664 -36780 36539
$$ packed form
1021H711m6415O1106l4567M2284n5514j1742J11987j23747O2078k8786P464P8030
1033G0889j70147J54927n9216j9193Q4521j64583J87008j00677j1734P5319j31805
1044h4691J90132j53852J2209R5744j05187J07279j34023Q9757L3965j08605R0591
1055C3319p1851P7149l2687m8801P4947n3207N6078n4849j2384P8009n3389J747
1067e919r713J7245M2229q1619J7763O3462o4544L7272m0842J4736P3007j28601
1079f5524R6118m0088o023Q6747j71403J55507m9184l3243P3741j39416J90707
1090I7939j25893j4377R8763j16193J41803j50046P0113M7915j08251J22995j38851
1101g4083J13966j6516p4705R8110j06153J26523q7341k6151J06014r6444P3319
$$ plain form
1112 36539 -37609 -4503 52161 -47353 15291 -5574 322 24377 -32634 2386 22704 -14205
1124 -14205 7485 -16351 -268 43109 -52654 15583 13231 -15073 31264 -61050 53236 -4829
1136 -4829 -30782 40889 -54445 64917 -37537 -11604 40687 -53083 70401 -67743 19972
1147 19972 34914 -55567 59323 -70143 57359 -1180 -54190 67837 -60195 53273 -27738
1158 -27738 -22865 58701 -57388 43342 -29436 97 35771 -42883 24907 -15164 14541 2627
1170 2627 -24679 19468 1847 -3187 -9698 7833 1510 4865 -14793 4638 13224 -17297 17428
1183 17428 -24708 21860 1438 -21568 25395 -29906 39195 -28645 -6256 34409 -41577 44232
1195 44232 -44784 22754 18400 -49107 55879 -51753 37120 -3321 -35647 54893 -53397
$$ packed form
1112C6539p4148L3106N6664r9514O2644k0865N896K4055n7011L5020K0318l6909
1124a4205K1690k3836J6083M3377r5763O8237k352k8304M6337r2314J14286n8065
1136d829k5953P1671r5334J19362j02454K5933N2291r3770J23484j38144Q7715
1147A9972J4942r0481J14890j29466J27502n8539n3010J22027j28032J13468q1011
1158b7738M873Q1566j16089J00730p2778K9533L5674p8654O7790m0071K9705j1914
1170B627k7306M4147j7621n034o511J7531o323L355j9658J9431Q586l0521L4725
1183A7428m2136M6568k0422k3006M6963n5301O9101o7840K2389M0665p5986Q5809
1195D4232q9016O7538m354o7507J04986j07632Q8873m0441l2326R0540j08290
$$ plain form
1206 -53397 44669 -23859 -12357 43927 -49444 38986 -29156 12727 14669 -35832 36165 -26495
1218 -26495 19409 -8480 -9142 21454 -21826 19429 -17691 9699 3062 -9013 8755 -12252
1230 -12252 18221 -15985 6760 -1948 172 8291 -20814 24838 -19471 12624 -3427 -11772 26919
1243 26919 -32191 28409 -18865 2608 18784 -34462 36829 -30461 18775 181 -23203 38521
1255 38521 -39131 29665 -14973 -4663 25132 -37571 37173 -26383 10527 8235 -24267 31702
1267 31702 -29703 21671 -9595 -5388 18599 -24273 23104 -19120 12641 -2169 -9920 18671
1279 18671 -22101 21475 -17016 8302 4679 -16344 23181 -24393 19283 -8673 -3274 12827
1291 12827 -20206 23289 -20798 12042 -684 -8723 16410 -22626 24108 -18270 6276 7067
$$ packed form
1206e3397R8066o8528J1502N6284r3371Q8430o8142M1883J942n0501P1997o2660
1218b6495M5904k7889o62L0596m3280M1255l7120K7390o637j2075J7768k1007
1230a2252L0473l4206K2745q708K120Q119k9105M5652m4309L2095j6051q345L8691
1243B6919n9110O0600m7274K1473J6176n3246P1291o7290M9236j8594k3384O1724
1255C8521p7652O8796m4638J0310K9795o2703P4744o3556L6910k292l2502N5969
1267C1702o1405N1374l1266M207K3987m2872M7377m2224L1761j4810p751K8591
1279A8671m0772M3576l8491K5318l623k1023L9525m7574M3676k7956N399J6101
1291A2827l3033M3495m4087L2840j2726q039K5133l9036M6734m2378K4546P91
$$ plain form
1303 7067 -18369 25374 -26702 20159 -7672 -8090 21059 -27394 25020 -16241 4611 7210 -16985
1316 -16985 23192 -21918 14541 -5334 -2965 10223 -17041 20760 -18770 11374 -1184 -8863
1328 -8863 16709 -21304 21278 -15007 2775 10456 -18621 20511 -17711 12215 -3802 -6867
1340 -6867 15710 -18304 15517 -10555 5546 484 -8412 15642 -18586 15616 -8417 837 6967
1353 6967 -14274 20017 -19283 10850 997 -10338 14779 -16738 15985 -11198 992 9251
1365 9251 -14491 14227 -12026 9502 -4792 -3237 11768 -15955 14260 -9151 3965 1607
1377 1607 -8832 15671 -17306 10620 -1180 -5447 8792 -11410 12809 -9272 1500 6360
1389 6360 -8214 6358 -4174 4654 -5244 2676 1979 -4315 4460 -4397 7678 -9970 5312 3899
$$ packed form
1303G067k5436M3743n2076M6861k7831m18K9149m8453N2414m1261K0852K599k4195
1316a6985M0177m5110L6459j9875K369J3188k7264L7801l9530L0144j2558p679
1328h863K5572l8013M2582l6285J7782P681k9077L9132l8222K9926j6017l065
1340f867K2577l4014L3821k6072J6101n062q896K4054l4228L4202k4033R254O130
1353F967k1241L4291l9300L0133r853j1335K5117l1517L2723k7183J2190Q259
1365I251k3742K8718k6253K1528j4294J555J5005k7723L0215k3411J3116k358
1377A607j0439K4503l2977K7926j1800m267J4239k0202K4219k2081J0772M860
1389F360j4574J4572j0532Q828r898P920o97o294Q775q857J2075j7648J5282j413
$$ plain form
1403 3899 -10641 10389 -9322 8816 -5552 -2659 12052 -15344 12415 -5892 257 4101 -7934
1416 -7934 12865 -14834 9822 646 -8370 10008 -10728 13759 -11616 535 13242 -18142
1428 -18142 14630 -8088 1774 5654 -13842 17214 -12747 2042 9893 -15809 11333 -3387
1440 -3387 -927 4020 -10048 13570 -5832 -8068 12843 -7711 1466 288 -2838 7894 -10478
1453 -10478 7019 249 -8018 11688 -8914 3501 -481 -498 6566 -15974 15742 -3246 -7689
1466 -7689 10025 -10833 14635 -13528 961 14785 -22495 19429 -9292 -4088 15165 -20328
1478 -20328 19679 -13752 -199 19702 -29682 20475 -3728 -7501 13243 -20537 23525 -12295
1490 -12295 -7637 21181 -22226 16521 -8011 -2683 12798 -19145 21266 -15777 782 15908
$$ packed form
1403C899j4540K1030j9711J8138j4368K893J4711k7396K7759j8307O149L844j2035
1416g934K0799k7699K4656r176r016J8378k0736K4487k5375J2151J2707l1384
1428a8142L2772k2718R862L880j9496L1056k9961J4789P851k5702K7142j4720
1440c387K460M947j4068K3618j9402k236K0911k0554R177j178l126J0732j8372
1453a0478J7497o770q267J9706k0602J2415l982j7P064k2540L1716j8988m443
1466g689J7714k0858K5468k8163J4489J3824l7280M1924k8721N204J9253l5493
1478b0328M0007l3431J3553J9901m9384N0157k4203l773K0744l3780M4062l5820
1490a2295M658K8818m3407L8747k4532N328J5481l1943M0411l7043J6559J5126
$$ plain form
1502 15908 -21620 17317 -12841 9412 3101 -22136 30074 -19824 3739 7830 -16730 24163
1514 24163 -23446 10661 7027 -22099 28183 -21250 3489 13367 -19348 19151 -17453 7407
1526 7407 13556 -28672 23674 -7102 -5342 12484 -20447 23372 -13067 -4978 19009 -25264 23311
1539 23311 -11859 -4595 16663 -21878 25525 -23929 6465 18355 -31324 28758 -22584 14205
1551 14205 5227 -29846 41784 -33573 14898 5551 -26525 39602 -35873 19635 86 -21348
1563 -21348 38683 -38965 17867 5389 -17741 24462 -29457 21937 615 -20261 23024 -16598
1575 -16598 9802 3 -13073 18207 -12889 4836 3202 -14060 20377 -12600 -1740 9732
1587 9732 -13069 19804 -21922 6582 16026 -27154 26148 -22365 12056 9897 -31930 39203
$$ packed form
1502A5908l7528L8937l0158K2253o311k5237N2210m9898K3563M091k4560M0893
1514B4163m7609L4107l634k9126N0282m9433K4739R878l2715L8499l6604K4860
1526G407O149m2228N2346l0776J760J7826l2931M3819l6439Q089K3987m4273M8575
1539B3311l5170P264K1258l8541M7403m9454L0394J1890m9679O0082n1342L6789
1551A4205q978l5073P1630p5357M8471r347l2076O6127p5475N5508j9549k1434
1563b1348O0031p7648N6832j2478k3130M2203n3919N1394k1322k0876M3285l9622
1575a6598K6400r799j3076L1280l1096J7725j634j7262L4437l2977J0860J1472
1587I732k2801L2873m1726K8504R444m3180N3302m8513L4421k159m1827P1133
$$ plain form
1599 39203 -31801 16169 7452 -32918 45670 -37463 19708 412 -24824 45961 -46469 24340
1611 24340 740 -18076 32222 -40770 32314 -8184 -13291 24380 -29428 27793 -14401 -4457
1623 -4457 15934 -19936 21628 -16743 588 14006 -15892 10328 -7725 3047 9369 -17166
1635 -17166 9923 3043 -9429 11905 -14310 9194 6294 -19732 22486 -18607 9860 7417
1647 7417 -27246 34243 -24405 10645 4546 -23780 39759 -36898 16806 3612 -18927 33154
1659 33154 -39921 28713 -6045 -13903 27340 -36387 34030 -16666 -5148 19106 -27677 32509
1671 32509 -25548 5470 13655 -21341 23144 -22781 13709 3539 -16471 17427 -13382 9363
1683 9363 -1546 -8199 10123 -4905 443 1048 -3690 4730 1833 -10126 10274 -4441 91 4445
$$ packed form
1599C9203p1004M7970q717m0370P8588q3133N7171j9296k5236P0785r2430P0809
1611B4340k3600j8816N0298p2992P3084m0498n107L7671n3808N7221m2194R944
1623d457K0391l5870M1564l8371J7331J3418k9898K6220j8053J0772O322k6535
1635a7166K7089o880j2472K1334k6215K3504k900k6026M2218m1093K8467k443
1647G417l4663O1489n8648L5050o099k8326O3539p6657N3704j3194k2539N2081
1659C3154p3075O8634l4758p858M1243o3727P0417n0696J1518K4254m6783O0186
1671C2509n8057L1018Q185l4996M4485m5925L6490j0170k0010L3898l0809K2745
1683I363j0909o653J8322j5028N348O05m738Q420k897j1959K0400j4715M532M354
$$ plain form
1697 4445 -13764 20145 -14906 2623 7564 -15779 22944 -23526 12897 2294 -15564 24687
1709 24687 -29104 22691 -6627 -10401 22037 -28629 28937 -17606 -1562 17519 -25140 26419
1721 26419 -22079 9905 6719 -18619 22803 -20726 14542 -3589 -7588 14082 -16052 14800
1733 14800 -10323 2032 5479 -8553 8621 -9159 7893 -3809 -1056 2953 -2648 4172 -6516
1746 -6516 7060 -6402 4967 -1951 -3518 8666 -12408 13764 -11271 3911 6784 -15209 18054
1759 18054 -17114 11948 -1752 -10847 19676 -21329 16954 -8623 -2213 12122 -18722 19681
1771 19681 -15607 7045 3749 -12307 16710 -17014 14385 -7552 -2360 11824 -16051 15320
1783 15320 -11925 6531 1426 -8860 13535 -13249 10443 -5447 63 4288 -7734 10840
$$ packed form
1697D445j8209L3909l5051J7529M941k3343L8723m6470L6423j0603j7858M0251
1709B4687n3791N1795k9318l774L2438n0666N7566m6543J6044J9081m2659N1559
1721B6419m8498L1984l186k5338M1422m3529L5268j8131l999K1670l0134L0852
1733A4800k5123J2355L447j4032J7174j7780J7052j1702K753M009n601O820j0688
1746f516J3576j3462J1369o918j567J2184k1074K6172k5035J5182K873k1993L3263
1759A8054l5168K9062j3700r095L0523m1005L8283k5577O410J4335l0844L8403
1771A9681l5288K2652l296j6056K9017l3724L1399k1937N192J4184k7875L1371
1783A5320k7245J8456n105j0286K2395k6784K3692j5890N510M225j2022J8574
$$ plain form
1795 10840 -11506 8822 -4156 -806 5013 -9833 13287 -13387 8182 -439 -6490 11708 -13817
1808 -13817 13018 -8765 1921 6170 -11999 13009 -10817 8259 -4261 -2399 9232 -13514
1820 -13514 13388 -9821 5172 1254 -7836 13777 -16209 12429 -4662 -3721 9595 -12731 13288
1833 13288 -11127 4572 3549 -9489 10619 -9101 7933 -5991 1705 4537 -8901 10259
1845 10259 -9155 7612 -4660 -845 7632 -13122 13382 -8904 2622 2843 -7180 11442 -13008
1858 -13008 9207 -1661 -4287 6611 -7363 8379 -8740 6347 -317 -4856 7313 -8268
1870 -8268 9011 -9036 4983 2698 -10482 13274 -10935 6988 -2711 -3198 10196 -13942 11878
1883 11878 -4781 -1794 5410 -6533 8308 -8814 5967 -407 -4332 6007 -5430 5602 -7099
$$ packed form
1795A0840k2346K0328j2978L350N819j4846K3120k6674K1569q621o051J8198k5525
1808a3817K6835k1783J0686M249j8169K5008k3826J9076j2520J862J1631k2746
1820a3514K6902k3209J4993l918r090K1613k9986K8638j7091R41J3316k2326K6019
1833A3288k4415J5699j023j3038K0108j9720J7034j3924P696K832j3438J9160
1845A0259j9414J6767j2272L815Q477k0754K6504k2286J1526K21j0023J8622k4450
1858a3008K2215j0868k626J0898j3974J5742j7119J5087o664m539J2169j5581
1870h268J7279j8047J4019k285j3180K3756k4209J7923r699m87J3394k4138K5820
1883A1878j6659K987P204j1943J4841j7122J4781o374l925J0339j1437J1032j2701
$$ plain form
1896 -7099 5195 953 -6923 7816 -5995 4578 -3614 884 4109 -7741 6448 -2872 180
1909 180 -399 799 943 -3880 5655 -4266 2951 -3188 2829 1959 -9392 12312 -8707 2148 2530
1924 2530 -6322 10728 -13146 9870 -847 -8376 12316 -11170 7845 -3926 133 6287 -11925
1937 -11925 12159 -6381 -344 3010 -4223 8022 -10998 7911 16 -6565 8681 -7540 5500
1950 5500 -2735 -1259 6773 -9700 7061 286 -6733 6577 -2666 644 193 -3889 7992 -5752
1964 -5752 -2347 8803 -9006 5092 -425 -3845 7420 -9413 9203 -3786 -5082 12239 -12338
1977 -12338 6784 -1944 -634 5667 -12598 14360 -7535 -1823 7280 -9997 11602 -10791 5458
1990 5458 3217 -12118 16599 -13518 4085 4588 -9441 12991 -15108 10353 2626 -14332 16482
$$ packed form
1896g099J2294m242p876J4739j3811J0573q192M498L225j1850J4189r320L052
1909A80n79J198J44m823R535r921P217o139O017q70j1351K1704k1019J0855L82
1924B530q852J7050k3874K3016j0717p529K0692k3486J9015j1771M059O154j8212
1937a1925K4084j8540O037L354p233J2245j9020J8909p895o581J5246j6221J3040
1950E500q235J476Q032j6473J6761o775p019J3310r243L310m51m082J1881j3744
1964e752L405J1150j7809J4098n517l420J1265j6833J8616j2989j296J7321k4577
1977a2338J9122q728J310O301j8265K6958k1895N712R103j7277K1599k2393J6249
1990E458k241j5335K8717l0117J7603N03j4029K2432k8099K5461p727j6958L0814
$$ plain form
2003 16482 -11336 4692 1919 -9679 14669 -13262 5821 4353 -12762 14494 -9295 1885
2015 1885 3492 -7688 12660 -12595 4304 6750 -11540 10215 -7964 4681 1478 -9449 13501
2028 13501 -11837 5136 3363 -10825 12820 -10534 6250 -132 -9606 17347 -15441 5261
2040 5261 4675 -10433 14692 -15451 8951 3725 -14098 18215 -15803 6986 5038 -14216 16975
2053 16975 -14972 9238 1994 -14915 20210 -14944 6026 1507 -9633 17567 -18561 9870
2065 9870 1051 -9601 15875 -17301 11497 -1826 -7021 13515 -17871 14832 -3925 -8194 13653
2078 13653 -14152 13159 -7048 -5170 15366 -15817 10261 -3497 -5043 13483 -14995 9173
2090 9173 -816 -6100 12888 -15580 8547 3162 -10065 11933 -12629 9689 847 -12827 15986
$$ packed form
2003A6482k7818J6028k773j1598K4348k7931J9083j468j7115K7256k3789J1180
2015A885J607j1180K0348k5255J6899K446j8290K1755j8179J2645l203j0927K2950
2028A3501k5338J6973j773j4188K3645k3354J6784o382r474K6953l2788K0702
2040E261n86j5108K5125l0143K4402n226j7823L2313l4018K2789j948j9254L1191
2053A6975l1947K4210p244j6909L5125l5154K0970m519j1140K7200l6128K8431
2065I870q819j0652K5476l3176K8798j3323n195K0536l1386L2703j8757m269K1847
2078A3653k7805K7311k0207J878K0536l1183K6078j3758j546J8526k8478K4168
2090I173r989n284J8988k8468K4127n385j3227K1998k4562K2318q842j3674K8813
$$ plain form
2103 15986 -12831 8170 -456 -10666 17799 -16115 9573 -2085 -7948 18269 -20220 12590
2115 12590 -2784 -5214 14892 -22163 18398 -5717 -5804 13297 -18778 19935 -10175 -3575 12640
2128 12640 -16112 17018 -12169 -308 11482 -14063 12399 -9597 2473 8075 -13133 9901
2140 9901 -4634 849 4707 -10215 9246 -2070 -3277 5463 -7408 8033 -2067 -6383 9840
2153 9840 -8203 6627 -2263 -6097 13394 -12679 7526 -2333 -4974 14155 -17542 11811 -3035
2166 -3035 -4883 12219 -18809 16934 -6746 -3871 10927 -16514 18086 -11881 -76 9095 -13822
2179 -13822 16089 -13896 4891 5857 -11444 12407 -12014 8147 913 -8360 10206 -8260 6145
2192 6145 -2432 -3925 7383 -5872 3097 -807 -1902 4463 -3502 -969 2815 -2363 2263 -1508
$$ packed form
2103A5986k8817K1001q626j0210K8465l3914K5688j1658n863K6217l8489L2810
2115A2590j5374k430K0106l7055M0561k4115q7J9101l2075L8713l0110O600J6215
2128A2640k8752L3130k9187J1861J1790k5545K6462k1996J2070N602k1208K3034
2140I901j4535N483L858j4922J9461j1316j207Q740j2871J5441j0100m316J6223
2153I840j8043J4830q890l834J9491k6073K0205r859k641J9129l1697K9353j4846
2166c035j848J7102l1028L5743k3680K875J4798k7441L4600k9967J1805R171k2917
2179a3822K9911k9985J8787R66j7301K3851k4421K0161p234r273J8566j8466J4405
2192F145q577j493J1308j3255Q969l904j095O365p965K533L784n178M626l771
$$ plain form
2206 -1508 -2335 7190 -6914 2819 745 -4105 8000 -10276 7268 -650 -4993 9036 -12175 11032
2220 11032 -4575 -3010 7875 -11545 13397 -9757 1515 6460 -10912 12343 -11837 6819
2232 6819 1823 -8660 11663 -11804 8568 -2251 -4079 8258 -9235 8696 -5393 23 4586
2245 4586 -6077 5386 -4610 3560 -557 -1935 2472 -2385 2870 -3066 2245 -1435 1176 714 -3189
2260 -3189 3868 -3445 4109 -3443 615 2785 -5037 6129 -6201 5198 -1994 -2881 7285 -9057
2274 -9057 8955 -5873 133 5504 -8632 10139 -9227 4591 2162 -7254 9395 -8766 6708
2287 6708 -2863 -2582 6418 -7882 7324 -5057 2234 886 -3338 5623 -6679 6091 -3424 -19
2301 -19 2327 -4652 6550 -6846 4350 -777 -2702 4749 -5854 5412 -4176 2057 947 -3704
$$ packed form
2206a508q27R525j4104R733k074m850J2105j8276J7544p918m343J4029k1211K3207
2220A1032j5607J565J0885j9420K4942k3154J1272M945j7372K3255k4180J8656
2232F819m996j0483K0323k3467K0372j0819j828J2337j7493J7931j4089N416M563
2245D586j0663J1463r996Q170m117j378M407m857N255n936N311l680K611m62l903
2260c189P057p313P554p552M058K170p822J1166j2330J1399p192q87J0166j6342
2274i057J8012j4828O006N371j4136J8771j9366J3818k429r416J6649j8161J5474
2287F708r571K81R000j4300J5206j2381P291j348m224Q961j2302J2770r515L405
2301a9K346o979J1202j3396J1196n127j925P451j0603J1266r588O233j110m651
$$ plain form
2315 -3704 5096 -4734 4027 -4197 2108 1141 -4991 6985 -6507 4867 -2311 -1290 5345 -8330
2329 -8330 8478 -5076 727 2956 -5282 6718 -6917 4936 -1502 -2463 4867 -5543 5232
2342 5232 -5035 3341 296 -4348 6355 -6271 4950 -3165 631 3169 -6293 7522 -5075
2355 -5075 2027 694 -2542 4166 -5591 5671 -3084 -74 1864 -2633 3778 -5304 5481 -3164
2369 -3164 -903 3945 -5241 5621 -5261 3904 -542 -4173 6944 -6062 3849 -2311 502 1807
2383 1807 -4955 6228 -4855 2568 -571 -872 2833 -5278 7188 -5677 1266 2442 -4597 5499
2397 5499 -6543 5865 -1666 -4045 7040 -6196 4132 -2001 168 2356 -4410 5158 -3303 717
2411 717 761 -558 38 -2139 3837 -3298 797 438 236 600 -3651 4766 -3446 556 1241 -1946 2113
$$ packed form
2315c704Q800r830Q761q224O305r67o132J1976j3492J1374p178J021O635j3675
2329h330J6808j3554N803K229q238J2000j3635J1853o438r61P330j0410J0775
2342E232j0267Q376l045m644J0703j2626J1221q115L796K538r462J3815j2597
2355e075P102j333l236O708r757J1262q755L010J938m497O411r082J0785q645
2369c164K261M848r186J0862j0882R165m446l631J1117j3006R911o160K813J305
2383A807o762J1183j1083P423l139l01L705q111J2466j2865O943J176p039J0096
2397E499j2042J2408p531k379J1085j3236J0328o133K169K188o766R568q461M020
2411G17M4j319N96k177N976p135M095l59k02L64m251Q417q212M002O85l187M059
$$ plain form
2428 2113 -2548 3816 -3797 1230 1789 -3065 2601 -3762 5975 -4337 -1193 6001 -6766 6023
2442 6023 -5086 2510 2500 -7392 9123 -7825 3107 2860 -6573 6544 -5851 5137 -1777 -4115
2456 -4115 7733 -5808 2295 -1217 656 2308 -5195 4662 -1825 154 1944 -3337 2386 -1015
2470 -1015 957 -487 -2539 4320 -837 -3730 3498 -316 115 -610 -2022 5685 -5010 452 3059
2485 3059 -5583 7190 -5453 409 3792 -5459 7822 -9139 4207 5037 -9298 7460 -5720
2498 -5720 5643 -889 -7229 10710 -7944 4521 -1320 -4205 8830 -8485 5690 -3424 -994
2511 -994 8124 -10829 6091 -463 -1018 3358 -8828 9695 -3174 -3795 5909 -6172 6814 -3781
2525 -3781 -2977 7018 -6338 5483 -3411 -3267 9807 -8223 2372 -277 -1368 6949 -11124 6395
$$ packed form
2428B113m661O364p613N027N59m854N666o363R737j0312L144P194j2767J2789
2442F023j1109P596j0r892J6515j6948J0932k47r433J3117j2395J0988o914k338
2456d115J1848j3541Q103l512J873J652p503R857o487J979J790n281N723l401
2470a015J972j444k052O859n157k893P228l814M31p25j412P707j0695N462K607
2485C059q642J2773j2643N862L383r251J3281j6961J3346Q30j4335J6758j3180
2498e720J1363o532o340J7939j8654J2465n841k885J3035j7315J4175r114K430
2511i94R118j8953J6920o554n55M376j2186J8523j2869o21R704j2081J2986j0595
2525c781Q04R995j3356J1821q894J44J3074j8030J0595k649j091Q317j8073J7519
$$ plain form
2539 6395 2023 -5538 6078 -8136 7622 -817 -6034 7917 -8015 8314 -3091 -5950 10408
2552 10408 -7926 5806 -5239 -867 10412 -12499 6625 -2101 -751 6515 -12572 10352 -2942
2565 -2942 -2384 6197 -10695 12042 -4465 -4215 7354 -8184 10583 -7583 -2494 10539 -9969
2578 -9969 6712 -5761 758 8001 -12357 8165 -3346 403 5229 -11690 10252 -3026 -1437
2591 -1437 3736 -8632 11971 -6087 -2926 6675 -6495 8411 -7839 -136 8484 -9403 6586
2604 6586 -5696 1637 6687 -11825 8003 -2957 682 4356 -11455 11456 -3699 -2854 4964
2617 4964 -8615 11787 -7197 -2903 8047 -8326 9532 -8346 460 8414 -10694 8322 -7364
2630 -7364 3419 6090 -12331 10282 -5478 2477 1862 -10069 12708 -7356 1058 2149 -6431
$$ packed form
2539F395m372p561J1616j4214J5758q439n217J3951j5932J6329j1405k859J6358
2552A0408j8334J3732j1045M372J1279k2911J9124q726J350P266j9087K2924j3294
2565b942N58Q581j6892K2737j6507K50J1569j5538J8767j8166N089J3033k0508
2578i969J6681j2473O519P243k0358K0522j1511L749M826j6919K1942j3278J589
2591a437N173j2368K0603j8058L161R601j3170J4906j6250P703Q620j7887J5989
2604F586j2282P333N050j8512J9828j0960L639L674j5811K2911j5155Q45P818
2617D964j3579K0402j8984M294J0950j6373J7858j7878Q806P954j9108J9016j5686
2630g364J0783K671j8421K2613j5760P955o15j1931K2777k0064Q414J091q580
$$ plain form
2643 -6431 11545 -9531 1581 3988 -5755 7680 -9401 4423 4240 -7509 6007 -5852 4566
2656 4566 1962 -8005 7369 -3489 1505 972 -6480 9000 -4386 -1340 2962 -4876 8452 -6735
2670 -6735 -763 6016 -6660 6515 -6669 2343 5269 -9111 7634 -5911 3510 2887 -9342
2683 -9342 9960 -6186 2910 560 -6869 11401 -8503 2739 1058 -3858 8442 -9657 4900
2696 4900 802 -3832 5668 -8070 6360 -413 -3981 4435 -4896 5412 -2244 -3050 5216 -3052
2710 -3052 2051 -1550 -1166 4348 -4159 436 1110 -1636 3040 -3796 753 3184 -3823 3354 -3336
2725 -3336 1579 2969 -6588 5176 -2713 1195 1481 -5857 7722 -5429 1534 986 -4205 7598
2739 7598 -6791 2889 377 -2576 5576 -7540 5367 -902 -2198 3481 -5246 6051 -3611 -588
$$ packed form
2643f431J7976k1076J1112K407r743J3435j7081J3824j83j1749J3516j1859J0418
2656D566k604r967J5374j0858M994n33p452J5480j3386L046M302p838J3328j5187
2670f735N972O779j2676J3175j3184R012K926j4380J6745j3545R421o23j2229
2683i342J9302j6146R096k350p429J8270j9904J1242j681m916J2300j8099J4557
2696D900m098m634R500j3738J4430o773l568Q416r331J0308p656q06Q266q268
2710c052N103l601L84N514q507M595O74k746M676o836M549K431p007P177o690
2725c336M915J390r557J1764p889L908K86p338J3579j3151O963n48n191J1803
2739G598j4389R680k512k953Q152j3116J2907o269j296N679q727J1297r662L023
$$ plain form
2753 -588 2568 -3789 4458 -3949 1349 1390 -2306 2408 -2837 2266 106 -1568 923 -476 800 -594
2769 -594 -137 -33 1306 -1592 546 497 -974 2443 -3169 2503 -619 -944 2345 -3751 4056 -2318
2785 -2318 -177 2163 -3173 4181 -3841 2027 475 -2393 3735 -4624 3600 -1494 -676 2592 -3908
2800 -3908 4601 -3285 959 945 -2770 3866 -3778 2806 -891 -1453 2574 -2567 2187 -1589 1054 23
2816 23 -1051 2064 -2109 1835 -1637 1472 -25 -1671 3048 -3109 2162 -1184 3 1148 -2646
2831 -2646 3326 -2719 1394 137 -980 1702 -2486 3178 -2703 979 1136 -2170 2674 -3360 3124
2846 3124 -1847 -709 3301 -3994 3253 -2155 823 709 -2628 3821 -2905 1093 -2 -767 1046
2861 1046 -1809 2585 -2391 1212 -19 -957 1724 -2372 2928 -2822 701 1663 -2959 2601 -2290
$$ packed form
2753e88L156o357Q247q407N298M1l696M714n245N103k160j674K491j399J276j394
2769e94M57J04J339k898K138m9j471L417n612N672l122l25L289o096P807o374
2785b318K141K340n336P354q022N868j552k868O128q359Q224n094Q18L268o500
2800c908Q509p886M244j4l715O636p644O584l697n62M027n141M754l776K643j031
2816B3j074L115m173L944l472L109j497j646M719o157N271l346J187J145l794
2831b646N972o045M113j257j117K682m188N664n881L682J57l306M844o034O484
2846C124m971J138M010p295P247n408K978j14l337O449o726L998j095p65J813
2861A046k855M394m976L603j231r38K681m096N300n750L523R62m622N560m891
$$ plain form
2876 -2290 1766 -815 -1062 2644 -2858 1945 -825 867 -273 -629 2111 -2890 2210 -1522 731
2891 731 297 -1716 3548 -3873 2274 177 -1708 2386 -2979 3226 -2410 257 2210 -3071 2665
2906 2665 -2109 1452 -701 -887 2773 -3524 2613 -1279 366 311 -1914 3352 -3400 1223 976 -1822
2922 -1822 1649 -1897 1671 -876 -648 1167 -1400 617 211 90 -1262 1350 76 -822 314 -613
2938 -613 2008 -2746 1469 998 -2197 2440 -2576 2146 -1095 -610 1987 -3739 3706 -1953 -224 718
2954 718 -1802 3673 -4697 2759 499 -2507 2997 -3796 4115 -2098 -1020 3297 -4571 4375 -2268
2969 -2268 -560 2457 -3052 3048 -3231 620 2719 -3697 1499 -118 874 425 -2121 2257 -483
2984 -483 -832 1028 -1198 1032 741 -1802 1179 -643 1246 -451 -2663 4040 -1870 -263 73 -1082
$$ packed form
2876b290M056k581k47L706n502M803k770J692j140l56K740n001N100l732K253
2891G31m34k013N264p421O147k097j885M094n365O205n636K667J953n281N736
2906B665m774L561k153j86L660o297O137l892J645n5k225N266o752M623k47k798
2922a822L471l546L568k547K28J815k567K017m06j21j352K612j274q98J136r27
2938f13K621m754M215m71l195M637n016M722l241M85K597n726P445n659J729R42
2954G18k520N475q370P456k260l006N504o793P911o213J078M317p868Q946o643
2969b268J708L017n509O100o279L851K099o416N196j617R92m49k546M378k740
2984d83l49J860k226K230k91k543K981j822J889j697k212O703n910J607L36j155
$$ plain form
3000 -1082 4073 -5267 2398 677 -1988 4109 -5597 3703 -411 -2443 3447 -5721 6274 -2160 -3136
3015 -3136 4507 -3990 4738 -4566 -115 4847 -5187 3382 -2998 1441 2788 -5337 3618 -2111 1392
3030 1392 948 -4779 4921 -895 -925 59 -2005 4809 -3354 -1650 2701 -1950 2415 -3276 -67 4206
3046 4206 -4170 2234 -1986 602 3873 -6482 3496 78 -128 1913 -6229 7205 -1824 -2507 3020
3061 3020 -4282 6494 -4762 -1415 5196 -4456 4833 -5657 1268 4886 -6117 3577 -3752 3542
3075 3542 1885 -7026 5924 -1952 1294 -638 -4255 7306 -3765 -553 944 -1864 5909 -5839
3089 -5839 218 2963 -2497 2902 -5285 3373 3312 -5710 2927 -2215 3170 541 -6081 6131 -1697
3104 -1697 349 -118 -4173 7390 -4230 -963 1801 -2357 5670 -6544 881 4251 -3722 3122
$$ packed form
3000a082N155r340P665j721k665O097r706R300m114k032N890r168J1995q434r76
3015c136P643q497Q728r304M451M962j0034Q569o380M439J347q125Q955n729L503
3030A392m44n727R700n816l0R84k064O814q163J704M351m651M365n691L209M273
3046D206q376O404m220K588L271j0355R978l418k06K041q142J3434r029o83N527
3061C020p302J0776j1256L347O611r652R289j0490O925L618j1003R694p329P294
3075C542j657q911J2950p876L246j932l617J1561j1071L212J497k808P773j1748
3089e839O057K745n460N399q187Q658o1r022Q637n142N385k629o622J2212p828
3104a697K046m67m055J1563j1620L267K764m158Q027j2214P425L370p973O844
$$ plain form
3118 3122 -5419 4009 2517 -6184 4500 -2826 3538 -674 -5770 6705 -2794 1122 -1022 -2643
3132 -2643 7137 -5741 655 1038 -1237 4532 -7059 3239 2396 -3225 2904 -4891 4933 524 -5191
3147 -5191 4230 -2631 3830 -1639 -3937 6637 -3406 1335 -1468 -1330 5784 -5991 1339 796 -1152
3162 -1152 3237 -5810 3182 1702 -2661 1987 -3602 4227 -397 -4203 3803 -2021 2589 -1999 -2487
3177 -2487 5584 -3637 842 -668 -495 4644 -5454 1804 795 -1126 2789 -5446 3964 780 -3189
3192 -3189 2388 -3435 4512 -1546 -3022 4370 -2893 2740 -2394 -1143 4357 -3931 2044 -1599 544
3207 544 2918 -4796 2772 -461 5 1283 -3473 4182 -1192 -1198 1079 -2058 3192 -2035 -892 2593
3223 2593 -1630 1564 -1818 -256 2805 -2751 830 -445 12 1960 -3368 2035 444 -1020 1172
$$ packed form
3118C122q541R428j492q701J0684p326O364m212n096J2475r499L916k144j621
3132b643R780j2878O396L83k275N769j1591J0298q43n621O129p795R824m409n715
3147e191R421o861O461n469k298J0574j0043M741k803J38P114j1775P330n43j948
3162a152M389r047Q992j480m363M648n589P829m624l806Q006n824M610m588m88
3177b487Q071r221M479j510J73N139j0098P258j009j921L915q235R410l184l969
3192c189N577n823P947o058j476P392p263N633n134J251N500q288N975l643K143
3207E44K374p714P568l233M66J278m756P655n374oK277l137N250n227J143L485
3223B593m223L194l382J562L061n556L581j275M57J948n328N403j591j464K192
$$ plain form
3238 1172 -2688 2739 -412 -1896 1818 -2100 2275 -1236 -1471 2956 -2461 1933 -1597 92 2307
3253 2307 -3362 2169 -1278 504 1325 -3055 3166 -1500 304 413 -2060 2969 -1741 532 426 -835
3269 -835 1592 -1652 707 283 -378 467 -1051 986 -131 -577 309 55 255 -103 -566 350 308 -646
3287 -646 567 -566 532 -73 -894 1380 -1210 1177 -443 -1251 1807 -1632 1373 -540 -487 1381
3303 1381 -2252 1971 -862 -99 1233 -1929 1768 -1245 727 230 -937 1260 -1479 901 -408
3318 -408 46 642 -1289 1455 -1051 517 -39 -646 1189 -1285 897 -332 -493 419 -383 606 -751
3335 -751 570 -347 280 107 -183 667 -1446 1298 -411 -25 793 -1078 1482 -1368 696 265 -1383
3352 -1383 1695 -1282 960 -550 -40 912 -1522 1303 -825 355 52 -444 1148 -1401 1385 -762
$$ packed form
3238A172l860N427l151j484L714l918M375l511k35M427n417M394l530J689K215
3253B307n669N531l447J782Q21m380O221m666J804J09k473N029m710K273j06j261
3269h35K427l244K359m24o61Q45j518K037j117m46Q86k54K00l58m63R16m2r54
3287f46J213j133J098o05q21K274k590K387j620q08L058l439L005j913N3J868
3303A381l633M223k833P63J332l162L697l013J972m97j167K197k739K380j309
3318d08M54N96j931K744k506J568n56o07J835k474K182j229j61R12q02R89j357
3335g51J321r17O27j73k90Q50k113K744j709L86Q18j871K560k850K064m31j648
3352a383L078k977K242j510N10R52k434K825k128J180l03m96J592k549K786k147
$$ plain form
3368 -762 -66 1044 -1057 1154 -1373 832 320 -1038 1244 -921 396 -416 227 389 -607 777 -520
3385 -520 524 -454 377 129 -798 1226 -874 539 -109 -118 824 -1489 1382 -532 -204 546 -547 967
3403 967 -1365 1162 -707 -14 662 -973 1496 -1453 1075 -238 -1553 2094 -1909 1094 -706 -367
3419 -367 1392 -2192 1760 -763 -171 746 -1272 1196 -936 802 159 -1154 1326 -803 494 -587
3435 -587 289 587 -1057 1016 -133 -177 -88 -205 339 -239 53 -204 -134 -190 678 -727 137 673 -804 676
3455 676 -1049 1313 145 -1768 2190 -1600 1204 -477 -1329 1989 -2293 1915 -954 -422 2248 -2815
3471 -2815 1934 -954 717 748 -2948 3063 -1739 747 132 -1498 2589 -2428 1047 527 -1020 1954
3487 1954 -2244 895 540 -1054 1348 -1743 1461 641 -1676 1274 -256 350 -32 -1636 2065 -737
$$ packed form
3368g62O96J110k101K211k527K205n12j358K282k165J317q12O43J62r96J384j297
3385e20J044r78Q31k48r27K024k100J413o48rR42k313K871j914L28P50j093J514
3403I67k332K527j869O93O76j635K469k949K528j313j315L647m003L003j800L39
3419c67J759l584L952k523N92R17k018K468k132J738o43j313K480k129J297j081
3435e87Q76K98j644K073j149m4Q9j17N44n78K92k57P0n6Q68j405Q64N36j477J480
3455F76j725K362j168j913L958l790K804j681q52L318m282M208k869N32K670n063
3471b815M749k888J671L1l696O011m802K486o15j630M087n017L475n20j547K974
3487A954m198L139l55j594K402l091L204q20k317K950j530O06l82j604L701k802
$$ plain form
3503 -737 -417 1161 -1642 2023 -1014 -1144 1637 -1665 2137 -2158 -80 3100 -2811 2077 -1471 881
3519 881 1505 -3806 3549 -1577 818 793 -3200 4407 -2457 524 343 -1684 4036 -3831 1010 1129
3535 1129 -1555 2730 -4042 2565 641 -2721 2005 -2069 2518 -398 -2394 2788 -1549 1375 -558
3550 -558 -1796 3342 -2225 -124 209 -1072 3041 -3499 677 1962 -2104 2051 -3075 1768 1747 -3677
3566 -3677 2923 -2213 1695 376 -3694 4302 -2245 1127 -492 -2295 5127 -3974 673 541 -1153
3581 -1153 3767 -5117 2744 811 -1957 2629 -3976 3778 -232 -2758 2681 -2754 3420 -1575 -2184
3596 -2184 3929 -2560 1541 -1597 -521 3625 -3703 1211 124 -383 2060 -4099 2488 908 -2030
3611 -2030 1543 -2816 2958 -256 -3028 3067 -1813 2404 -1582 -2128 4280 -3018 1357 -942 -458
$$ packed form
3503g37L20J578k803L665l037j30K781l302L802m295K078L180n911M888l548K352
3519H81O24n311P355n126K395k5l993P607o864K981j81k027N720p867M841J19
3535A129k684M285o772O607j924l362M726m074M587k916j996N182m337K924j933
3550e58j238N138n567K101L33j281M113o540M176J285m066M155n126M843k1n424
3566c677O600n136L908j319m070P996o547L372j619j803P422r101M647j32j694
3581a153M920q884P861j933k768M586o605P754m010k526N439n435O174m995o09
3596b184O113o489M101l138J076M146p328M914j087n07K443o159O587j580k938
3611b030L573m359N774l214k772O095m880M217l986n46O408p298M375k299M84
$$ plain form
3626 -458 3896 -4745 2174 122 -676 2507 -4749 3726 116 -2125 2203 -3445 4196 -1644 -2481 3201
3642 3201 -2647 2726 -2496 -1032 3469 -3415 1660 -1174 537 2404 -4357 2279 -282 -274 982 -3418
3658 -3418 3480 -685 -1531 1105 -1859 3434 -1972 -1317 2767 -1892 2014 -2109 -124 3134 -3173
3673 -3173 1794 -874 656 1962 -3904 2533 -252 -519 1312 -2972 3489 -930 -1749 1856 -1948
3688 -1948 2744 -2078 -862 2675 -1866 1760 -2137 475 2325 -3124 1670 -973 925 804 -2870
3703 -2870 2669 -916 83 316 -2020 3310 -2018 -556 1191 -1270 2310 -2552 119 1903 -1869
3718 -1869 1300 -1549 1009 1248 -2549 1688 -576 523 562 -1888 2317 -602 -95 63 -1193 2106
3734 2106 -1260 -334 577 -1138 1117 -1670 567 1126 -1408 1027 -956 758 881 -1694 1705 -465
$$ packed form
3626d58M354q641O919k052p98L183p256Q475l610k241M328n648P641n840q37N682
3642C201n848N373n222J464M501o884N075k834J711J867o761O636k561QJ256m400
3658c418O898m165q46K636k964N293n406O55M084m659L906m123J985L258o307
3673c173M967k668J530J306n866O437k785k67J831m284O461m419q19L605l804
3688a948M692m822J216L537m541L626l897K612J850n449M794k643J898j21l674
3703b870N539l585R99K33k336N330n328J462J747k461L580m862K671J784l772
3718a869L169k849K558K39l797M237k264J099L9k450M205k919N07J58j256L299
3734B106l366R26R11j715K255k787K237N59k534K435j983J714J23k575L399k170
$$ plain form
3750 -465 501 500 -1837 2035 -1070 -51 591 -1010 1790 -1536 -175 1040 -1175 1227 -1261 469
3766 469 685 -1248 1089 -968 1049 45 -1153 1218 -757 808 -241 -506 1285 -963 606 -208
3782 -208 -275 687 -869 567 80 -282 415 -677 260 123 -386 247 -391 163 302 -630 576 207 -429
3801 -429 611 -167 609 -434 -52 718 -608 732 -545 -4 348 -771 975 -872 508 343 -579
3818 -579 759 -867 801 -294 -366 937 -898 602 -113 254 534 -807 444 -205 -30 240 -369
3835 -369 238 40 140 -212 -114 154 -47 -157 -25 231 -193 50 30 -329 276 -203 527 -278 89 148 -346
3856 -346 192 -437 471 -187 -7 588 -607 342 -466 82 103 -778 776 -596 401 397 -378 516 -542 348
3876 348 -272 -280 336 -501 471 -352 389 -59 -133 352 -499 480 -204 82 124 -151 509 -306 190 226 -7 2
$$ packed form
3750d65R66jk337L872l105J019O42j601K800l326J361J215k215K402k488J730
3766D69K16j933K337k057K017j004j198K371j975J565j049k65J791k248J569q14
3782b08o7R62j556J436m87l62O97j092R37j37n09O33o38N54J39r32J206l69o36
3801d29J040p78P76j043L82P70j326J340j277N41L52j119J746j847J380j65r22
3818e79J338j626J668j095p2J303j835J500p15L67K80j341J251o49J75K70o09
3835c69O07j98J00l52R8K68k01j10J32K56m24K43k0l59O05m79P30q05L67N9m94
3856c46N38o29R08o58J80N95j195R49q08N48K1q81J554j372R97mp75Q94j058Q90
3876C48o20qO16q37R72q23P41m48p4M85q51R79o84K86M2k75O60q15M96L6k33R
$$ plain form
3898 2 -213 206 -477 203 -126 111 184 -322 383 -491 454 -30 -32 359 -147 822 -582 182 365 -723 722
3919 722 -453 258 -197 -317 949 -682 618 -233 -278 238 -635 764 -676 345 323 -887 734 -862
3937 -862 736 -181 -611 813 -492 288 -312 49 452 -666 425 -447 85 477 -185 -57 60 67 19
3956 19 -201 -5 358 -451 2 100 -57 418 -312 550 -141 -239 388 -1164 1047 -350 -365 700 -656 1033
3976 1033 -1068 23 655 -1018 1192 -1346 578 422 -1065 1047 -1274 779 -116 -1080 1592 -1252
3992 -1252 860 -764 -482 1560 -1008 486 63 -14 643 -1400 767 30 -339 263 -1002 761 36
4009 36 -848 419 -404 604 -143 -920 1093 -385 -46 -88 -726 1474 -908 8 750 -719 1363 -1896
4027 -1896 747 697 -1105 1255 -1744 1528 174 -1563 1649 -1382 1486 -808 -1132 2388 -1669 1279
$$ packed form
3898Bk15M19o83O80l29K37P3n06P05q74R45m84kL91n06R69j404P64J83j088J445
3919G22j175P11m55j20J266j631J300q51m5N16q73J399j440J021k2j210J621j596
3937h62J598r17m30J424j305P80o00L61M03j118J091q72N32L92o62J28J17Pm8
3956A9k20J96L63q09M53R8j57M75p30Q62o91r8O27j552K211j397j5J065j356J689
3976A033k101J091O32j673K210k538J924j56j487K112k321K053q95r64K672k844
3992a252K112j624K82K042k568J494m23p7O57k043K167p37l69O02j265J763p25
4009C6q84J267q23J008p47p77K013j478L39m2o38K200k382R16P42j469K082l259
4027a896K643n0j802K360k999L272j354j737L212l031K868k294l24L520m057K948
$$ plain form
4043 1279 -896 -108 1835 -2416 1205 -304 -234 1175 -2296 1910 -64 -338 575 -1096 1651 -903
4059 -903 -988 1010 -295 850 -1371 -577 1616 -940 215 -565 147 1374 -2066 803 432 -356 1190
4076 1190 -2182 1772 321 -1120 962 -1679 2036 -923 -1468 2033 -1404 1762 -1255 -363 2415
4091 2415 -2445 1009 -886 409 1651 -2728 1734 -292 -110 180 -2376 2752 -708 -761 559 -1255
4107 -1255 2271 -1768 -178 1203 -1046 1091 -1913 599 1424 -1707 990 -1057 799 999 -2464
4122 -2464 1606 -9 -18 269 -1854 2237 -848 -1039 1023 -1018 1979 -1625 -478 1910 -1538 1058
4138 1058 -1304 522 1661 -2253 1379 -727 832 569 -2352 2455 -1024 -134 190 -1485 2691 -1723
4154 -1723 51 657 -941 2072 -2653 735 1362 -1475 1287 -1841 1353 854 -2412 1209 -851 887
$$ packed form
4043A279k175P88J943m251L621j509P0J409l471M206j974k74R13j671K747k554
4059i03q5J998j305J145k221P94K193k556J155p80P12J227l440K869l71p88J546
4076A190l372L954j451j441K082k641L715k959n45L501l437L166l017Q92K778
4091B415m860L454j895J295J242m379M462k026J82K90k556N128l460n3J320j814
4107a255L526m039J590J381k249K137l004K512Q25l131K697k047J856K00l463
4122b464M070j615rK87k123M091l085j91K062k041K997l604J147K388l448K596
4138A058k362J826J139l914L632k106J559k63k921M807l479Q90L24j675M176m414
4154a723J774O06j598L013m725L388O27k837K762l128L194m99l266L621k060J738
$$ plain form
4170 887 -15 -1531 2268 -925 7 106 -675 1790 -1344 15 780 -728 1602 -1655 618 812 -1411
4187 -1411 1125 -1205 951 223 -1777 1472 -913 959 -288 -1414 2008 -1664 162 98 -787 1952
4203 1952 -2172 657 663 -804 1460 -1693 942 522 -1288 1150 -1345 1122 -64 -1162 1650 -737
4219 -737 747 -537 -680 1696 -1224 261 -2 -38 1346 -1465 778 0 -528 821 -1490 1184 -22
4236 -22 -1083 775 -890 1229 -526 -718 1585 -400 404 -40 -151 1137 -1062 11 -29 -510 1036
4253 1036 -1160 625 291 -145 558 -858 931 139 -849 947 -590 775 -569 -526 879 -709 627
4270 627 -327 -228 1043 -744 852 -140 -207 630 -948 746 108 -251 605 -571 673 -432 -433 605
4288 605 -555 425 -259 -165 521 -484 367 -223 71 262 -329 419 -181 148 -138 -150 471 -98 -381 317
$$ packed form
4170H87r02j516L799l193R32R9p81K465l134J359P65j508K330l257K273J94k223
4187a411K536k330K156p28k000L249k385J872j247j126L422l672J826o4q85K739
4203A952m124K829Oj467K264l153K635m20j810K438k495K467j186j098K812k387
4219g37J484j284j43K376k920J485k63l6J384k811K243p78n28J349k311K674j206
4236b2j061J858j665K119j755j92K303j985Q04m44j11J288k199J073m0m81J546
4253A036k196J785l34m36P03j416J789p92r88J796j537J365j344M3J405j588J336
4270F27r54R9J271j787J596r92o7Q37j578J694o38l59Q56j176J244j105jJ038
4288F05j160R80o84R4O86j005Q51n90K94J91n91P48o00L29k86j2O21n69k83O98
$$ plain form
4308 317 -296 57 -230 -283 500 -423 555 -37 -425 773 -333 354 175 -222 427 -712 291 88 -192
4327 -192 170 -394 601 -155 -270 287 -437 590 -91 47 31 -51 377 -338 347 -10 -374 334 -198 -47
4347 -47 -63 -116 217 -134 30 51 -109 258 -196 0 -24 -19 149 -105 -154 296 75 -272 232 -308 445 -294 125
4370 125 91 -325 460 -293 135 -259 33 322 -449 57 -14 -269 470 -353 126 -117 305 94 -431 589
4390 589 -514 -98 -195 -123 392 -621 157 56 133 291 -34 179 -40 227 -4 -303 -55 65 82 -127 -54
4411 -54 -124 -140 168 52 272 -215 81 70 48 221 -274 215 -360 298 110 -148 354 -372 345 -105 62 305
4433 305 -581 313 -388 -11 115 -535 482 -587 183 -44 -56 574 -430 339 -104 -320 668 -459 470
4452 470 8 87 258 -384 400 -188 110 227 -372 302 -171 -58 181 -107 -80 -145 -180 30 -331 -47 426
$$ packed form
4308C17o13L53k87n3P83r23R78n92l88J198j106O87j79l97O49j139J003k03k80
4327a92L62n64R95p56j15N57p24J027o81J38j6q2M28p15O85l57l64P08n32J51
4347d7j6n3L33l51J64K1j60L67m54J96k4NJ68k54m9M50k21l47N04n40P53p39M19
4370A25l4m16P85p53M28l94K92K89p71N06p1k55P39q23M79k43M22k11n25J020
4390E89j103M16r7P2N15j013P78j01P7J58l25K13k19K67k31k99K48J20J7k09P3
4411e4p0j6L08j16K20m87K96j1k2J73m95M89n75O58j88k58N02p26P17m50J67K43
4433C05q86Q94p01L77J26o50J017j069P70k27j2O30j004P69m43k16R88j127R29
4452D70m62P9J71o42P84n88K98J17n99O74m73J13K39k88K7o5l5K10l61K84M73
$$ plain form
4473 426 -185 314 -488 47 185 -522 662 -396 392 200 -568 809 -667 343 -104 -192 903 -949
4491 -949 355 38 -559 898 -1048 588 55 -452 628 -1006 1005 -374 -176 681 -652 868 -514
4508 -514 -6 542 -569 570 -722 -48 556 -476 598 -410 107 531 -1080 694 -163 -158 506 -687
4526 -687 857 -138 -406 484 -488 510 -397 -559 856 -811 558 -489 -295 1117 -1269 510 -205
4543 -205 -260 790 -953 1240 -206 -217 727 -1028 1211 -852 -452 892 -742 1211 -1190 177 692
4560 692 -1043 770 -830 497 560 -1228 1150 -677 269 486 -1049 1551 -648 -153 422 -805 1091
4577 1091 -724 -34 551 -864 872 -801 154 1065 -1160 655 -755 167 688 -1449 1354 -576
4593 -576 209 626 -1283 1599 -894 -134 445 -826 1670 -1469 312 673 -1284 1196 -1155 632
$$ packed form
4473D26o11M99q02N35J38p07J184j058P88j92p68J377j476J010m47q8J095j852
4491i49J304l17n97J457j946J636n33n07J080j634K011j379J98Q57j333J520j382
4508e14N08N48j111J139j292O74O04j032J074j008N17M24j611J774q57NO64j193
4526f87J544r95k68Q90r72R98r07j62J415j667J369j047J94J412k386J779p15
4543b05n5J050j743K193j446j1R44j755K239k063M00J344j634J953k401J367N15
4560F92j735J813j600J327O3j788K378j827R46K17j535K600k199M95N75j227J896
4577A091j815O90N85j415J736j673R55R11k225J815j410R22N21k137K803j930
4593e76P85M17j909K882k493P60N79j271K496l139J781L61j957K480k351J787
$$ plain form
4609 632 234 -1181 1330 -762 657 82 -1289 1414 -956 557 124 -853 1491 -1149 481 374
4625 374 -763 998 -1176 611 679 -424 645 -1013 662 509 -1074 1149 -708 670 40 -1042
4641 -1042 1482 -929 44 161 -619 1406 -1365 441 670 -937 1097 -1379 470 724 -1310 1048
4657 1048 -1077 888 -50 -1263 1349 -986 659 -240 -762 1488 -952 472 -55 -568 1035 -1300
4673 -1300 787 -46 -332 797 -1248 1049 100 -621 690 -995 973 -379 -563 1291 -598 310
4689 310 -417 -529 1249 -1079 269 -27 -423 926 -1379 382 287 -699 553 -778 798 84 -895
4706 -895 755 -730 673 -209 -549 900 -1122 696 -420 -316 1134 -1171 527 -232 141 622 -1122
4723 -1122 751 261 -639 535 -750 997 -310 -351 885 -723 431 -291 -405 573 -531 438 -160
$$ packed form
4609F32l98j415K511k092J419n75j371K703k370J513m33r77K344k640J630j07
4625C74j137J761k174J787O8j103J069j658J675j53j583K223j857J378o30j082
4641a042K524k411R73J17p80K025k771J806K29j607K034k476J849K54k034K358
4657A048k125J965r38j213K612k335J645q99n22K250k440J424n27n13J603k335
4673a300K087q33k86J129k045K297r49p21J311j685J968j352j84J854j889R08
4689C10p27j12J778k328J348k96l96J349k305J761r5r86J252j331J576p14r79
4706h95J650j485J403q82l40J449k022J818j116J04J450k305J698p59L73M81j744
4723a122J873m90r00J174j285J747j307m1J236j608J154p22j14R78j104R69n98
$$ plain form
4740 -160 255 593 -740 603 -116 -148 183 -607 643 -10 -22 511 -492 589 -247 -242 467 -318 432 -546
4760 -546 -119 705 -808 260 -328 50 189 -896 653 -20 -213 307 -626 771 1 -278 211 -232
4778 -232 393 -342 -232 172 -262 313 -307 252 371 -465 278 -152 331 19 -270 205 -438 51 182 -596
4798 -596 509 -75 66 368 39 201 -127 47 105 -402 128 -54 88 285 -184 15 -25 -3 488 -242 263
4819 263 87 -145 307 -99 243 -192 -46 393 -49 119 44 124 188 -170 53 -134 -18 -47 -367 257 -70
4840 -70 382 -18 -274 253 -76 29 49 -148 81 -173 249 153 -13 53 -12 -176 -19 -15 -76 -203 -55 0 -38
4863 -38 -95 -2 -153 35 167 -134 -350 190 -2 194 38 46 136 -42 -89 330 -208 -82 -16 -208 323 -159 -17
4886 -17 156 -352 4 -180 30 155 -141 61 140 77 165 -101 74 -311 -89 117 54 163 -193 154 -33 -38
$$ packed form
4740a60M15L38j333J343p19l2L31p90J250o53j2N33j003J081q36NP09p85P50r78
4760e46M27Q24j513J068n88L78J39j085J549o73j93N20r33J397p70k79M89m43
4778b32O25p35J10M04m34N75o20N59J19q36P43m30M83l12k89M75o43M89J31p78
4798e96J105n84J41L02l29J62l28J74N8n07N30j82J42J97m69J99m0K2M91p30N05
4819B63j76k32M52m06L42m35J46M39m42J68p5Q0O4l58K23j87J16k9l20O24l27
4840g0M52m00k56N27l29J05K0j97K29k54M22r6j66O6o5j64J57Mo1j27J48N5l8
4863c8n7R3j51J88J32l01k16N40j92J96j56QR0j78m7M19n38J26O6j92N31m82J42
4886a7J73n08L56j84K10J25k96K02P9o3Q8k66J75l85K22K06o3J09l56L47j87n
$$ plain form
4908 -38 97 -121 -67 53 -4 194 -302 113 31 50 -139 -113 192 42 -91 -284 -190 161 82 -201 353 -58 39
4931 39 27 66 243 -216 18 58 -311 158 -92 -153 10 -111 143 -401 300 269 -113 189 -210 146 -8 -294
4953 -294 202 -117 -71 -115 -62 162 -400 154 -236 37 294 -367 301 -372 123 -109 -257 503 -38 -2 280
4974 280 -98 444 -131 -9 112 -124 79 -108 -83 411 -324 234 -158 -218 350 -47 409 -159 -188 425 -239
4995 -239 480 109 165 377 -426 482 -248 -40 342 -516 168 -311 111 149 -519 734 -263 16 176 -609
5015 -609 633 -431 168 200 -478 719 -442 215 202 -262 600 -419 -9 9 -597 362 -148 235 168 -311
5035 -311 473 -176 129 123 -543 514 -184 -259 96 -266 687 -223 315 243 -624 609 -707 -68 345 -643
5055 -643 625 -568 594 121 -672 725 -739 500 -13 -544 950 -504 403 270 -330 518 -690
$$ packed form
4908c8J35k18N4J20n7J98m96M15q2J9j89K6L05j50j33j93R4L51p9k83N54m11R7
4931C9j2L9J77m59K34M0l69M69k50o1J63j21K54n44P01l1l82L02l99L56j54k86
4953b94M96l19M6m4N3K24n62N54l90K73K57o61O68o73M95k32j48P60n41L6K82
4974B80l78N42n75J22J21k36K03j87K5M94p35N58l92o0N68l97M56n68k9O13o64
4995b39P19l71N6K12q03R08p30K08L82q58O84m79M22L8o68J253r97K79J60p85
5015f09J242j064N99L2o78J197j161O57j3m64Q62j019M10J8o06R59n10L83o7m79
5035c11P84o49L05oo66J057o98p5L55l62R53r10N38p2q67J233j316O39M13r88
5055f43J268j193J162m73p93J397j464J239n13n31J494j454R07j33o00Q48j208
$$ plain form
5072 -690 390 53 -365 276 -639 517 36 -632 540 -594 427 -248 -661 540 -707 481 -235
5089 -235 -251 701 -658 422 -128 -404 532 -522 765 -42 -575 679 -714 219 166 -737 522 -737
5107 -737 608 158 -664 763 -1079 420 -174 -436 888 -833 375 -193 -222 671 -1011 770 -245
5124 -245 -391 810 -1039 960 -365 -386 629 -1035 706 -501 -324 812 -840 529 -235 -131 585
5141 585 -868 640 -482 -355 771 -705 603 -152 -162 615 -717 615 -122 -119 823 -750 680 -293
5159 -293 -300 839 -899 636 -296 -401 640 -1064 1010 -119 -139 663 -1067 1129 -390 -155 675 -869
5177 -869 751 -412 -133 407 -786 794 -443 56 595 -778 842 -406 -67 244 -715 821 -406
5194 -406 295 280 -834 365 -394 47 476 -633 419 -476 -121 540 -506 450 -328 -114 465 -566
$$ packed form
5072f90J080l37m18O41r15J156m81o68J172j134J021o75m13J201j247J188p16
5089b35j6R52j359J080n50k76R36j054J287q07n33J254j393R33n3r03J259j259
5107g37J345m50q22J427j842J499n94k62J324j721J208n68k9Q93j682J781j015
5124b45j46J201j849J999j325k1J015j664J741j207J77J136j652J369p64J04P16
5141E85j453J508j122J27J126j476J308p55j0P77j332J332p37LR42j573J430r73
5159b93pJ139j738J535r32j05J041j704K074j129k0Q02j730K196j519K35Q30j544
5177h69J620j163K79N40j193J580j237M99N39j373J620j248L39L11r59J536j227
5194d06P01j5j114J199p59M41M29j109J052q95L55O61j046R56p78K14N79j031
$$ plain form
5212 -566 612 -394 -127 251 -782 801 -369 -71 373 -615 636 -518 112 378 -722 544 -347
5229 -347 280 221 -539 652 -381 207 114 -641 549 -562 113 401 -325 442 -388 129 138 -471 567 -432
5249 -432 158 422 -554 458 -432 325 237 -495 392 -149 -41 129 -441 342 -62 64 153 -266 404 -696
5269 -696 -17 251 -292 367 -255 99 147 -474 644 -351 122 -11 -321 223 -172 334 -22 -174 525 -494
5289 -494 -58 139 -307 282 -376 187 -20 -544 295 -82 -55 107 -159 191 -40 173 -202 -143 67 4 -73
5310 -73 27 180 148 -212 33 -173 -208 165 -325 -26 93 -125 -167 -360 99 -73 -211 249 -404 -118 -141 -247
5332 -247 259 -113 63 -29 -117 269 -270 -136 70 -116 246 -37 309 -4 52 144 -39 82 -15 -146 156 -55
5354 -55 7 -257 -144 143 70 90 -386 157 -4 -84 51 -167 -252 111 -161 205 67 -167 318 -323 -85 -67
$$ packed form
5212e66J178j006K67L78j033J583j170K98M44r88J251j154O30K66j100J266q91
5229c47O27n9p60J191j033N88r3p55J190j111O75K88p26P67q30N17Ro09J038r99
5249d32N90K64r76J012q90P57q8p32Q87n41J08J70n70P83m04J26Q9m19O70j100
5269f96O79K68n43O59o22L54M8o21J118r95M73j33l10N44l95N06l56j52O99j019
5289d94M36J97m46N89o58N63k07n24Q39l77K7J62k66L50k31K13l75N9K10o3p7
5310g3J00J53l2l60K45k06l5L73m90K99J19k18m2j93M59j72j38M60o53K86k3j06
5332b47N06l72J76r2q8L86n39J34K06j86L62k83L46l13N6R2j83J21r7j31L02k11
5354e5O2k64J13K87p3K0m76N43j61q0J35k18q5L63k72L66j38k34M85o41K38J8
$$ plain form
5376 -67 49 -61 -133 26 89 -89 199 10 -21 -40 112 -20 -50 15 -394 -148 -38 184 181 57 5 131 -335
5399 -335 131 -34 -223 175 -106 184 -219 -81 71 -151 162 -66 -172 -46 5 256 110 198 -25 -44 52
5420 52 -43 18 138 -28 58 -205 -44 206 -150 108 1 22 -78 -110 0 141 -82 115 89 24 -85 -89 290
5443 290 -103 76 -20 11 123 -151 211 29 -59 98 -371 177 -174 -106 129 -408 167 -54 -138 250 -331 293
5465 293 -98 -167 333 -176 406 -121 217 129 -38 106 -139 64 -95 -89 125 -115 157 147 -129 334 123 69
5487 69 -264 148 121 -53 -21 43 -248 55 -14 16 192 -250 14 -234 133 264 -315 296 -71 155 105 -284
5509 -284 187 -222 -40 -10 -268 411 -300 -149 89 -168 170 -577 234 157 -285 278 -244 147 83 -248 281
5530 281 -311 345 -102 -327 411 -207 364 67 -325 338 -325 250 279 -94 514 -172 206 13 -300 120
$$ packed form
5376f7J16j10p2J59O3j78K88j89l1j9J52j32l0O5m09K46J10K22lj24n2J26m66
5399c35M66j65j89L98k81K90m03J38J52k22L13k28j06J26N1K51j46Q8k23j9R6
5420E2r5O1J20j66Q6k63J61K50l56K58j07K1j00l2J10J41k23J97k6o5j09mL79
5443B90l93J79r6L1J12k74L62j82q8J57m69N48l51O8K35n37N75k21q4L88n81O24
5465B93l91o9N00n09N82n27L38q8j67J44k45K03j59OK14k40K72j0k76M63k11n4
5487F9l33M12k7j74L2O4k91L03o9L0J76m42K64k48L67J31n79O11l67K26n0l89
5509b84M71m09J82L0k58O79p11J51K38k57L38p47Q11p7m42N63n22L91o4l31N29
5530B81n92O56m47k25P38o18N71k97l92O63o63N75K9l73O08o86L78j93l13M20
$$ plain form
5550 120 -318 87 -17 -308 123 -372 228 -85 -437 608 -443 139 -114 -233 513 -379 258 -25 -354
5569 -354 642 -542 158 71 -200 377 -534 420 -270 -406 355 -565 147 -170 -295 534 -521 548 -187
5588 -187 -75 529 -411 350 -302 44 56 -511 580 -72 -108 416 -460 241 -53 -190 122 -378 490 -200
5608 -200 -317 390 -652 408 -363 32 405 -572 82 35 -212 416 -404 345 -12 -180 508 -642 550
5627 550 -263 -102 488 -383 574 -556 -57 457 -408 388 -495 148 53 -456 377 -182 163 173 -418 535
5647 535 -395 81 68 -440 535 -301 -121 305 -527 442 -261 27 320 -409 361 -242 110 230 -469 313
5667 313 -517 17 69 -588 346 -261 112 223 -363 286 -545 -83 302 -344 656 -276 84 406 -561 503
5687 503 -454 406 220 -343 326 -257 187 46 -332 326 -299 167 240 -226 342 -672 204 69 -162 428
$$ packed form
5550A20m38M05j04k91M31m95O00l13l52J045j051N82k53j19P46q92O37k83l29
5569c54R96j184P00q7k71N77r11R54o90j36P61r20P12l17j25Q29j055J069p35
5588a87J12O04r40P61o52L46J2n67J091o52l6N24q76P01k94j37L12n00Q68o90
5608b00j17P07j042J060p71L95L73r77O54m7k47O28q20P49l57j68O88j150J192
5627E50q13J61N90q71R57j130M99N14q65P96q83O43r5n09Q33n59L45J0n91R53
5647E35r30M76j3n08R75q36J80M26q32R69p03K88K93p29P70o03L52J20o99P82
5667C13q30N34N2o57R34o07L73J11n86O49q31M62L85o46J000r32L60L22r67J064
5687E03r57Q60j86n63O69n83M44j41l78O58o25M66P3m66N68j014Q76j35k31N90
$$ plain form
5707 428 -501 237 221 -228 194 -507 106 315 -403 71 -336 -2 100 -424 289 -307 120 9 -279 353
5727 353 -476 151 65 -329 542 -490 65 65 -191 421 -334 49 214 -247 576 -398 170 -165 -471 349 -70
5748 -70 130 -4 -258 277 -217 80 11 -121 243 -315 193 -93 -124 256 -220 165 98 277 331 -135 233 -30
5770 -30 -242 201 -4 396 -137 -276 173 -312 204 210 -292 191 -169 47 42 -52 370 -73 -31 81 -174 349
5792 349 -59 130 35 137 177 -240 94 -74 97 165 -399 421 -57 78 -68 -174 227 -212 147 -229 -81
5813 -81 191 -285 -27 291 -105 176 160 237 144 203 -142 58 73 218 -127 15 283 -96 282 -282 163 195
5835 195 0 101 -145 -33 -2 -72 -63 74 99 233 -138 -41 -84 -20 -75 -75 44 -53 342 -125 -209 144 -189 -42
5859 -42 21 35 -19 -253 -117 30 -6 27 -293 -51 -105 201 -7 66 110 213 -41 -195 6 -130 -82 156 169 39
$$ packed form
5707D28r29P38j6m49M22p01O13K09p18M74m07L34J02n24P13n96M27j11k88O32
5727C53q29O27q6l94Q71j032N55%k56O12p55L83J65m61Q23r74N68l35l06Q20m19
5748g0K00j34k54N35m94K97o9j32L64n58N08k86l1L80m76L85o7J79N4m66L68k63
5770c0k12M43k05M00n33j39M49m85N16On02M83l60K16nr4M22m43M2J12k55N23
5792C49m08J89r5J02M0m17L34j68J71O8n64Q20m78J35j46j06M01m39L59l76J48
5813h1K72m76K58L18l96K81j6P7r3N9l45K00J5J45l45J42K68l79L78n64M45L2
5835A95j95J01k46J12L1p0RJ37K5J34l71R7m3O4n5%J19r7L95m67q4L53l33J47
5859d2O3J4n4k34J36J47l6L3l20K42n4L06k08P3M4J03k54j54K01j36M8K38J3j30
$$ plain form
5883 39 212 -194 173 269 201 30 20 -101 26 -112 279 252 87 170 -31 27 165 -100 -22 -119 170 -110 -82
5906 -82 -95 -149 177 -131 -87 259 39 239 48 104 -121 -12 163 -216 190 94 -301 68 -62 -40 15 -58 104
5929 104 27 110 58 242 74 -118 111 -113 -268 -86 -407 151 -121 129 143 -150 231 -49 -171 138 -111
5950 -111 92 44 -80 183 31 157 -70 -181 190 -17 166 114 113 -19 -207 -41 84 -138 48 -137 -17
5971 -17 19 142 141 -163 306 -133 -117 152 -138 41 -88 -253 195 -127 95 -87 229 80 -286 374 132 175
5993 175 216 -332 -136 -42 -206 26 -182 18 -26 -199 372 -308 -37 -46 -216 17 112 325 86 86 -35 -172 186
6016 186 -306 -30 -108 -106 87 -53 -44 313 -165 273 -185 -122 97 -221 149 -149 -27 169 -311 509 -128 82
6038 82 283 -549 37 -105 -182 0 -122 355 -272 -96 -73 -248 369 -324 -292 257 -299 276 -323 107 382
$$ packed form
5883C9J73m06L67R6o8j71j0j21J27j38L91k7j65Q3k01N8J38k65P8r7K89k80K8
5906h2j3n4L26l08M4L46k20K00j91N6k25J09J75l79M06r6l95L69j30K2N5p3J62
5929A04p7Q3n2J84j68j92K29k24j55J82l21N58k72K50J4k93L81k80j22L09k49
5950a11K03m8j24K63j52J26k27j11L71k07J83n2jj32j88J66J25k22J86j85J20
5971a7L6J23jl04M69m39J6K69k90J79j29j65M48l22K22j82L16j49l66O60k42M3
5993A75M1n48J96R4j64K32k08K00m4j73N71o80K71rj70K33R5K13k39%j21j37L58
6016A86m92K76p8KJ93j40RL57m78M38m58O3K19l18L70k98J22J96m80Q20o37K10
6038H2K01q32N86j42p7J82j22M77o27J76K3j75O17o93L2N49n56N75n99M30K75
$$ plain form
6059 382 -471 310 -85 31 257 -207 291 -59 -95 159 -36 545 -181 -179 246 -255 391 -443 -21 297 -373
6080 -373 113 -146 5 237 -250 491 -104 -187 277 -542 236 -113 105 135 -221 500 -213 -28 286 -83 418
6101 418 -408 31 200 -350 272 -460 300 238 -460 152 -151 175 -27 -151 544 -107 -26 -129 -231 464 -190
6122 -190 167 59 -308 258 -422 203 31 -270 304 -406 400 184 -316 464 -198 -6 -137 -503 505 -345
6142 -345 229 -275 -92 614 -341 2 306 -60 587 -683 46 118 -268 290 -484 217 87 -212 336 -444
6162 -444 284 -196 -293 515 -442 23 -71 -355 286 5 106 43 -113 365 -254 269 42 -10 236 -240 269
6183 269 249 -533 440 -40 211 -269 -207 348 -475 291 -65 -476 458 -447 263 -102 -179 259 -555 425 -383
6204 -383 -187 314 -242 238 -258 -122 366 -135 88 -296 -24 321 -162 283 -207 6 65 -302 266 65
$$ packed form
6059C82q53P81l95J16K26m64M98l50l6K54j95N81p26KM25n01O46q34M22L18o70
6080c73M86k59J51K32m87P41n95q3M64q19P78l49K18L0l56P21p13J85L14l69N01
6101D18q26M39J69n50O22p32P60o2o98O12l03L26k02j24O95o51Q1j03j02O95o54
6122a90L57j08l67N66o80O25j72l01N74p10Q06k16n00P80o62J92j31l66J008q50
6142c45N74n04J83P06r55L43L04l66O47j270P29P2l86N58p74P01j30k99N48p80
6162d44P28m80r7Q08r57M65r4k84O41k81J01o3j56M78o19N23k27n2K46m76N09
6183B69k0p82R73m80K51m80O2N55q23P66l56m11R34r05P10l65p7M38q14R80q08
6204c83J96N01n56M80m96J36M88n01K23l84K72L45m83M45m90K13N9l67N68k01
$$ plain form
6224 65 83 258 -408 312 -47 -261 264 -373 181 -72 -299 389 -232 140 -80 90 73 -359 164 -20 -17 222
6246 222 -451 307 -397 3 173 -368 201 -196 -164 288 -63 94 -189 -207 20 -291 -72 -97 182 -29 92
6267 92 280 -155 -202 73 -95 285 -133 79 225 -116 -56 -84 38 243 -228 54 -114 -24 230 -142 49 -173
6289 -173 -108 74 -215 158 -110 -32 199 -60 151 58 45 27 -158 355 -278 -154 -133 -66 -81 -76 -244 50 -148
6312 -148 188 -1 239 189 -66 17 65 -77 -10 -123 -86 153 -33 147 -47 -44 -158 12 -210 -4 5 -253 -133
6335 -133 -26 -168 162 60 -143 -32 -145 121 -297 67 -170 29 148 -144 -53 -12 -142 31 -128 199 54
6356 54 -126 265 -31 -41 141 214 265 -86 248 53 -160 57 -209 -156 -100 -245 130 128 -166 138 85 3 -170
6379 -170 -27 19 207 74 88 -8 -151 152 90 -239 -103 152 98 -74 76 -27 32 -206 53 -177 91 167
$$ packed form
6224F5J8J75o66P20l59k14N25o37N54k53k27O88o21L72k20J70j7m32N23j84LK39
6246B22o73P58p04M00J70n41N69l97L2M52l51J57k83j8K27l11K19k5K79k11J21
6267I2J88m35m7K75j68L80m18K12J46l41O0k8J22K05m71K82j68R0K54l72J91k22
6289a73O5J82k89L73k68P8K31k59K11r3j3j8j85N13o33J24K1O7j5Nj68K94j98
6312a48L36j89K40n0k55Q3M8j42O7j13L7K39j86J80j94Lj14J70k22K06Rk58J20
6335a33J07j42L30j02k03J11j13K66m18L64k37J99J19k92R1M1j30J73j59L27j45
6356E4j80L91k96j0J82P3N1l51L34j95k13K17k66N3N6j45L75kk94L04n3q2j73
6379a70J43M6J88j33J4r6j43L03o2l29J36K55n4j72J50j03N9k38K59k30K68P6
$$ plain form
6401 167 50 90 -161 -57 175 78 -115 -16 -24 35 344 103 -71 225 -36 154 163 141 -103 210 -12 -179 209
6424 209 -30 -42 14 489 50 -156 -214 47 -18 -183 233 -68 40 77 -168 11 99 -180 93 -125 138 98
6446 98 -74 143 -48 160 -71 189 69 74 14 275 90 -24 -172 137 69 42 83 -163 166 -47 -39 118 97
6469 97 -18 -100 -311 117 -152 -50 55 6 122 -168 27 1 -74 26 -348 17 -49 -123 270 13 75 94 29
6492 29 -108 -139 -76 -18 16 93 46 -68 -180 -97 8 -168 87 -2 -108 40 -128 205 -41 -320 250 12 153
6515 153 30 35 -54 -177 491 -100 150 22 -221 16 -65 157 70 -293 361 67 110 146 -366 193 15 -72 12
6538 12 -84 394 28 -37 -2 -131 -6 -253 36 354 -491 262 -240 78 122 26 35 23 204 -202 -373 33 -212
6561 -212 -2 124 -136 40 -284 51 146 -8 145 -82 85 258 -104 -87 -96 84 118 -329 151 27 105 -99
$$ packed form
6401A67j17M0k51J04K32r7j93R9qN9L09k41j74K96k61J90Rk2k44L13k22j67L88
6424B09k39j2N6M75m39k06n8K61o5j65M16l01J08L7k45J79Q8k79K73k18K63m0
6446I8j72K17j91K08k31K60j20No0K61j85j14j48L09o8k7M1k46L29k13QJ57k1
6469I7j15q2k11M28k69J02J05m9J16k90J95k6p5J00l74L65o6p4L93k57O2J9o5
6492B9j37l1O3N8L4P7m7j14j12Q3J05j76K55q9j06J48j68L33k46k79N70k38J41
6515A53j23Nq9j23O68n91K50j28k43K37q1K22q7l63O54k94M3L6n12N59j78q7Q4
6538A2r6M78l66o5L5j29J25k47K89L18q45P53n02L18M4r6Rj2J81m06j71M06k45
6561b12K10J26k60J76l24L35R5j54J53k27J67J73l62J7rJ80L4m47M80j24P8k04
$$ plain form
6583 -99 -208 259 -45 23 42 -43 252 -231 6 -42 126 112 -439 277 -47 -201 85 -271 40 -271 -214 470
6605 470 -5 230 -105 -79 193 -106 -111 -345 -176 171 -9 5 -142 140 208 -282 273 -89 -34 276 -254 51
6627 51 -110 -139 284 -152 52 -64 -29 235 -241 41 -129 16 308 -165 45 38 -96 120 -199 393 -198 -63
6649 -63 322 67 154 95 -350 293 -240 149 -191 -200 51 -455 166 -236 -189 5 -59 190 -79 59 49 108 136
6672 136 -1 -79 63 -86 214 83 20 222 -14 128 -76 56 131 -312 -122 21 264 205 -252 63 72 -35
6694 -35 124 -167 250 -201 135 93 -217 319 -424 94 104 -91 272 -252 221 189 -520 11 80 192 111 -248
6716 -248 33 37 -97 62 -94 278 -585 362 65 -344 188 -310 -36 123 -99 371 -226 272 22 -143 -11
6737 -11 -81 129 15 -295 347 249 75 -97 -97 10 -273 44 235 -91 328 -75 112 68 -182 104 -166 -124
$$ packed form
6583i9j09M67l04O8J9q5K95m83K37m8J68j4n51P16l24j54K86l56L11l11N7O84
6605D70m75K35l35K6K72k99nk34J69L47j80J4j47K82O8m90N55l62N5L10n30L05
6627E1j61k9M23m36K04j16L5K64m76K82j70J45K92m73K10pj34K16l19N92n91J35
6649f3L85k55Q7n9m45O43n33L89l40rK51n06O21m02M7J94o4K49k69J38j0N9K8
6672A36j37p8J42j49L00j31o3K02k36J42k04J32P5m43J90J43K43n9m57L15Rj07
6694c5J59k91M17m51L36m2l10N36p43N18J0j95L63n24M73l2p09N31O9J12q1l59
6716b48K81Mj34J59j56L72q63R47k97m09N32m98K74J59k22M70n97M98k50j65J32
6737a1p0K10j14l10O42r8j74j72%J07k83L17J91l26M19m03J87m4k50K86k70M2
$$ plain form
6759 -124 96 23 223 -68 113 117 -316 212 -104 286 -176 -51 294 -101 -39 252 -138 156 -115 154 330
6780 330 -364 90 -106 201 59 -17 266 -27 133 -71 19 165 2 -123 -13 -242 86 2 -54 332 -145
6801 -145 261 144 310 -76 -245 117 -85 86 -51 -25 232 -206 75 -183 74 -48 -286 -210 63 223 147
6822 147 -1 -158 113 -132 -18 -44 83 -115 108 -100 155 -107 246 12 162 -253 149 119 -93 197 -142
6843 -142 -96 -139 -363 68 131 -10 55 46 182 -63 153 21 -29 384 -43 75 -151 -124 218 -175 -223 20 -3
6866 -3 249 -12 -37 -22 -39 231 99 -80 103 -14 93 -176 147 -130 -276 28 -31 -124 -10 -13 177 -84 230
6889 230 6 83 204 -33 105 48 -76 13 -255 -65 -41 4 -70 -36 106 -94 80 53 10 66 159 2 -54 -99
6913 -99 -16 50 -20 70 172 60 -74 60 10 79 -31 -17 -153 95 51 62 -114 -214 111 -276 126 6 -75 -99
$$ packed form
6759a24K20p3K00k91J81Mm33N28l16L90m62J25L45l95O2K91l90K94k71K69J76
6780C30o94M54j96L07j42p6K83k93J60k04R0J46j63j25J10k29L28q4n6L86m77
6801a45M06j17J66l86j69L62k02J71j37K6K57m38K81k58K57j22k38P6K73J60p6
6822A47j48j57K71k45J14k6J27j98K23k08K55k62L53k34J50m15M02l0k12K90l39
6843a42M6m3k24M31O3j41O5rJ36k45K16j32n0M13m27J18k26K7L42l93m8K43k3
6866cK52k61k5J5j7K70j32j79J83j17J07k69L23k77j46L04n9r3J14lJ90k61L14
6889B30k24P7J21k37J38n7j24Q9k68J90K4M5p4L4J42k00J74k7m3N6R3j57n6m5
6913i9Q3O6p0R0J02j12j34J34n0O9j10J4j36K48m4J1j76j00L25l87M02j20q1k4
$$ plain form
6937 -99 -56 10 -44 7 112 50 -17 -13 -147 60 -43 63 -19 81 84 -30 -12 -26 -24 -63 48 118 129 75 73 -128 247
6964 247 -64 140 -78 12 -107 -320 -16 -84 -97 35 -8 35 29 163 66 -198 61 24 75 31 -133 43 -72 -128
6988 -128 179 -285 62 -171 -162 32 -41 -27 200 15 19 163 -32 183 -12 -180 -97 96 -112 -274 -123 -113 -75
7011 -75 -24 -315 67 -165 99 -70 -115 246 -275 141 11 110 346 11 -207 8 -99 -28 -13 67 -26 -4 101
7034 101 -9 -336 -74 -217 19 -78 231 312 -41 51 -126 123 27 -206 137 -367 29 -180 104 56 -147 128
7056 128 -217 -255 209 8 -58 78 67 169 -218 261 -32 -172 100 -154 166 -42 31 162 -35 -1 -241 -88
7078 -88 154 -286 343 -301 102 338 -567 74 -210 -28 -126 -178 386 -125 -126 -50 -363 -126 -247 -145 106 -259
7100 -259 -88 -291 5 99 -99 53 -109 -64 225 -277 221 10 -151 -56 -41 301 2 52 -63 -77 320 -131
$$ packed form
6937i9M3O6n4N1J05o2o7Mj34K07j03J06q2J00Lj14J8j4Kl9J11P0J1n4kk01L75
6964B47l11K04k18R0j19k13L04o8j3J32m3M3oJ34r7k64K59l7N1m4j64J76j15n6
6988a28L07m64L47k33RJ94p3J4K27j85MJ44j95K15j95j68Q3J93k08j62J51J0L8
7011g5N1k91L82k32K64j69m5L61n21M16j30R9K36l35k18K15j07P1J5Q0r3K2J05
7034A01j10l27K62j43K36r7L09Q1l53R2j77K49r6k33L43n04L96k09K84m8k03K75
7056A28l45l8M64k01o6J36j1J02l87M79k93j40K72k54L20k08P3J31j97L4k40J53
7078h8K42m40O29o44M03K36r05O41k84J82r8n2N64n11jP6l13K37j21J02K51l65
7100b59J71k03K96R4j98J52j62M5K89n02M98k11j61R5J5L42k99N0j15j4L97m51
$$ plain form
7122 -131 -185 136 -305 -28 -122 -194 193 -344 106 61 28 34 -199 185 90 185 -151 -60 327 -244 -5 -127 62
7145 62 275 -252 58 217 -36 232 -219 120 187 -261 46 -59 -2 62 -77 -21 -214 63 137 -6 226 -50
7167 -50 -95 298 -115 140 -161 114 136 -228 -296 -292 -90 143 -14 148 101 -73 -120 -202 320 -174 238 59 -288
7190 -288 231 -166 286 128 14 3 4 202 243 -183 127 -270 82 -67 -310 115 -209 179 86 -177 311 42
7212 42 51 -293 6 324 -139 224 96 -208 209 -352 141 -143 -153 42 -329 128 -176 -129 241 -191 191 -223
7234 -223 -285 5 -326 412 -55 -121 168 -79 157 -60 -210 175 -3 44 296 -76 137 7 332 -120 -135
7255 -135 202 -41 -127 -39 -140 90 -254 153 -54 -318 61 -46 257 50 -368 -6 -174 114 -122 -73 168
7276 168 -294 135 -37 -38 339 -37 174 17 88 74 -51 172 -308 108 75 27 28 -316 29 53 233 216 -59
$$ packed form
7122a31n4L21m41K77r4p2L87n37M50m5l3Ok33L84r5R5l36R1L87n71K39j22J89
7145F2K13n27L10J59k53K68m51L39O7m48L07j05N7O4j39N6j93K77P4j43K32k76
7167e0m5L93m13K55l01K75K2l64o8MK02K33j57J62m7j74m7q2N22m94M12j79l47
7190b88N19l97M52j58j14j1JJ98M1m26L10l97L52j49k43M25l24L88r3k63M88k69
7212D2Rl44K99L18m63L63j28l04M17n61M93k84j0J95l71M57l04M7L70m32L82m14
7234b23o2K90l31P38m67o6K89k47K36k17j50L85j78M7K52l72K13j30L25m52j5
7255a35L37k43q6Q8j01K30l44M07k07k64L79j07L03k07m18L62j68K88k36M9K41
7276A68m62M29j72jL77l76K11j57P1j4j25K23m80M16l3m8Jl44L45K4J80j7k75
$$ plain form
7299 -59 -72 -128 -235 129 72 -164 168 -171 66 -156 -214 89 -5 64 -103 -18 158 -147 108 -97 -54 -5 78 0
7323 0 -123 -157 227 -36 81 -71 -157 352 -252 156 -333 15 196 2 6 -128 53 156 113 40 -3 -30 140
7346 140 114 16 79 44 -4 64 23 66 -44 -264 -104 85 -233 34 113 -137 -84 24 100 127 -39 -245 -29 -266
7370 -266 237 58 -37 57 91 -117 -169 -148 -48 52 48 -212 -67 180 180 -135 -189 145 -185 197 -22 -39 54 -59
7394 -59 -82 -376 -32 -199 59 -114 -212 -224 -45 87 -1 332 18 -105 72 46 38 42 150 -60 -91 91 79 69
7418 69 -34 81 -14 -61 -2 296 -93 86 -77 187 -7 -78 64 140 104 48 -67 -41 -77 75 -39 74 -164
7441 -164 -24 244 -165 312 -35 135 187 74 -50 191 -83 -47 -334 93 -288 -31 88 129 125 -8 -69 117
7463 117 -108 31 199 97 148 -136 -171 -110 -119 -37 -235 29 109 67 21 -185 -125 7 164 195 79 -233 29 -150
$$ packed form
7299e9j3n6j07L64n7k36L32l39K37k22n8L03r4O9j67Q5J76l05K55k05M3M9Q3p8
7323@j23l4L84k63J17j52q6N09o04M08m89L48J81j94Mj34J81J03m3p3m3k7J70
7346A40k6r8O3l5m8O8m1M3j10k20J60J89l18K67P9k50N3J08P6K7j66k06K16k37
7370b66N03j79r5R4L4k08n2K1J00J00mk60J45K47%l15n4L34l30L82k19j7R3j13
7394e9k3k94L44j67K58j73r8j2J79J32q8L33l14j23J77k6qMJ08k10l1J82j2j0
7418F9j03J15r5m7N9K98l89J79j63K64j94p1J42P6l6n6j15K6l6J52j14J13k38
7441a64J40K68m09M77l47J70N2j13j24K41k74L6k87M27l81K57J19M1mj33o1J86
7463A17k25J39J68j02N1k84l5O1rQ2j98K64Q0m2m6k06O0J32J57L1j16l12K62j79
$$ plain form
7487 -150 101 -279 -120 -80 -205 116 246 26 -72 -195 161 249 87 -140 -109 52 -178 -194 222 -105 -111 -75 274
7510 274 90 84 -85 -176 259 194 13 -145 2 -145 -100 -439 157 -3 5 -80 -460 -105 -206 -29 -82 94 137
7533 137 -47 -158 -41 70 106 55 -114 -285 -96 177 -67 155 9 -64 91 -151 -9 -26 94 -109 -326
7554 -326 -80 42 76 8 66 4 -108 -135 -140 -231 -20 -57 -237 -67 -59 46 3 -5 -44 -163 102 109 197 -32 -298 396
7580 396 99 85 75 -70 78 -101 -69 -19 -270 208 -120 28 158 -163 13 -129 -153 310 -107 120 -352 102
7602 102 -61 -105 147 -203 29 73 -7 119 87 -186 49 -252 229 -209 18 154 53 -25 -94 -50 -10 -203 208
7625 208 -168 27 -83 -203 252 -279 -38 -381 -145 60 -240 -102 76 52 89 -166 60 -2 158 41 -363
7646 -363 -87 -124 -235 151 -142 85 -149 26 162 -242 -103 -192 -127 192 -185 189 -118 -163 259 -30 -38 22
$$ packed form
7487a50K51l80J59M0j25L21J30k20r8j23L56Q8j62k27L1J61k30j6M16l27oL6L49
7510B74j84oj69r1M35o5j81j58J47j47M5l39N96j60Qq5l80L55j01J77n3J76M3
7533A37j84j11J17J11L6n1j69j71J89K73k44K22j46p3J55k42J42j7J20k03k17
7554c26K46J22L4o8N8o2j12k7nr1K11l7j80J70QJ05m3ql9j19K65PQ8k29k66O94
7580C96k97j4j0j45J48j79L2N0k51M78l28J48J30l21J76j42k4M63m17K27m72M54
7602A02j63m4K52l50K32M4q0J26l2k73K35l01M81m38K27J36j01p8o9M4M0j93M11
7625B08l76J95j10j20M55n31K41l43K36K05l00J38J78k4L7k55K26o2J60j17m04
7646c63K76l7j11L86k93K27k34J75J36m04J39q9O5L19l77L74l07m5M22k89qO0
$$ plain form
7668 22 91 272 137 -100 -33 -275 111 -151 164 -113 -15 34 -64 -105 66 -49 57 -232 72 22 134 -136 -212
7691 -212 201 33 -129 -190 -87 91 98 -177 74 -225 223 -150 -2 47 -129 160 -177 202 133 -304 68 -240
7713 -240 -51 265 -167 281 -18 -67 89 -139 -65 -277 19 254 -232 -87 -176 -222 231 -403 -188 -55 -28 -78
7735 -78 -161 191 -71 100 -16 -11 242 109 -150 -8 -52 57 -39 285 152 -210 112 -304 13 56 66 145 46
7758 46 58 162 -231 185 7 -104 184 231 -67 -96 44 250 -402 234 -109 -43 243 -193 -80 83 183 82
7780 82 -64 51 15 206 -66 -306 352 -156 -163 59 -48 56 -87 -275 59 54 145 -213 56 -9 7 282 26
7803 26 84 120 -157 -26 -254 78 324 10 177 -230 19 89 53 191 -217 132 162 -9 -10 17 -153 206 -219
7826 -219 81 -98 -133 11 -201 226 22 244 91 -29 -171 -132 -61 -29 88 -12 -250 130 -65 107 112 -166
$$ packed form
7668B2O9J81j35k37O7k42L86k62L15k77R8M9r8m1J71j15J06k89L04n0J12k70p6
7691b12M13j68j62o1J03J78Pk75K51k99M48l73J48M9j76K89l37L79o9m37L72l08
7713b40J89L16m32M48k99m9J56k28P4k12K96K35m86J45q9m6M53o34K15J33K7n0
7735g8q3L52k62J71j16NK53j33k59J42m4J09r6L24j33l62L22m16L17M3J0P9r9
7758D6J2J04l93M16j78j11K88M7k98k9J40K06o52O36l43O6K86m36J13J63J00j01
7780H2j46J15l6J91k72k40O58n08pK22j07J04j43j88L34nR1l58K69o5J6K75k56
7803B6N8L6k77J31k28L32K46l14J67m07K49P0l6J38m08L49L0j71jK7j70L59m25
7826b19L00j79l5J44k12M27k04K22j53j20j42L9P1L2J17j00k38L80j95J72Nk78
$$ plain form
7848 -166 -85 115 196 130 -121 108 -128 60 -129 159 -59 28 61 -95 0 106 139 -74 117 -115 62 208
7870 208 50 -132 71 254 37 42 144 -60 198 79 -292 10 51 107 225 -118 162 65 -38 55 38 169
7892 169 36 -42 24 4 210 -54 33 110 -34 -78 -318 -213 -7 -207 41 12 130 29 -112 65 -40 92
7914 92 -161 19 116 -108 262 28 182 7 56 151 307 64 31 -86 23 -12 -55 -2 103 -202 -232 -2 306
7937 306 279 64 167 -5 64 107 150 -47 -99 -76 -135 6 105 -54 -40 -33 -161 -220 9 130 168 -77 48 -60
7961 -60 235 -20 -182 -126 -13 219 -12 2 -125 -136 25 174 -159 -8 -61 7 -47 44 -1 -251 72 47 -80
7984 -80 -247 83 -171 93 -77 91 -98 -24 97 -33 -99 137 92 -11 -34 -66 205 3 -4 66 -1 -76 -57 -1
8008 -1 10 86 -191 -8 -143 30 -88 -15 -327 -200 77 -251 59 -130 107 165 -130 -55 32 -47 81 -92 -119
$$ packed form
7848a66Q1K00Q1o6k51K29k36J88j89K88k18Q7L3j56R5J06L3k13J91k32J77J46
7870B08j58j82K03J83k17NJ02k04K58j19l71L02M1N6J18l43K80r7j03R3j7J31
7892A69j33p8O6k0K06k64Q7P7j44m4k40J05K06k00K48k9J18j01j41J77j05J32
7914I2k53J80R7k24L70k34J54j75M9R5J56k43l3j17J09l5m3N3J05l05l0K30L08
7937C06k7k15J03j72O9M3M3j97n2K3n9J41R9j59J4Pj28n9K29J21L8k45J25j08
7961f0K95k55j62N6J13K32k31J4j27j1J61J49l33J51n3O8n4R1m5k50L23k5j27
7984h0j67L30k54K64j70J68j89P4J21j30o6K36m5j03k3l2K71k02pP0o7p5J9N6
8008aJ1P6k77J83j35J73j18P3l12J27K77l28L10j89K37N8k95P5Q7p9J28j73k7
$$ plain form
8031 -119 59 -153 77 101 -4 1 -178 110 -289 83 -124 -64 -24 -163 123 0 -43 -9 161 88 70 -129 96
8054 96 -32 259 -23 -53 -131 -133 205 -236 -307 125 -134 -124 -130 -100 216 -296 -102 130 -85 47 34 32 -112 -76 251
8079 251 -200 82 19 28 -70 -114 72 128 53 -71 -74 138 -23 20 314 -163 105 70 -150 -40 -250 295 114 -149
8103 -149 268 84 25 -85 -326 187 169 -8 -75 -121 352 -253 75 181 -31 136 -260 -40 -30 34 116 -102
8125 -102 193 175 -271 260 -12 29 -116 14 164 -348 101 -28 263 5 25 -18 31 -149 423 -125 -93 -154
8147 -154 -43 204 -331 -227 -145 -149 -41 -182 162 114 -212 12 -246 85 49 -211 174 -15 252 -28 -252 22
8169 22 -63 -19 41 56 4 -136 70 13 -26 225 -95 -44 115 112 170 -107 66 -40 4 233 -50 80
$$ packed form
8031a19J78k12K30K4j05Nj79K88l99L72k07O0M0j39K86j23m3L4J70p3j8j99K25
8054I6j28K91k82l0p8kL38m41p1M32k59J0oL0L16n12J94K32k15J32j3kj44L6L27
8079B51m51K82o3Rr8m4J86N6p5j24lK12j61M3K94m77K68l5k20J10k10N45j81k63
8103a49M17j84n9j10k41N13j8j77o7m6M73o05L28J06k12J67l96K20J0O4Q2k18
8125a02K95j8m46N31k72M1j45J30J50n12M49j29K91k58K0m3M9j80N72n48L2o1
8147a54J11K47n35J04Q2mJ08j41L44m8l26K24k58L31l6k60L85j89K67k80k24K74
8169B2q5M4O0J5n2j40K06n7l9K51l20N1J59lN8k77J73j06M4K29k83J30
8191H0
$$ Imaginary data points
##PAGE= N=2
##DATA TABLE= (X++(I..I)), XYDATA
$$ plain form
0 0 0 0 0 0 0 0 8 -8 8 -16 16 -24 24 -32 40 -52 64 -80 96 -112 132 -156 183 -212 244 -284 327 -373 425
29 425 -486 550 -621 698 -786 879 -981 1095 -1219 1352 -1497 1656 -1830 2018 -2222 2446
45 2446 -2694 2961 -3256 3579 -3936 4329 -4767 5257 -5810 6437 -7156 7989 -8964 10121
59 10121 -11521 13248 -15426 18256 -22074 27462 -35543 48766 -73554 133736 -526329 -500553
71 -500553 844726 -631057 653315 -610911 -45078 726821 -703366 395054 -363847
80 -363847 233583 269445 -519935 233516 -89675 331509 -273330 -215631 346887 1973
90 1973 -38963 -331575 326110 120940 -246967 -18915 28944 207626 -132307 -114356 -2837
101 -2837 250778 -112384 -138242 58908 -14520 363791 -562013 153952 309125 -310392 270263
$$ packed form
0@%%%%%%Qj6J6k4L2m0M8n6P2r2J16j44J76k08K44k88L39l95M56n28O11p00P98
29D25r11J036j171J319j484J665j860K076k314K571k849L153l486L848m240M668
45B446n140N655o217O835p515Q265r096J0024j1067J2247j3593J5145j6953J9085
59A0121k1642K4769k8674L3682m0330M9536o3005Q4309j22320K07290o60065K5776
71e00553J345279j475783J284372j264226N65833P71899j430187J098420p58901
80c63847N97430L5862p89380P53451l23191M21184o04839N7699N62518l44914
90A973m0936k92612O57685k05170l67907K28052M7859J78682l39933J7951J11519
101b837K53615l63162k5858J97150p3428L78311r25804P15965J55173o19517N80655
$$ plain form
112 270263 -523754 541063 -3471 -491939 516273 -447129 493055 -266358 -259039 532723
122 532723 -442633 413288 -428641 90643 405602 -496011 290801 -295833 371597 -60746
132 -60746 -400457 464383 -262753 231284 -231323 -52187 362367 -340743 185739 -162970
142 -162970 81196 181294 -289100 96140 32819 66904 -70217 -111677 112496 123872 -179001
153 -179001 -48923 181915 -106492 104659 -194779 93524 165625 -269460 212692 -208704
163 -208704 177711 54744 -294314 285195 -182007 197501 -159833 -97979 328411 -293956
173 -293956 179248 -179916 128296 108032 -312052 309314 -238882 192971 -42761 -204146
183 -204146 326074 -273737 209015 -141959 -53081 277562 -301325 162555 -79190 49459
$$ packed form
112B70263p94017J064817n44534m88468J008212r63402R40184p59413P319P91762
122E32723r75356Q55921q41929N19284L14959r01613P86812n86634O67430m32343
132f0746l39711Q64840p27136M94037m62607J79136M14554p03110N26482l48709
142a62970K44166J00098m70394L85240o3321L4085j37121m1460K24173J1376l02873
153a79001J30078K30838k88407K11151k99438K88303P2101m35085M82152m21396
163b08704L86415j22967l49058N79509m67202L79508l57334O1854M26390o22367
173b93956M73204l59164L08212k0264m20084O21366n48196M31853k35732j61385
183b04146N30220n99811M82752l50974Q8878L30643n78887M63880k41745J28649
$$ plain form
193 49459 70701 -206789 180617 -55342 10310 -21511 -23159 68873 -35469 5725 -55454
204 -55454 89414 -40032 1937 -20852 -8582 112598 -150754 74857 -13543 16200 19609
215 19609 -114882 153857 -105232 56643 -28831 -40065 131137 -161016 131670 -99326
225 -99326 41820 76591 -181526 188779 -135197 83860 -8634 -113028 201734 -186308
235 -186308 107970 -33176 -41095 120328 -157782 127762 -71298 20153 38691 -93152 104197
246 104197 -78101 55693 -38276 -4576 57649 -78311 66930 -56567 46944 -14337 -30808
257 -30808 57786 -63332 62314 -50230 19121 12848 -32409 48100 -63553 62424 -36947
268 -36947 5154 19189 -43181 68883 -76979 55543 -17472 -21624 55169 -76917 76567
$$ packed form
193D9459K1242k77490L87406k35959O5652l1821j648R2032j04342M1194o1179
204e5454J44868j29446M1969k2789J2270J21180k63352K25611q8400K9743L409
215A9609j34491K68739k59089J61875q5474j1234J71202k92153K92686k30996
225i9326J41146L4771k58117L70305l23976K19057r2494j04394L14762l88042
235a86308K94278j41146p919J61423k78110K85544j99060R1451J8538j31843J97349
246A04197j82298J33794r3969L3700O2225j35960J45241j23497J03511o1281j6471
257c0808Q8594j21118J25646j12544O9351o273m5257Q0509j11653J25977r9371
268c6947M2101J4035o2370J12064j45862J32522p3015m152P6793j32086J53484
$$ plain form
279 76567 -53910 17860 22463 -58073 77177 -70568 44565 -11290 -20346 49072 -65910
290 -65910 62604 -40397 10046 17994 -38589 50185 -51516 39733 -16591 -10621 31920 -42009
302 -42009 41456 -33707 20408 -398 -21703 36318 -39410 32221 -19558 4160 13579 -30078
314 -30078 37865 -32070 16882 -114 -12734 22060 -27311 26446 -16668 1637 10815 -17458
326 -17458 19060 -17631 14232 -6632 -4094 13397 -16671 15027 -11719 7366 383 -9837
338 -9837 16963 -16803 10442 -2397 -5213 11462 -13960 12480 -5979 -2769 10514 -13558 10542
351 10542 -4606 -1997 8371 -12931 13381 -7241 -2060 8963 -13247 15311 -11913 2503
363 2503 7055 -12056 16647 -19271 14413 -1081 -12865 19684 -22797 22902 -12974 -5465 20651
$$ packed form
279G6567j30477P1770M603q0536J35250j47745J15133n5855r056O9418j14982
290f5910J28514j03001N0443P948n6583Q8774j01701R1249n6324N970M2541p3929
302d2009Q3465p5163N4115k0806k1305N8021p5728P1631n1779K3718R419m3657
314c0078O7943o9935M8952j6996j2620L4794m9371N3757m3114J8305R178k8273
326a7458L6518l6691L1863k0864K538J7491l0068L1698k6746J9085o983j0220
338i837K6800l3766K7245j2839k816J6675k5422K6440j8459L210J3283k4072K4100
351A0542j5148K609J0368k1302K6312k0622N181J1023k2210K8558k7224J4416
363B503M552j9111K8703l5918L3684j5494j1784L2549m2481M5699l5876P509K6116
$$ plain form
376 20651 -27076 27260 -20264 1848 17377 -23860 20854 -18465 11920 6319 -21255 15178
388 15178 -531 -967 -4970 3682 -1462 9462 -13379 -160 17165 -24500 28936 -30027 10279
401 10279 24694 -41536 35285 -33554 34439 -6906 -40216 58804 -44312 35256 -32801 4482
413 4482 42482 -65154 61964 -57591 39106 13382 -65720 79378 -74697 71271 -32387
424 -32387 -51345 109016 -93159 55158 -36068 -2141 73861 -108071 69505 -18663 -2842
435 -2842 27887 -62003 55563 -14232 -566 -8664 -11173 37048 -11673 -25228 -1113 47555
447 47555 -29182 -15378 5055 23382 8484 -56547 44286 -11187 19793 -23781 -23452 62590
459 62590 -53231 52870 -74608 34948 69588 -121458 91574 -76692 83365 -7641
$$ packed form
376B0651m7727N4336m7524K2112J5529m1237M4714l9319L0385n601k7574L6433
388A5178j5709m36m003Q652n144J0924k2841J3219J7325m1665N3436n8963M0306
401A0279J4415o6230P6821o8839O7993m1345l3310R9020j03116P9568o8057L7283
413D482L8000j07636J27118j19555R6697k5724p9102J45098j54075J45968j03658
424c2387j8958J60361k02175J48317r1226L3927P6002j81932J77576q8168J5821
435b842L0729q9890J17566o9795J3666q098k509M8221m8721j3555K4115M8668
447D7555p6737J3804K0433J8327j4898o5031J00833n5473L0980m3574L29Q6042
459F2590j15821J06101j27478J09556L4640j91046K13032j68266J60057r1006
$$ plain form
469 -7641 -132641 187504 -125602 61865 -19723 -71742 174079 -173050 88929 -23586 -30923
480 -30923 121868 -170006 101350 -13129 1406 12972 -99859 143746 -62658 -19161 2511
491 2511 9005 64628 -108948 49206 7977 3006 7673 -65837 62254 8402 -22646 -20222
503 -20222 3017 44515 3824 -87916 43720 76608 -95666 40724 -51261 75784 21337
514 21337 -158338 170085 -95671 49279 14435 -145703 219021 -147108 49268 -8718
524 -8718 -72316 208016 -223763 81264 24860 -22565 64110 -179665 191536 -66567 -21100
535 -21100 27588 -82173 174609 -157108 49681 6517 -34456 129780 -195110 101199 32127
546 32127 -44357 28436 -107305 148961 -26295 -99762 64741 9948 13706 -30938 -40943
$$ packed form
469g641j25000L20145l13106J87467q1588n2019K45821l47129K61979j12515p337
480c0923J52791k91874K71356j14479J4535J1566j12831K43605k06404M3497K1672
491B511O494N5623j73576J58154m1229m971M667p3510J28091n3852l1048K424
503b0222K3239M1498m0691r1740J31636L2888j72274J36390r1985J27045n4447
514B1337j79675L28423k65756J44950l4844j60138L64724l66129J96376n7986
524h718o3598K80332m31779L05027n6404m7425Q6675k43775L71201k58103M5467
535b1100M8688j09761K56782l31717K06789m3164m0973J64236l24890K96309o9072
546C2127p6484P2793j35741K56266j75256p3467J64503n4793L758m4644j0005
$$ plain form
557 -40943 67393 25219 -88114 48084 -28114 49627 20685 -150638 148987 -31469 -9433
568 -9433 -15873 -63943 192442 -166947 26109 31143 -24725 101532 -196828 155446 -39958
579 -39958 -14594 62958 -177394 229093 -124542 2524 34579 -100179 229422 -238795 66814
590 66814 82532 -98868 116738 -184150 148134 12391 -112097 90926 -80102 99498
600 99498 -39947 -57943 54867 3835 19984 -68436 14802 51299 3838 -76368 19865 65446
612 65446 -35172 -18064 -30913 84191 -30382 -33110 14677 -9531 77622 -105901 43348
623 43348 -2714 9755 50753 -164170 167540 -52789 -24148 42458 -118408 216099 -176191
634 -176191 18711 88948 -121304 167047 -189322 94041 50561 -115441 125819 -151405
$$ packed form
557d0943J08336m2174j13333J36198p6198P7741k8942j71323K99625j80456K2036
568i433o440m8070K56385l59389J93056N034n5868J26257k98360L52274j95404
579c9958K5364P7552k40352M06487l53635J27066L2055j34758L29601m68217L05609
590F6814J5718j81400K15606l00888L32284j35743j24488K03023j71028J79600
600I9498j39445j7996J12810n1032J6149q8420Q3238L6497m7461q0206R6233M5581
612F5446j00618J7108j2849J15104j14573k728M7787k4208Q7153j83523J49249
623D3348m6062J2469M0998k14923L31710k20329K8641O6606j60866L34507l92290
634a76191J94902P0237k10252K88351l56369K83363m3480j66002K41260k77224
$$ plain form
644 -151405 129863 -10535 -92772 87450 -64914 98072 -91935 -6725 78124 -49600
654 -49600 24227 -61449 67072 -391 -39538 16303 -14930 49565 -38349 -11443 8952 28591
666 28591 -10556 -35116 21809 10725 26762 -81090 51492 19129 -38499 38073 -80454
677 -80454 108308 -52227 -31365 69220 -90457 120977 -101216 10803 66062 -86188
687 -86188 102726 -123663 79850 24154 -89376 88844 -89205 99554 -56299 -31704
697 -31704 82249 -82467 83793 -81144 31526 37565 -66983 67717 -75554 64402
707 64402 -7363 -45565 47872 -36205 46185 -44029 4467 26947 -17684 6619 -21668 31641
719 31641 -19559 12992 -19596 8458 23069 -41176 40908 -44705 42414 -7840 -40184 60408
$$ packed form
644a51405K81268j40398q2237J80222j52364J62986j90007Q5210Q4849j27724
654d9600P3827q5676J28521o7463l9147N5841l1233O4495q7914K6906K0395J9639
666B8591l9147k4560N6925j1084J6037j07852J32582l2363n7628P6572j18527
677h0454J88762j60535K0862J00585j59677K11434k22193J12019N5259j52250
687h6188J88914k26389K03513n5696j13530J78220j78049J88759j55853K4595
697c1704J13953j64716J66260j64937J12670O039j04548J34700j43271J39956
707F4402p1765l8202R3437q4077Q2390r0214M8496K2480m4631K4303k8287N3309
719C1641n1200L2551l2588K8054J4611o4245Q2084q5613Q7119n0254l2344J00592
$$ plain form
731 60408 -55972 52807 -42239 2315 46254 -68547 66495 -58014 36415 6249 -48700
742 -48700 68816 -70784 61621 -31200 -16248 53377 -66173 65340 -55497 25554 19178
753 19178 -52311 60906 -55870 42788 -17305 -15294 38293 -46688 46291 -36821 16980 6284
765 6284 -21786 32016 -39352 38218 -23753 3889 10842 -22621 33794 -38310 31617 -16309
777 -16309 -426 17608 -32969 40812 -37819 25580 -6691 -16095 36207 -45054 40802 -27205
789 -27205 8105 15459 -36562 45927 -41009 25713 -5852 -14138 31069 -40246 38269 -26444
801 -26444 9239 9752 -25751 35579 -37225 29642 -13733 -6209 24154 -34350 35201 -28421 14919
814 14919 3089 -20410 31140 -31618 25115 -13825 659 12822 -23602 28566 -25532 17107
$$ packed form
731F0408j16380J08779r5046M4554M3939j14801J35042j24509R4429l0166n4949
742d8700J17516j39600J32405r2821J4952O9625j19550J31513j20837Q1051o376
753A9178p1489J13217j16776R8658o0093K011N3587q4981R2979q3112N3801j0696
765F284k8070N3802p1368P7570o1971K7642O953l3463N6415p2104O9927m7926
777a6309J5883J8034n0577P3781p8631O3399l2271r404N2302q1261Q5856o8007
789b7205L5310P354n2021Q2489q6936O6722l1565q286M5207p1315P8515o4713
801b6444L5683N13l5503O1330p2804O6867m3375P524L0363n8504O9551o3622M3340
814A4919j1830k3499N1550o2758N6733l8940J4484J2163l6424N2168n4098M2639
$$ plain form
826 17107 -5634 -6524 19010 -27600 28759 -21551 8138 6604 -18637 25638 -27206 20930 -8303
839 -8303 -6221 17296 -22062 21893 -17364 9393 1434 -11912 18242 -19430 16867 -11720 3882
852 3882 6760 -16992 22430 -19774 12621 -3195 -6662 16203 -22671 20883 -10354 -1734 10510
865 10510 -14935 16773 -14434 6626 2998 -9944 11632 -9234 5690 -2909 401 2400 -5712
878 -5712 6212 -3176 734 -3020 4837 -1205 -4927 5960 -2752 2388 -5509 5019 273 -4896
892 -4896 6055 -6092 6054 -4821 2813 812 -8038 15123 -13489 3567 3722 -5222 11059
905 11059 -20218 17419 360 -16602 19490 -15944 12923 -3138 -13202 23803 -22486 13909
917 13909 351 -19077 28753 -19662 5125 1600 -9274 25768 -32108 13011 11513 -17769
$$ packed form
826A7107k2741q90K5534m6610N6359n0310K9689j534k5241M4275n2844M8136k9233
839h303K082K3517l9358M3955l9257K6757p959j3346L0154l7672L6297k8587J5602
852C882K878k3752L9422m2204L2395j5816l467K2865l8874M3554l1237Q620J2244
865A0510k5445L1708l1207K1060l628j2942K1576k0866J4924q599L310J999q112
878e712J1924r388L910l754P857o042l722J0887q712N140p897J0528m746n169
892d896J0951j2147J2146j0875P634k001q850K3161k8612J7056J55q944J6281
905A1059l1277L7637j7059j6962L6092l5434K8867j6061j0064L7005m6289L6395
917A3909j3558j9428M7830m8415K4787l525j0874L5042n7876M5119j498k9282
$$ plain form
929 -17769 15269 -20397 22587 -6202 -14002 21707 -23204 23878 -12937 -8393 19551 -20208
941 -20208 26176 -29631 6546 28553 -37108 21084 -13311 12932 8287 -38590 39490 -12705
953 -12705 -7430 16074 -27283 29419 -7870 -15603 18988 -19161 25374 -10855 -27843 43620
965 43620 -18024 -4316 771 -8149 38301 -44755 10496 19945 -23019 27730 -40184 28805 3633
978 3633 -22014 28461 -47055 55149 -18354 -29448 40369 -36272 54052 -57904 4471 59189
990 59189 -69830 49431 -41198 22779 30702 -74226 66204 -38092 17113 18255 -63724
1001 -63724 65882 -22638 -3219 1111 -22441 57980 -41806 -15231 33468 -8376 5218 -24409
1013 -24409 9586 27617 -28409 2699 285 2653 23493 -41374 14367 13148 -4681 9406
$$ packed form
929a7769L3038l5666M2984k8789p800L5709m4911M7082l6815M544K7944l9759
941b0208M6384n5807L6177K2007o5661N8192l4395K6243m645m6877P8080n2195
953a2705N275K3504m3357N6702l7289p733L4591l8149M4535l6229j6988P1463
965D3620o1644J3708N087q920M6450q3056N5251R449m2964N0749o7914O8989k5172
978C633k5647N0475p5516J02204p3503j1094O9817p6641R0324j11956O2375N4718
990E9189j29019J19261r0629O3977P923j04928J40430j04296N5205J142q1979
1001f3724J29606q8520J9419M330k3552Q0421r9786K6575M8699m1844J3594k9627
1013b4409L3995J8031n6026L1108k414K368K0840o4867N5741j219j7829J4087
$$ plain form
1025 9406 -52994 65602 -10269 -40688 38822 -39226 68097 -58462 -14176 73151 -75561
1036 -75561 67420 -60575 9999 66344 -93933 70997 -55751 35557 34574 -103659 91468
1047 91468 -33831 13678 -7104 -43989 91541 -64482 7675 6505 -7986 41183 -61722
1058 -61722 29818 3117 -1200 11403 -47896 44620 6746 -27108 2498 -3708 34317 -17980
$$ packed form
1025I406o2400J18596p5871l0419P9510p8048J07323j26559M4286Q7327j48712
1036g5561J42981j27995P0574N6345j60277J64930j26748R1308r83j38233J95127
1047I1468j25299M7509k0782l6885J35530j56023P2157j170j4491M9169j02905
1058f1722R1540k6701m317J2603n9299R2516l7874l3854K9606o206L8025n2297
$$ [...]
8191a87
##END NTUPLES=NMR FID
##END=
