##TITLE=1H_LR-754-P1
 CCl4
 8 sc, 
 21.10.2022
##JCAMPDX= 6.0         $$ Bruker NMR JCAMP-DX V2.0
##DATA TYPE= NMR FID
##DATA CLASS= NTUPLES
##ORIGIN= UXNMR, Bruker Analytische Messtechnik GmbH
##OWNER= root
$$ XWIN-NMR		Version 3.5
$$ Fri Oct 21 16:24:29 2022 Russian Standard Time (UT+4h)  she@DPX200
##.OBSERVE FREQUENCY= 200.1313499994
##.OBSERVE NUCLEUS= ^1H
##.DELAY= (6, 6)
##.ACQUISITION MODE= SIMULTANEOUS
##.ACQUISITION SCHEME= undefined
##.AVERAGES= 8
##.DIGITISER RES= 18
##SPECTROMETER/DATA SYSTEM= spect
##.PULSE SEQUENCE= zg30
##.SOLVENT NAME= CDCl3
##.SHIFT REFERENCE= (INTERNAL, CDCl3, 0, 15.7039)
##AUDIT TRAIL= $$ (NUMBER, WHEN, WHO, WHERE, WHAT)
$$ ##TITLE= Audit trail, XWIN-NMR		Version 3.5
$$ ##JCAMPDX= 5.01
$$ ##ORIGIN= Bruker BioSpin GmbH
$$ ##OWNER= she
$$ F:/spectra/data/she/nmr/H-F/1/audita.txt
$$ ##AUDIT TRAIL=  $$ (NUMBER, WHEN, WHO, WHERE, WHAT)
(   1,<2022-10-21 16:23:06.50 +0400>,<she>,<DPX200>,
      <created by zg, POWCHK disabled, PULCHK disabled
       configuration hash MD5:
       00 E9 B6 7A A2 85 ED C7 34 08 36 98 17 FE 4E 26
       data hash MD5: 16K
       2B A2 87 A6 34 AF 9F FA C3 27 3B F0 15 61 1A C5>)
$$ ##END=
$$ 
$$ hash MD5
$$ 5E 94 93 40 35 D8 0D 4A CA E3 8C 10 73 2C C1 7D
##$RELAX= 
##$RELAX= 
##$RELAX= 
##$RELAX= 
##$RELAX= 
##$RELAX= 
$$ Bruker specific parameters
$$ --------------------------
##$DU= <F:/spectra>
##$EXPNO= 1
##$NAME= <H-F>
##$PROCNO= 1
##$TYPE= <nmr>
##$USER= <she>
##$AMP= (0..31)
100 100 100 100 100 100 100 100 100 100 100 100 100 100 100 100 100 100 
100 100 100 100 100 100 100 100 100 100 100 100 100 100 
##$AQSEQ= 0
##$AQ_mod= 1
##$AUNM= <au_zg>
##$AUTOPOS= <>
##$BF1= 200.13
##$BF2= 200.13
##$BF3= 200.13
##$BF4= 200.13
##$BF5= 200.13
##$BF6= 200.13
##$BF7= 200.13
##$BF8= 200.13
##$BYTORDA= 1
##$CFDGTYP= 0
##$CFRGTYP= 5
##$CHEMSTR= <none>
##$CNST= (0..31)
1 1 145 1 1 1 1 1 1 1 1 1 1 1 1 1 1 1 1 1 1 1 1 1 1 1 1 1 1 1 1 1 
##$CPDPRG= <>
##$CPDPRG1= <>
##$CPDPRG2= <>
##$CPDPRG3= <>
##$CPDPRG4= <mlev>
##$CPDPRG5= <mlev>
##$CPDPRG6= <mlev>
##$CPDPRG7= <mlev>
##$CPDPRG8= <mlev>
##$CPDPRGB= <>
##$CPDPRGT= <>
##$D= (0..31)
0 1.2 0 0 0 0 0 0 0 0.06 0 0.03 0 0 0 0 0.0002 0 0 0 0 0 0 0 0 0 0 0 0 
0 0 0 
##$DATE= 1666354986
##$DBL= (0..7)
120 120 120 120 120 120 120 120 
##$DBP= (0..7)
150 150 150 150 150 150 150 150 
##$DBP07= 0
##$DBPNAM0= <>
##$DBPNAM1= <>
##$DBPNAM2= <>
##$DBPNAM3= <>
##$DBPNAM4= <>
##$DBPNAM5= <>
##$DBPNAM6= <>
##$DBPNAM7= <>
##$DBPOAL= (0..7)
0.5 0.5 0.5 0.5 0.5 0.5 0.5 0.5 
##$DBPOFFS= (0..7)
0 0 0 0 0 0 0 0 
##$DE= 6
##$DECBNUC= <off>
##$DECIM= 32
##$DECNUC= <off>
##$DECSTAT= 4
##$DIGMOD= 1
##$DIGTYP= 9
##$DL= (0..7)
0 120 120 120 120 120 120 120 
##$DP= (0..7)
150 150 150 150 150 150 150 150 
##$DP07= 0
##$DPNAME0= <>
##$DPNAME1= <>
##$DPNAME2= <>
##$DPNAME3= <>
##$DPNAME4= <>
##$DPNAME5= <>
##$DPNAME6= <>
##$DPNAME7= <>
##$DPOAL= (0..7)
0.5 0.5 0.5 0.5 0.5 0.5 0.5 0.5 
##$DPOFFS= (0..7)
0 0 0 0 0 0 0 0 
##$DQDMODE= 0
##$DR= 18
##$DS= 0
##$DSLIST= <SSSSSSSSSSSSSSS>
$$ [...]
##$SUBNAM2= <"">
##$SUBNAM3= <"">
##$SUBNAM4= <"">
##$SUBNAM5= <"">
##$SUBNAM6= <"">
##$SUBNAM7= <"">
##$SUBNAM8= <"">
##$SUBNAM9= <"">
##$SW= 18.0517283424941
##$SWIBOX= (0..15)
0 0 2 0 0 0 0 0 0 0 0 0 0 0 0 0 
##$SW_h= 3612.71676300578
##$TD= 16384
##$TD0= 1
##$TE= 0
##$TE2= 300
##$TE3= 300
##$TEG= 300
##$TL= (0..7)
0 120 120 120 120 120 120 120 
##$TP= (0..7)
150 150 150 150 150 150 150 150 
##$TP07= 0
##$TPNAME0= <>
##$TPNAME1= <>
##$TPNAME2= <>
##$TPNAME3= <>
##$TPNAME4= <>
##$TPNAME5= <>
##$TPNAME6= <>
##$TPNAME7= <>
##$TPOAL= (0..7)
0.5 0.5 0.5 0.5 0.5 0.5 0.5 0.5 
##$TPOFFS= (0..7)
0 0 0 0 0 0 0 0 
##$TUNHIN= 0
##$TUNHOUT= 0
##$TUNXOUT= 0
##$USERA1= <user>
##$USERA2= <user>
##$USERA3= <user>
##$USERA4= <user>
##$USERA5= <user>
##$V9= 5
##$VALIST= <valist>
##$VCLIST= <CCCCCCCCCCCCCCC>
##$VD= 0
##$VDLIST= <DDDDDDDDDDDDDDD>
##$VPLIST= <PPPPPPPPPPPPPPP>
##$VTLIST= <TTTTTTTTTTTTTTT>
##$WBST= 1024
##$WBSW= 4
##$XGAIN= (0..3)
0 0 0 0 
##$XL= 0
##$YL= 0
##$YMAX_a= 860006
##$YMIN_a= -788132
##$ZGOPTNS= <>
##$ZL1= 120
##$ZL2= 120
##$ZL3= 120
##$ZL4= 120
##$ABSF1= 10
##$ABSF2= 0
##$ABSG= 5
##$ABSL= 3
##$ALPHA= 0
##$AQORDER= 0
##$ASSFAC= 0
##$ASSFACI= 0
##$ASSFACX= 0
##$ASSWID= 0
##$AUNMP= <proc_1d>
##$AZFE= 0.1
##$AZFW= 0.1
##$BCFW= 1
##$BC_mod= 2
##$BYTORDP= 1
##$COROFFS= 0
##$CY= 11.3945322036743
##$DATMOD= 1
##$DC= 2
##$DFILT= <>
##$DTYPP= 0
##$F1P= 2.36226072786647
##$F2P= -0.459571619588291
##$FCOR= 0.5
##$FTSIZE= 0
##$FT_mod= 4
##$GAMMA= 1
##$GB= 0.15
##$INTBC= 1
##$INTSCL= 1
##$ISEN= 128
##$LB= 0.24
##$LEV0= 0
##$LPBIN= 0
##$MAXI= 10000
##$MC2= 0
##$MEAN= 0
##$ME_mod= 0
##$MI= 1.114404
##$NCOEF= 0
##$NC_proc= 0
##$NLEV= 6
##$NOISF1= 3.799351
##$NOISF2= 2.8
##$NSP= 1
##$NTH_PI= 0
##$NZP= 0
##$OFFSET= 15.70392
##$PC= 1
##$PHC0= -18030.58
##$PHC1= 8.6007
##$PH_mod= 1
##$PKNL= yes
##$PPARMOD= 0
##$PSCAL= 0
##$PSIGN= 0
##$REVERSE= no
##$SF= 200.130013532006
##$SI= 16384
##$SIGF1= 3
##$SIGF2= 2
##$SINO= 400
##$SIOLD= 16384
##$SREGLST= <1H.CDCl3>
##$SSB= 0
##$STSI= 0
##$STSR= 0
##$SW_p= 3612.71676300578
##$SYMM= 0
##$S_DEV= 0
##$TDeff= 0
##$TDoff= 0
##$TI= <>
##$TILT= no
##$TM1= 0
##$TM2= 0
##$TOPLEV= 0
##$USERP1= <user>
##$USERP2= <user>
##$USERP3= <user>
##$USERP4= <user>
##$USERP5= <user>
##$WDW= 1
##$XDIM= 8192
##$YMAX_p= 0
##$YMIN_p= 0
$$ End of Bruker specific parameters
$$ ---------------------------------
##NTUPLES= NMR FID
##VAR_NAME=  TIME,          FID/REAL,        FID/IMAG
##SYMBOL=    X,             R,               I
##VAR_TYPE=  INDEPENDENT,   DEPENDENT,       DEPENDENT
##VAR_FORM=  AFFN,          ASDF,            ASDF
##VAR_DIM=   8192,          8192,            8192
##UNITS=     SECONDS,       ARBITRARY UNITS, ARBITRARY UNITS
##FACTOR=    0.0002768,     1,               1
##FIRST=     0,             0,               0
##LAST=      2.2672688,     0,               0
##MIN=       0,             -788132,         0
##MAX=       2.2672688,     860006,          0
$$ Real data points
##PAGE= N=1
##DATA TABLE= (X++(R..R)), XYDATA
0 0 0 0 0 0 0 0 0 8 -8 16 -22 26 -33 48 -57 73 -93 113 -144 174 -209 253 -303 358 -420 494 -575 670
28 670 -772 890 -1021 1166 -1328 1506 -1706 1924 -2166 2431 -2724 3041 -3390 3771 -4189 4642
44 4642 -5137 5679 -6271 6917 -7624 8398 -9249 10181 -11215 12358 -13631 15056 -16666
57 -16666 18497 -20598 23042 -25924 29379 -33615 38944 -45889 55365 -69179 91563 -136489
69 -136489 410095 -773051 -36646 324401 -259183 571945 -788132 316939 166097 -43293
79 -43293 -52272 -357512 566092 -164271 -127850 8796 -141353 540477 -374805 -253649 334965
90 334965 132184 -219903 -128295 177220 58204 -3928 -177486 -5883 242519 -26627
100 -26627 -254725 95179 148471 -94626 112924 -370638 305073 238272 -558802 323899
110 323899 -76131 123824 -61700 -283845 474131 -329122 188249 -131459 -114299 452133
120 452133 -498915 292463 -131882 -16956 301861 -504479 363654 -79143 -17578 16180
130 16180 -178687 389627 -348654 107938 65676 -132762 209362 -259817 183597 -32848
140 -32848 -75692 131400 -170809 143872 -18559 -84286 58069 -4949 34020 -38264 -73563
151 -73563 133584 8530 -186401 173696 -43431 -8701 21270 -121613 215532 -163993
161 -163993 59810 -8385 -90992 256261 -285605 128001 4191 -45355 159531 -317017
171 -317017 265864 -21342 -104597 54940 -88998 235064 -241031 84695 24740 -84003
181 -84003 211957 -286715 156331 24920 -72352 94321 -194036 204039 -36509 -84609
191 -84609 28567 -7194 129482 -171482 30486 76421 -46015 29067 -56386 8986 60692
202 60692 -4258 -94305 65065 19455 -8344 -9352 -87060 154555 -51863 -61483 31167 7378
214 7378 70601 -133913 82633 -16901 -8375 68963 -149249 130875 -36108 -4587 3148 -70118
226 -70118 152771 -122101 29467 -3070 -2288 80931 -158121 130665 -41739 -26573 75367
237 75367 -107769 90707 -37159 9885 -8559 -27369 80743 -72489 21253 -9246 23917
248 23917 4981 -52688 54935 -25677 11314 -13123 11124 -2401 -16115 45781 -65130 41579
260 41579 5880 -23839 13248 -21887 48139 -45911 16483 4181 -11402 22892 -41057 55988
272 55988 -49557 12151 35397 -58432 45346 -22655 20166 -24441 -1028 43800 -59256
283 -59256 43314 -21923 4427 12015 -30115 45736 -45190 20135 10170 -20662 12090 -8397
295 -8397 26874 -45077 27027 15977 -36989 26742 -14004 13728 -16090 6987 12744 -25257
307 -25257 19839 -10747 12102 -16118 5635 20487 -40779 28897 3211 -15252 2323 5110
319 5110 8683 -25141 22970 -2915 -11809 9936 -5690 10818 -15372 10427 5662 -18294 10968
332 10968 7501 -5760 -14771 21097 -753 -22290 22613 -4166 -8248 2353 3027 4456 -12756
345 -12756 10058 2521 -12569 7388 6397 -4164 -11970 11689 9600 -24283 13237 9700 -19534
358 -19534 8849 2372 -712 -3912 1156 7377 -12477 6629 3482 -2305 -7352 2229 16402 -24801
372 -24801 10856 11370 -20050 8790 3525 864 -11773 10162 4880 -15049 11036 -2964 4224
385 4224 -6158 -3548 13445 -9003 -3016 8072 -2500 -14048 26784 -13478 -19440 35992 -21950
398 -21950 5043 -5372 3964 15949 -32730 26739 -16833 14763 743 -30170 44248 -37651
410 -37651 27317 -3824 -36877 54426 -24967 -2829 -11459 26298 1959 -39339 41065 -32235
422 -32235 33928 -12506 -36785 58205 -35671 17765 -13418 -12053 40310 -25424 -1545 -15373
434 -15373 39147 -5621 -45895 39123 44 -6470 -2183 -8873 6040 26942 -31214 -13800 42819
447 42819 -29633 23243 -28585 -5475 57486 -51749 5139 -1231 30716 -16509 -35064 54896
459 54896 -44563 40650 -24213 -23016 55309 -43940 33523 -45351 32271 19249 -54536 52396
471 52396 -55003 65743 -31489 -44442 92951 -82637 45262 -9533 -23327 44833 -48064
482 -48064 42963 -34816 11279 22487 -39653 31035 -14950 8400 -7046 4312 3941 -9690
494 -9690 6817 -6550 27312 -46434 21155 30965 -43640 12216 987 18009 -24924 10226
506 10226 -3886 -4410 37230 -56334 29766 -6775 16799 -2508 -57317 80383 -39823 21326
518 21326 -40089 -1740 106746 -143056 72392 3872 -41238 85353 -110085 56916 10453
529 10453 -6610 -4669 -53655 95785 -45467 -461 -24881 13596 80962 -115498 27458
540 27458 37945 -4132 -15244 -29443 42794 -16438 36807 -62679 -7302 95307 -65697 -12262
552 -12262 6968 18768 28842 -52752 -27896 79282 1141 -86003 60687 -11533 8636 14418
564 14418 -65669 54376 -4427 21181 -60067 2814 91776 -92294 40896 -41453 35702
575 35702 56836 -132732 86448 -4359 -5984 -3717 -27623 52625 -49766 68191 -82248
586 -82248 13340 92804 -116455 69551 -44108 25941 42166 -103702 77550 -16471 3113
597 3113 -10851 -13470 45342 -51497 44141 -23226 -23717 54739 -25213 -19807 16813 12824 -18999
610 -18999 14941 -24373 20198 15433 -46152 47662 -30548 2930 22719 -19109 -2990 -9623
622 -9623 54915 -62106 13621 25204 -30506 44794 -68191 54981 -12594 -16530 42248 -81432
634 -81432 87618 -42253 3077 13653 -64421 129500 -107351 3202 59714 -52118 59412
645 59412 -85627 51590 20541 -43219 33114 -52598 59375 -8356 -28017 3196 830 49937
657 49937 -55413 -9873 31115 20873 -28800 -32869 49717 -1615 -9690 -21858 12515 21072
669 21072 -7126 -13298 -22847 52744 -13400 -18320 -12916 19411 46137 -81648 30550 9760
681 9760 7666 3297 -67296 88995 -42107 3714 14296 -57425 91244 -55856 1664 2567
693 2567 -3213 53928 -89089 47815 2694 -2923 8238 -55290 78411 -39938 -3470 15806
705 15806 -27324 41853 -31476 11682 -16029 17289 18524 -51253 35022 -3677 2081 -5328 -12563
718 -12563 23131 -5670 -6354 -5862 19912 -21084 15518 2700 -32054 42644 -20784 948 -6560
731 -6560 8633 16552 -41323 40120 -27441 14936 8156 -36850 49552 -43678 27656 731 -31144
744 -31144 38207 -24324 21151 -33036 24700 13919 -46106 48338 -35963 20009 4255 -25317
756 -25317 30433 -27566 26408 -15677 -3623 11617 -8407 18190 -38147 33126 215 -23938
768 -23938 19285 -9932 12272 -14455 11555 -8558 -135 16937 -25881 19290 -12992 12346
780 12346 -1155 -20428 27576 -14046 6086 -14647 16392 3555 -26478 34269 -28248 13366
792 13366 5736 -16626 16698 -18422 23877 -18680 -60 14438 -14429 14114 -23228 25246
804 25246 -6497 -15639 22006 -17392 12118 -10238 9684 -5290 -7954 23646 -26887 14797
816 14797 -2088 -2003 4891 -16783 24569 -16147 715 4011 -1923 5098 -14694 20451 -16261
829 -16261 2985 10257 -13914 10250 -8090 12705 -13288 1009 14869 -17050 9847 -8196
841 -8196 10747 -5137 -8852 18635 -17092 7958 -1213 -477 746 -5297 14444 -18146 8697
854 8697 5232 -7138 1988 -5971 15665 -14947 2040 8695 -10411 8562 -8115 8647 -5944
867 -5944 -2487 12372 -15770 7841 2888 -3230 -1752 -2551 11238 -8597 -2489 7268 -3428 -2190
881 -2190 3551 -203 -4018 4454 119 -1799 -4006 7945 1983 -12885 9021 1212 -829 -3985
895 -3985 -1207 10517 -11641 5725 158 -6221 10324 -6547 1945 -5409 8349 4022 -19555
908 -19555 15906 -1799 -975 -367 -10874 22028 -14638 -1260 10462 -14577 19003 -13450 -1164
921 -1164 9875 -10574 17835 -25520 9919 18383 -28284 17436 -11114 8322 8059 -27310 25782
934 25782 -9597 -773 4862 -13831 20462 -14197 5901 -3665 -5590 24423 -29006 9518 9508
947 9508 -11500 11805 -18043 15866 2249 -15611 13498 -9199 11437 -7001 -10098 22083
959 22083 -19159 11081 -856 -17896 35596 -28865 -637 22472 -25083 25001 -25379 7778
971 7778 23210 -36199 25940 -19159 16877 4972 -37892 46519 -28446 13378 -30 -30112
983 -30112 55450 -40127 5185 5283 -6562 31803 -51598 30089 1725 -6373 13597 -45395 55390
996 55390 -15067 -21730 20847 -24506 47018 -33266 -19760 40407 -16643 13433 -30440 5368
1008 5368 43632 -41686 1529 5182 3735 25573 -52275 15612 32618 -25520 9793 -35067
1020 -35067 39766 18045 -58307 32552 -12910 32358 -16674 -48839 70786 -28704 8366 -20720
1032 -20720 -8629 65829 -61661 16784 -13162 21348 31518 -90285 65669 -7437 -4129
1043 -4129 10744 -62566 88219 -31482 -27269 23863 -19446 53343 -54897 -455 32580 -17073
1055 -17073 23896 -53452 26708 40851 -52949 10849 2623 8739 15507 -47528 20870 28720 -26984
1068 -26984 648 -10128 27800 -5571 -23744 20284 -19756 42536 -37074 -19769 64538 -53630
1080 -53630 28634 -21591 -835 49129 -71324 44544 -15237 8123 10888 -55502 79502
1091 79502 -56169 14865 19312 -55969 83341 -64072 5720 34166 -36441 37553 -47814
1102 -47814 29603 14177 -32074 17077 -17429 37003 -24043 -21748 40587 -17332 2104 -5486
1114 -5486 -9804 30445 -11983 -21853 16672 4765 8553 -26400 -3456 39739 -25046 -62 -16709
1127 -16709 25055 23779 -66930 44833 -7733 3989 11473 -58323 70686 -26083 -4942 4463
1139 4463 -31941 77649 -62569 -204 22561 -10623 36755 -74496 45351 16746 -28014
1150 -28014 15639 -38878 58064 -19708 -22968 19599 -15868 41476 -38170 -11447 30600 -208
1162 -208 -3378 -31286 27711 17218 -24963 -6336 6939 15817 -3095 -25456 9966 23407 -21133
1175 -21133 7330 -16172 11221 30662 -50209 18984 5333 6918 -2005 -35448 50054 -23970
1187 -23970 3974 -1473 -18784 50207 -48863 19107 747 -14324 38072 -47854 23321 -778
1199 -778 2973 1980 -31148 47453 -28990 4983 5388 -17162 33591 -32445 13494 833 -7920
1212 -7920 16595 -19293 9152 -3412 9349 -7559 -9039 17879 -8402 -721 -2041 7384 -6888
1225 -6888 4317 -4 -8424 14467 -14529 14656 -11995 -2008 19956 -23402 15439 -11776 10970
1238 10970 -898 -15549 26160 -28269 21858 -5827 -12650 20262 -20276 23822 -23104 5798
1250 5798 15923 -21658 17125 -19625 20756 -7110 -11530 20362 -21006 19707 -11154 -819
1262 -819 5544 -6265 15100 -23766 15619 1890 -6429 3561 -9582 18963 -14694 2734 1695
1275 1695 -1880 6168 -10948 11372 -12427 12199 -1545 -13231 15172 -8697 9738 -15290
1287 -15290 8107 8652 -16595 14571 -13715 13982 -5910 -6389 14455 -18187 17444 -9124 -2232
1300 -2232 5042 -3377 9508 -19830 17748 -4297 -6231 7977 -10375 15427 -15082 7603 1480
1313 1480 -8495 12686 -12509 10186 -9115 6565 4794 -17418 18416 -8430 1280 -1820 910
1326 910 5952 -12028 12297 -8511 4723 -401 -3981 8614 -13959 15171 -7052 -3954 8386
1339 8386 -5628 6630 -12599 13508 -3661 -8465 12405 -9780 7264 -6301 4276 730
1351 730 -7022 10797 -8778 5022 -4234 4717 513 -11547 16718 -10296 1202 1854 -1859 5205
1365 5205 -10983 12324 -7268 -1301 7753 -8762 5013 -4596 6794 -4242 -4323 9011 -4696
1378 -4696 1052 -4573 8005 -3372 -5858 9743 -6930 2742 -1579 2480 -2324 -2302 10089 -11120
1392 -11120 3248 3235 -1688 -269 -4518 8567 -4785 -656 328 1603 726 -6408 10349 -10202
1406 -10202 3033 7585 -11014 5276 -703 5435 -7788 -1166 11075 -10167 4593 -3539 1717
1419 1717 4707 -10725 8589 -3013 -2250 6321 -5137 -1673 4012 4386 -9804 1766 8478 -6699
1433 -6699 -850 994 1945 540 -4388 1829 2080 -1103 334 -372 -1738 2482 2209 -4235 -3478 9563
1449 9563 -1375 -11700 11539 -767 -5010 4407 -5999 7816 -3630 -3391 6788 -6437 4796
1462 4796 -1849 -1576 1721 -1545 6467 -10237 4646 7654 -11771 5384 1290 -1457 -510 -911 4554
1477 4554 -5359 2499 119 -596 2836 -7150 8681 -4312 -3605 10552 -11604 5983 2690 -7226
1491 -7226 5163 -4879 8916 -7288 -4150 13540 -10881 4407 -2502 -604 9461 -13602 7614
1504 7614 239 -3170 7584 -10561 4891 2612 -1323 -2170 -5079 12757 -4853 -7482 5042 2118
1518 2118 2836 -9099 2506 5955 -4619 2910 -6825 3876 7631 -10427 3189 -1478 4424 4304
1532 4304 -17304 12056 3532 -6298 1873 -7728 15952 -9175 -4118 9018 -12157 18549 -13727
1545 -13727 -5241 16806 -12799 10257 -12602 2992 13182 -14583 5740 -5942 11209 -4423
1557 -4423 -10151 14808 -13507 12583 -5288 -10975 18149 -10032 3656 -4916 -110 10878 -11727
1570 -11727 4211 -2861 3738 4338 -13636 10934 -1330 -4568 10012 -14313 6469 9477 -14952
1583 -14952 8109 -2691 1952 5223 -13918 11867 -4417 1649 2003 -11800 17776 -11854 4454
1596 4454 993 -12030 23202 -19195 4048 4333 -6311 13857 -21579 15285 -2876 -4425 11745
1609 11745 -21905 21203 -7610 -3661 8356 -16555 23613 -14841 -3872 11445 -10079 13431
1621 13431 -14788 3314 9661 -10790 7680 -8019 2587 8116 -9339 420 983 3730 1493
1634 1493 -10966 7242 4686 -7611 4575 -7512 9253 1049 -11726 11962 -10381 10397
1646 10397 -1475 -12416 16226 -9723 9816 -12138 523 18456 -23618 16386 -10458 2527
1658 2527 13292 -24453 20845 -12101 4805 7588 -20395 20704 -10500 5699 -3387 -8000 21327
1671 21327 -19242 6557 1931 -5756 11075 -12611 5772 -499 -860 4685 -8702 4043 3594
1684 3594 -1822 -2634 -943 5188 302 -8212 5629 1365 -4156 7000 -10207 6362 1886 -4642
1698 -4642 5641 -12473 16125 -6033 -7860 10814 -9831 14647 -15179 2405 11162 -15521
1710 -15521 15711 -15051 6374 6040 -10357 10999 -16826 17722 -3179 -12639 13933 -9513
1722 -9513 11784 -10955 -925 11948 -10989 7453 -8104 3805 4208 -5605 2668 -6158 9317
1735 9317 -793 -8289 2975 5690 -1692 -5653 3627 409 3424 -6398 852 4396 -4002 5896
1749 5896 -9352 5242 2967 -3029 1357 -8261 15526 -8695 -3699 7702 -6393 9632 -12274
1762 -12274 6271 1504 -5515 10405 -14509 10498 -1690 -2363 3878 -10866 16487 -9540 -2554
1775 -2554 6416 -4038 6265 -9468 7201 -1471 -1935 4942 -7247 5656 -2794 3150 -3472 -2272
1789 -2272 7867 -5964 1764 -2718 5412 -2345 -4143 7338 -6724 5515 -2544 -646 1061 -2112
1803 -2112 7033 -9541 5341 619 -1043 967 -6030 11443 -9221 1834 3899 -5448 6623
1816 6623 -6184 5804 -4574 1337 5816 -10061 7698 -3265 2267 -1579 -2970 8206 -7928
1829 -7928 3707 -1174 1067 -393 -2543 6888 -9833 7495 -28 -5388 5130 -3584 5406 -7066
1843 -7066 3141 3502 -5363 3924 -3458 5404 -4712 781 4140 -6367 5001 -2193 1336 -3717
1857 -3717 3456 2625 -9058 9440 -4708 730 612 -2839 7216 -9011 5840 -409 -3167 3427
1871 3427 -2966 4627 -7000 5749 874 -6844 6754 -3079 2042 -4174 3595 1724 -7201 7218
1885 7218 -4621 2389 -1441 -1119 5531 -8573 6297 -145 -4659 3863 -432 -298 -3595 4599 -477
1900 -477 -3289 2048 1374 -832 -3152 4815 -2787 102 1394 -1215 2540 -5765 7380 -3419 -4217
1915 -4217 7962 -5455 2218 -3106 4412 -164 -6512 9141 -6822 2389 -86 -1038 3900 -8376
1929 -8376 10232 -5507 -2354 7377 -6651 5623 -6598 5111 1695 -9406 11540 -6794 -715
1942 -715 4325 -3852 3840 -5852 5102 1663 -8029 6913 -443 -2569 1652 -1817 3507 -3234 -699
1957 -699 4895 -6855 4650 2018 -6519 4394 -1340 3243 -5616 -372 9209 -10631 4474 -682
1971 -682 248 4260 -10168 10812 -6464 150 7805 -13598 11306 -3346 252 689 -7968 16966
1985 16966 -13604 -588 8895 -8272 9132 -11257 5735 5447 -11381 11443 -9617 3300
1997 3300 6963 -10924 5846 -3726 6592 -2259 -10205 14354 -5500 -1704 728 -3031 10309
2010 10309 -11394 3761 3841 -7691 11176 -10105 1215 6060 -6107 6051 -11020 9912 3155
2023 3155 -14070 12436 -6891 5614 -1131 -9368 16575 -13307 4464 3755 -11495 15394 -10665
2036 -10665 2097 2504 -5860 12071 -15847 8025 4582 -10616 10235 -10349 9554 -2339 -9245
2049 -9245 15815 -13189 6079 989 -7368 11273 -10839 7903 -3520 -3577 12354 -16082 10091
2062 10091 -260 -5230 7910 -12841 14647 -5258 -9053 14012 -10726 7877 -4210 -4087 11558
2075 11558 -11751 7843 -4366 -2706 12969 -14399 5560 1292 -1659 5938 -14760 12685 1565
2088 1565 -9928 7898 -7532 10061 -3871 -8038 11374 -8193 9018 -7711 -5156 15814
2100 15814 -11429 4122 -6206 3683 11521 -20578 11023 -380 -441 4842 -15461 16771 -4667
2113 -4667 -3276 4142 -10552 17305 -9609 -5041 7095 -3930 10045 -15460 3249 11364 -10523
2126 -10523 3942 -6080 6355 4508 -11669 5816 -1360 3658 392 -10147 9456 908 -2705
2139 -2705 -1211 -3846 12267 -7340 -5737 8779 -4827 5800 -7007 -1307 9539 -9126 6325
2152 6325 -6596 2317 8311 -12848 8071 -4600 4336 2330 -12861 15136 -7162 240 2970
2165 2970 -7052 10658 -9324 4522 -37 -4754 9917 -10117 4795 -272 -2433 5263 -8374
2178 -8374 7026 -1225 -3755 4822 -3550 2049 -1029 410 1021 -3684 3537 449 -3126 2378 -581
2193 -581 469 1275 -3934 3958 -1730 -648 3198 -6764 6048 -1018 -2161 1602 -3216 8415 -8000
2208 -8000 729 4931 -5501 6041 -7743 4752 1445 -4263 5890 -8160 7652 -1085 -4133
2221 -4133 3572 -3938 8209 -7872 -406 6454 -4908 3200 -4738 3748 821 -2870 2449 -3730
2235 -3730 4869 -790 -2460 519 1069 2439 -4517 -131 2398 1756 -4163 350 3584 -2583 1864
2250 1864 -3053 1658 1364 -1388 351 -3685 6187 -2883 -1285 1532 -1299 5943 -7831 2923 2514
2265 2514 -3454 3401 -4512 4615 -2513 929 956 -5374 8041 -4823 105 1084 -1425 4485 -6189
2280 -6189 2867 272 174 -271 -1610 3878 -4658 3843 -2138 -2340 4997 -3579 1496 -2096 2217 477
2296 477 -3056 2851 -1985 2982 -3065 906 1706 -3153 3812 -3159 850 -152 1395 -900 -3192
2311 -3192 5880 -4781 1752 -136 -1860 4547 -5452 4231 -1763 -945 3221 -3094 2224 -2401 3417
2326 3417 -2398 -1958 4500 -4164 2672 -2039 1511 -91 -2211 3599 -3715 3053 -1812 438 829
2341 829 -3667 5796 -4811 717 2391 -2571 1335 -2201 3076 -2410 727 1073 -2180 2714 -2865
2356 -2865 2893 -2117 -244 3244 -4039 2594 -1314 1853 -1931 -993 4148 -5205 3249 -639 -631 1306
2372 1306 -2181 3096 -3198 1476 -105 -767 868 -1967 3730 -4380 1897 1675 -3862 3364 -1846
2387 -1846 2365 -2391 251 2463 -3829 3353 -1900 807 -193 -1091 2689 -3613 2442 -335 -859
2402 -859 -77 493 2069 -4442 3370 -224 -1429 1239 -1732 2920 -2669 1614 286 -2053 2349 -1294
2418 -1294 917 -1799 2258 184 -3059 2696 -459 776 -2566 2045 930 -3374 4022 -3037 1295
2433 1295 -129 -1134 2363 -4117 4751 -1370 -2493 3168 -1330 1431 -3097 2542 1016 -3422 2428
2448 2428 -1244 1198 -1299 614 679 -2436 3249 -1800 -544 1176 -45 204 -2481 3129 -184 -2382
2464 -2382 1460 1081 -1124 -889 1104 70 -449 -605 1431 -1615 -611 2750 -3663 1635 861 -1311
2480 -1311 679 -2069 4299 -3228 -1452 3874 -2742 1361 -2375 2123 507 -3041 4084 -3402 1937
2495 1937 556 -2259 1883 -2052 4079 -3657 -1556 5393 -3512 740 -1266 1985 1658 -5087 4025
2510 4025 -485 -750 1746 -3240 2821 -558 -474 525 -3207 5268 -1287 -4088 3847 -290 379 -2607
2526 -2607 -128 4426 -3932 1074 -337 -346 3210 -4219 1851 -353 568 2557 -6613 5065 1188 -3469
2542 -3469 1213 -2231 5658 -4138 -1427 4327 -3953 4271 -3987 68 3832 -4532 4288 -4705 1218
2557 1218 4843 -6877 3270 -831 1405 2 -5071 7156 -3157 -513 2557 -4148 5657 -3517
2571 -3517 401 1581 -3693 6124 -5336 124 4003 -3820 3103 -3876 3579 1056 -5829 6108
2585 6108 -3613 1359 821 -3961 5304 -4878 2555 422 -4698 7037 -5195 850 1974 -3417
2599 -3417 4820 -5757 3536 2053 -5891 5291 -3226 1990 51 -3513 6529 -5580 2737 777
2613 777 -4862 7333 -5455 1406 1552 -2634 5544 -7300 3754 2175 -4203 3824 -5196 6188
2627 6188 -2070 -4486 6996 -6224 5176 -1580 -4415 7127 -4761 2734 -2920 40 6431 -7467
2641 -7467 2859 -230 736 2481 -7826 6735 -345 -3203 3432 -5080 5514 -39 -4376 3235
2655 3235 -1802 4061 -4213 -2538 6758 -3829 1463 -2583 367 6381 -7515 3012 416 -1404
2669 -1404 4360 -7317 4333 840 -1023 1707 -6226 8662 -2846 -3895 4184 -3768 6254 -5426
2683 -5426 -1243 5727 -5073 4177 -4165 1389 3761 -4845 3280 -3930 3582 1707 -6822 5332
2697 5332 -944 234 52 -2743 4703 -2259 -42 543 -1397 3883 -3065 -401 2011 -1867 3425
2712 3425 -3877 -321 4964 -4338 1274 -328 37 1822 -3705 3155 -1968 625 2083 -4796 4837
2727 4837 -2458 489 2057 -4898 6019 -2833 -940 2398 -2220 2849 -3482 2810 -672 -1835 4181
2742 4181 -4800 2580 287 -1848 2763 -3588 2588 143 -1964 1584 -538 1047 -928 516 287
2757 287 -1656 2335 -825 -1412 2417 -793 -772 950 -1003 1683 -520 -1281 2294 -1451 927 -411
2773 -411 -596 1197 -1084 1957 -2902 1416 2264 -3676 2365 -1061 1278 -98 -1759 2885 -1933 1581
2789 1581 -1055 -336 2080 -2447 2569 -2174 466 2327 -3250 1467 -99 699 -772 -819 1575 -1127
2805 -1127 822 -482 -151 524 -623 422 -970 963 -206 72 -1062 637 1306 -2281 1440 -146
2821 -146 -243 179 -760 1012 -1115 904 -760 -570 1143 -1164 1299 -1655 1371 531 -1891 1808 -1214
2838 -1214 1123 -963 104 1085 -1790 1918 -1193 83 657 -871 1307 -1620 1037 -217 -798 741
2854 741 -489 774 -1212 1501 -473 -345 1248 -1205 1078 -656 607 138 -767 1466 -1020 280
2870 280 -13 485 273 -997 1545 -1062 304 -137 188 320 -1112 1326 -1403 784 -103 -915 1105
2887 1105 -1821 2169 -1293 -718 2116 -1901 1223 -1020 531 -65 -1260 1548 -1658 1159 -414
2902 -414 -294 741 -953 1535 -1253 35 746 -833 185 -703 1122 -924 -319 1060 -980 809
2918 809 -192 -318 21 360 18 -435 -53 194 902 -1729 1050 493 -967 933 -1017 1224 -691
2935 -691 -67 985 -2014 2526 -1567 -237 894 -1330 2408 -3107 1110 999 -1779 1636 -1528 1867
2951 1867 -1108 63 1464 -2501 2976 -1379 -647 1360 -1827 1997 -2071 251 1581 -2105 975
2966 975 -301 365 198 -960 1538 -1007 100 1084 -1894 1090 643 -1221 952 -1113 1079 128
2982 128 -2033 2376 -1226 493 122 -1045 1758 -2644 2378 -776 -1062 3185 -3429 2186 -913 -656
2998 -656 2256 -3844 3685 -1384 -683 2291 -2753 3206 -2635 1072 1670 -3622 3848 -2465 108 1625
3014 1625 -2256 2536 -2111 1112 959 -2313 2719 -1695 185 560 -1242 2385 -2426 443 1919
3029 1919 -2509 2222 -1039 -38 1470 -2074 2330 -2025 494 1872 -3283 2811 -1143 262 911
3044 911 -3087 4355 -2556 103 2127 -2862 3701 -3245 1090 1099 -2856 3992 -3862 1544 1781 -3014
3060 -3014 2704 -3057 2854 -114 -2955 4040 -2997 1799 -130 -1831 3301 -3281 1724 -110 -1881
3075 -1881 3348 -2739 683 298 -571 1920 -3424 2513 390 -2257 2738 -2655 1941 423 -1887
3090 -1887 2967 -2775 1818 668 -2264 3184 -2337 1649 -1077 -896 3445 -4217 2486 169 -2170
3105 -2170 3144 -3387 2229 -470 -1367 2848 -3347 2325 -623 -581 1778 -3134 3522 -1751 -808 3265
3121 3265 -3632 2556 -440 -1101 1704 -1981 2430 -1462 -376 1854 -2084 2006 -1643 409 1503
3136 1503 -2885 3043 -1504 -620 2631 -2533 1206 -506 427 930 -2412 2720 -1246 -272 858 -1830
3152 -1830 3101 -1731 -285 1547 -2467 2734 -1535 -838 2208 -1434 1285 -2026 1112 1323 -2798
3167 -2798 1854 -1138 766 825 -2562 2460 -1318 359 447 -2199 2674 -1037 -190 -389 -481 2871 -3054
3184 -3054 636 983 -1329 1578 -2024 1108 672 -1065 892 -1713 1786 166 -1614 1170 -785
3199 -785 1817 -1000 -1085 2452 -1369 -70 296 -455 952 -577 -3 -584 191 907 -1600 836 654
3216 654 -392 631 -1296 1524 535 -1604 1143 -517 423 70 -936 584 -1026 1334 -904 -648
3232 -648 1938 -1501 533 -626 -35 1300 -1588 1011 33 -154 362 -874 782 -805 1245 -275
3248 -275 -1406 2069 -575 -298 -186 -189 838 -965 2 430 258 135 -525 398 -402 127 151 -1236 780
3267 780 540 -1188 0 962 -115 107 -307 290 332 -166 168 -458 507 -30 -110 -53 -289 1461 -1090
3286 -1090 -720 1159 -736 55 -551 649 46 -542 654 -1143 806 -241 -489 362 -589 1480 -982
3303 -982 -908 1309 -313 -254 -228 949 -442 -488 318 -711 599 -438 -93 53 -21 487 -526 37 59
3322 59 449 -725 -281 1053 -497 8 81 118 -268 112 343 -935 826 -395 -16 379 -659 1337
3340 1337 -1072 30 735 -556 465 -529 717 -514 288 676 -894 993 -123 73 -136 -248 634
3357 634 -948 701 -115 219 26 -287 1191 -1006 562 215 -375 279 -352 387 -608 267 217 -618 404
3376 404 -232 124 -409 203 404 -742 353 -249 717 -500 27 720 -1039 1009 -496 -325 46 -86
3394 -86 440 -806 949 -270 -40 92 -508 707 -1006 567 -72 -178 461 -821 795 -676 213
3411 213 57 -1268 1042 -653 -81 -51 -205 567 -1085 588 -100 7 342 -451 371 -500 257 -348 -166
3430 -166 546 -322 120 -204 772 2 -457 520 -257 35 -224 50 -344 59 101 -126 550 -875 489 -351
3450 -351 -397 709 -776 720 -612 395 186 -712 1572 -1538 360 538 -1129 1363 -1151 623
3466 623 -237 -838 507 -931 943 -671 66 632 -825 1094 -1393 -36 941 -934 215 -319 485
3483 485 -99 -350 499 -243 -62 -108 -310 824 -63 -521 398 -377 1042 -186 -1507 1473 -19 -308
3501 -308 -67 -435 1333 -1063 691 80 128 1161 -2188 1349 223 -342 825 -2493 2060 -106 -1329
3518 -1329 632 -554 1926 -2201 143 1290 -1227 1614 -1984 707 1031 -1542 832 -905 1234
3533 1234 428 -1758 1097 -26 276 -829 -925 2014 -1078 -731 646 -758 1431 -1172 -463 1246
3549 1246 -833 1031 -1584 255 1592 -2211 796 -409 949 611 -2607 2565 -848 -436 451 -1855
3565 -1855 2769 -1659 76 940 -1114 2500 -2597 644 1500 -1553 1424 -1856 1587 331 -2105
3580 -2105 1997 -1035 1279 -875 -1478 2756 -1912 637 -346 -1046 2709 -2009 46 598 -103 1179
3596 1179 -2626 1488 863 -1666 1203 -1868 1935 30 -2436 2200 -1414 1046 -5 -1910 2897
3611 2897 -977 -203 -436 -38 2631 -3040 1168 640 -523 1482 -3270 2664 808 -2055 2067 -2220
3627 -2220 1898 -350 -1752 1663 -1170 2139 -1969 -623 3030 -2263 1190 -974 -132 2581 -3603
3642 -3603 1403 542 -836 1225 -2323 1490 259 -603 600 -1665 3074 -1375 -1678 2345 -1831 1431
3658 1431 -1275 -312 2588 -2368 799 -385 -13 1484 -2322 1510 -447 423 698 -2732 2879 -710
3674 -710 -1001 1164 -1690 2391 -1470 -938 2052 -2111 1393 -1120 60 1429 -2045 1617 -1250 233
3690 233 1267 -2409 2004 -611 -329 551 -1497 2379 -1464 -506 1556 -1371 1386 -1446 555 1051
3706 1051 -1694 1543 -1294 679 899 -2025 1607 -623 648 -136 -1791 2660 -1343 -510 967 -913
3722 -913 1433 -1484 -16 1003 -988 1092 -1307 400 728 -1180 926 -923 1218 247 -2179 1760
3738 1760 -561 -228 217 -857 1796 -1023 40 376 -490 1500 -1547 232 518 -420 957 -2113
3754 -2113 1266 833 -2069 1017 -686 770 -205 -953 903 -704 880 -770 -373 1254 -620 253
3770 253 -738 71 1531 -1478 43 712 -294 178 -522 516 -57 -215 284 -613 605 -10 -668 769
3788 769 -389 794 -110 -980 1415 -644 -276 192 -149 335 -782 515 -320 -406 829 -970 386
3805 386 -29 -58 451 -914 1047 -179 -752 315 -262 284 -415 317 -20 -693 831 -715 -107 143
3823 143 175 4 -550 542 190 -417 169 411 47 -305 77 177 -134 -73 144 -684 109 395 -719 199
3843 199 231 78 -269 -357 751 -273 -147 -251 -35 408 -377 431 -281 -250 913 -669 -183 262 184 -230
3863 -230 -514 653 -523 102 66 100 397 -460 478 -98 -307 406 -75 -257 164 469 -605 -227 488 -291
3883 -291 -234 -52 278 96 279 151 -268 31 -401 313 -307 129 274 -719 -29 30 59 -329 274 389 -625
3904 -625 360 -284 -100 277 -578 411 -690 222 311 -746 234 -234 273 -339 -65 557 -688 506 86
3923 86 -59 50 -69 445 -326 188 74 -324 116 15 137 -220 64 245 -175 -22 405 -309 -110 466
3943 466 113 -27 -328 328 7 -407 852 -482 37 329 -285 573 -665 572 239 -622 702 -521
3961 -521 506 -129 122 599 -1228 954 -292 -406 1011 -754 538 -582 131 672 -731 1103 -584
3978 -584 147 367 -714 532 -702 507 64 -983 835 161 -392 146 47 511 -351 134 136 -539 633
3997 633 -104 -303 908 -451 698 -593 -237 1266 -1077 487 -96 94 493 -901 1057 -699 111
4014 111 190 -1635 1557 -570 -301 450 -977 1429 -1156 19 699 -345 672 -1260 1172 -112
4030 -112 -858 913 -994 1054 288 -1042 725 -319 566 -390 -765 1100 -555 -65 -63 244 944 -1397
4048 -1397 465 240 -727 947 -1041 301 782 -893 318 -366 635 255 -1098 1002 -437 152
4064 152 -258 -436 1668 -1571 356 136 -817 1203 -1278 541 176 -475 804 -1611 1230 -188 -643
4081 -643 872 -668 1314 -939 -80 1157 -1189 586 -572 79 747 -1192 526 -401 -45 630 -1200
4098 -1200 944 260 -675 135 -475 997 -739 -614 937 -608 709 -363 -386 929 -1007 462 -435
4115 -435 -134 1136 -876 451 475 -60 98 -1023 1556 -489 -448 328 -1038 1468 -985 -15 886 -1236
4133 -1236 1118 -694 -313 529 -515 130 -692 870 -155 -1112 1238 -346 278 -75 -555 767 -666
4150 -666 -224 250 -431 396 -314 -131 -271 109 181 -961 604 72 -735 665 -217 211 254 -643 694
4169 694 -278 -58 553 -572 635 -430 279 -437 -79 946 -1012 467 514 -792 336 -424 288 16
4187 16 -464 579 -762 274 -41 142 354 -565 615 -440 -209 553 -849 439 79 -13 205 -553
4205 -553 763 -237 -458 429 44 463 -157 135 492 -434 492 -419 -149 287 -202 11 -231 490 146
4224 146 -571 151 147 -270 92 -137 407 -317 -267 -1 -355 568 -456 -286 367 -77 502 -653 614 576
4244 576 -727 192 24 242 124 -305 292 -405 264 -158 -698 534 -393 -135 -104 -91 732 -723 101 239
4264 239 106 -18 -343 219 -376 -66 112 -464 406 147 -203 -38 -70 132 -274 -289 305 -258 148 -43 -49
4285 -49 -91 28 327 -360 -211 373 -202 226 197 -179 68 -117 220 36 -293 191 90 -73 156 275 -72
4306 -72 -372 409 -218 -377 89 -155 179 -207 95 57 -230 269 -247 404 231 24 198 -561 442 156
4326 156 -831 476 15 -355 -223 133 -22 -260 122 -43 -60 45 -203 162 -77 191 51 -73 -137 238
4346 238 -491 -46 476 -63 -61 62 140 190 -45 368 -265 -77 -156 258 -90 -117 460 -307 -81 262 -164 -100
4368 -100 -85 298 -189 -240 520 -399 101 -53 -18 10 -78 67 -165 -73 29 223 258 -30 356 -19 -382 467
4390 467 -362 -13 18 90 -172 -110 241 260 185 -82 242 -226 -27 76 -328 -120 312 142 -165 -191 349 -225
4412 -225 325 131 -50 124 -73 545 -406 101 19 -233 298 -359 396 -435 -245 227 -485 296 42 134 -132
4433 -132 -80 545 -296 126 6 -328 48 -264 298 -267 -250 481 -218 42 -90 83 39 -56 566 -361 102
4454 102 517 -202 -289 183 -173 -50 -181 74 -62 -450 298 -273 -81 241 -262 320 -689 366 146 -792
4474 -792 835 -161 -211 26 -100 419 -886 520 127 -427 761 -853 583 89 -350 571 -858 756
4492 756 14 -362 295 -338 735 -658 258 512 -778 937 -276 154 732 -693 -99 -295 149 201
4510 201 -579 587 315 -84 72 -407 858 -725 -470 835 -578 543 -224 -494 668 -549 231
4527 231 -529 262 780 -1218 1208 -478 46 339 -1295 1638 -547 -424 602 -927 995 -688 -4
4544 -4 520 -633 909 -1398 600 656 -967 917 -899 812 371 -1528 1114 -359 88 -131 -582
4561 -582 974 -732 181 -48 -262 1048 -1295 170 493 -847 1063 -1397 613 907 -1286 1064
4577 1064 -504 504 43 -1410 1522 -980 441 316 -1269 2076 -1423 -152 605 -816 1320 -1756
4593 -1756 561 509 -949 947 -1326 1376 151 -1000 1284 -1349 830 -149 -1279 1623 -901 563
4609 563 -523 -445 1638 -1364 252 11 -36 693 -1711 1040 177 -799 881 -1155 1016 -274 -1365
4626 -1365 1186 -876 1007 -379 -1188 1878 -1025 469 -383 -232 1685 -1965 1046 232 -640 1022
4642 1022 -2013 1229 -150 -631 673 -1636 1765 -514 -822 1325 -987 1071 -1206 -89 1572
4657 1572 -1600 1056 -509 169 945 -1520 1112 -300 47 855 -1752 1205 14 -822 752 -655
4673 -655 1314 -634 -626 1149 -703 687 -1139 -17 1307 -1681 741 -511 223 883 -1817 1330
4689 1330 60 -297 175 -1412 1639 -558 -348 708 -703 1176 -1659 179 1049 -1094 857 -1009
4705 -1009 -61 1266 -1151 522 -204 786 106 -1248 1086 -448 128 -19 -547 1157 -881 -226 627
4722 627 -583 709 -838 -214 586 -273 433 -907 667 489 -1182 646 -749 454 363 -930 1382
4739 1382 -329 143 213 -776 1015 -679 -159 256 -237 896 -884 553 734 -736 469 -495 452
4756 452 50 -481 741 -295 101 115 -433 562 -267 145 95 -286 693 -509 240 180 -252 402 -468 335
4776 335 21 -397 399 -538 438 -61 -383 281 -311 409 66 -519 520 -394 140 96 -379 315 -556 448
4796 448 61 -388 667 -351 185 -7 -257 297 -299 99 -172 -6 410 -383 14 -225 16 282 -666
4815 -666 481 315 -331 298 -504 157 138 -260 418 -137 437 -238 -216 152 -336 206 -374 -41 397 -491
4835 -491 51 193 -7 -121 -4 -48 -150 293 42 -417 215 -30 157 -112 -297 269 12 -205 329 -184
4855 -184 156 194 98 -213 5 91 -184 -128 55 -266 79 0 -120 298 -301 56 -70 -239 208 -14 15 -265
4877 -265 -18 -24 -225 150 -68 -19 73 -331 132 85 -184 266 -129 88 -15 319 -70 136 289 -386 127 122
4899 122 -70 149 23 51 -39 -17 79 98 178 144 27 43 11 40 20 -203 347 -88 -287 554 -398 30 217 67
4923 67 -190 -204 260 -249 -233 92 -283 195 -146 299 64 -20 40 -256 139 79 -144 147 -181 216 -351 -295
4945 -295 278 -181 450 -59 144 355 51 513 -241 -313 375 -176 24 -170 -20 65 -396 217 138 -307 136
4966 136 -31 -43 104 10 138 -25 430 -270 -319 251 -214 59 197 -70 682 -448 79 266 -217 283 -226
4987 -226 272 -227 -149 219 -480 376 16 -198 311 -410 219 -236 -268 266 -122 49 -162 342 189 -454 333
5008 333 -260 132 300 -646 185 35 -356 58 -66 63 -116 -254 146 -3 161 -606 57 393 -599 564
5028 564 -454 48 620 -643 25 107 215 -43 -491 649 -246 -30 -286 -386 1057 -816 310 267 -643
5047 -643 504 -475 233 364 -112 230 -442 615 -119 -514 594 -457 373 -132 -607 657 -210 -122 68
5066 68 7 345 -277 112 -46 61 200 -566 483 224 -554 160 -175 321 226 -582 454 -87 33 1 -78
5087 -78 129 -167 406 -346 -258 645 -805 372 145 -268 62 -677 729 -24 -184 323 -335 716 -552
5106 -552 14 339 -493 393 -608 17 287 -385 173 -229 32 225 -462 235 82 -148 -249 -28 553 -599
5126 -599 -335 455 -157 397 -168 -210 361 -28 14 -340 426 169 -406 313 -152 249 -103 -453 667 -531
5146 -531 94 164 -246 581 -611 155 74 -163 279 -736 491 19 -477 558 -34 323 -142 -238 133 -423
5166 -423 327 -429 -127 230 -390 232 -244 150 366 -414 177 248 185 32 -135 352 44 111 88 -243 363
5187 363 -144 187 353 -358 388 -181 -195 183 26 -6 -65 93 92 -120 280 -280 199 39 -150 337 -407 -102
5209 -102 200 -468 485 -412 156 -32 54 124 -442 422 13 -254 588 -458 348 116 -191 387 -222 2
5229 2 146 -535 305 -99 235 -149 43 437 -339 267 25 -325 187 -114 269 34 -15 72 -255 222 27
5250 27 96 212 -459 283 -204 -314 427 -599 173 255 -312 277 -219 282 149 -162 279 -240 371 -267 15
5271 15 151 -474 157 -244 -70 336 -443 151 122 243 -216 -396 269 -166 -90 -227 -186 253 105 33 10 -267
5293 -267 19 -59 -193 342 -274 -182 -179 144 277 -478 244 -84 -162 66 -220 150 -3 -28 486 -364 393 66
5315 66 -353 -33 -184 157 -211 -56 318 -89 234 92 -150 122 -16 127 -158 99 87 -311 60 -2 -2 -105
5337 -105 266 193 -205 106 35 31 -54 -92 53 13 -193 198 -137 241 175 21 132 46 79 -113 -230 156 -102
5360 -102 -220 162 53 287 -52 -118 106 -91 -23 -56 -11 340 24 -38 -69 191 191 -368 -28 19 116 -233 15
5383 15 166 -267 221 411 -105 147 -95 125 96 -13 92 -247 -155 -209 -278 243 -10 276 -129 -166 -62 -205
5405 -205 210 100 -30 118 66 -78 168 -107 223 -196 -2 201 6 76 -123 127 -85 -3 -70 -158 210 111
5427 111 -85 5 -333 118 -347 -75 161 -234 13 -170 147 127 21 374 -35 -161 271 -256 13 -34 -55
5448 -55 259 -282 259 -6 -79 -79 49 63 -101 98 107 -246 144 -294 5 17 -196 126 -318 -138 42 -249 220
5471 220 -67 224 6 -150 558 -275 109 131 84 160 -377 -147 25 -206 338 -125 -61 133 -231 270 -157
5492 -157 379 -182 -356 169 -487 267 180 -639 396 -435 124 -79 -265 475 -461 365 5 -28 227 -418
5512 -418 438 -64 -337 550 -128 144 -256 -162 356 -185 511 -340 -164 330 -445 393 -171 -176 551 -713 195
5533 195 168 -418 491 -429 226 -271 35 142 -481 534 -30 -100 642 -459 467 -46 -325 786 -698
5552 -698 69 -9 8 180 -848 637 -403 16 688 -921 763 -286 -230 711 -569 305 -475 84 553
5571 553 -613 399 -462 256 240 -917 758 -546 -228 117 -645 739 -299 -153 392 -549 353 -276
5589 -276 -350 206 -443 529 -726 413 448 -878 735 -517 238 256 -1113 704 -117 114 89 -661 928
5608 928 -823 -55 474 -722 1092 -923 145 640 -623 716 -553 444 260 -547 639 -481 622
5625 622 98 -821 970 -482 -249 146 -450 1032 -767 -49 193 -274 879 -887 399 301 -300 402
5643 402 -941 648 331 -828 904 -650 416 -73 -656 899 -549 114 -123 -266 1070 -694 231
5660 231 322 -489 1116 -1030 428 321 -659 692 -684 505 -53 -477 666 -808 594 -16 -735
5677 -735 1024 -677 763 -492 -542 853 -950 205 202 -242 497 -824 509 86 -371 559 -788 583
5695 583 -195 -482 627 -773 372 -185 -536 826 -856 194 -174 -309 479 -1058 451 -69 -355
5712 -355 496 -944 688 -358 -419 380 -825 480 -409 -152 574 -651 408 -354 -173 565 -1093 699
5730 699 -319 -138 192 -601 545 -90 -200 79 -341 678 -358 37 465 -521 888 -451 11 455
5748 455 -533 265 -114 107 -28 -272 656 -107 249 -7 -383 449 -515 -19 397 -318 850 -54 -305 268
5768 268 -396 379 -465 48 160 -218 427 -264 135 317 -709 489 -108 -48 33 -512 370 158 -24 -154
5788 -154 -20 400 -306 273 136 -194 164 -402 171 211 -526 278 -176 -12 204 -312 206 11 5 -90 -326
5809 -326 360 -160 109 156 -185 83 -301 31 92 -147 114 -232 218 479 -118 34 -181 72 -2 -229 126
5830 126 -8 29 209 84 -84 -156 401 -189 198 439 -172 144 49 71 88 68 132 85 -116 -67 -53 113 -236
5853 -236 -123 10 -60 45 -15 4 345 -278 29 172 -36 302 -197 -181 -94 -41 -173 25 108 -123 -175 147 -250
5876 -250 128 151 63 181 -136 -214 12 57 -132 38 44 -65 -2 49 44 194 -218 -238 130 -28 -82 172 -29 127
5900 127 -149 9 -26 62 162 -94 99 -3 64 -4 -68 114 3 -160 -11 -150 -118 -36 137 -284 -356 -13 5
5923 5 -81 9 140 6 110 -231 152 -152 123 2 41 -57 23 73 -183 99 296 -284 2 -78 -315 -8 -199
5946 -199 -259 -67 273 246 -106 154 -85 66 127 -19 238 -134 5 -212 -154 43 77 -146 -80 130 79 -35
5968 -35 -10 -103 -223 -119 -149 126 328 -150 142 -56 -45 50 -32 86 -65 85 -171 -165 67 -152 -70 180 -231
5991 -231 234 -21 -124 9 -128 474 -250 92 -170 61 -18 -113 113 -109 89 155 -92 -18 -182 52 -142
6012 -142 92 171 -159 -40 64 -4 -203 80 -133 286 -171 -70 -175 -93 2 1 108 -144 -178 -202 -189 350 -263
6035 -263 159 -21 -66 152 -177 85 -158 -82 60 -210 -178 -103 -79 246 -114 -151 404 -348 220 260 92 269
6057 269 -311 -65 -249 -91 -266 -98 88 -254 -132 -98 -116 455 -349 15 -41 -99 -22 -57 -21 39 -16 -49 -107 -9
6081 -9 -345 261 71 -246 151 -86 131 30 -163 191 192 9 -60 -329 59 103 376 -141 -97 365 84 -259
6103 -259 -25 -82 240 -3 -138 -52 81 48 240 -46 246 -132 99 -112 28 31 -321 247 -81 -12 65 -340
6125 -340 191 130 -173 79 -93 -61 -293 -48 23 -392 47 -393 336 21 2 38 -30 24 18 -209 132 -162 118
6148 118 -249 97 357 -151 -92 368 -205 229 -386 -37 -130 13 154 -240 261 -179 87 248 -205 294 -236
6169 -236 -245 163 20 58 -50 -220 128 -97 239 -81 -51 -13 -312 115 -259 -73 160 -203 219 -336 -183 61
6191 61 14 214 -400 -131 -67 -191 188 -90 31 126 -125 318 -270 9 269 -252 91 86 89 40 -183 60 -288
6214 -288 -7 25 -408 -27 -117 -138 199 174 160 -144 131 223 -223 220 -445 -59 286 -61 350 -341 131 279
6236 279 -280 84 -153 273 184 -223 363 -226 305 8 52 284 -371 272 -35 -222 234 -254 107 -63 9
6257 9 -115 -373 95 -36 -228 170 -263 33 145 -229 263 -325 390 139 -185 157 -119 72 -296 -148 501
6278 501 -233 50 70 29 324 -156 -80 -30 121 132 -108 140 -71 -161 -214 -230 266 72 -229 93 -162 330 129
6301 129 108 254 -270 212 -242 -161 125 -200 -163 -64 86 92 -266 202 161 -171 -16 -111 -10 -38 -237 -99 -141
6324 -141 78 12 -101 178 -195 5 -171 48 88 -105 171 -58 -100 21 -62 105 -229 -56 67 -164 158
6345 158 103 -102 -138 192 -1 -119 184 213 -115 106 -211 -274 130 -99 147 -497 -31 341 -80 208 255 -112
6367 -112 167 -170 293 -74 81 38 84 115 -117 167 145 -342 283 -76 -185 117 -30 52 66 177 131 -175
6389 -175 215 -139 -122 209 -298 -108 137 27 -171 69 245 -354 40 63 126 119 -124 -7 -89 -251 368 -112
6411 -112 60 -13 -175 121 62 86 -2 24 90 -124 93 125 -65 82 10 -28 201 -181 0 275 -297 -28 -301
6434 -301 -49 -159 -40 123 -310 16 -23 115 -158 -60 282 58 16 -10 -50 79 -170 -33 -198 -244 7 -302
6456 -302 -49 17 5 165 -368 100 124 -213 241 179 -39 -108 -166 -54 0 -34 248 -206 194 7 190 -24 122
6479 122 -104 -224 -34 -71 9 202 -40 -10 -138 70 163 -210 269 -186 19 208 2 21 13 -40 91 -298 315
6502 315 -129 -2 30 -253 -185 -265 -48 62 -327 49 -60 -75 -27 -284 104 34 177 -107 -183 327 -143 -191 -187
6525 -187 -127 195 -331 -27 282 -157 123 -79 -28 256 -57 290 -315 183 156 -264 274 -200 -19 -130 -159
6546 -159 172 -322 286 -29 -219 283 -375 99 116 -77 174 -346 189 85 -77 431 -190 133 -215 -381
6566 -381 240 -265 203 91 -221 222 -483 246 110 -304 319 -573 386 -190 -156 331 -231 275 -101 -326
6586 -326 288 -508 266 251 -277 313 -451 300 -293 -317 344 -325 294 55 79 186 -150 261 -86 114 446
6607 446 -596 529 -66 -55 304 -349 266 -201 -124 324 -258 359 -54 15 233 -395 250 -32 -57 97 -326
6628 -326 93 16 -123 181 -408 405 -125 -16 214 -108 226 -165 95 190 -500 90 -17 101 261 -396 312
6649 312 -154 -135 43 -273 407 -222 3 502 -290 302 -71 -59 285 -465 -51 -103 208 189 -220 125 -293
6670 -293 132 116 -403 173 -411 -237 54 -230 429 -140 10 -37 -303 151 -347 211 343 -241 278 -56 113
6691 113 94 -219 398 -106 101 118 -242 309 98 226 -148 -222 429 -200 67 353 -238 489 -220 -172 419
6712 419 -421 317 -343 123 -81 -359 139 -190 213 -76 -281 308 -73 -131 -6 -271 312 -284 131 49 -8
6733 -8 114 -450 362 240 -43 51 -112 129 298 -283 275 -74 30 -118 26 280 -194 229 135 -154 263
6754 263 -253 31 -67 -108 133 -108 -107 -111 -11 59 -109 124 -48 -41 63 -392 333 49 -72 104 -301 107 203
6777 203 -98 225 -222 183 -130 -174 236 -188 -92 -43 -132 -123 -295 -101 206 95 173 10 -197 -174 173 -76 -124
6800 -124 228 68 -170 -53 -232 153 -105 -169 188 -175 -189 -270 302 177 -141 -5 -157 159 -84 -264 46
6821 46 -95 -75 97 -6 215 122 117 3 115 13 -139 139 -43 72 59 -280 -95 -6 -112 2 -131 1
6843 1 136 -163 232 -151 91 -82 -417 97 83 22 218 -44 92 169 101 -155 11 108 -229 -40 -77 -1 -62
6866 -62 205 165 -124 -91 -52 -54 12 117 -146 -24 22 -59 -65 143 166 85 -185 201 -217 -101 96 -44 113 -57
6890 -57 81 116 32 -165 291 48 65 -71 -128 102 30 -12 170 112 -183 193 -211 98 -2 -8 -153 53 106 54
6914 54 -101 86 -171 221 -261 -160 49 6 209 69 -75 60 -132 114 72 -38 -115 -212 209 82 153 -246
6936 -246 -104 -32 -33 64 36 126 210 -151 -310 -91 -152 -41 -107 211 90 73 44 1 -184 -13 -128 -78 -5 -147 -96
6961 -96 -156 -156 -98 6 28 49 70 2 189 -130 -115 -13 277 -229 13 156 171 -75 -285 143 -327 -146 -26 87
6985 87 228 -209 -234 -128 39 -155 14 109 124 30 -110 -253 -131 -143 78 -150 -214 -368 36 -2 5 -89 -294 -86
7009 -86 31 100 -185 90 -159 146 -137 -173 71 291 -91 -50 28 -76 -118 -40 139 124 194 -274 -60 115 170
7032 170 137 -181 -59 49 47 -8 67 140 64 -145 95 58 6 -108 -29 -53 -189 20 -72 120 67 35 -117 86 42
7057 42 -76 -60 -69 -91 -64 43 -218 -97 181 69 -22 -25 118 88 -86 -114 54 93 -159 410 -131 165 -66 -177
7081 -177 237 2 9 80 207 2 -3 -66 255 -195 248 20 12 89 38 -59 -53 49 42 81 174 64 -132 -188 -89 83
7107 83 -120 -40 100 58 56 113 -264 -55 33 81 6 -67 107 73 19 -153 126 40 -179 108 -84 -96 23 -201 23
7132 23 -57 31 233 -134 182 -51 127 -3 -248 77 -259 58 -41 -143 176 -35 281 12 -407 7 -238
7153 -238 -57 90 212 -112 -106 -15 -46 124 219 -410 52 -174 164 37 -33 260 -12 -7 -87 -220 236 -110 -272
7176 -272 430 -56 287 -118 284 9 -61 181 -198 -10 -76 -35 108 165 12 271 -253 -55 39 31 239 39
7198 39 87 44 137 102 -47 93 -56 68 279 -168 -30 -23 108 52 -547 -88 -173 -30 160 -183 369 15 -97
7221 -97 34 -397 73 -110 -104 36 -212 -119 -246 -218 -27 -174 146 -108 -65 278 -130 191 -128 41 181 -194
7243 -194 138 -83 -204 -39 -33 143 -43 -31 277 -66 265 -108 18 -54 -208 225 -63 24 -345 -40 102 -97
7265 -97 -18 -102 106 -29 -247 82 114 -78 27 -241 38 20 -240 -95 -155 122 -259 -149 62 214 2 -76
7287 -76 -80 170 -187 159 -54 -63 78 -315 243 78 71 298 -1 84 -163 -236 143 -164 -102 199 83 -38 -34 129
7311 129 -60 -46 234 -25 116 71 -135 -68 -77 -68 85 28 -30 -133 86 -153 -13 291 -189 -20 -132 -56 127
7334 127 56 2 -214 -193 65 -75 20 -232 -53 144 -9 0 -23 -142 90 -77 -143 -198 163 331 -45 -56 -52 -76
7358 -76 61 38 80 371 -234 0 -222 202 -162 -15 111 31 68 65 71 -217 -70 34 -17 103 51 -98 17 -92
7382 -92 -9 42 -220 13 103 322 40 -194 -28 -10 13 96 169 184 -36 -217 27 81 137 -127 77 -86 -69 -175
7406 -175 -208 -342 143 70 -80 -61 -60 36 -243 83 60 -85 30 41 -154 -67 -106 238 -181 13 83 -3 110 -16
7430 -16 23 -1 -136 -167 -95 90 124 107 46 -139 49 -238 -2 -38 -19 41 96 -170 70 -71 160 -33 -319 -48
7454 -48 54 -31 23 -63 286 311 153 -92 -168 51 177 36 -108 -185 150 -137 -58 176 109 61 -11 -16 50 245 35
7479 35 -43 46 -61 -365 20 -124 82 -224 -140 -81 -164 125 223 58 -112 -221 13 48 212 141 -210 83 -37
7502 -37 329 61 -48 84 -27 -157 -19 -182 53 -204 90 62 54 96 -239 87 -133 -162 190 -65 -158 -14
7524 -14 -114 167 -234 9 -107 -97 -32 -203 138 -105 -176 161 -45 132 178 -91 -45 -66 198 89 -43 232
7546 232 -176 -76 32 7 202 -56 106 -225 -74 -46 -207 226 108 -71 154 -128 18 69 -44 -52 67 -46
7568 -46 -183 -28 -17 26 66 176 159 38 -158 116 63 2 -193 -31 26 55 -122 348 -82 -94 36 -29 65 -298
7592 -298 -12 -84 -27 -95 -88 282 -15 162 -27 -202 -157 -196 268 340 203 218 -41 41 294 -323 -55 -156 49
7615 49 -79 91 194 -33 -7 82 -380 -3 -203 169 -204 -224 186 31 21 -40 -150 176 -98 -223 -63 98
7637 98 157 26 131 219 -297 163 -280 37 103 -204 -13 -236 274 -30 -155 122 -28 145 -1 -19 407 -136
7659 -136 7 -57 -96 236 79 102 224 -56 -226 -185 210 -15 -276 60 52 133 50 -10 234 -244 192 -186 -227
7682 -227 163 -47 -19 179 -275 31 -249 -53 -133 -115 260 -199 399 -282 -128 221 -22 115 -126 -46 -46 -213
7704 -213 -204 -56 -23 15 -91 58 -176 114 170 32 184 -140 -116 -159 -260 116 -105 146 212 -189 -129 212 -7
7727 -7 -6 -84 126 -40 -163 272 -131 36 -26 7 -155 -73 -92 -44 69 266 110 95 128 431 260 155 161 -178 -246
7752 -246 -42 73 -198 -162 173 -208 -70 48 49 -113 -124 19 27 -4 -48 -4 -179 147 -9 96 104 51 -103 -62
7776 -62 158 -194 38 45 -85 -37 95 150 236 -159 133 -74 160 -25 -252 40 228 -56 55 152 261 -121
7798 -121 -101 -54 76 9 -11 23 9 -10 1 -165 -277 94 -123 135 22 -215 -164 -6 30 -236 -115 159 -109
7821 -109 166 92 -62 8 116 -39 -54 125 211 -263 -258 -168 122 -71 133 -206 -97 -41 -97 64 91 -31 -54 -170
7845 -170 104 150 -98 -213 149 0 -305 102 115 18 -362 -105 -40 -121 9 -64 49 106 -90 125 -98 98
7867 98 -6 244 174 -67 -154 72 -192 -121 225 -240 110 171 -79 13 -26 -51 52 13 -5 81 72 -84 93 185 -248
7892 -248 6 36 -201 -63 -45 67 70 -90 146 -6 -46 -228 -218 -75 134 -18 -38 -208 -17 -152 -81 126 -141
7915 -141 14 31 198 -172 264 -33 118 -42 107 316 -142 42 -74 -2 -36 14 147 130 98 79 -185 -5
7937 -5 7 268 70 206 32 171 45 15 98 -129 0 17 96 88 -100 200 95 71 -44 33 12 -62 116 93 2
7962 2 249 174 123 -220 -54 61 -18 28 -86 74 38 69 -219 86 -251 14 48 -163 -106 76 -110 -51 -79 19
7986 19 -63 25 112 -42 -47 101 -191 -112 4 18 74 40 -65 155 -148 192 -10 -6 -141 222 23 -17 48 -105 120
8011 120 61 191 -194 -113 243 -33 -4 132 -144 -84 47 -158 -175 -2 33 247 60 76 -83 -131 -307 25 112
8034 112 -84 -53 -146 234 -109 69 26 111 33 -145 -52 -185 -87 223 -33 181 -13 106 63 10 -45 40 246 -92
8058 -92 -66 100 -8 60 -106 8 -1 -8 -84 -1 2 -9 83 -175 -112 -87 116 158 36 -20 -22 14 -146 -191 172 -10 184
8085 184 -239 30 35 -29 -63 -126 -12 25 -15 -53 147 24 -163 -284 -137 -98 -95 -114 -85 -21 -29 -204 7 -10 -94 55
8111 55 -199 -258 -180 -61 55 108 242 20 -221 -75 -60 121 -1 -112 53 -99 -91 -258 -54 167 -11 94
8133 94 -308 -148 17 204 273 124 84 3 -77 -95 -61 17 46 62 198 -33 127 -25 -70 -50 59 -208 254 8
8157 8 -95 -39 30 178 -83 -195 -94 -114 13 -361 -97 -166 19 253 -174 247 7 -87 80 -113 9 131
8179 131 227 87 -121 -120 221 -48 313 -224 -77 -78 -152 -125
8191a25
$$ Imaginary data points
##PAGE= N=2
##DATA TABLE= (X++(I..I)), XYDATA
0 0 0 0 0 0 0 0 8 -8 8 -16 16 -16 24 -32 40 -45 56 -68 80 -96 116 -136 156 -180 212 -244 283 -321 368
29 368 -418 474 -534 604 -679 758 -846 944 -1051 1168 -1294 1432 -1582 1745 -1923 2117
45 2117 -2331 2563 -2818 3100 -3409 3750 -4130 4556 -5035 5578 -6202 6925 -7771 8775
59 8775 -9993 11496 -13393 15866 -19207 23946 -31096 42902 -65332 121040 -499301 -609094
71 -609094 860006 -443671 382922 -382917 -156997 614785 -369539 76904 -294519 366766
81 366766 131587 -463348 245754 -155044 353686 -123414 -452786 428626 136248 -243901
91 -243901 -151439 217823 78498 -89701 -99991 -28651 233376 -23137 -239129 37676 247587
102 247587 -152041 19961 -120728 6620 444051 -565217 112014 265822 -212044 170479
112 170479 -369710 387902 -59079 -205975 248672 -345654 470037 -295065 -87316 298932
122 298932 -340845 411299 -382437 73972 267816 -318285 206921 -227020 283266 -106061
132 -106061 -199535 323843 -255690 182684 -119385 -21811 175735 -220034 169989 -104697
142 -104697 20640 98183 -155212 78423 15222 -5425 -12131 -56864 75161 67927 -190376
153 -190376 96033 90038 -143382 101910 -120916 134158 -16676 -128897 164405 -173952
163 -173952 210855 -127963 -94840 229611 -199798 183912 -200721 56809 204121 -280963
173 -280963 143347 -79501 140295 -76869 -126284 224616 -190627 182982 -143588 -45058
183 -45058 223611 -208311 123411 -118092 67343 107529 -200497 96616 -16227 85413
193 85413 -89997 -68672 160978 -77605 4814 -17850 -8867 60117 -5625 -78755 29402
204 29402 73362 -64582 18091 -65100 90377 31818 -141085 82624 -5117 48719 -82362
215 -82362 -5195 93102 -96619 96424 -109404 42020 76300 -111811 75848 -85385 110480
226 110480 -34259 -83020 104552 -72439 95350 -112237 28790 86205 -129325 113872
236 113872 -82936 26079 41913 -65903 49806 -54928 73543 -38235 -30136 45255 -21108
247 -21108 33220 -61907 40993 8003 -26003 17910 -16940 24721 -33335 40360 -31409 -7261
259 -7261 51690 -55060 25859 -16307 26472 -11112 -26546 43264 -35910 30088 -29585 21293
271 21293 4022 -42421 68844 -59363 19170 15681 -21863 17016 -33465 56766 -45624 4709
283 4709 26309 -37351 39532 -38028 30462 -10969 -20012 42483 -36875 16350 -5284 13340
295 13340 -16745 -9194 45593 -48601 17948 5687 -8381 6347 -14380 26323 -27199 10625
307 10625 5407 -6928 5271 -14708 30089 -31795 6557 26649 -30091 8411 2329 9128 -18326
320 -18326 6639 15603 -25123 14380 -3217 3366 -4228 -4198 16098 -19941 6734 11085 -7886
333 -7886 -10552 10930 11819 -27479 15768 8661 -17966 7332 1384 4030 -9248 1613 9947 -14075
347 -14075 4661 8615 -6142 -7987 5739 13545 -19551 747 20880 -20987 2440 10721 -7038
360 -7038 -114 -2524 8506 -8431 50 9559 -7546 -1548 -1839 15419 -14012 -5601 23859 -21561
374 -21561 3002 10343 -4706 -5251 593 12751 -17058 6480 5510 -5496 2092 -8306 13287
387 13287 -4660 -8041 8388 1036 -11873 12897 6148 -32011 32897 -4981 -18340 16864 -12055
400 -12055 22367 -27383 8722 11856 -16988 24259 -38621 33678 -5885 -16988 34155 -51634
412 -51634 44124 -815 -30547 15824 1279 22231 -48723 31277 943 -12251 27820 -56990
424 -56990 53297 -7510 -24064 24544 -31794 42600 -17284 -16692 7278 12531 16674 -55035 31520
437 31520 20360 -25717 3539 -4548 5928 16118 -13207 -30098 47702 -14336 -12224 12395
449 12395 -32791 60823 -34844 -24235 32045 -844 10605 -52470 52066 -11898 -12971 28570
461 28570 -57456 65168 -28020 -5527 7325 -20773 60050 -72065 37503 -7343 -4018 38719
473 38719 -91097 94803 -36230 -27419 58009 -64771 56238 -32193 6068 13101 -32268
484 -32268 49807 -44952 17000 8260 -14330 11278 -11656 15256 -16427 10407 -6121 13639
496 13639 -17059 -13272 53667 -47373 926 18794 1449 -7713 -13221 23788 -23407 35447
508 35447 -34788 -4572 36311 -26747 26622 -60192 56557 7158 -44405 29617 -49402 108529
520 108529 -88928 -24714 106440 -102816 82607 -57534 -14820 80581 -63505 26113 -51359
531 -51359 67219 2083 -61360 36102 -24411 80930 -80095 -27794 91654 -37502 -5087
542 -5087 -30167 41960 249 -6209 -8873 -44116 101872 -43422 -52852 46212 1759 21559
554 21559 -40082 -27545 62941 23774 -94293 35922 43556 -44364 37027 -58286 31998 29983
566 29983 -27823 -6458 -37832 105173 -67501 -22960 43709 -37474 89369 -115557 27011
577 27011 73680 -71706 32791 -42444 53407 -25537 7088 3174 -63696 130510 -99279
588 -99279 672 49396 -55090 83926 -99329 35375 44893 -53439 27367 -34205 49504
599 49504 -31471 -492 25680 -52316 55851 -10562 -34646 21507 16966 -19736 1211 2089
611 2089 -8617 35842 -47884 23843 10291 -34121 43015 -27490 942 -5280 33120 -21602
623 -21602 -35982 67822 -48115 29762 -26553 -3162 50816 -68013 60750 -56371 29378
634 29378 33588 -74074 69059 -71742 80182 -18772 -90359 124769 -68531 26990 -23749
645 -23749 -17601 80707 -79566 33406 -19907 14218 33294 -62046 25628 -2561 33917 -30742
657 -30742 -34227 52188 4412 -18784 -36949 46708 12600 -31832 -3979 3124 30249 -18781
669 -18781 -8827 -14249 34891 8492 -44957 14456 2082 44879 -58817 -10382 60352 -34598
681 -34598 22606 -58624 52128 20044 -65530 60415 -61170 57201 -325 -60121 55987
692 55987 -32555 51510 -57030 -4017 61399 -51164 30786 -49053 46131 11289 -57636 51242
704 51242 -34472 29069 -8474 -17864 17979 -12591 34250 -48851 15530 25103 -24457 10048
716 10048 -17978 22394 -1214 -11918 -1299 12986 -4572 -10153 24194 -36812 28853 3991
728 3991 -26907 18857 -10919 26575 -37028 16851 11284 -26345 38320 -46411 34753 -6644
740 -6644 -20038 40187 -50646 36986 -7426 -6552 2579 -13470 43542 -55035 30447 3197 -23506
753 -23506 37099 -41953 28858 -9645 -1876 12854 -26983 27241 -15790 13396 -18956 3920
765 3920 29054 -41972 21602 -1124 -70 -1579 -4975 10968 -15789 23018 -20893 4610 8541
778 8541 -11177 16944 -27817 23094 -1257 -11292 5048 -4086 20794 -33518 23777 -2354
790 -2354 -16845 28385 -28226 17014 -7625 4243 4853 -21273 28363 -18023 7427 -7084 2042
803 2042 17109 -31847 25418 -8339 -2705 5941 -7481 11337 -18994 23156 -14423 -4872 18568
816 18568 -17656 13629 -15599 14228 511 -16470 17425 -9396 8250 -11667 9748 1459
828 1459 -14840 21486 -16612 5788 704 -62 1794 -12867 22067 -15691 1159 4853 -3638
841 -3638 8212 -17562 18389 -7846 -5268 11612 -10027 7291 -8025 10799 -7482 -4856 16434
854 16434 -13819 4259 -3622 8560 -3005 -11032 17726 -11969 4038 -142 -1568 5104 -11156
867 -11156 14612 -10209 -1885 11752 -9141 1691 -2968 7956 -2853 -8158 10108 -1891 -3987
880 -3987 2844 1312 -4397 2947 1876 -3318 -786 3080 4950 -12428 4597 7848 -7387 415
894 415 -3586 9703 -6009 -3918 8818 -10222 8583 -2021 -4087 2805 -692 9584 -17871
907 -17871 7735 10598 -13316 6966 -9991 13839 -593 -16975 19802 -12951 7196 2379
919 2379 -15825 19440 -11808 7468 -5894 -10343 31423 -27888 3780 10574 -12221 19694 -26409
932 -26409 13018 10292 -19791 15958 -14708 12848 -699 -11545 12681 -13977 21124 -14593
944 -14593 -10292 26427 -19044 7732 -5675 -498 16012 -22842 11565 697 -2992 6612 -17567
957 -17567 20198 -6484 -8977 17075 -23585 24131 -4296 -25975 37461 -22768 5793 3735
969 3735 -19250 38179 -33969 7153 11254 -15309 27605 -42783 30474 4652 -26970 31689
981 31689 -40255 40863 -7735 -33163 38347 -24156 28296 -30235 -2875 37946 -35448 23281
993 23281 -31787 23559 23263 -54052 35791 -14217 16982 1576 -46384 51384 -9098 -10506 -1706
1006 -1706 -14647 48203 -30179 -21613 30876 -9538 18999 -30541 -10487 53938 -32766 -3471
1018 -3471 -4455 5655 41913 -64884 17254 22613 -10956 16611 -60999 58127 6326 -39920
1030 -39920 22532 -31219 62737 -37105 -26801 38985 -21345 47714 -74462 22078 52197 -58241
1042 -58241 36636 -51768 47916 22225 -77307 51906 -16912 25612 -16240 -39263 61726
1053 61726 -25820 7080 -19020 -7701 61313 -52272 -9407 31073 -10396 15494 -32470 305
1065 305 45863 -32681 -8365 7650 8933 11210 -36777 23589 -3836 8063 3806 -50595 69984
1078 69984 -28515 -19370 31121 -38722 59773 -51704 864 39107 -40548 40259 -55727 47212
1090 47212 3065 -52010 68293 -65217 49890 -4292 -55398 75342 -46438 18387 -9817
1101 -9817 -12192 46787 -49082 16002 -698 9355 4559 -41446 43789 -4247 -19374 11669
1113 11669 -12666 21591 -705 -29695 18804 11012 -5479 -10158 -13627 40726 -15535 -21159 11861
1126 11861 -884 35354 -58077 13823 38234 -39212 31976 -49742 37556 22204 -55904 40287
1138 40287 -37140 51215 -15759 -52478 65602 -29821 26234 -39594 -1259 62256 -59094
1149 -59094 20525 -18618 23168 17961 -56980 38291 -10733 17730 -8674 -35343 45918 -4979
1161 -4979 -9762 -18070 13839 29406 -32135 -7492 13969 10498 -4001 -20428 4012 28399 -18978
1174 -18978 -8443 7969 -8355 34836 -38490 -5366 34775 -18734 11186 -33893 32946 7632
1186 7632 -34048 28116 -29908 39822 -19253 -22275 40806 -36318 36142 -25961 -7864 32461
1198 32461 -24897 18025 -31390 30791 1554 -30334 32108 -26822 25989 -12079 -13087 25757
1210 25757 -22106 18504 -12628 -832 9292 -4173 4059 -16053 18157 -3437 -7894 3858
1222 3858 2538 240 -5271 8765 -12494 12181 -5417 -1726 7209 -17480 25737 -17975 768
1235 768 8587 -10092 16373 -24453 22491 -10182 -5076 20529 -30210 25447 -12371 4106 2667
1248 2667 -18434 31882 -25492 8382 -1114 -2340 15267 -27610 24923 -11956 1358 8921 -17734
1261 -17734 18073 -11825 11602 -11604 -1381 18520 -19210 8832 -7919 11160 -2325 -11411
1273 -11411 13937 -8752 8334 -9324 5080 -413 -3641 12101 -20269 14911 -1729 -1908 -263
1286 -263 -7089 20234 -20409 8796 -344 -3290 10486 -18684 18768 -11646 3049 7668 -15868
1299 -15868 14854 -8152 8117 -11106 3348 12389 -19022 14185 -8764 7107 -1694 -7716
1311 -7716 14845 -15622 11766 -5587 -1037 4601 -7693 14399 -18779 11045 4298 -11266 8267
1324 8267 -6183 9514 -10680 4922 2231 -6881 9350 -10418 10129 -8636 3633 6603 -15136
1337 -15136 14466 -6190 2522 -4295 1546 8898 -17266 13808 -4801 -1580 3499 -5343 8636
1350 8636 -10686 9163 -2936 -3114 4919 -4309 7633 -13214 11206 269 -10486 10986 -6470
1363 -6470 6239 -7746 4159 3875 -11235 12510 -7685 1399 1165 -798 2980 -8907 10130
1376 10130 -2809 -3016 556 1737 3584 -10534 9763 -2534 -3315 3915 -2611 2622 -5916 8987
1390 8987 -5261 -4440 9633 -5561 1313 -3548 5484 90 -6026 4966 -1537 2863 -6574 6388
1404 6388 -1188 -6590 13003 -11110 1162 4792 -1272 -714 -7004 12973 -7156 -2956 5247 -4567
1418 -4567 8205 -9643 3131 4909 -8179 7363 -3434 -2801 4379 3067 -6337 -2280 11432
1431 11432 -5768 -4306 4097 525 1034 -4018 920 3366 -1974 -676 259 -911 1445 1958 -3126
1446 -3126 -2890 6275 2634 -12283 7116 6503 -10798 5697 -2423 1638 3053 -8448 8074 -3231
1460 -3231 -257 3293 -5554 4365 -2237 3692 -3929 -3148 12131 -11097 230 7495 -5304 1213
1474 1213 -1790 3818 -2640 -1724 4387 -4070 3667 -4454 2822 3549 -9854 10709 -5642 -3422 10409
1489 10409 -10176 4231 -734 920 1533 -10461 14565 -5390 -5319 7040 -6736 10017 -9122
1502 -9122 -1066 9393 -9613 7577 -5770 -1165 8628 -5968 249 -4054 8098 968 -12131
1515 -12131 7211 2593 -195 -5040 -1323 9560 -5327 -545 -688 -1360 9822 -9549 -1647 5892
1529 5892 -2399 6579 -13284 3870 12570 -13213 3711 -3485 7330 1926 -15142 14939 -8710
1542 -8710 6065 2530 -18189 22220 -9438 -1426 2733 -9102 19408 -14288 -868 4384 -53
1555 -53 6146 -16948 14896 -4034 -2726 9003 -18358 17171 -2452 -7645 5945 -6671 12371
1568 12371 -8771 -2415 6360 -3669 7631 -11603 3920 8290 -11619 9116 -5661 -3697 15836
1581 15836 -14611 737 7575 -7069 8735 -11621 4295 6463 -9671 9073 -12126 10656
1593 10656 661 -11080 13738 -15787 16372 -4422 -13598 19135 -13349 11770 -10585 -716
1605 -716 14881 -18373 16300 -14620 6110 11175 -20081 17042 -13596 10668 3220 -19985 20612
1618 20612 -9663 4341 -2015 -8884 18157 -12134 1845 1601 -4883 11290 -8296 -2930 5543
1631 5543 -117 1765 -8000 2176 9991 -10060 1739 -56 260 8628 -15373 9186 -210 -3538
1645 -3538 10170 -18082 14485 -1090 -4591 3973 -12577 23683 -17875 80 10884 -15462
1657 -15462 21862 -21463 6909 8552 -15020 19066 -21159 11682 4882 -11982 11151 -14962
1669 -14962 18816 -8484 -9135 15621 -12688 10565 -6207 -3006 8285 -6615 6041 -6393
1681 -6393 460 6639 -3985 -1799 -124 4099 1125 -7014 2174 6593 -7731 4998 -3117 -1687
1695 -1687 9778 -10123 5997 -6141 4783 7152 -18160 14699 -5892 3186 149 -12186 21177
1708 21177 -16147 6036 619 -9520 17916 -16232 8480 -5965 1576 12467 -22928 15518
1720 15518 -2721 -690 2234 -11923 17982 -9981 312 1848 -4481 10340 -8952 2188 -1914
1733 -1914 3214 4029 -10621 3753 5597 -1529 -6568 3534 2721 -505 -2168 -3384 7940 -4960
1747 -4960 2301 -2637 -1951 9405 -7898 3220 -5354 7652 2031 -13893 13620 -5895 3775
1760 3775 -2910 -4442 11868 -11783 9574 -7197 -656 9824 -11563 8639 -9145 8328 1792
1773 1792 -13559 13174 -5810 3439 -3863 -502 6864 -8587 7189 -5534 1892 2351 -2873 2446
1787 2446 -5898 8684 -4034 -2354 2286 108 2872 -7835 7804 -3275 -885 3659 -5488 4944
1801 4944 -3908 5373 -4737 -1708 7365 -6617 4205 -5677 6822 -979 -7394 10551 -7675
1814 -7675 4511 -1792 -759 3293 -5980 9436 -9112 2542 3922 -4890 4111 -6368 7933
1827 7933 -4133 -2253 5038 -3878 3677 -4978 6143 -4361 -895 7428 -10204 6156 -1330 1077
1841 1077 -921 -3594 8348 -7450 2594 -402 432 931 -4550 7401 -6350 2335 1753 -2845
1855 -2845 1015 -1772 6214 -9038 5004 2593 -6546 6017 -5454 6111 -4530 -1357 6288
1868 6288 -7578 4783 -2046 1806 -2170 -998 6893 -9707 5670 778 -2653 553 -1174 5765
1882 5765 -8276 4793 924 -3619 3902 -4898 6197 -5050 162 5655 -7660 4141 702
1895 702 -926 -1787 1626 2301 -5583 2700 1555 -522 -2789 3109 712 -3876 4184 -2311 2182 -3171
1911 -3171 1909 3167 -9066 8650 -2420 -2478 2311 -1408 4457 -8695 7043 -480 -4607 6198
1925 6198 -5202 5557 -6017 3694 3260 -10013 10378 -5255 756 859 -2764 7852 -11164
1938 -11164 7184 1392 -8161 8624 -4354 1476 -1341 -774 5982 -8854 3953 3851 -6017 2857
1952 2857 -518 1247 256 -3699 5548 -3668 -729 6332 -7734 2970 2144 -1106 -332 -4657 10410
1967 10410 -6596 -2720 7142 -5569 6291 -8094 3905 3673 -9554 11806 -10681 3213 6685
1980 6685 -9615 7401 -8344 10562 -2003 -12476 16624 -8968 2976 -1073 -4935 13587
1992 13587 -13375 6039 1032 -7012 12756 -11150 1655 3558 -1943 4299 -12273 10716 1919
2005 1919 -10145 6789 -4512 7212 -4338 -5623 11356 -9797 6179 -913 -7684 11946 -7651
2018 -7651 2675 -2821 -621 11632 -16544 7988 3375 -6191 7855 -13096 12844 -2552 -9085
2031 -9085 13991 -13701 9407 -55 -9415 11556 -9433 8615 -5919 -4579 15127 -15084 6892
2044 6892 -861 -2370 8946 -15143 13683 -3868 -6714 11710 -12457 9657 -3901 -2535 7595
2057 7595 -11190 13133 -9021 -1897 11712 -13019 9581 -7170 3155 7390 -17191 14992
2069 14992 -3991 -3578 6789 -10885 12522 -6861 -1954 6668 -10048 13105 -8433 -4167 11110
2082 11110 -8134 6116 -8652 2520 11775 -16031 7225 -596 271 5261 -13757 11833 -2286
2095 -2286 -1793 3900 -12268 16581 -5829 -6107 5730 -5546 14406 -15941 416 13089 -11209
2108 -11209 8530 -11922 7398 7710 -15250 10564 -8304 8430 1820 -15493 13516 -3962
2120 -3962 4378 -5370 -6708 17992 -11146 -1442 2590 -1292 8874 -12174 2469 5397 -3114 3486
2134 3486 -9033 5700 5747 -7807 1427 -2471 7628 -587 -11728 11312 -1650 -1254 932 -6985
2148 -6985 11850 -6313 -1139 3060 -5804 12010 -11032 1137 5468 -5603 8609 -13001 8878
2161 8878 3504 -10750 9839 -8280 6999 -1400 -5517 8294 -8996 8525 -4294 -3282 7860
2174 7860 -7361 6203 -4974 1209 5304 -7928 5557 -1344 -899 2056 -2016 2520 -3139 1331
2188 1331 2572 -4029 1350 1132 -1638 2057 -2606 1525 1849 -3727 4485 -4262 1320 4218 -6606
2203 -6606 3953 -2830 4122 -1858 -6168 9629 -6347 3012 -1473 -2178 7702 -8513 5430 -3412
2217 -3412 374 5643 -9256 5849 -2493 3190 -948 -7027 10313 -5007 55 -331 -737 5071
2231 5071 -5581 2630 -1784 1324 2026 -4752 1997 807 1558 -3298 -1407 3591 322 -2756 -1968
2246 -1968 4998 -2549 -312 184 -1340 3831 -2997 1115 -2287 3125 1245 -5497 4381 -2385 3840
2261 3840 -3499 -2681 7206 -5887 2789 -1964 585 2401 -3971 4399 -5650 5025 353 -5360
2275 -5360 5096 -3341 3732 -3356 -832 4159 -3225 1800 -2701 3361 -2012 -235 2785 -5932 5719
2290 5719 -2013 -1354 1150 -988 2880 -4306 2656 -581 129 279 -2198 3996 -3695 2370 -384 -2113
2306 -2113 2301 -927 1380 -3921 4504 -1157 -2907 4441 -4322 4558 -3046 -129 3372 -4680 4024
2321 4024 -2896 703 103 -10 1543 -4685 5219 -2463 -641 1498 -1745 2855 -3750 3086 -1563
2336 -1563 -326 1951 -3013 3448 -3697 3557 -508 -3725 5494 -3570 1018 -469 587 552 -2196
2351 -2196 3579 -3076 2062 -950 -182 1732 -3367 4398 -2941 806 1182 -1060 1314 -3008 4752
2366 4752 -3192 -139 3328 -3479 2823 -2250 1836 -836 -1030 2938 -2959 2093 -2029 2291 -1146
2381 -1146 -1990 4946 -4723 2168 230 -624 1019 -2498 4117 -3567 1177 1100 -2020 2235 -2280 2712
2397 2712 -1990 -352 2248 -2672 1074 -321 2215 -2975 808 2921 -3899 2307 -1181 1265 -438
2412 -438 -1201 2694 -3147 1849 -302 -618 227 105 2181 -3731 2153 650 -1086 -134 -307 3110 -4138
2429 -4138 2367 83 -1929 3043 -2889 2821 -2284 1141 2389 -5429 3785 -550 -519 -685 -279 3523
2445 3523 -4174 1970 518 -726 596 -1446 1985 -2404 1991 211 -2563 2524 -748 305 -1664
2460 -1664 1220 1621 -3385 1294 1586 -1170 -849 970 419 -637 -409 667 234 -1884 2747 -1957
2476 -1957 -1052 2848 -2691 797 -958 2013 -52 -4203 4942 -1925 -526 515 -637 3027 -4396
2491 -4396 2832 -375 -1864 3421 -3741 2127 -570 966 192 -4421 6212 -2203 -2148 1674 -453
2506 -453 2984 -4784 1455 2789 -3356 2477 -2328 1064 1897 -2805 1671 -2040 2488 1842 -6002 3497
2522 3497 1625 -1932 -356 -1312 4142 -2616 -2170 2950 -2171 2868 -2453 -1013 3208 -2190 3153
2537 3153 -4711 1081 5049 -5884 1540 -490 2439 -369 -5263 6390 -2944 521 839 -4001 6046
2552 6046 -3743 844 488 -3102 6838 -6167 4 3734 -2479 2640 -5418 4296 1247 -5369 5084
2567 5084 -3889 2573 886 -4187 4933 -3916 3125 -621 -4192 7043 -4006 846 -152 -844 4831
2582 4831 -6854 3848 834 -3480 4358 -4965 3503 -472 -2215 4548 -5931 4598 -477 -4246
2596 -4246 5851 -4274 2546 -1106 -1798 6089 -6711 3195 918 -2765 3956 -5336 4758 -1348
2610 -1348 -3050 5818 -6540 5209 -626 -4533 6049 -4708 3719 -2871 -1802 6878 -6821 3244
2624 3244 -1513 653 3666 -8517 7252 -2188 -1331 4468 -7390 6709 -1509 -2256 2544 -3787
2638 -3787 6848 -5293 -1654 4988 -3409 3604 -5953 2364 5056 -7016 4200 -2274 452 3842
2652 3842 -6574 3442 364 317 -56 -5165 7184 -1636 -2916 1908 -2834 6410 -5096 -1935 5809
2667 5809 -4711 4164 -4148 -396 5414 -5256 2862 -4196 3632 3318 -8720 6105 -1942 1595
2681 1595 260 -5960 8313 -4094 -126 1061 -3240 6472 -5145 989 473 -1167 4925 -7478
2695 -7478 2747 3078 -3645 1926 -3154 3253 176 -3478 2484 -1802 2111 -558 -2813 3592 -1776
2710 -1776 1263 -434 -2901 5758 -2696 -1726 2847 -2069 2533 -2641 575 1314 -2667 4173 -4348
2725 -4348 1946 1561 -3990 4256 -4460 3218 1302 -4810 4712 -2399 1403 -603 -854 2615 -3952
2740 -3952 3929 -2476 -1301 4076 -3990 2866 -1592 -69 2650 -3247 1495 -106 -327 218 -757 1354
2756 1354 -1723 1017 417 -2331 1962 437 -1782 1162 -228 252 686 -2432 1859 -386 -747 944
2772 944 -1331 1848 -1008 596 -689 -1415 3681 -3612 910 1548 -1307 1743 -2821 2184 -633 -1072
2788 -1072 1180 -2245 2728 -1893 408 580 -1830 3317 -2744 152 1516 -561 485 -1501 1702
2803 1702 -1018 -342 423 -1009 1104 -747 276 -313 404 465 -732 175 -348 1609 -1986 283 1231
2820 1231 -1423 1031 -1152 1015 -118 -121 591 -1540 1497 -1030 490 -367 -895 1827 -2436 1082
2836 1082 266 -469 580 -1250 1995 -1604 776 436 -1450 1939 -1580 951 -391 -217 1203 -1724
2852 -1724 1069 -497 529 -503 12 895 -1621 1403 -770 180 444 -809 1243 -1718 1142 12
2868 12 -796 653 -501 725 -959 878 -125 -1056 896 -931 889 -882 1022 -141 -652 1383
2884 1383 -1956 1663 -980 189 943 -2366 2548 -1288 -88 766 -1007 1063 -1634 1570 -578
2899 -578 -461 1084 -1515 1393 -685 629 -342 -1122 1731 -999 -56 -239 609 187 -1239 1508 -635
2916 -635 185 439 -999 392 148 224 -609 276 69 834 -1001 -394 1716 -1547 873 -375 7 784
2934 784 -1473 1652 -1470 938 540 -1810 2301 -1546 1456 -829 -1229 2835 -2823 1320 -520 -173
2950 -173 882 -1893 2629 -2132 1221 905 -2920 2453 -1438 1004 -202 -1638 2745 -2074 71
2965 71 746 -506 895 -1392 579 -25 -1030 1372 -1377 -173 1755 -1628 481 -81 -305 1517
2981 1517 -2480 1515 255 -1797 1415 -1475 1498 -977 149 1737 -3237 3403 -1521 -934 2333
2996 2333 -2502 2870 -2710 893 1854 -3597 3143 -2214 1198 103 -2364 3923 -3719 1880 865
3011 865 -2995 3479 -2578 1329 122 -1308 2605 -3050 1519 566 -1869 1870 -1690 1445 -498
3026 -498 -1898 3063 -2403 586 1039 -1916 2169 -1755 793 351 -2018 2868 -3086 889 1706 -2168
3042 -2168 2392 -2942 2370 480 -3404 3804 -2942 1995 -169 -2320 3897 -3874 2263 -521 -2471
3057 -2471 4532 -3903 1498 -278 -788 2885 -4490 3276 -299 -1753 2474 -3062 2827 -1306 -1239 2579
3073 2579 -3018 2685 -631 -1367 2530 -1790 1862 -1825 -100 2640 -3767 2316 -257 -942 2345
3088 2345 -3153 2267 -367 -1180 2679 -3191 2319 -206 -1032 1743 -2696 3478 -2239 -857 3329
3103 3329 -4037 2863 -1118 -925 2460 -3141 3062 -1600 -471 2374 -2877 2587 -2075 1043 1553
3118 1553 -3264 3793 -2355 -190 2262 -2983 2228 -1183 492 741 -2334 2698 -1669 454 589
3133 589 -1941 2565 -2685 982 1064 -2796 3209 -1555 -539 1580 -1464 1601 -2126 1329 685 -2274
3149 -2274 2017 -1834 1238 404 -2369 2912 -1744 927 867 -2450 2687 -1212 -270 -41 -652 2300
3165 2300 -2759 847 1058 -1378 1963 -2507 1248 737 -1473 1615 -2245 1649 259 -1733 1171
3180 1171 -1081 2138 -1378 -1341 2938 -2051 1028 -443 -687 1684 -1692 724 -621 255 1440 -2144
3196 -2144 889 -28 465 254 -1942 2414 -247 -1401 1184 -610 493 -205 -440 467 -292 1270 -1333
3213 -1333 -159 1397 -844 426 -761 368 1483 -1949 628 568 -835 590 -1098 742 -103 258
3229 258 267 -1613 2079 -695 -681 995 -844 1667 -1204 -351 905 -1007 632 -887 496 100 -330
3246 -330 892 -1797 1569 408 -1099 456 -375 730 -651 -787 524 -331 119 -475 250 219 68
3263 68 449 -685 498 738 -962 -531 1061 -403 -571 68 13 634 -540 71 -101 97 435 -781
3281 -781 205 -380 833 -107 -1252 1702 -374 -396 105 -131 636 -854 503 -254 184 890 -1088 711
3299 711 -313 207 188 -1396 1371 -48 -381 -366 534 288 -861 527 -594 111 164 -636 394 -552
3317 -552 280 -501 -248 469 11 -219 -840 1193 -103 -609 467 -402 -77 -420 403 -657 235 436 -681
3336 -681 590 -462 678 -66 -766 1293 -682 133 -21 231 115 -751 1218 -676 350 327 -710
3353 -710 115 -319 738 -627 81 565 -529 134 -619 938 -297 -514 892 -794 314 -45 146
3370 146 256 -12 718 -831 421 93 -19 91 -267 655 -531 127 13 57 211 -646 797 -814 259
3389 259 567 -673 752 -348 346 -458 161 430 -873 611 -444 252 -389 -240 763 -956 591
3406 591 -390 463 4 -407 819 -965 659 247 -1087 613 -434 832 -554 40 467 -562 443
3423 443 -646 533 -19 -22 459 -499 423 -400 29 -42 154 321 -796 680 -64 -272 260 -41 -67 -306
3443 -306 297 -528 481 40 -133 508 -853 803 -563 -12 250 -523 702 -1081 987 -517 -711
3460 -711 1550 -1387 664 -149 -287 856 -1268 858 -333 -40 -51 -844 1213 -955 722 87 -816
3477 -816 1547 -901 -212 556 11 204 -769 469 216 -150 -26 -373 617 21 -425 302 -34 250 584
3496 584 -1526 989 621 -1101 476 -481 1210 -293 -904 1228 -617 1285 -1398 -33 1437 -1618
3512 -1618 1331 -1521 624 1360 -2249 1420 -259 766 -431 -1500 2258 -1538 437 -66 -842 2332
3528 2332 -1565 164 222 -229 1460 -2020 753 961 -895 50 -905 1545 -89 -1516 1314 -657
3544 -657 392 -40 -1339 1405 -509 -9 198 -1074 2224 -1741 -245 1118 -768 1382 -2380 1305
3560 1305 1183 -2237 1624 -1500 1369 -55 -2117 2198 -1618 1318 -570 -1715 2793 -1909 448
3575 448 -542 -295 1695 -2944 1387 634 -626 678 -2194 2380 -223 -1098 1410 -1796 1883 -371
3591 -371 -1536 1880 -793 668 -1405 -87 2206 -2364 626 -37 28 1435 -3006 2066 468 -1186
3607 -1186 1570 -2426 1993 344 -2111 1065 -947 2330 -1941 -969 2417 -1876 1312 -1783 300
3622 300 2813 -3352 1645 -552 -363 1593 -3075 1865 -46 147 -230 -1938 3579 -1523 -1187 1480
3638 1480 -1518 2627 -2186 -596 2652 -2040 1280 -1364 -9 1661 -1943 589 -1042 1020 558
3653 558 -3027 2743 -613 -328 619 -1916 3383 -1447 -986 1617 -1453 1505 -1708 245 1210 -1405
3669 -1405 1557 -2299 1386 1549 -2769 2044 -959 985 330 -2532 2745 -1234 -496 1030 -1645 2043
3685 2043 -1620 422 791 -1291 1894 -2231 877 1330 -2053 1725 -1182 1249 317 -2189 2233 -1287
3701 -1287 487 -43 -1156 2146 -1742 527 389 -887 1831 -1643 854 627 -1079 922 -1743 1651
3717 1651 108 -1977 1964 -891 422 -365 -1016 1777 -1012 225 -228 -592 1841 -1334 270 32
3733 32 -17 1311 -2134 1199 912 -1548 795 -903 986 79 -1225 1158 -698 1064 -464 -945 1657
3750 1657 -1322 815 -1060 -115 2140 -2123 456 792 -243 479 -1105 826 183 -371 288 -1110
3766 -1110 1402 -142 -533 586 -600 1261 -783 -799 1479 -425 -246 16 255 409 -475 134 -188
3783 -188 132 500 -915 411 142 183 569 -1159 1107 295 -1001 855 -353 506 -328 -266 736 -601
3801 -601 928 -405 -451 695 -605 357 -513 372 902 -985 427 173 57 -308 -111 543 -601 527
3819 527 -160 -673 730 -21 -48 -47 314 378 -337 -66 187 -304 -267 70 164 -154 -5 394 -72 -114 648 -511
3841 -511 -258 757 -259 96 -44 474 9 -464 442 -244 357 -80 202 95 -498 615 -659 -416 395
3860 395 -133 208 -269 862 -286 -403 438 -492 391 -218 172 307 -320 504 162 -474 260 353 -386 -5
3880 -5 497 -257 -42 59 51 -342 -50 398 -108 236 -139 -67 104 -394 780 -371 -176 531 2 -14 -280
3901 -280 630 -466 190 532 -502 291 -655 415 94 -336 802 -827 436 10 -207 280 -352 770
3919 770 -608 -124 541 -411 311 -55 268 -344 -213 491 -423 -5 210 -71 233 -106 63 13 -130 546
3939 546 125 -97 202 -75 -131 13 18 422 -724 545 344 -784 780 -463 502 -150 -121 817 -745
3958 -745 641 -57 -471 608 -697 667 -796 182 367 -1330 1243 -362 -24 280 -686 775 -675
3975 -675 153 95 -577 718 -701 512 -139 -381 714 -1024 174 479 -666 132 -200 148 -172 -649
3993 -649 380 -489 350 119 -672 689 -240 -44 314 -738 1095 -849 -601 980 -553 456 -828
4010 -828 129 698 -688 995 -1320 637 718 -1302 976 -702 913 -92 -770 1342 -894 477
4026 477 -400 -13 1090 -1383 1139 -354 -223 1268 -1419 539 458 -459 233 -839 1057 -107 -333
4043 -333 418 -189 581 -832 -288 882 -797 364 -28 -325 1360 -955 -180 307 -589 627 -1259
4060 -1259 995 397 -477 440 -1066 1186 -652 -719 1367 -1056 760 -277 -578 1351 -743 748
4076 748 -825 127 961 -1420 985 -243 288 169 -966 1656 -669 -257 529 -567 1196 -1026 88
4093 88 668 -641 911 -687 164 1116 -1027 213 -171 343 208 -1009 980 -10 -475 148 -731 834
4111 834 -447 -293 324 -568 1194 -514 -431 993 -419 171 -858 850 303 -1370 938 -667 686
4128 686 244 -1016 1387 -952 114 127 -1036 1017 -649 -42 147 167 770 -1330 686 158 -534 600
4146 600 -818 750 76 -536 470 -158 22 -5 -219 176 89 193 -545 347 581 -728 420 242 -306
4165 -306 477 -734 425 179 -463 726 -560 203 201 -121 537 -568 765 -275 -700 1067 -1010 426
4183 426 143 -137 582 -578 696 -196 -203 453 -562 649 -679 147 326 -648 658 -372 59 409
4201 409 -577 305 -190 268 157 -387 867 -278 -9 36 -141 565 -192 29 -53 -289 452 -619 -289 297
4221 297 250 65 -418 185 267 -495 300 -110 75 48 -159 306 -177 446 -261 -354 513 -35 408 -55 30 893
4243 893 -710 -70 366 -133 100 -590 195 -58 113 235 -647 555 43 -430 380 118 391 -254 -311 572
4263 572 -56 -168 -467 12 75 -211 346 -293 333 325 -387 270 -75 220 -44 -518 532 -288 -175 -69 -82
4284 -82 27 -342 153 132 -175 277 -292 -218 515 -202 70 -312 -174 326 -255 68 -16 160 58 -38 62 -21
4306 -21 236 95 -702 105 209 -122 -5 54 269 -271 -33 167 -168 464 -354 420 -411 43 292 -632 107
4327 107 372 -479 232 217 424 -377 82 26 89 11 -71 122 158 386 54 -321 -12 358 -134 -60 469 316
4349 316 -220 -63 -14 86 37 60 -106 -20 79 -206 -64 -295 511 213 -458 536 -69 -141 -52 -30 16 -308 497
4372 497 -193 80 437 -156 123 -231 177 8 -562 506 -183 -164 254 280 52 -449 145 -60 -424 -28
4392 -28 27 -240 51 62 62 -415 368 99 48 -358 246 97 -73 86 73 -264 -249 217 -623 73 418 -367 -9
4415 -9 54 56 -29 -196 506 -61 324 -56 261 -4 -611 423 -349 -222 20 -229 123 -317 91 -282 -186 691
4437 691 -574 176 -71 5 293 -232 494 -328 -13 275 -139 112 -107 91 -189 -301 579 -235 -243 402 272
4458 272 -322 -148 -45 204 -282 178 228 -208 463 -215 -72 52 -179 335 -726 557 107 -622 316 -386
4478 -386 546 -538 -150 433 -406 566 -664 1 776 -845 557 -324 101 609 -798 541 -202 351
4496 351 -244 -601 945 -681 -91 272 -836 774 -504 -280 454 -277 219 -190 238 528 -646 209
4514 209 -417 338 204 -1095 973 -465 -326 491 -1108 738 -451 -253 195 -395 826 -813 147
4531 147 356 -875 949 -1422 910 672 -1524 1062 -576 365 -49 -1068 1352 -810 912 -277
4547 -277 -703 1394 -1139 415 32 -562 1224 -1410 436 530 -1150 574 -861 529 -74 -520 664
4564 664 -695 1034 -88 -1097 1307 -999 243 -153 -255 1631 -1638 332 503 -351 834 -1331
4580 -1331 1001 167 -834 1108 -1563 1619 -92 -1400 1353 -877 1094 -706 -894 1684 -1524
4595 -1524 570 -365 39 1209 -2028 1001 -265 -300 1237 -1712 1211 -135 -454 673 -1120 1515
4611 1515 -1300 -801 1344 -787 933 -1052 -41 1297 -1524 761 -329 -357 1097 -1621 750 -147
4627 -147 0 609 -1546 1920 -219 -880 1108 -1144 1404 -766 -808 1454 -1425 1097 -918 13 1110
4644 1110 -1711 1168 -817 357 1014 -1866 1438 -324 39 367 -929 1706 -1107 -229 593 -765
4660 -765 1103 -1123 200 910 -742 1040 -1175 423 1079 -1829 945 -318 325 287 -1527 1383
4676 1383 -446 -31 414 -734 1476 -1049 101 605 -676 1318 -1256 61 1193 -1016 741 -826
4692 -826 716 492 -1478 1109 -746 751 -199 -1046 1792 -1020 331 34 -982 1522 -985 28
4708 28 802 -273 492 -1435 619 566 -902 555 -933 946 -61 -1038 1092 -519 625 -47 -542
4725 -542 1162 -470 1 61 -252 827 -1238 194 406 -427 637 -872 958 381 -726 814 -819
4742 -819 458 2 -629 920 -520 416 -441 -39 933 -1090 128 208 -194 500 -671 402 -11 -380
4760 -380 458 -539 714 255 -154 557 -292 624 -517 -237 464 -716 475 -108 193 520 -656 295
4778 295 92 -292 583 -580 512 -159 -334 415 -443 474 52 -259 281 -67 30 -322 417 259 -702 315
4798 315 105 -151 225 -270 142 114 170 -68 -520 461 -139 -75 101 -175 525 -342 -46 448 -581 552
4818 552 29 -162 237 -53 311 -309 -18 -50 -225 285 -50 -2 84 -252 315 -296 -332 420 -236 -2 105
4839 105 -108 -108 255 42 -153 23 369 -60 148 -155 310 12 -207 473 50 -149 92 -52 -72 197 80
4860 80 -14 -395 484 -1 105 76 -100 189 -261 119 56 -73 18 6 -161 111 8 137 -184 55 279 -262
4882 -262 70 -163 11 -80 -24 35 -212 -28 164 80 117 -281 193 67 -184 199 -136 -232 -45 -133 -5 172
4904 172 76 122 92 -82 -233 -80 57 -193 -111 -30 216 156 -243 285 -164 -1 125 0 -48 -152 227 -22
4926 -22 -241 408 -277 70 77 -332 533 -303 417 -102 -23 190 21 280 -194 178 81 -343 375 -28 -183 74
4948 74 10 21 -31 60 -124 -227 85 -154 -163 273 -170 87 -422 67 103 -339 39 368 -17 -53 -159 263 -130
4971 -130 -59 94 -231 287 -244 -243 335 -459 283 -69 -453 484 32 161 -206 237 73 -398 479 -540 312
4992 312 345 -720 662 -264 -90 146 -630 349 3 -201 54 13 283 -395 345 68 -575 365 -373 -28
5012 -28 665 -532 25 126 -6 -16 -303 -94 93 195 -81 -68 372 -355 103 462 -455 765 -427 -255
5032 -255 273 -265 263 -586 493 98 -334 371 -620 589 72 -368 708 -264 88 147 -339 318 -341
5051 -341 33 -224 241 338 -500 554 99 -38 472 -626 388 -33 -609 267 -44 248 -348 72 44 -66
5071 -66 178 -399 82 840 -688 162 169 -84 383 -621 304 254 -334 353 -167 435 -335 -89 253 -335 785
5092 785 -550 -194 548 -433 184 -159 50 269 -536 313 -237 157 -193 -409 689 -416 229 -56 -425
5111 -425 488 -432 -172 118 -100 339 -329 106 178 -206 -115 -309 465 -286 -672 351 -158 179 79 -239
5131 -239 462 -208 -285 -148 -84 266 -482 243 348 -256 87 -204 548 -99 -359 408 -502 359 -43 -126 307
5152 307 -314 499 -120 -200 409 -517 243 -170 198 180 -460 299 -226 314 144 -259 595 -340 3 2 154
5173 154 538 -258 -14 357 -98 -191 100 171 466 -224 113 -223 345 -217 -399 423 -246 229 50 -549 224
5194 224 -379 -95 -22 -262 205 -390 192 120 -202 392 -535 320 147 -361 480 -258 16 85 -236 394 -239
5215 -239 202 -221 160 303 -387 250 95 -13 279 -514 176 -160 -215 209 -497 23 -15 -272 54 -304 433
5236 433 -297 -97 448 -577 34 2 -277 262 -151 6 -62 -75 264 -309 176 24 8 60 -220 410 -301
5257 -301 -25 217 -413 93 68 -163 152 -413 207 -96 -159 220 -173 360 -444 13 24 -360 169 -198 -140
5278 -140 282 -39 118 -197 87 8 -362 19 -292 185 132 -3 212 -113 -148 238 -91 17 -144 -2 -44
5299 -44 -35 94 -63 -169 41 -625 88 65 149 129 -374 95 185 51 135 -123 -41 137 34 112 -128 368 -208
5322 -208 -10 152 -45 283 -67 22 -64 90 87 -216 -37 14 -216 97 -161 262 -40 -42 213 -32 -164 -33
5344 -33 -60 24 139 193 35 61 333 -260 95 67 24 322 -241 2 41 11 189 167 231 83 -152 -63 -28 173
5368 173 -239 21 130 -96 212 -129 25 28 99 204 117 -111 -25 -37 368 -246 -327 101 -32 91 -106 -160 380
5391 380 47 -96 -117 -413 196 -54 71 164 19 -36 -379 26 10 -173 147 37 95 103 -246 85 166 161 59
5414 59 20 161 193 98 -211 -72 42 -212 277 -51 -351 103 40 -159 -282 48 34 -110 328 -271 57 -31
5436 -31 -20 316 -58 15 78 -72 415 -162 64 -157 -61 66 -287 57 189 -240 145 -68 -23 198 13 183
5458 183 -335 257 142 -370 242 18 -34 -117 15 377 -458 28 -27 -66 80 -176 29 70 -210 398 -346 -1
5480 -1 -19 -286 234 78 278 -210 150 237 -8 86 -129 41 182 -342 438 97 -147 568 -310 195 179 -300
5502 -300 58 -370 259 -137 88 302 -412 622 -92 7 325 -474 335 115 -242 249 -296 325 -142 7
5522 7 212 -412 522 -135 -17 298 -538 418 -359 9 565 -365 89 63 -231 89 -456 522 -181 32 191
5543 191 -689 697 -470 -309 239 -734 499 -295 -148 486 -404 202 -623 324 377 -869 663 -707
5561 -707 223 334 -702 966 -192 35 391 -500 805 -506 -77 299 -448 615 -541 138 320 -417
5579 -417 733 -724 329 354 -776 244 -177 335 113 -568 575 -390 31 148 -321 894 -661 305
5597 305 632 -552 438 -693 355 257 -498 714 -759 433 58 -657 630 -543 596 12 -780
5614 -780 1081 -789 280 41 -427 788 -948 177 81 -286 571 -1128 441 264 -654 813 -723
5631 -723 616 47 -882 660 -683 229 -308 -178 865 -885 365 -114 -271 891 -1029 439 83
5648 83 -449 537 -890 745 149 -702 559 -712 933 -478 -351 777 -606 798 -510 -299 834
5665 834 -872 508 -222 27 692 -1168 652 -125 -91 88 -925 898 -332 -353 487 -944 563 -395
5683 -395 -366 747 -606 513 -502 141 593 -739 659 -133 59 690 -850 693 -341 -271 579 -670
5701 -670 771 -413 -243 303 -505 639 -515 -163 714 -757 420 -480 151 498 -664 854 -285
5718 -285 -88 -27 -754 548 -459 307 127 -583 879 -631 56 467 -266 436 -226 167 332 -445 578
5737 578 -120 308 196 -366 661 -302 234 308 -595 759 -342 -250 131 -149 700 -561 78 193 -154
5756 -154 331 -460 395 137 -603 609 -424 -51 297 -437 616 -354 -135 -28 27 453 -247 65 72 -457
5776 -457 563 -645 53 -164 -453 366 -433 316 56 -243 203 -15 286 -341 -174 247 -203 111 -293
5795 -293 -276 456 -345 250 282 -269 130 -322 88 387 -246 -243 -81 259 58 -233 340 -207 335 75 -164
5816 -164 366 -306 133 -1 70 154 36 -38 138 138 -181 -22 65 27 -13 254 -122 138 107 73 -63 -177 252
5839 252 -10 -73 25 -377 254 -52 162 289 -235 -36 -69 65 287 -7 84 0 25 197 -151 315 -32 -44
5861 -44 171 207 -57 -50 -143 4 -44 -57 206 108 -104 -201 397 62 -72 -126 -60 12 126 -118 69 -115 11 -15
5885 -15 166 -48 9 -195 -56 82 180 17 -111 -82 -480 68 51 36 -206 154 64 -70 178 102 -4 273 -10
5908 -10 62 -21 -88 67 136 128 52 -338 30 -165 43 113 -11 138 -32 35 237 -252 344 20 -35 187 185 -48
5932 -48 -61 24 145 -73 -135 120 298 0 -63 -18 -239 -91 126 -53 -39 240 -134 -199 162 -180 -218 -142 -89 263
5956 263 -36 -8 19 36 -38 -128 -94 118 -26 145 34 -156 100 -95 206 -67 -267 101 -150 -71 58 -181
5978 -181 70 -30 329 250 -134 -84 69 -5 -19 -116 141 -256 -69 56 -305 206 23 22 61 -123 -55 -142 344
6001 344 167 77 345 -274 147 291 -45 -57 86 -164 -215 -93 -18 -179 60 -236 398 256 -39 390 -134
6022 -134 26 -10 -13 54 -211 -72 -317 91 281 53 -54 109 -271 119 -191 392 -100 -91 80 79 -72 -83 -48
6045 -48 1 -132 -168 231 -170 282 -258 -194 19 232 269 -500 -6 -99 21 6 -36 254 -32 -207 63 -78 406
6068 406 -202 50 480 -357 25 96 183 -153 65 58 271 122 -238 -342 218 3 -107 -62 -167 192 -85 -104
6090 -104 216 -68 11 -436 73 212 -295 -252 89 216 75 -434 266 -10 -136 -47 -24 309 -4 -77 -148 94
6112 94 322 -452 200 37 37 41 -348 131 208 -56 -120 -334 319 49 -425 115 -101 244 -180 -230 89 -349 172
6135 172 -69 -15 -70 70 22 159 27 149 46 -25 -7 89 117 -349 304 -158 -153 7 -91 137 -201 -125 4 -366
6159 -366 292 -299 249 56 -359 163 -285 -7 252 -236 123 -55 155 151 -163 130 -99 160 89 -279 166
6180 166 -280 50 -101 -337 231 -24 138 21 -64 143 -106 111 236 -129 209 -171 110 318 -262 269
6200 269 -6 52 158 -28 409 -228 -12 -139 -288 88 -32 157 182 -284 298 -130 79 21 -215 261 26
6221 26 332 7 -225 94 -320 184 -229 -62 374 -401 110 -136 -45 220 -226 138 -40 8 279 -233 162
6242 162 -167 -24 244 -271 160 65 13 245 -214 274 -116 -275 141 -45 204 -73 97 250 -262 181 9
6263 9 -355 248 -316 -74 -288 64 38 -384 -69 17 -226 109 -210 326 -233 -38 18 -333 96 41 -52 -50 -349
6286 -349 88 -95 -166 101 -248 222 56 66 18 -228 201 -236 -46 139 -270 83 -32 -25 -12 -57 138 22
6308 22 -128 184 -53 59 -120 109 30 -274 109 -180 -222 474 -70 160 -261 37 -13 -335 339 13 278
6329 278 139 -194 316 -74 -32 171 -87 101 -203 -132 141 59 49 -113 136 129 -256 31 -33 150 202 -196 67
6352 67 -71 84 187 125 210 -81 -18 54 -185 56 -99 -14 -118 -8 100 90 -144 -87 -130 -158 25 7 1 10 102
6377 102 8 44 -106 -222 237 116 -136 234 140 -21 -183 17 136 5 -43 -98 25 66 -116 293 -8 104
6399 104 -76 -62 29 61 180 -87 -133 -195 -124 57 35 -322 -73 -11 -207 -108 119 64 -206 253 53 155 -202
6422 -202 -133 -95 -70 69 -120 -131 -96 121 151 16 -268 -122 122 -115 -70 -104 -87 163 -33 44 -187 56 94 -74
6446 -74 -22 -40 121 150 306 91 270 130 77 -174 161 168 -298 11 -27 59 74 264 -147 32 -171 -243 48 -116
6470 -116 168 -59 -105 99 -337 94 124 -248 235 -200 5 196 -158 34 -6 73 78 -166 201 -109 42 303
6492 303 -36 34 38 279 -48 -3 386 -236 55 -82 -321 261 -30 156 31 -118 319 -318 315 72 -251
6513 -251 65 31 230 -189 -238 9 -106 214 218 -103 78 -204 32 -95 -176 319 -70 63 78 -212 195 -434
6535 -434 81 187 -101 221 -254 84 -96 -304 250 -263 0 -51 47 376 -378 -165 -177 66 168 -432 43
6556 43 -54 -56 243 -184 71 -66 -46 318 -235 161 -7 -121 186 -330 513 -167 -199 -8 -415 126 -170 -186
6578 -186 154 -154 119 -262 -80 415 -294 547 -326 -73 151 -475 338 -197 116 171 -258 477 47 -179
6598 -179 57 -329 216 -375 60 303 -399 576 -209 3 65 -445 360 -212 -272 173 -323 221 -135 34 79
6619 79 -174 166 -160 -34 398 -310 363 -113 163 155 -374 289 -712 34 102 -284 330 -280 63 358 -148
6640 -148 444 -313 48 239 -355 513 -382 325 174 -477 142 -33 193 151 -398 588 -163 117 -87 -355
6660 -355 294 -109 149 98 18 339 -507 199 285 -294 192 -202 340 163 -314 427 -317 78 228 -360 301
6681 301 -241 149 -100 -163 216 -376 304 -179 -112 263 -215 -76 137 -341 120 -290 178 141 -303 -12 -195
6702 -195 416 -78 -223 255 -172 111 -84 -147 398 -252 17 103 34 189 -335 143 50 -53 141 -111 161
6723 161 16 102 38 -245 232 -200 -149 176 -281 271 -52 -224 321 -168 -45 -35 -139 115 -397 271 188 -134
6745 -134 -58 -345 278 135 -472 211 -284 233 -204 -287 286 -254 2 -1 -184 338 -187 -19 -39 198 260 -52
6767 -52 188 -181 -289 184 -72 14 54 240 3 -12 73 -83 -167 63 -110 208 -60 176 118 -122 339 -328
6789 -328 -1 77 -110 40 -250 -171 39 -119 -51 -93 15 163 -315 83 -232 127 -10 -88 155 94 -39 -46 -21
6812 -21 360 -236 -72 297 187 260 -104 47 111 150 -88 -5 -168 233 -86 -162 5 67 -21 -120 92 -54 -28
6835 -28 -37 -8 -174 50 70 285 -5 128 57 35 184 11 212 -149 -94 -71 73 -82 115 -56 -184 -74 -77 -217
6859 -217 276 138 -160 -35 -274 -102 -190 125 92 -45 -200 -17 -33 -16 -21 -150 65 -49 -212 -180 265 45
6881 45 94 114 149 114 -164 -188 -2 -30 -20 -51 -117 42 -271 -84 -76 -81 -14 110 158 -46 94 41 -24 191 -43 -81
6907 -81 159 130 -200 -314 206 63 -149 -62 -217 -57 161 -7 223 99 148 -144 202 265 -163 -263 130 95
6929 95 125 -76 -219 -53 -231 -233 133 -80 -151 -214 10 -99 255 -72 101 24 50 -205 123 -81 47 -122 -143
6952 -143 133 -303 118 -64 -25 -203 -284 193 -137 46 -127 -108 -3 173 -157 81 11 -172 0 76 117 -54
6974 -54 10 -9 -4 222 60 99 -82 18 -19 -8 23 -167 -8 -180 -36 -36 -128 41 -13 189 0 -242 -49 20 -12
6999 -12 259 40 33 37 -49 -45 -11 -307 54 79 6 13 -92 -178 -199 39 80 110 -147 -5 -170 -49 169 -120 -204 -95
7025 -95 62 -105 -156 82 5 29 -61 -126 135 -12 -12 179 2 183 -49 -165 208 49 46 -115 -174 -24 -87 -195
7049 -195 -160 -71 249 -180 -299 47 353 -202 -53 209 46 118 -177 -179 166 -111 140 -50 -111 -48 172 -144
7071 -144 -64 193 111 141 111 -70 -155 35 324 -78 52 -161 -35 -1 -62 84 -51 42 74 9 -27 -55 -67 -325
7095 -325 -27 185 -263 144 -80 141 -113 35 -201 -88 132 -153 -10 -246 -65 -36 24 -72 -41 124 -195
7116 -195 -9 -159 -39 -26 236 180 74 43 -292 -28 -176 -213 92 -306 68 182 -5 84 -69 -81 -47 141
7138 141 -188 -23 325 -39 72 -64 -105 44 -110 -136 64 -130 54 216 -136 -102 -31 26 1 -291 141 -42
7160 -42 75 190 -50 64 -246 116 21 19 161 25 181 -224 16 89 -319 434 30 31 61 6 46 16 30 25 -280
7185 -280 196 -91 185 257 -257 222 -76 -106 -106 -293 74 -195 57 21 -202 307 -247 127 -201 -54 66 -173
7207 -173 94 156 -206 -95 120 -120 8 -236 305 -138 6 91 100 266 71 -7 -60 -192 -4 -307 -3 -103
7229 -103 -216 -12 -70 13 -72 42 41 11 188 -100 -198 249 -39 203 -57 -65 91 -206 -53 127 -84 37 -233
7252 -233 64 111 40 400 -100 231 56 -110 297 -122 110 -102 -160 190 -39 40 -117 -213 137 40 72 116 -52
7275 -52 76 -84 72 102 82 47 25 254 226 -167 193 64 79 48 -240 53 -168 111 114 -69 57 29 -68 -121
7299 -121 52 143 -151 -36 169 -140 294 -94 -55 -90 -27 162 -31 206 54 -38 86 -192 85 164 26 -195
7321 -195 13 -16 -58 -71 2 86 -133 -207 -49 123 -155 29 -41 75 -225 158 -77 -67 57 38 -21 208 5
7344 5 -105 304 -36 75 117 -58 -160 14 -63 -240 -163 112 296 -136 -25 -128 -184 -409 92 -84 5 193
7366 193 2 15 -14 153 -224 31 278 -99 30 316 112 -10 -34 -42 37 34 -262 -36 -200 63 -40 150 35
7389 35 71 169 -287 -77 -397 -87 -152 -192 98 58 -22 -18 -57 -112 173 66 220 -157 -64 55 -235 10 -157 -132
7413 -132 -14 31 19 15 37 40 -127 -134 -7 -233 116 23 -30 -2 -72 224 196 -24 -165 -21 167 -209 -41 128 220
7438 220 -219 -81 130 -93 -126 -119 177 -90 -35 178 131 -143 -308 75 120 132 47 -78 214 203 -44 211 -125
7461 -125 138 147 4 13 84 157 -77 21 -5 -94 191 51 24 83 -61 129 -16 30 -117 106 -73 8 104 260 -161
7486 -161 -209 142 -129 311 129 197 164 9 35 110 -66 -10 -205 210 -83 -186 -169 -1 -121 -105 -62 242 145
7509 145 110 158 -95 -28 50 -3 -40 56 -46 92 169 280 -97 212 -172 92 -194 -204 -107 -65 -111 -62 -78 221 -150
7534 -150 117 -21 20 303 -166 30 -78 53 188 -57 267 -208 -6 112 126 211 -260 -39 -33 -173 -88 42
7556 42 -27 249 86 30 -290 -176 76 -141 22 -97 65 -374 -79 -32 -111 91 -3 -174 122 -85 178 -63
7578 -63 -252 430 135 0 -53 -20 18 14 -33 156 -255 94 -176 -27 6 -50 198 -11 14 10 -180 -95 -1 -145 -41
7603 -41 60 101 -10 176 -180 -50 251 -138 30 54 -132 28 -226 31 20 48 -123 71 17 43 -194 -58
7625 -58 -97 -29 -15 -49 220 -186 -20 -90 116 196 13 114 -64 -200 168 -80 -145 3 14 503 -130 209 99
7648 99 -26 35 -373 357 -206 -47 90 -2 307 -82 40 -2 -126 166 -239 -152 22 -215 -22 -156 -157 45
7670 45 -130 163 -192 -233 119 -176 54 -115 207 -104 -407 158 -87 125 -198 -331 -39 -237 35 68 12
7691 12 30 -34 155 104 -112 136 -115 109 59 -60 -3 -99 -71 -5 -2 123 -253 132 -89 -146 263 -277 62 64 225
7716 225 157 -204 -147 190 -66 -85 -247 137 -134 131 120 73 -258 30 -134 -13 -33 48 69 -48 -40 90 -167
7739 -167 -23 73 107 -10 77 156 67 146 -21 -126 34 68 122 -207 -96 47 -239 -138 -208 23 -1 19 -38 -127
7763 -127 389 10 109 -127 -56 -194 37 -190 246 74 -30 -62 79 -29 89 154 54 -51 171 -348 176
7784 176 61 -102 197 3 219 25 204 54 -86 -80 33 -57 72 -23 -74 -42 -13 90 -94 -1 -143 -106 13
7807 13 -162 -21 -11 94 -46 -114 63 93 -283 -24 -100 -173 28 134 -25 146 87 -190 35 156 23 26 85
7830 85 110 23 -113 -120 -35 54 -13 60 -155 -130 209 23 -41 337 -31 -108 87 -157 -83 -164 -83 -80 38 181 87 28
7856 28 65 -1 -133 -30 70 200 -56 14 -127 22 -99 -44 143 -107 165 -197 -196 183 97 -150 -61 -150 -72 -91
7880 -91 53 -37 197 -189 -37 -143 140 -96 66 24 -29 220 41 77 -216 -68 -55 1 69 189 -10 146 -157
7903 -157 9 143 -73 -19 -96 -151 -72 26 -40 -127 104 19 -16 -58 -62 126 -85 -178 70 -78 41 -67 -114 -1 142
7928 142 -159 -81 -101 -144 -66 -42 105 111 -7 -144 -129 -65 -112 92 -166 104 57 154 4 -160 -82 -29 -13 -148 -98
7953 -98 -60 -229 -5 156 -95 -19 -105 -84 15 125 -85 184 206 -191 127 74 -75 -68 132 -157 -5 -330 -30
7976 -30 -108 85 25 -88 115 72 -88 -83 55 17 4 59 113 140 -114 -223 -64 51 36 73 89 -86 226 168 -126
8001 -126 -19 -123 -30 -38 -162 322 -202 -113 100 -100 -135 111 -38 -68 108 -23 -94 -98 -160 -50 131 -5 59 55
8025 55 -226 -52 44 49 -49 31 314 21 -114 84 4 111 -43 -57 57 139 6 -139 70 167 113 99 -131 172
8049 172 56 57 -79 -200 -12 -145 -63 -341 90 159 117 -7 142 -130 -44 -12 75 29 -21 100 -184 -25 100
8072 100 380 -50 -90 144 -400 172 8 -240 167 309 86 -172 50 38 -57 -86 1 158 -261 -109 247 -115
8094 -115 198 -94 175 82 140 129 -225 -22 54 -27 -84 47 0 -107 44 242 46 11 165 -119 113 -9 -165
8117 -165 -19 -86 98 190 -39 -243 129 31 46 101 42 177 -168 -98 -28 16 181 -39 -317 203 -111 -321 88
8140 88 68 25 -144 -322 122 -148 -100 246 -67 111 -438 165 -1 -105 145 -210 -137 -28 -212 73 2 36
8162 36 -12 -27 -54 10 76 -98 -190 100 -143 134 281 -134 -44 -124 -33 -131 -78 93 -116 -329 13 17 -41 40 78 -48
8188 -48 94 190 -141
8191a41
##END NTUPLES=NMR FID
##END=
