##TITLE=1H_LR-754-C1
 CCl4
 8 sc, 
 20.10.2022
##JCAMPDX= 6.0         $$ Bruker NMR JCAMP-DX V2.0
##DATA TYPE= NMR FID
##DATA CLASS= NTUPLES
##ORIGIN= UXNMR, Bruker Analytische Messtechnik GmbH
##OWNER= root
$$ XWIN-NMR		Version 3.5
$$ Thu Oct 20 14:01:38 2022 Russian Standard Time (UT+4h)  she@DPX200
##.OBSERVE FREQUENCY= 200.1313499994
##.OBSERVE NUCLEUS= ^1H
##.DELAY= (6, 6)
##.ACQUISITION MODE= SIMULTANEOUS
##.ACQUISITION SCHEME= undefined
##.AVERAGES= 8
##.DIGITISER RES= 18
##SPECTROMETER/DATA SYSTEM= spect
##.PULSE SEQUENCE= zg30
##.SOLVENT NAME= DMSO
##.SHIFT REFERENCE= (INTERNAL, DMSO, 0, 15.7039)
##AUDIT TRAIL= $$ (NUMBER, WHEN, WHO, WHERE, WHAT)
$$ ##TITLE= Audit trail, XWIN-NMR		Version 3.5
$$ ##JCAMPDX= 5.01
$$ ##ORIGIN= Bruker BioSpin GmbH
$$ ##OWNER= she
$$ F:/spectra/data/she/nmr/H-F/1/audita.txt
$$ ##AUDIT TRAIL=  $$ (NUMBER, WHEN, WHO, WHERE, WHAT)
(   1,<2022-10-20 14:00:35.17 +0400>,<she>,<DPX200>,
      <created by zg, POWCHK disabled, PULCHK disabled
       configuration hash MD5:
       00 E9 B6 7A A2 85 ED C7 34 08 36 98 17 FE 4E 26
       data hash MD5: 16K
       2D 1C 71 E1 0C B2 62 52 2C 2C 66 50 71 5B 84 00>)
$$ ##END=
$$ 
$$ hash MD5
$$ 99 9F 08 C4 1E 0D 2A F8 76 10 AE 66 97 19 55 48
##$RELAX= 
##$RELAX= 
##$RELAX= 
##$RELAX= 
##$RELAX= 
##$RELAX= 
$$ Bruker specific parameters
$$ --------------------------
##$DU= <F:/spectra>
##$EXPNO= 1
##$NAME= <H-F>
##$PROCNO= 1
##$TYPE= <nmr>
##$USER= <she>
##$AMP= (0..31)
100 100 100 100 100 100 100 100 100 100 100 100 100 100 100 100 100 100 
100 100 100 100 100 100 100 100 100 100 100 100 100 100 
##$AQSEQ= 0
##$AQ_mod= 1
##$AUNM= <au_zg>
##$AUTOPOS= <>
##$BF1= 200.13
##$BF2= 200.13
##$BF3= 200.13
##$BF4= 200.13
##$BF5= 200.13
##$BF6= 200.13
##$BF7= 200.13
##$BF8= 200.13
##$BYTORDA= 1
##$CFDGTYP= 0
##$CFRGTYP= 5
##$CHEMSTR= <none>
##$CNST= (0..31)
1 1 145 1 1 1 1 1 1 1 1 1 1 1 1 1 1 1 1 1 1 1 1 1 1 1 1 1 1 1 1 1 
##$CPDPRG= <>
##$CPDPRG1= <>
##$CPDPRG2= <>
##$CPDPRG3= <>
##$CPDPRG4= <mlev>
##$CPDPRG5= <mlev>
##$CPDPRG6= <mlev>
##$CPDPRG7= <mlev>
##$CPDPRG8= <mlev>
##$CPDPRGB= <>
##$CPDPRGT= <>
##$D= (0..31)
0 1.2 0 0 0 0 0 0 0 0.06 0 0.03 0 0 0 0 0.0002 0 0 0 0 0 0 0 0 0 0 0 0 
0 0 0 
##$DATE= 1666260034
##$DBL= (0..7)
120 120 120 120 120 120 120 120 
##$DBP= (0..7)
150 150 150 150 150 150 150 150 
##$DBP07= 0
##$DBPNAM0= <>
##$DBPNAM1= <>
##$DBPNAM2= <>
##$DBPNAM3= <>
##$DBPNAM4= <>
##$DBPNAM5= <>
##$DBPNAM6= <>
##$DBPNAM7= <>
##$DBPOAL= (0..7)
0.5 0.5 0.5 0.5 0.5 0.5 0.5 0.5 
##$DBPOFFS= (0..7)
0 0 0 0 0 0 0 0 
##$DE= 6
##$DECBNUC= <off>
##$DECIM= 32
##$DECNUC= <off>
##$DECSTAT= 4
##$DIGMOD= 1
##$DIGTYP= 9
##$DL= (0..7)
0 120 120 120 120 120 120 120 
##$DP= (0..7)
150 150 150 150 150 150 150 150 
##$DP07= 0
##$DPNAME0= <>
##$DPNAME1= <>
##$DPNAME2= <>
##$DPNAME3= <>
##$DPNAME4= <>
##$DPNAME5= <>
##$DPNAME6= <>
##$DPNAME7= <>
##$DPOAL= (0..7)
0.5 0.5 0.5 0.5 0.5 0.5 0.5 0.5 
##$DPOFFS= (0..7)
0 0 0 0 0 0 0 0 
##$DQDMODE= 0
##$DR= 18
##$DS= 0
##$DSLIST= <SSSSSSSSSSSSSSS>
$$ [...]
##$SUBNAM2= <"">
##$SUBNAM3= <"">
##$SUBNAM4= <"">
##$SUBNAM5= <"">
##$SUBNAM6= <"">
##$SUBNAM7= <"">
##$SUBNAM8= <"">
##$SUBNAM9= <"">
##$SW= 18.0517283424941
##$SWIBOX= (0..15)
0 0 2 0 0 0 0 0 0 0 0 0 0 0 0 0 
##$SW_h= 3612.71676300578
##$TD= 16384
##$TD0= 1
##$TE= 0
##$TE2= 300
##$TE3= 300
##$TEG= 300
##$TL= (0..7)
0 120 120 120 120 120 120 120 
##$TP= (0..7)
150 150 150 150 150 150 150 150 
##$TP07= 0
##$TPNAME0= <>
##$TPNAME1= <>
##$TPNAME2= <>
##$TPNAME3= <>
##$TPNAME4= <>
##$TPNAME5= <>
##$TPNAME6= <>
##$TPNAME7= <>
##$TPOAL= (0..7)
0.5 0.5 0.5 0.5 0.5 0.5 0.5 0.5 
##$TPOFFS= (0..7)
0 0 0 0 0 0 0 0 
##$TUNHIN= 0
##$TUNHOUT= 0
##$TUNXOUT= 0
##$USERA1= <user>
##$USERA2= <user>
##$USERA3= <user>
##$USERA4= <user>
##$USERA5= <user>
##$V9= 5
##$VALIST= <valist>
##$VCLIST= <CCCCCCCCCCCCCCC>
##$VD= 0
##$VDLIST= <DDDDDDDDDDDDDDD>
##$VPLIST= <PPPPPPPPPPPPPPP>
##$VTLIST= <TTTTTTTTTTTTTTT>
##$WBST= 1024
##$WBSW= 4
##$XGAIN= (0..3)
0 0 0 0 
##$XL= 0
##$YL= 0
##$YMAX_a= 784318
##$YMIN_a= -981237
##$ZGOPTNS= <>
##$ZL1= 120
##$ZL2= 120
##$ZL3= 120
##$ZL4= 120
##$ABSF1= 10
##$ABSF2= 0
##$ABSG= 5
##$ABSL= 3
##$ALPHA= 0
##$AQORDER= 0
##$ASSFAC= 0
##$ASSFACI= 0
##$ASSFACX= 0
##$ASSWID= 0
##$AUNMP= <proc_1d>
##$AZFE= 0.1
##$AZFW= 0.1
##$BCFW= 1
##$BC_mod= 2
##$BYTORDP= 1
##$COROFFS= 0
##$CY= 11.3945322036743
##$DATMOD= 1
##$DC= 2
##$DFILT= <>
##$DTYPP= 0
##$F1P= 2.36226072786647
##$F2P= -0.459571619588291
##$FCOR= 0.5
##$FTSIZE= 0
##$FT_mod= 4
##$GAMMA= 1
##$GB= 0.15
##$INTBC= 1
##$INTSCL= 1
##$ISEN= 128
##$LB= 0.24
##$LEV0= 0
##$LPBIN= 0
##$MAXI= 10000
##$MC2= 0
##$MEAN= 0
##$ME_mod= 0
##$MI= 1.114404
##$NCOEF= 0
##$NC_proc= 0
##$NLEV= 6
##$NOISF1= 3.799351
##$NOISF2= 2.8
##$NSP= 1
##$NTH_PI= 0
##$NZP= 0
##$OFFSET= 15.70392
##$PC= 1
##$PHC0= -18039.25
##$PHC1= 17.0007
##$PH_mod= 1
##$PKNL= yes
##$PPARMOD= 0
##$PSCAL= 0
##$PSIGN= 0
##$REVERSE= no
##$SF= 200.130013532006
##$SI= 16384
##$SIGF1= 3
##$SIGF2= 2
##$SINO= 400
##$SIOLD= 16384
##$SREGLST= <1H.CDCl3>
##$SSB= 0
##$STSI= 0
##$STSR= 0
##$SW_p= 3612.71676300578
##$SYMM= 0
##$S_DEV= 0
##$TDeff= 0
##$TDoff= 0
##$TI= <>
##$TILT= no
##$TM1= 0
##$TM2= 0
##$TOPLEV= 0
##$USERP1= <user>
##$USERP2= <user>
##$USERP3= <user>
##$USERP4= <user>
##$USERP5= <user>
##$WDW= 1
##$XDIM= 8192
##$YMAX_p= 0
##$YMIN_p= 0
$$ End of Bruker specific parameters
$$ ---------------------------------
##NTUPLES= NMR FID
##VAR_NAME=  TIME,          FID/REAL,        FID/IMAG
##SYMBOL=    X,             R,               I
##VAR_TYPE=  INDEPENDENT,   DEPENDENT,       DEPENDENT
##VAR_FORM=  AFFN,          ASDF,            ASDF
##VAR_DIM=   8192,          8192,            8192
##UNITS=     SECONDS,       ARBITRARY UNITS, ARBITRARY UNITS
##FACTOR=    0.0002768,     1,               1
##FIRST=     0,             0,               0
##LAST=      2.2672688,     0,               0
##MIN=       0,             -981237,         0
##MAX=       2.2672688,     784318,          0
$$ Real data points
##PAGE= N=1
##DATA TABLE= (X++(R..R)), XYDATA
$$ [...]
2343a331J190J675m412O558o650M353n62k387L721m506M707m056J930O02k526
2358a694L418l971M420m008K245J211m131N513n245M259k660m12L896o342N416
2373A915l123J301L60j781L801m891L963k156P62L91j649L599n681N394k825p93
2389a413L327m468N615n679L482O98m490O114n167L291j575m76K895m791M499
2404A862k786Q08O7m28J981l918M253k204l2R71j394K544l606L100j081j141J872
2421H68j601J067j309K041j402j65J207p63R87k839M025k794k31K707l959M535
2437B374m584K799N58l820O332o247L567j86k161L611n369O186l823p96L625m070
2453b004M238m631L329J13l288M856m639L306q07j475K713l798M188k388j676
$$ y = [-1331, -141, 1534, -2878, 3680, -2970, 1383, 821, -1566, 2155, -2351, 2356, -1700, 230, 832, -1694, 1724, -2247, 2173, -1835, 410, 1621, -2510, 3003, -2242, 2017, -643, -1055, 2841, -3501, 1915, -1208, 93, 453, -1328, 2473, -2418, 1545, -611, 151, 542, -1107, 2492, -3189, 2205, -620, -1413, 1914, -2554, 3061, -2618, 864, 1562, -2928, 3186, -1981, 1310, -265, -741, 2154, -2637, 1862, -924, -116, -49, -477, 1504, -2414, 1839, -365, -397, 574, -820, 1724, -1882, 1218, 137, -1004, 868, -733, 334, -975, 1066, -336, -501, 706, -57, 930, -1909, 2116, -678, -909, 1798, -2161, 2374, -2210, 589, 1147, -2673, 3659, -2588, 979, 793, -1368, 2243, -3126, 3060, -763, -1559, 2066, -2004, 2234, -2397, 932, 1045, -2243, 2613, -2026, 1280, 473, -1002, 1711, -2087, 2101, -287, -1963]
2468a963L870k704J025o85r2K234l057J155J721k953K624j347p91K711l388K818
2484A178k147N22L320o351N106j599l58J752m436O593n224J066K215m229N990
2499C398o075L304J10k939O098p987O146q43l548N165o282O925m080k231O605
2514C766o846N325l399m82M946o487N188k935LM204o601M630r68q99K342n161
2530c374N891k392k367M270m307M733l261j075N035n724M968l592k21N026p073
2545c463N210k956J061L058p882Q220l748k47L152o313Q484o312O25L778o485
2560c818Q107p128J801M060o294O632o591L792K569p304P574n711L673K11n802
2575d229Q387o400K877K93m337P780p283L165Q11l284O414q324N404N30m435N765
$$ y = [-1963, 1907, -797, 228, -457, -549, 1685, -1372, -217, 1504, -1449, 1175, -172, -963, 1748, -1640, 1178, -969, -447, 2873, -3478, 1628, 29, -329, 1423, -3013, 3580, -1644, -578, 1637, -2592, 3398, -2677, 627, 737, -2202, 3896, -4091, 2055, 1212, -2336, 2829, -3453, 3472, -608, -2839, 3766, -3080, 2245, -1154, -1636, 3310, -3177, 2011, -924, -921, 3283, -3318, 1312, 344, -555, 1787, -3374, 2517, 125, -2242, 2028, -2279, 2454, -807, -1882, 3153, -2571, 2397, -1195, -1416, 3610, -3463, 1747, -1209, -148, 2910, -4972, 3248, -500, -747, 2405, -3908, 4576, -1736, -1111, 2667, -3818, 4289, -2839, -1038, 3022, -3272, 3360, -3231, 561, 3130, -4174, 3400, -2311, 1362, 1573, -4229, 4158, -2242, 635, 928, -3409, 4371, -2912, 253, 1064, -2220, 4194, -4130, 1274, 1804, -2631, 3134]
2591C134o776O000j415m217O724o433N259k326l053P140o669M096j636j764O299
2606D363p946M626k27k588N178p361N755j090l274N548o270O092k570k964O302
2621C574o475N619l767j186O331p695N804l682M95M863q360P440l827M08L306
2636B848p323Q341m963K29K888n819P968o376J682K844m847N775n983L080K008
2651B352n158N407m500K740P83m711N222l224J451K94l302N527l971O43J764l207
2667a890M689m755J413K413m022M489m734K711J708n255N814m656L307R1m712
2682c389P103n750L218q93k735O212o769L960q69j832M797o469M964j259j255
2697i66L164n322N724k826q24K695l526M103l378L16K494l268K818k230Q42J597
$$ y = [3134, -3642, 2358, 943, -3274, 3450, -2983, 2276, -50, -3103, 4037, -2632, 1464, -172, -1936, 4363, -3583, 1043, 816, -1772, 3406, -3955, 1800, 710, -2564, 2984, -3286, 2806, 236, -2728, 3574, -2901, 2718, -1049, -2235, 4096, -3599, 2205, -1477, -982, 3881, -4479, 2961, -866, -458, 2848, -4475, 3866, -1097, -868, 2020, -3799, 4169, -2207, -525, 2319, -2528, 3247, -2736, 344, 2352, -2806, 2601, -1899, 841, 1624, -3087, 2135, -1089, 362, 656, -2646, 2881, -1090, -447, 1317, -1890, 2799, -1956, -543, 1870, -2152, 2337, -2397, 314, 2022, -3233, 2581, -2075, 1232, 1323, -3389, 3714, -2036, 1182, 289, -2446, 3766, -3003, 957, 88, -1744, 3053, -3416, 1548, 289, -966, 2198, -3124, 2600, -226, -1050, 1645, -1881, 2222, -1156, -840, 1654, -1614, 1204, -1026, -184, 1413]
2713A413k600J763o75R0J191k649K101q9j495J674j859K114o64j735L101l029
2729a348K461j152j473L425l680K964j729j44K655m568M035k394Q49J437l547
2744b209M677l632J277M89k334M054l959K280m95j168K583l298K679q91n09J197
2760G41j959K264j336N0N99o09O50p67L14R2L8j61J42k59K00K42p55J487j391
2779d18O94j37m78J256k038J736q30r1J248k165K569k399J290J85j619K706k932
2796a423K052p74n04J858k804K820j565r5J174j496J669j807J403n92k29J305
2812I92j794J633j398J072n38p03J638j705J343r13P15kj108J558j440R97n51
2829b04K63J97p43J302j640J328q39O3P58j366K147k147J237J79j299J647j915
$$ y = [1413, -1187, 576, -99, -9, 1182, -1467, 634, 545, -950, 724, -1135, 979, 315, -1420, 1681, -1348, 1113, -39, -1512, 1913, -1767, 1197, -532, -676, 1979, -2589, 1446, -948, -99, 1338, -2209, 2468, -1164, 113, 602, -1732, 2322, -1637, 643, 148, -1020, 1563, -1735, 944, 53, -456, 741, -1218, 1046, -290, -240, 359, -250, 400, -367, -53, 39, 77, -84, 58, -201, -1, 241, -514, 973, -418, 276, 139, -339, 917, -1121, 615, -215, -306, 942, -1223, 1346, -1053, 237, 422, -1197, 1509, -1423, 629, -145, -649, 1209, -1595, 1225, -340, -435, 739, -757, 912, -895, 508, -84, -313, 992, -802, 831, -567, 505, -33, -736, 902, -803, 540, -373, 342, 340, -768, 790, -650, 347, -204, 59, 256, -487, 815, -825, 503, -336, -273, 485, -881, 1266, -881, 356, 535, -764, 883, -1032]
2846a032J847j232K4J149j944J885j276Q72k70k28J001j778J712j089O26j32r39
2863h04J867k241J645m77n32J118j336J627j641R21K97o54P30j127J037r61P59
2880B28p9r67J311j202J421j126M74N78j579J662j408J092l33m63J030j922J986
2897G03r75L72p8k49J290j907J639r89J09P04j362J747j860J354l02j254K087
2914A029j827J162m97j08Q43j241J243p58l7M63n05K72n31Q33o46j9L66J3J51
2933B06n95R89o30J75j07q7K71o95R16q79L64J36l41N77j049J804j789M25J107
2952G98j689J941k112J538k50j194K128k264J597m18o91J684k140K053j436M3
2968d12J223j710J438r96O25M1j359J931j102K83K01m24R12j017M16L0k50Q94
$$ y = [-1032, 815, -417, -393, 756, -1188, 697, -579, 293, 23, -205, 796, -982, 730, -359, 267, 135, -804, 1063, -1178, 467, -10, -542, 576, -760, 867, -774, 147, 444, -210, 520, -607, 430, -531, 228, 149, -818, 493, -709, 712, -414, 60, 638, -941, 721, -687, 405, 72, -391, 639, -1283, 703, -272, 100, 22, -227, 1063, -844, 795, -194, -85, 619, -743, 1004, -856, 498, 196, -1058, 1029, -798, 364, -133, -241, 602, -639, 604, -154, -191, 272, -233, 39, -492, 341, -305, -324, 42, 55, 206, -389, 600, -30, 145, 38, -49, 222, -473, 443, -436, -72, 64, -277, 300, -749, 1055, -734, -309, 798, -891, 1050, -1062, 476, 226, -968, 1160, -1104, 493, 75, -616, 1068, -1072, 981, -455, -412, 811, -899, 539, -457, 168, 209, -1150, 781, -321, -38, 163, -261, 651, -366, 50, 80, -170, 724]
2986G24j166J07R60r46M28n58L20Q90j856J514l40l51J115j800J714r22l45J582
3004A070k428K546j581j89J394j992K303k376J104J317k324K065j782J466k75
3019C18j660K491k152J644p52j120K597k256J340p19j98K005k730J608l17k45
3035a46R03k013J871n35o19J366j740J770o82j204J878j519J221o65p47K433k357
3052g85R15m4o73J878k764J949l33o94J634k785K931j039q35J611k060K469k173
3069g98q0K143k450K221k168J278J190k737K217j513J136M75k687L120j752Q39
3085D34j49j626K808k262L88O22r48K210k526R30J174j828J617k016J354M02j977
3102a393K075j397J314m28j599K841k144R19l6j005K460k848J181M99j131J968
$$ y = [724, -442, -335, 625, -321, 107, -451, -131, 759, -1097, 417, 77, -274, 841, -959, 755, -167, -512, 1070, -1358, 1188, -393, -582, 812, -1180, 1123, -1253, -149, 1168, -1156, 909, -873, 593, 318, -1342, 1149, -1003, 641, -111, -1231, 1366, -890, 450, -269, -467, 1538, -1192, 416, 99, -146, 757, -1256, 615, 80, -539, 827, -913, 857, 175, -1029, 849, -670, 551, -114, -861, 1572, -785, 130, 86, -587, 1291, -1473, 476, 143, -551, 1083, -1702, 1229, 190, -645, 966, -1094, 1375, -798, -878, 1265, -1185, 1036, -1132, 146, 1336, -1401, 816, -697, 439, 914, -1773, 1347, -405, 434, 285, -1341, 1467, -795, -407, 215, -733, 1477, -1049, -119, 1055, -773, 844, -1172, 182, 584, -1393, 682, -715, 599, 171, -1428, 1413, -731, 188, 152, -853, 1607, -1241, -60, 439, -692, 1276]
3118A276k940K084K22j566J642j967K482r46j530K555j939J726j463o08K448k473
3134i97J452r97K01J541k705J977m00k54J126k363K416q41q05J214j700K543j771
3151c63m40J614j646J660j540N17J363k114J707j402J171M10k288J974q47L96
3167A72P9j562K485j369n0N01q44J851k062Q26P72j465J225j478J202M56j743
3184a004J504q28Q89j86j421J993j237N52k21p41J881k067Q21n9m17J533k073
3201a081J568k03o83J074j461J507o74n79R81j136J442j025j86R31j153R65n46
3218b59R4R70j351Q24k46l7L95j086R95m14p2K85o17J058p38k72P45o89R61q65
3238c19P6R32j058P26p20J55P44j227R98n72J57M44r56J388j076K52M22p10J204
$$ y = [1276, -1664, 420, 642, -924, 718, -1249, 1233, 287, -1243, 1312, -627, 1099, -364, -972, 1476, -997, 455, -542, -341, 1200, -1505, 472, 72, -182, 944, -1419, 997, 156, -649, 565, -1135, 1408, -363, -803, 811, -835, 825, -715, -198, 1165, -949, 758, -644, 527, 937, -1351, 623, -224, 172, 251, -1311, 1174, -195, -245, 256, -588, 1263, -799, 27, 799, -666, 559, -919, 283, 739, -1004, 500, -328, 561, 375, -1046, 947, -290, 262, 41, -700, 1181, -886, -65, -124, -541, 992, -1081, 487, 284, -399, 675, -786, 721, 47, -532, 449, -687, 755, -270, -456, 475, -678, 287, -259, -165, 805, -546, 278, 32, -5, 390, -696, 299, -115, -187, 98, -519, 539, -199, -471, 274, -415, 546, -319, -243, 689, -369, 357, -363, -208, 536, -691, 307, -265, -108, 336, -620, 768, -308, -56, 366, -344, 860]
3257H60j347N19J07m42O04q68Q76m84j79Q24m79M84o28k6N05n51N17n64J26J27
3277a9j85J34P8j56K83l32L07N4n4pj12P0J33m05L59l27j3M38p50O50j77R6j7
3300D8k92P73q20M58j37o2K37p03P08n51K79K63p14R32p38L67j17P1N18q32M73
3321A61Mm32M52m67L12m55N35j69j58K93j22L14k88K22j78l19L69l34M21n23M66
3342A04m4k57L91m16O27o35L36K9j50L14l51K12l83J14K49n78O15l65L76j34l22
3363b68N60o78O25k83k15N96n63L86m09K83j0k22L96k19K22k39K44q1k05M76n15
3384a19K63k94K13J69o14M93l57J86J19M8N8k24K45j28q4K44j4k2n93N48o01M18
3406d6R8l79N09n51O19k69j7N20o87M11o25O78q0n10Q03r49L63P8j66M27n13P17
$$ y = [860, -487, 32, 139, -303, 301, -567, 309, -175, -354, 470, -9, 475, -153, -179, 326, -225, 292, -272, -146, -19, -204, -70, 8, -148, 135, -197, 110, 164, 110, 103, -9, 61, 194, -211, 148, -179, -192, 246, -504, 146, -31, 65, 48, -244, 529, -291, 167, 30, -32, 205, -498, 210, -341, -62, 201, -513, 419, -319, 48, -69, 2, 520, -312, 161, 165, -267, 185, -282, 30, -425, 110, -59, -217, 76, -46, 268, -20, 202, 24, -295, 74, -260, 161, -362, 104, 60, -197, 194, -222, 405, -230, 106, 135, -15, 299, -52, 160, -223, -109, 140, -438, 177, -188, 188, 54, -268, 292, -386, 239, -44, -259, 337, -226, 160, -249, 34, 24, -198, 198, -21, 201, -38, 206, 125, -80, 396, -119, 144, -150, 63, 232, -382, 111, -246, -60, 59, 107, 165, -59, 186, 58, -26, 218, 204, 182, -411, 137, -464, -46, 52, -327, 182, -369, 250, -19, -36, 484, -203, 208, -417, 261, 181, -329, 474, -475, -112, -34, -200, 227, -286, 431]
3428D31n37R6M90p01P48o53K86j16m56M19N6j52MJ27J54j38O5J27j82o2J71n80
3450d03L84j41Q0J1k41O72o41L53K45l76N14m48L04k61l69O23r71R96n53pO01
3471C72p05R49j060J26P63r71J111r36M95K2p26R96q47N88k43o44J128o77L04
3490D5j01KM28p59M43J85k61L01n18L34N5o16N58l10J88K97p06Q66o51M10L3j012
3512g89J666j273K61J91m45Q60j107Q62K42j004J235j338J301l81j065J275j312
3529h21J520p17n51J296j401J184j126M45R70j425J241p60N06K86j443J494q00
3546a02K2L11j110J662j069R0L62l75R07j177K81J073j170N82o69L58O20j573
3564i77J468q14L36M10j433K004j397L23M91r99J905k275P70P01j159J477j835
$$ y = [431, -106, -10, 480, -221, 527, -126, 160, 44, -412, 7, 63, -89, -85, 42, 196, 58, 123, 250, 68, 6, 177, -403, -19, -160, -80, -69, -310, 362, -279, 74, 319, -57, 457, 9, 313, 52, -317, 306, -665, 331, -222, -229, 372, -333, 616, -444, -318, 445, -526, 585, -351, 144, 166, -560, 436, -411, 177, -66, -710, 418, -259, 45, -56, -54, 374, -385, 58, 243, -18, 283, -235, 99, 154, -462, 96, -214, -26, 271, -435, 431, -220, 190, 223, -789, 877, -396, -135, 56, -389, 471, -636, 226, 468, -536, 699, -639, 662, 281, -784, 491, -821, 699, -18, -569, 727, -674, 510, -616, -171, 799, -626, 615, -145, 361, 647, -796, 698, -102, -80, 231, -879, 783, -286, -196, 166, -209, 698, -479, -198, 875, -295, 287, -382, -24, 596, -977, 491, -323, 13, 423, -1010, 994, -403, -80, 411, -588, 1317, -958, -188, 513, -646, 831, -1004]
3581a004J178O02j533J490j604J531m08j305K013j706J410q50m89J765j899R28
3597A19m69PJ253j923J306j28k20P90j764J725l90p98R73j171J322p24r32J998
3615I74j557J158q18k44J674k037J300m15k30J087k082J830n46n46J029j760K296
3632A113j285m42J171j328J742j390J22J179j476J194j354N37Q59j661J531r85
3648d73P31R4j455K120j205J53M32j171J918j818L36N57o82J346j571P37M75j113
3666e89J097j187J113J8j321J579r83N59k82o55J568j419M55K1m63J417j687R26
3684A67J19n48J117j794J255o6j030J288j167J230o37p37J450j155J049o72k12
3701c43J406j636Q10n65K2O58j308J102j67r4N36j314J600o37l64N73o73J001
$$ y = [-1004, 174, 776, -757, 733, -871, 660, 252, -1053, 960, -746, 664, -186, -675, 1090, -809, 119, -350, -343, 910, -1013, 293, 165, -55, 735, -1029, 696, 306, -492, 481, -690, 632, -92, -1024, 974, -583, 575, -243, -487, 1187, -850, 450, 35, -195, 892, -1190, 640, 94, -452, 577, -1183, 1113, -172, -614, 557, -771, 971, -419, -297, 882, -594, 600, -754, -217, 642, -1019, 512, -473, 258, 352, -1103, 1017, -188, -35, 397, -774, 1144, -674, -338, 219, -463, 883, -688, 49, 524, -589, 508, -679, 434, 452, -869, 710, -273, 286, 4, -651, 917, -502, -47, -26, -489, 928, -759, 167, 286, -262, 855, -939, 316, 250, -780, 508, -659, 571, -66, -803, 647, -508, 541, -131, -343, 1063, -573, 237, -328, -306, 352, -956, 146, -21, -115, 421, -893, 707, 70, -294, 279, -394, 607]
3719F07q05K8P86r82O47p32M46M44j033R55m70L44K25j135J318n06k77K34n63
3738d69R91r52NO22m33N94o31J47N88o32O99q57N68K75j202R50n02M88k40o50
3758f41J133p75L92p0k68Q08r44O10J11o00N94q83N46J51o84O95m96O05j26m13
3778b55N48n98O30l13j56L62m42M13m12J1K55j73K49k98K9L12l68L18k1j32R7
3799E6k38L51k09k53L16k65K85m4j93O64p95N49j30k26O60r03L88q5j91M88n08
3820b83N70n69K62J64l42L64l00J66K63l00K44k47n8J22j80J77p1J18l28L27O9
3841A68j32K05j75J99j30j13Jo9Q7j52P8k85M85j67l1J09m43O75k49m7K10l04
3863h0L60m99L06r0m3Q2l23M45k28J84kq4J37m59N85l83J01K6k19L33n12M49p2
$$ y = [607, -198, -170, 616, -366, 281, -451, -5, 439, -594, 361, -109, 235, 460, -675, 643, 137, -140, 94, -469, 522, -430, -425, 197, -236, 358, -273, -126, 462, -170, 529, -328, 240, 515, -687, 263, -239, 249, 9, -641, 492, -283, 109, 39, -229, 579, -365, 245, 356, -244, 350, -533, 13, 164, -520, 175, -321, 284, 158, -255, 293, -305, 325, 12, -144, 218, -224, 189, -223, -212, 43, -130, 119, -179, -150, 162, -206, 112, 91, -41, 56, -182, 169, -40, -293, 23, -242, 43, -1, -194, 470, -325, 224, 94, -132, 528, -375, 13, -72, -263, 225, -283, 287, -282, -20, 144, -198, 166, -134, 32, 295, -5, 239, -8, -66, 56, -124, 53, -18, 100, -228, 99, 168, 36, 241, 66, 265, 135, 22, 23, -46, 41, -111, -33, -318, 167, 0, -31, 78, -365, 310, 61, 14, 224, -80, 280, -219, 87, -3, -46, 36, -287, 158, -70, 114, 112, 28, 165, -294, 291, -92, 9, 35, -184, 149, -363, 86, 14]
3886A4J11K4k63J73j21J67Q9l61K74k53J76l94L18K17l59J94j24K73k23P6J11
3907A19j74J50M9nj81J20m8l40M82k35mR6j93M39m39L88l09j26M33m75M85o07
3929c75N00n1n42P54n31L30J23l35M01l84M42l32N8J14k39L03m93L83L2k96K48
3950A10j45p1K36j31O7n5N2K60l31p3L7j07K58l12L10j09j73N07p49N32J04l11
3972i4L86o65O63k84l27O08o64P17n20n6P07p77P81q11M72L38j054J029p83L95
3992F1L1n87R91o97K97m0m97P43o86N61M7l46L59m93L27N7l59L52m81M22J82o98
4014d54O90k92J11J61n61Q80n64j66M63p84J203j051K61L94q93R03q27P30L31
4033E35r54R73r64R59l80q73J443j445J039q05J36J260j493R03o33K03O57j322
$$ y = [14, 125, 149, -114, 59, -62, 105, 194, -167, 107, -146, 30, -364, -46, 171, -188, 6, -118, 155, -68, 8, 119, -55, 95, 144, 139, -42, 78, 30, -310, 172, -63, -67, 29, -164, 275, -164, 224, -85, -211, 222, -253, 232, -375, 125, 74, -468, 286, -245, 85, 208, -127, 274, -110, 332, 0, 58, 172, -67, 236, -257, 126, 158, -138, 110, -35, -106, 130, -1, 66, 11, 63, 323, -8, -81, -44, -151, 107, -205, 105, -4, -177, 330, -419, 113, 217, -94, 292, -373, 290, 6, -321, 287, -377, 340, -180, -236, 471, -306, 475, -336, 136, 474, -580, 449, -334, 61, 92, -495, 496, -201, 96, 56, -441, 302, -384, 177, 224, -122, 237, -256, 71, 128, -231, 121, -360, 62, 244, -454, 236, -56, 55, 216, -345, 535, -29, -195, 268, -516, 687, -364, -103, 291, -602, 301, -526, 204, 535, -419, 554, -410, 549, 169, -704, 739, -706, 333, -472, -336, 924, -569, 334, -299, -96, 561, -761]
4051g61J252m23j32N02j156J092n79k33N11l14R28q53j7Q47j054P59p52M61N60
4070F38j301J013l83j28M17j248J531n46l27N12q13J496j242L3Q76j118J406j548
4088g32M90J143j836J298j067Q19M92j682J787j217Q14j52r85J745j323M23N1
4105F8o10J409j631P11M44n97P90j326J130K51j037O39p69J085m48q43J213q82
4123d03P54n35m00J571j461O25j10j21R28j636J052j42m22P97j453J710n67p82
4141e95J260j446J788j189k51J317j509J236q50Q8R42j489J089n13M02J20j369
4158i69J718q15J73m8o45J487j308K01N84p51J135j337N75N65j021R46j080J084
4176D94O5j161Q45m79N67j98r13J221n82j10K31n94J518j450K69P84q45R50j182
$$ y = [-761, 491, 68, -64, 438, -718, 374, -205, -438, 73, -241, 687, -166, -183, 664, -390, 369, -383, 78, 638, -663, 350, -33, -161, 256, -992, 539, -7, -334, 178, -635, 861, -381, -348, 528, -590, 816, -732, -242, 901, -935, 363, -704, 115, 607, -1075, 712, -505, 309, 157, -828, 917, -406, 17, 68, -542, 867, -764, -53, 391, -206, 584, -742, 388, 639, -398, 241, -528, 557, 109, -734, 479, -403, 351, -184, -584, 987, -474, 151, 41, -80, 848, -788, 264, 122, -300, 497, -956, 754, 187, -595, 665, -781, 1007, -182, -433, 884, -625, 611, -239, -151, 791, -698, 391, -122, 280, 400, -969, 749, -66, 107, 59, -586, 901, -407, -206, 378, -373, 762, -575, 0, 565, -456, 490, -590, 494, 559, -602, 243, -236, 331, 133, -780, 441, -141, -251, -20, -614, 904, -546, -277, 507, -338, 612, -570]
4195e70P45L56j067Q57q59R76l49j033J262p63Q96o41q3J139j221P11l16j89Q25
4214F76j329J022k81k75N80j035J101k87o52P55p23R64o32j91R22j095Q81o68
4232b67K77K78p54O69m16K44L09q92R68l64q9K87n69R04p81J10K32m35O23p17
4252c83K47N65q92P07m23L46K21r17Q05n77L28K20o45P91n44J2J15l87P75m72
4272a08L7K34m27O62o30L80j71p3J71m28N85k40m10O59l76M83n74J34L38m23N66
4293C89m15j70M61m70K95Oj85J81l49M77k88m4J04r9J69n0j70L48l29O8L1k18
4315b58L30k31K16k00M9K43l17K45M4j42J33k44M81m24L0J40l78L17l7M5J09l32
4337a81M60m75J73K13k68K06j25L3j86N3J18r9nk3L34j14k73J62J58k82J24j08
$$ y = [-570, 175, 531, -536, 321, -538, 438, 89, -944, 318, -445, 451, -190, -273, 866, -355, 356, 40, -149, 676, -653, 369, 88, -187, 393, -642, 459, 172, -480, 275, -448, 516, -116, -307, 615, -480, 401, -267, 10, 288, -466, 203, -213, 31, 340, -552, 416, 52, -37, 250, -319, 585, -196, -86, 146, -289, 334, -383, -136, 429, -463, 244, -179, 167, 388, -529, 276, -301, 27, 247, -398, 393, -151, -139, -24, -411, 364, -108, -71, 163, -264, 398, -232, 148, -23, -96, 75, -353, 232, -8, -418, 241, -135, 348, -226, -92, 246, -177, 389, -26, -196, 265, -205, 90, 96, -89, 92, -257, 220, -68, -112, -8, -107, 62, 12, -158, 190, -139, -71, -40, -258, 72, -159, 57, -143, -94, 149, -168, 77, 121, -21, 112, -132, 349, -75, -45, 95, -283, 34, -3, 42, 151, -181, 279, -196, -23, 190, -78, 128, 3, 36, -150, -97, 21, -78, -83, -106, 228, 114, -159, 3, 161, -121, 3, -105]
4359a05O6R5M0k76J12J25L6M4q6m3r0K90m02K43k2M7N4l00L13k14m0L46l06L53
4383B80m12J26o0l00O26n53M93j78j32L09k48k8L3M8J78n5r0k18K02J85k22J63
4405A47j12J08l08J73O3l24K87K0p0O0o1o6J09k6OK5qn1j41J10k19L6M39k14j88
4430b05K92q8K84n37N12l21J52J31n49M95k91J6m8j33M44l88K95J8k60M45n51
4451b87O33l74r6K05k99J98K6j04J54l06K84N1j30Q0K7J5j19K25j86j26K77j59
4473a1r3K53k63J55M1j04P8l29M93Ql88L37m41M17q3l02N70p09L72j30j42O23
4495C52o86N39l85M4N47q49P57m26J45J9n63R53n34R1J83o06J002p97K36Q4m30
4516c24R09q93L34L16n80K97k66M97o5o16Q02n32J74J61l64N13o49L32J65n20
$$ y = [-105, -39, 56, 96, -180, -68, 57, 93, 137, 51, 8, -82, 208, -194, 49, 27, 74, 128, -172, 141, -73, -113, 233, -73, 280, -132, -6, -66, -366, 260, -293, 200, 22, -110, 199, -49, -77, -44, 4, 182, 127, 37, -181, 21, 206, -16, 147, 35, 143, -165, 8, 71, -253, 34, 54, -16, 44, -17, -83, 26, 0, 6, 31, 23, -28, -169, -59, -278, -242, 197, -17, -205, 87, -1, 283, -254, 258, -63, 89, 220, -329, 166, -125, -109, -157, -290, 154, -234, 61, 79, -181, 264, -287, 346, -28, -124, 81, -218, -20, 6, -98, 56, -250, 34, 85, -45, 35, 62, 77, -42, 183, -3, -129, 148, -11, -104, 149, -114, 41, 82, -22, 56, -273, 220, 228, -160, 177, -264, 153, 70, -232, 338, -371, 1, -129, -271, 352, -334, 205, -180, -136, 411, -438, 319, -107, 38, 57, -506, 447, -87, 4, 187, -419, 583, -214, 22, 106, -324, 585, -308, 26, 342, -238, 59, -207, 290, 225, -391, 411, -121, 53, 214, -150, 363, -286, 46, 211, -309]
4536c09O48p84K72O50q63P28p20N66Q9r23J311j041N95k06n27J443j350N27k0
4555H6m97J023j239O96M8k56Q16j390J167m44m19Q14r68J051p11o3O02o94Q94
4574E16p55n4P94j121P75k66J33M22j047Q91l31p9L43q28J106l05o14R19r43J029
4594E85q06j5R60j311J162r48L28Q79j589J183n93K18J87j000J643j199L80J58
4612B22q06J493j593N32K87o48J395j533P60L26p75R71j191J001m66m80R93q02
4630c14N36j58q28J513j100L10N3m59J201j118N11K1k69N64j021P87J33r45J020
4649D37j076J060j49r59J342j201J110p60k99J383j476Q38m55j56R75j407J174
4666C81n35R8O45j364J627q70k26N42r04J101r22J25R02j044O83n32M7N90r11
$$ y = [-309, 339, -445, -173, 477, -386, 342, -378, 188, 277, -646, 665, -376, 219, 13, -514, 929, -421, 106, 86, -411, 612, -627, 69, 117, -139, 677, -713, 454, 10, -409, 405, -563, 488, -223, -286, 316, -378, 516, -239, -293, 501, -620, 155, -111, 22, 444, -603, 288, -43, -122, 221, -607, 499, 194, -420, 499, -444, 585, -221, -236, 724, -587, 575, -373, -45, 834, -755, 428, -165, 53, 240, -760, 883, -316, 64, 222, -584, 909, -684, -152, 135, -513, 882, -651, 109, 435, -340, 631, -560, 441, -25, -505, 488, -314, 222, 64, -764, 749, -351, -41, 12, -447, 754, -364, 147, 168, -101, 463, -558, 229, 362, -583, 437, -639, 421, 272, -687, 655, -546, 564, -196, -495, 888, -588, 250, -205, -361, 614, -793, 381, -154, -56, 589, -775, 852, -18, -244, 298, -606, 495, -427, -302, 600, -444, 239, -293, -246, 344, -567]
4685e67Q19l88J86K29r29J037k99j13P6n19J132p35j47K47m99J133j194M71P03
4704F43j099Q10q64O91J21q80J053q42M31J87q02J148r09N22j99m59J331j490
4722f07Q27L1n22O40r89R12m02rM31o24N93k60j81M60n33N14l27l13N17o86P03
4743A75k52r8O32j096P66k38o4N33o45L03k2k31O00m95N16l73k72M78m81K80p1
4764e5l0M55q39O70l19J20K41m93M95n00J74K63m80L58j85j77M71k21L77m76J17
4785c4L61n75M16n57M65l0l15M39j60L7r2n5M73m56O2O5j77L58k71n5J31p8J14
4808F6j51J48O0j85K85m27M18j25j10K10l97J03J97l51N34m67J51K6j36N73p33
4829c11J35J90K8j37P7J33k24Q7L04l48J58j5j74L92m35K1J10M4pj28J86mn7p6
$$ y = [-567, 252, -136, 50, 279, -650, 387, 88, -25, 51, -468, 664, -71, -218, 29, -470, 663, -531, -60, 643, -456, 354, -510, 181, 302, -578, 475, -367, 64, 251, -551, 597, -312, 210, 11, -448, 883, -607, 220, 251, -271, 369, -620, 292, -110, -119, 312, -312, 281, 21, -160, 300, -233, 281, -46, -359, 158, -528, 175, -77, -175, 457, -639, 127, -111, -175, 358, -287, 16, -6, -237, 363, -132, 384, 11, -261, 217, -264, 16, -55, -85, 370, -469, 201, -118, 2, 243, -250, 245, -255, -81, 182, -298, 60, -125, -302, 169, -52, 325, -151, -34, 327, -248, 168, -389, 76, 46, -269, 170, 10, 47, -45, -100, 373, -83, -21, 44, -133, 225, -46, -101, 30, -48, 66, -85, 63, 123, -62, 223, -204, 214, 89, -21, 189, -208, -105, 92, -259, 275, -192, -41, -15, -151, 422, -311, -176, 14, 42, -95, -18, 115, -109, -22, 282, -66, 92, 77, -97, 295, -140, -119, -9, 35, 28, -100, 86, 82, 25, -51]
4853e1j85M19l51n4K48m2J10k03o7J37J8J68k12O0R0j17l0M0q7J82M3m7R2k19
4877e8K82k75J1J24k25J51p9J60k10J78p1m6J5J35l8Mj59K15l62L03Q2q6J57m39
4901b31M09K3k86K37j25m8j47P9l4j01K95r6L7K32m49K20k6p3J46N7om9l4J0j02
4926f2J64K7R7j11q1j71J71o4N0o8L2j9p3L80l16R6J18l28L09l47K75l6j14L04
4950B33n70L96k70J66K13n68O22l40K38l5o1K66l99L0J63j93o8J94J57j31j18
4971g5L07m79L48l5j29J37k78K38Jk91L75j93J07m6J1J47m15L70K2l85K98k37
4993b02K67q9k49M55l98M77k56k49L66l77M71l2m31M12n85O39j40k99N19o71O85
5014C13l47m7K64n23O49o36J99N88o85O98o08J03L38p45M90k49J52L30p28O48
$$ y = [-51, -236, 183, -168, -222, 26, -16, 94, -109, -176, -39, -21, 147, -65, -5, 85, -32, -62, -22, -109, 73, 116, 69, 161, -58, 224, -51, -40, 84, -141, 10, -69, 91, -119, 59, -12, -58, -43, 92, 54, 58, -101, 114, -248, 55, 137, 51, 208, -231, 178, 201, -85, 152, 27, -21, -168, -89, -123, -224, 71, -25, 12, 244, -205, 15, -11, -84, 62, 119, 113, 64, 30, 40, -62, 102, 129, 226, 115, 34, -137, 34, -30, 20, -48, -16, -35, -108, 272, -44, 52, 170, -158, 151, -196, 79, 43, -71, 233, -337, 59, -211, -45, 168, -400, 222, -118, 120, 85, 24, 290, -109, -79, 84, -109, -177, 17, 174, 43, -75, 232, -247, 101, 66, -63, 74, -204, 34, 35, -256, 119, -74, 33, -13, -2, 145, -270, 100, 122, -263, 35, -202, 65, -24, -273, 182, -216, 261, 5, -244, 122, -255, 216, 184, -247, 165, -420, 219, 79, -220, 299, -372, 313, -34, -81, 183, -340, 309, -327, -128, 460, -225, 473, -135, -32, 306, -439, 51, -198, -46, 284, -444, 204]
5034B04j87k5K88o11P25n05K14N9l52O04o19J09M53n13K56k99L34J81q64Q34l89
5055a03J57K3m98P55o57M48l9o37J209j068M82K4l22P81j051Q11j70m75N51r01
5075f80R13j67m02N65n57N56k45j16N82q77O72j92q3N76j116Q74l61J29K24q52
5095e57Q59k37j38M07p84Q75n15r3P34j021P55n04pO98r79R22n91P7O56j120R68
5116D05n44o0N76j088J330o15J4L65q10R60q83M53K06n31O30r07O95O7p25Q48
5136C86o93O77l72o74J115p77N02r6n33R26q06M91O0o05Q89q97L98K53o10O46
5156B80p10O01q8o80J062p89N98l05l19R89j104P90l57j21O92j120R55m60k51
5175c37Q55j055J125o37j53O89r57R95n90l05P49q64R20o72n7P24q00P28l63r
$$ y = [204, 17, -8, 280, -331, 394, -111, 103, 162, -190, 414, -205, -96, 357, -156, 100, -199, 135, 316, -548, 286, -103, 54, 77, -421, 334, -323, 125, 86, -551, 658, -410, 72, 96, -226, 555, -496, 315, 145, -330, 221, -680, 233, 66, -336, 229, -328, 228, -17, -133, 449, -428, 244, 52, -31, 545, -571, 303, -58, 71, 295, -557, 302, 65, -73, 334, -450, 425, -90, -183, 551, -470, 285, -219, -226, 472, -507, 415, -176, -99, 557, -563, 405, -139, -199, 377, -711, 619, 4, 18, 383, -427, 533, -350, 103, 309, -222, 408, -499, 196, 263, -462, 386, -307, 370, -2, -676, 439, -338, 164, 68, -465, 461, -345, 146, 206, -399, 490, -407, -9, 244, -366, 280, -430, 171, 83, -597, 465, -324, 274, -31, -350, 639, -465, 325, -32, -153, 539, -581, 374, -86, -337, 518, -537, 588, -49, -202, 487, -470, 525, -65, -370, 379, -485, 435, -237, -294, 430, -370, 358, -5, -14]
5195a4J87p39Q65n13N5K09m89P83n62%M66n17O23m85J0M72p59O11l32K35M67j089
5217e16R26p44N37J60q87J101q29L28J36q41J298j038N22K5p26Q92p38M86M5m36
5237b99N62o51M80J95l59L67l43O0N1l49P16o36K17J5l79O72q81O09p5O2Q8o42
5259e20Q11k02l80N26m81M07J9n84P64o27M85k58j54O26o51K59j8j86N15n99K49
5280AK09l94L48n11N72l03q4L24l93N31l28j8K56m71L71l79K16K54m34M55m68
5301b46J75L3j44K95j58k29K30R9J82k70k28L56k93n3Q4P6J66l95L64r1q1K72
5323A44l35K32j21J41j54j73L47k10K02Rk31K81k03J18p8n9L90l89J37J46l60
5344a66J81n4j0Q4j17J94j37O5l06J14L67l10J8k4m5K23k65L08j10K7jm3n4K8
$$ y = [-14, 173, -566, 299, -214, -159, 50, -439, 344, -218, -218, 248, -269, 354, -131, -121, 351, -408, 203, -129, 106, 573, -516, 410, -334, 203, 363, -524, 577, -252, 76, 212, -629, 669, -369, 153, 178, -548, 344, -394, 92, 137, -299, 263, -388, 92, 287, -72, 295, -48, 12, 63, -286, 430, -206, 11, 26, -353, 319, -562, 47, -28, 34, 122, -520, 291, 89, -291, 235, -246, 161, 180, -404, 360, -267, 218, -40, -194, 432, -219, 40, 22, -164, 351, -248, 1, 210, -184, 164, -347, 225, -78, -162, 162, -231, 300, -28, -46, 210, -261, 110, -269, -53, 201, -233, 222, -246, -71, -38, -182, 113, -45, -274, -44, 55, 237, -33, -261, 95, -198, -251, -167, -91, 75, -320, 44, -47, -128, 144, -191, 41, -80, 61, -93, -266, 81, -129, 73, 82, -149, 132, -71, 47, -31, -90, 300, -89, 48, 194, -166, 15, -39, -49, 35, -82, 112, -25, 40, -266, -152, 215, -95, -77, -101, -146, 77, -188, 120, 10, 37, 36, -7, -61, -33]
5368c3j29L01n5K9j97L2J02j73M21m32J41J37k46J54m4n2P6j62J88l03J43J72
5390G0l78N01j41M0jl00K08m5k2K61j76J6J26j57R7k51Q6PK6j22J3N33k91q7O7
5415H0k73J73N5P5nk70K38p0J81j84J0o9J32J24k22J38P9l87J04K44k11J06p2
5438b4J59j32K7M8K7m0P5j19J31j55j53J30L1J18k45J80J1kl5j89P1k8J7K14k24
5463a07L53k06k10L45m59M59k17J64j70r9K95j92m4J42k68M71m98J98O6j00K74
5484A97l32P8J35j64J1j54J21L12l09M32m70J31J51k89K03k88K69Pj92L95l69
5505a25n5J28j91N09k66J49r9m85P28m59J88l7m16P52n62L60j24k81O35o50L25
5526B4K13m79M09l16K26r5j01M26n69L94j05l6K36o01O62m24p3L41o83Q74l50
$$ y = [-33, -162, 139, 84, 113, -84, -52, 50, -123, 298, -134, 7, 144, -102, 52, 8, -44, 32, -130, 58, -245, -102, 70, -308, 193, 52, 92, 91, -209, -1, -46, -68, 193, 17, 33, 159, 2, 99, -152, -66, -59, -33, -155, -142, 391, 100, 13, 80, -193, -20, 35, 110, 105, -165, 73, 3, 184, 0, 10, -59, 73, 197, -25, 113, 192, -195, -91, 153, -58, 48, -24, 135, 3, 30, 78, 105, 65, 140, 21, 152, -3, -156, -26, 5, 123, -122, 58, 69, 67, 32, -157, -86, -114, -97, 117, -107, 246, 40, -170, 175, -284, 175, -42, 122, -48, -147, 148, -44, -88, 54, -214, 257, -241, -43, 23, -77, 197, -135, -57, 78, -86, -75, -229, -108, 204, -105, 327, -143, -12, 139, -150, 53, -235, 34, 41, -151, 244, -125, -180, -52, -243, 266, 0, 149, 50, -435, 293, -166, 22, -15, -431, 321, -241, 119, -5, -286, 349, -301, 24, 237, -242, 167, -149, 77, -18, -119, 307, -262, 132, 27, -9, 227, -374, 288, -136, -209, 132, -551, 323, -27]
5547b7p2L47o28P03m17j03M46n75O20k98J54J69n55O25n78l2N26o23N35l36nK82
5569A58m78N32l72J64K32o44R50p92K81J26o11Q41p33L55K01n05O79o49M66J40
5589C41n78M80n99O87m93k10O66n95K70J66n11Q26q68N30M8n24P64p04K80M4k64
5610b44N96q71O93k81k32O40p64N61p8l17Q31p41K79q1j13N16p93N05j86l5N14
5631C99r73R68o92J56L11m71N39l52j28O00p57O99n25oO89r14O41l54L08J98o58
5652c22P46o54K95J16n73P02o41L60J93p02O54m36J39M94p25O18l76J93J69o32
5672c82R18q36K80J27n95P83o96O85m7m87N79p65N01O0l25O84r05N77k5n33R28
5693E26j061Q41l23k11O18q23P51k15k10L68o46N74k86k35P35q64P04j69l19N12
$$ y = [-27, -99, 248, -380, 323, -94, -197, 249, -326, 294, -4, 150, 319, -236, 389, -189, -221, 305, -318, 217, -119, -124, 158, -320, 212, -160, 4, 236, -408, 542, -250, 31, 157, -454, 387, -346, 9, 210, -295, 384, -265, 201, 341, -237, 243, -356, 331, -162, -372, 294, -301, -31, 135, -376, 450, -418, 112, 160, -364, 400, -304, -24, 20, -244, 352, -519, 174, -107, -339, 301, -463, 98, 20, -297, 534, -207, 72, -9, -122, 394, -399, 106, -80, -115, 399, -574, 394, -298, -142, 169, -302, 237, -115, -243, 357, -400, 299, -226, -232, 457, -457, 184, -170, 138, 336, -322, 424, -230, 65, 181, -392, 310, -331, 29, 222, -480, 174, -262, -123, 371, -354, 264, -112, 81, 250, -382, 536, -300, -20, 107, -488, 295, -401, 284, 237, -250, 329, -436, 65, 125, -200, 484, -421, 156, 131, -402, 526, -535, 306, -17, -228, 390, -433, 318, 103, -107, 261, -385, 189, -97, -332, 403, -461, 243, 74, -245, 267]
5713B67o06M92l10n6N44m72M65k35l36N34m44M17m12j40M79m37N04l68PL05l76
5734a78M95n12K2M77n61O56p50J54N32p11P39n89J31M77o05N87m50J37J36m82
5754b95N27k10n5N4j24K78k59l4N27m80J72k85K58O4k89L17m08L02r4k98N05l56
5776a83J50J24j24J81l94M47k16j44K47m16N00j74j66L31m11K62N8l26L80k08
5796h2J15m5j79M90m21L27j67k33K95k31J41k24M2R6l7J36p9K17l5j57K44k62
5818d9n8PP5J58J4k22K73l15K24r3q3Q0j16M25k43m0J5k68K05R0rQ6m33M04n3
5843G4k49J97j09k0J92j2j36m1J25J13r6OM4j11j70N8J86p4N7j21K36r6L0k6k5
5868C2P8m0o0J32j20J19k56J21J27k57K12J39o0j48j12J90N7k37J53J98k31J35
$$ y = [267, -339, 153, -157, -213, 331, -141, 324, 89, -247, 287, -157, 260, -152, -292, 187, -250, 254, -114, -107, 198, -178, 317, -195, -173, 304, -257, 399, -351, -197, 335, -376, 363, -226, -95, 382, -223, 364, -86, 51, 187, -295, 232, 22, -33, 21, -103, 175, -84, -118, 409, -71, 101, -184, 74, 138, -151, 166, -242, 60, -34, -332, 173, -183, -33, 91, -33, 148, -246, 201, -15, -159, 88, -328, 172, -2, -168, 163, -248, 14, 72, -254, 126, -82, 33, -12, -191, 299, -122, 205, 38, -195, 100, -131, 10, -214, -172, -76, -113, 23, -56, 161, 126, -31, 213, -49, -107, -100, -25, 133, 147, -75, 198, -117, 107, 14, -69, 11, -105, 320, 77, 37, 52, -216, -11, 79, 70, 156, -277, 127, 74, -175, 22, -87, -107, 85, 73, -63, -104, 21, 134, 38, 44, 88, -23, -193, -135, 51, -23, 34, -87, 149, 53, 83, 57, 32, 110, 70, 10, 142, 22, 141, -115, 6, 133, -124, 88, 227, 167, 19, -93, 97, 154, -83, 70, 268, 37, 172]
5890A72l12N8L15q9l7k18J48J0mj28o0J25o0J83j01K6N7l07K28mj48J51n7J91
5914A39m24K32J94k67L1J61j97J38%J69j73N6K14l07j13R4K19j97j67J08J6O9
5936eL9n6J23n7o2j3J36Olq3J24l17K35p2K5L0j65J30Q1k15L54l13R1p7J80Ok71
5963a49O5l1K68n0j19J64j36j05J07l5J12j06l5J64k47J93k04K37m4lp0j7K94
5986B53k15J0J21k11L7k83K62J81k65J70j80L62k87o0J72p2p0J64j43J56j30j18
6008a46K23K6K78n80J15J32m54M97j60PN2k68L75j37J61j46k46M33l68n4K54k17
6030b23M60j91J49j21k30L20l55L60l4k30K73l61K73R9l41K99k67L41m59J41K43
6051A46m20N02p5j13J56n05N20r0l32J99l86O65k17N5M0l33L22l58K37K57l19
$$ y = [172, -140, -82, 233, 144, 107, -111, 37, 47, 43, -85, -145, -20, -80, 103, 2, 28, 85, -222, 6, 2, -146, 5, -52, 139, -285, -53, 141, -126, -95, 66, -131, 7, 7, 176, 3, 59, 273, -34, -147, -53, 166, -31, -198, -90, -74, -5, 34, -22, 101, 44, -18, -31, 105, 111, 108, 25, 149, -168, 67, -5, 20, 50, -115, 15, 96, -119, 235, -78, 13, -64, 116, 122, -149, -84, -115, 153, 103, -16, 148, 12, -93, 14, -21, 91, -15, -50, 114, -133, 60, -144, 93, 49, 46, -24, -41, 253, 38, 48, 169, -42, -5, -288, -26, 155, -110, 60, -120, 242, -45, -105, 67, -5, -75, 89, -54, 102, -28, -146, 77, 103, 381, -199, -84, 48, -406, 91, -69, -62, -10, -278, 97, -40, 121, -25, -271, 162, -206, -260, -6, -223, 237, 46, 195, 74, -156, 164, -191, 169, 135, -95, 178, -183, 90, 189, -152, 147, -120, 221, -238, -97, 146, -274, 228, 153, 40, 196, -309, 211, 121, -211, -12, -398, 267, 50, 105, 145, -188, 134, -224, 13, 270, -49]
6072d9N69o91P0L22m17L96m16K78R7l30O23o89M45J6n85P79m81J19Q7n32P79p29
6094c39M04j5k30N55o36M41J86m69L83n57K12R1m16Q33p56M98j66k45P44q60L07
6115c5L3q7M00o23M14N3m09N50o49L73k0l06M48l89L07j02K2L45q16P93j71k93
6137a62P13p68L82j22j26N61q15O61k89j27M27p61P73m52K45L44q28O31m29qM32
6158B82n31O06o66K90L01m90O30m92j22N58q33O48k61J6J64m02O15n92L93R6k97
6179h7N02p16K99K44m60M73n70L64Q1m97P49m27N2j5k82N46m86J15K14m41Q16
6200D74p33L42L4l78N97n23L73m2l40M33o00M83j37j08L48n14M46k22j44L74n90
6221d27M07lk21M82n13M04j56M8K63m52N95m84j24L81o66O39m53K66l7k53M97
$$ y = [-49, 520, -171, -101, 221, -196, 200, -216, 62, 159, -171, 452, -237, 208, 224, -361, 418, -63, 56, 143, -389, 390, -339, 65, 50, -180, 375, -261, 180, 366, -103, 280, -277, -65, 26, -390, 443, -313, 185, 19, -226, 518, -342, -35, -2, -89, 311, -312, 102, 155, -254, 296, -353, 20, 0, -306, 142, -247, 60, -42, -20, 325, -491, 302, 131, -162, 551, -217, 165, 43, -83, 478, -337, 324, 35, -92, 335, -426, 347, -105, 140, 484, -344, 287, -142, -150, 282, -249, 357, -309, -19, 282, -208, 422, -70, -192, 366, -467, 181, -80, -64, 100, -302, 313, -279, 114, 210, -87, 415, -301, -2, 242, -218, 255, -315, 49, 130, -367, 382, -45, 7, -8, -290, 256, -230, -115, 99, -342, 474, -259, 83, 117, -261, 336, -187, 186, 144, -196, 237, -363, 120, -17, -125, 223, -291, 155, -67, -211, 163, -427, -20, -23, -244, 238, -275, 129, -27, 21, 284, -168, 427, -57, -181, 200, -466, 173, -280, -14, -51, -304, 193]
6242A93l37J2L52j92J17j81j1K63n60M10j00k3L03o46P11k78j0K00n75M07j06
6263e1k21K87m6K06m06K51N2k66O59o81K90Q9n07N54l26J96j30j98M65m86K94
6284B5L3n9J69j32p0J10o9K12m22M18k42j25N20o11M15j5m48J55P4J21q1K6M58
6307D62o15K93L4l13L50l87J68p5k0J63j90J88R9j96J21j20K73k20J9m9N8J02
6329A45k62q0L45j28m4j01J02k22J77R2n3K97j83k23R5M3m5J04j61J85j31LK61
6352B16n93L53l6o5J13j35K34O2k49j6J75j7k15QK29j11K85k03k61K81j25Q9n7
6375c8Q9j62j29M15k51K5P6k2r3l9k0J18j14K44N0k4k73J29j2j69j9K77N0o6j65
6400a23K88mk74J27Q1j87j0J87q3N6l03L45j41J8m8J09K46l77N9J44n6R3k72L08
$$ y = [193, -144, -132, 220, 28, 145, -36, -47, 216, -344, 66, -34, -57, 246, -400, 311, 33, 23, 223, -352, 55, -51, -272, 15, -31, 175, -231, 20, 72, -194, 465, -216, 74, 163, -344, 210, -116, 80, -50, -248, 217, -269, 25, 58, -1, 168, 36, -34, 76, 7, 219, -203, 215, -27, -152, 368, -243, 172, 157, -291, -136, -62, 59, -22, 4, 462, -153, 140, 174, -139, 211, -176, -8, -83, -103, 60, -130, 58, 157, -39, 82, -38, 235, 15, 34, -15, 43, 145, -117, -197, 148, 20, -24, -125, -23, -245, -68, 24, -29, 268, 85, -138, -43, 0, -45, 59, -102, 83, -48, -45, 216, -377, -24, -60, -125, -12, -147, 87, 149, -100, -116, 59, 42, -173, -165, 64, -47, 238, 35, -226, 55, -70, 19, -38, 51, -111, -240, 175, -76, -51, 25, 3, -90, -129, -149, -31, -145, 99, 149, 125, -148, -19, -31, -200, -219, 58, 108, 42, -123, 165, 161, -113, 14, 95, -92, -102, 85, 2, 58, -245, 100, -41, -23, -71, 38, 284, -93, -34, 110, 54, 147, -125, 183]
6424A83m53M16O9j07K30l17k51M20n3j31j05Q9q6Q4P2j24K06j32K0j0l39L37P8
6447I6J6Qj25J93k66JJ78r1N2k51J84q7j74J77J90j78J44J57k12j62K7N9j60J46
6471g8MM0M4k81L81k00K31k53L7L36l72K22o9o3J55l79L51q2j56J70j93K55j18
6494a8j34J49J08J5j73n3K71l48l6K84n3M7j96J61j67N6P9k28J77P6p6J69j68
6517e8K76k64l3L59n21K30PK1O6l02L06k47J98J93n34N26l15J62j48j39L29l52
6539b40J90N0j00M00k63j76K31k16j30K71N3Pj69K70k37J67L4l26J98k7R7l3L4
6562H5J24n67L76N6j98K80Q5k04j51j13M37m17L15p3k04K61k11M12m89jL03j84
6584g8K68l37J03J93m41L24L6JJ42m79M43k13J48k62j60O73m18L7K06p08Q94o35
$$ y = [183, -270, 146, 215, 108, 338, 21, -230, 190, 137, 6, -99, -10, -96, -12, 60, -64, 142, 10, 30, 20, -319, 18, 96, 112, 120, -5, 188, -78, -77, 101, 10, 62, -189, -5, -92, -266, -89, 101, -77, 67, 224, 12, -150, -123, -64, -224, -78, -74, -34, 10, -271, 110, -90, 141, -112, -75, 261, -111, 111, 42, -21, 134, -245, 106, 24, -132, 38, -155, 100, -18, -152, -3, 105, 120, -53, -106, 165, -183, -219, 65, 12, 59, -137, 24, -143, -87, -8, -236, -59, 17, -59, 110, -58, 218, -46, -79, 280, -241, -11, -4, 17, 83, -219, 87, -160, 38, 231, -303, 223, -92, 70, -78, -217, 112, -240, -50, 0, -100, 300, 37, -139, 92, -124, -254, 17, 70, 77, -92, 178, -59, 108, 142, -184, 14, -13, 84, 51, 85, 209, -358, 18, 74, -124, 156, 241, 37, -114, -227, 210, -207, 108, 35, -169, 92, -119, 293, -196, -197, 106, -78, 190, -147, -44, 149, -292, 32, 68, 69, 211, -268, 175, -38, 110, -152, -312, 361, -57, -20, 186, -522, 372, -263]
6606b63L06J5k32L96l86K02J67k36L52l82J41j2k33N38n89K09L6j73N49n19K28
6627A14J28k66K57m14K90K55n11M59n77M89j14n93P82n85K87N1k03K38j94K19
6647A12j19n9K37l21LJ11p8L40n70O25Q3o08N42o21N67m11J8L19l96M09k15j26
6669a58L54n54L75J32j25L42p34O61m98M5L66o30O58l45j0M84n47N55n01J1J81
6690F2k09L14l47NL24m57M60k83JK09m09M45j43P4R1l94N07k90N0J08m95N67m84
6713b94K92L6l20L73o11N27J83k33K13k26J12Q5l10K62r6O6k7k37N17m37K35J13
6735B23l47M24n26L39K3k71K05l62O72j77m09L13k37J77l8l37O25m58L50p7K0
6756A32n8k52K97k06k5L04m66L50%j93J23k68N41n42K11J33p8J61l69R1K13k00
$$ y = [-263, 43, 58, -174, 222, -164, 38, 205, -31, 321, -61, 80, 68, -165, 373, -216, -7, 29, -144, 405, -114, 114, 242, -24, 233, -181, 109, 364, -147, 312, -265, 224, 110, -483, 299, -286, 1, 52, -151, 87, -107, 112, -7, -66, 171, -150, -147, -36, -114, 226, -344, 281, 364, -244, 298, -323, 244, -167, -149, 170, -226, 183, -32, -158, 196, -358, 17, 149, 24, 366, -368, 293, -205, -160, 206, -424, 234, -111, -121, 363, -184, 371, -130, -119, 62, -147, 167, -180, -175, 149, -308, 152, -131, -130, 79, -330, 115, -28, 46, 137, -257, 250, -40, 10, 118, -377, 190, -294, -2, 34, -286, 87, -524, 3, 186, -47, 166, -60, 52, 137, -173, 89, -7, 59, 32, -205, 312, -125, 110, 223, -124, 300, -226, 113, 136, -135, 70, -292, 380, 203, -206, 107, -130, 47, 9, -328, 297, -161, 189, 112, 132, 74, -178, 119, -87, -112, 192, -274, 76, 76, -117, 6, -262, 279, -263, -52, 81, 3, 164, -205, -114, 99, -101]
6778a01K62j40q1N1r3J68j62Oj4J23O9j8j11om1K04j89J1j9j52L09j15J81j53
6802a1j88K74k16J79nj70J28R0q0J11j98K67l38K5R6j78L23k07J67o7j1K1OnJ22
6827A35n8J2j00R5m6%K30l15J01k25K95j80j67J15J77n8nP0j07J14k00J82k51
6850a86j9L07j81K02j90j10K15n2K6k38L01l08J33L7j14J36k6P0M5jp7j41m6J47
6874g0J1J91j65J05J03j49R9n6j04O0r1K59M7k44j8J10O6k32m3oN3R5j90J27J00
6899E8k02J21J40j26P1j47o2Q8J29l2k9M7R8k37r1K33J8l1M2k48J33O0k07K07
6923C3O8j80K79k98J91l0k72L72j34j79J34R6m01L21mj14J08J04j27Oj15Q1J40
6946G9j01J04l4j05K22j94k7p7K21J69m04K89k58K39j78K26k05j4p4L03m44K85
$$ y = [-101, 161, 21, -60, -9, -102, 66, -96, -90, -104, 19, 88, 70, -41, -47, -88, 116, -73, -62, -81, -233, 76, -39, 142, -11, -199, 75, -141, 38, 33, -137, -9, 81, 1, 112, -86, 181, -157, -132, -36, -214, 109, -98, 69, 2, -9, 12, 18, 13, 135, 77, 89, -11, 84, 38, 38, 268, -47, 54, -171, 124, -56, -223, -108, 69, 11, 6, 76, -31, 83, -117, 65, -186, -205, 102, -79, 123, -67, -177, 38, -14, 12, -226, 75, -233, -100, -63, -177, -41, -67, 3, 48, 47, -30, -171, -217, -70, -59, 132, -33, 72, 175, 26, 125, 69, -35, 25, -66, 193, 240, -4, -22, 88, 154, -78, -121, -127, -74, 21, -169, -42, 58, -144, -23, 117, -9, 62, -85, -147, -59, 70, 38, 9, 56, 154, -83, -174, 59, 77, 46, 88, -160, -27, 33, -174, 33, 101, -79, 200, -98, 93, 63, -209, 163, 29, -150, -16, 80, -321, 0, -4, -118, -10, 94, -33, -27, -142, -61, 79, -22, 82, 48, -57, 165, -29, -56, -133, 88, 257, -147, 142, -116, 123, -55, 171, -34, -48, -122, 181, -263, 22]
6968B2P4j66J83l19J18K7L2J84j07j05j11J92L7j05m8j72J64J92k06K50l08J83
6990A1K83l62n7r8M1L57k81J95k03J85l9p1J61j15J56j05rQp5L72l83N2K44o03
7014c36N73k08j88J52k05K55p2k6K16k00J81j47mJ02r0J28l98k6N04j94J12k62
7036a33J19K92n65M08q6O5j11k5p8K10j32R9j37J20l15J11K72k07m3q1K45O9o0
7059C7L02m69L31j21l99L30l18K90l5kM64o28K02M4j51L69m43L55m9l59N01m59
7081b08K38P1l83M44m94M65p4j73M15l75K10k31lK30j34J91j76J0J20l20J44J30
7103I7k65K63n15O79l55j19L15k01J22q7k20M85k95L56n09J51L63n22M01k33N0
7124c9K31m67L93j4j38J97m66O77m63O7K4l01N76k75K70k16k82J84k14L45J29
$$ y = [22, 96, -70, 113, -206, -88, -61, -29, 155, 48, -57, -168, 24, 61, -44, -92, -264, -100, 92, -114, 136, -172, 11, 294, -68, -125, -223, -182, 175, -106, 89, -114, 71, 32, -39, 122, 7, 163, 58, 49, 57, -18, 354, -29, 23, 267, -336, 237, 29, -159, -7, -212, 43, -29, -55, 161, -39, 142, -5, -9, 93, 3, 131, -267, -293, 211, 17, 129, -133, -14, 278, -287, 121, 35, 100, -11, -36, -114, 96, -36, 63, -74, 46, -269, -158, 114, -93, -136, -217, 28, 97, 37, 339, -130, 201, 80, -319, 11, -307, -17, -52, -54, 410, -218, -16, 28, -123, 246, -197, 158, 109, -250, 251, -208, 30, 101, -282, 162, -332, 133, 59, -114, 301, -74, 136, -95, -98, 132, -2, 189, 13, 23, 143, -177, -33, 97, -168, 95, -420, 259, -96, -215, 100, -101, 21, -66, -286, 199, -96, 260, -249, -98, 265, -257, 144, -89, -39, 192, -275, 118, 104, -34, 163, -303, 374, -89, -22, 2, -299, 277, 2, 272, 56, -226, -42, -256, 89, 218]
7145B18m77L62j67J90K2m33L11k38K75j46q5M24m92J93M1r6M37o10N49k14k60
7166a96M96o05M65j24l93N38l36L81j63k19L87p15O52k73Q5K44m40N07m00O6K91
7187B48m87K84p7j57L72l04K11j50j79M57o84O59k58M6K94m95K85j58QJ4j60L35
7209A04j02L3J63n25N53l61j22L41k74K39l33J07L69k89L14m22J79J38k05K38
7229A45j11K03l7j97K05k70K07j42k28M62l37K15j07k04M36m28L32l3j93K48k68
7250a02J89M3m35L77MJ48j70j85L05k24J13qk38K56k03P5n6q5N03n13K90k48M8
7273a16M94m42J80j21j52K87j97J54j25j29J91m54M32J20m06L67m20L16j66K36
7293D9j29pO2J34r1J61j10M0j62l7K29j51P5p1k6K83k41q6j57L4K05J18p9J1K1
$$ y = [218, -259, 103, -64, 126, 148, -285, 26, -212, 63, -83, -168, 256, -236, -43, -2, -98, 339, -271, 278, 64, -196, 300, -305, 160, 36, -357, 181, -155, 226, 63, -156, 231, -484, 168, -105, -20, 224, -216, 291, -109, -43, 248, -239, 45, -32, -189, 183, -121, 90, -60, -239, 218, -466, 193, -65, -19, 275, -220, 65, -93, -85, -71, -231, 104, 2, 35, 198, -327, 226, -135, -257, 84, -190, 49, -284, -177, 192, -97, 217, -205, -26, 112, -93, 145, 34, 237, 200, 3, 208, -62, 145, 3, -225, 237, -100, 115, 8, -196, 240, -188, 144, 111, -82, 166, -102, 87, 130, -305, 72, 76, 224, 54, -131, 174, -50, 63, 55, -183, 73, -130, -55, -111, -196, 307, -206, 84, -164, -116, 378, -64, 116, -5, -157, 130, -67, 87, -38, -167, 24, -430, 2, 122, -284, 83, -337, -21, -187, 49, -80, -87, -25, 109, 18, 179, 69, 109, -53, -90, 139, -12, 63, -8, -34, 249, 8, -78, -235, -201, 4, 122, 43, 54, 75]
7318G5l6j27L84l78KK29l18M16k96Q2K01k65M1j57J97r1n2K39l07J04P0n0P5l5
7342CJ73j02o7J03j36J27l16K9K44j21K94k92J46N8k42N0K1K3J65k16j06K13N9
7365A10k5K2j96p9Q0L15k55N8j55nJ49n4K11k09K8J97k81J70p0q7J29k61J93k01
7389b16J20K0J02J08m4K2j47j29J86j27L9J82j24Q8j83K19Np4j48K03p5q1k14
7412b68Q3K40o2J50k44K72m2j98q6o0L64q6j48L47l19L9J25k1j07l9K92j17l30
7435b15K43j5N3k03K38J27k9l47J69j17L06k92R7p6J98l7l36L30k66J74J3M8r7
7458c4Q6k10K05k9%k11K88j28N7l4j07K02j20m3J20k72M00j60p7L21k74jr9J92
7482G2k1j10J87J4k56K96k19oj56L87k72j66K94k54P2K28k69K33k12K18L5j48
$$ y = [75, 39, -88, 296, -82, -80, 149, -169, 247, -49, 33, 234, -31, 10, -147, 50, -41, -93, 146, -161, -57, 13, -37, 38, 3, 176, 74, 7, 110, -26, 101, -215, -186, 58, -63, 231, -61, 85, 143, -99, -49, -28, -5, 160, -56, -162, 51, 110, 85, 107, -89, -168, -88, 227, -28, 30, -125, -130, 19, -35, 176, -33, -5, 192, -89, 81, 11, -76, 53, -208, -15, -216, -96, -76, 26, 134, 90, 112, -35, -164, 22, -105, -66, 116, -8, 80, -103, 116, 121, 47, -101, 102, 27, -54, -268, -185, 55, -7, 143, -101, 171, 129, -69, -155, -215, 149, 63, -85, 262, -57, -18, 107, 86, -21, -60, 232, 115, -215, 28, 13, 66, -137, 101, 228, 199, -148, 21, -96, 210, -82, 15, -61, 137, 100, -236, 94, -172, 2, 15, 63, -34, 52, -158, 47, 18, 18, -193, 95, -33, 24, -10, -117, 85, -35, -78, 42, -230, 170, 10, -67, 254, -20, -21, -120, 72, 51, -59, 128, 142, -114, 182, -37, -43, -199, 188, -84, -250, 44, -210, -138, 90, -179, 54, -158, 60, 95, -53]
7504e3J82l91Q9K24j62K25N0j00j55J28K5j20L7Q9K0n6j20K47o4j66K28k60J70
7527F7p5k8K66m80L35k08J85R2k99K72n8p9J18l50K72j33k4K69k12K73l27r8K67
7550D5L9Kr4j79K40m40N84k81J15N8k76L26k5q2K43m41J60j18Q7K93l55J18j83
7573a64K02L7l60L19PPk1j88L02l21L12j25j91L53k52k9J58p5M08m59J59M2j18
7596CK64n10K80N7j67J48j81J94K2j73J29l58K33R0l4K01m53M38j45r6J07l57
7618c08N23l75K57m2k04K51j20MK67n17O19l91O1O9k05K86k29K2O0j86K21q7K6
7641BJ35l39L56j14o6J39k11K35j68J85Q0n49N97m72K40Q0k18K94j99J48j22J6
7663D9M19n46N5J6r3M24n71K70J16k36L13m88K56J11k72K27j45J49K16l18K65
$$ y = [-53, 129, -262, -173, 51, -111, 114, 164, 64, -91, 37, 62, -58, -21, 68, 88, 32, -88, 159, 95, -71, 157, -103, 67, -8, -36, 230, -250, 85, -123, 62, 154, -145, 127, 69, -10, 108, -242, 30, -103, -127, 142, -70, 203, -124, -222, 45, 84, 86, -8, -187, 53, -387, 197, -84, 31, 89, -187, 139, 114, 32, 275, -166, -6, -124, -37, 256, -99, 19, -164, 38, 75, -285, 34, 41, 48, 27, -161, 141, -180, 132, 7, -184, 169, -83, -112, 46, -29, 379, -80, 79, 121, 3, 267, -243, 37, 94, -73, 75, -106, 88, 110, -63, 66, -292, -59, 31, -3, 198, -255, 183, 38, -58, 49, -308, 215, -160, 97, 55, -149, 102, -18, -14, 253, -264, 355, -36, 25, 94, -111, 175, -54, -32, 28, -158, 63, -24, 2, 137, -202, 154, 40, -26, 113, -98, 137, -31, 154, 234, -315, 282, -190, 50, 130, -88, 206, 7, 155, 33, 49, 468, -78, -23, -7, -100, 324, -247, 23, 139, -97, 216, -272, -16, 95, -177, 50, -95, 54, 270, -48, 217]
7684B17l92K82pk01N15n52L89k16j62L31m58L23M8k44J94j74K76k76QM46m50L30
7706B27m16L7L83m48L12j17J4L06o25K22J25N2J1m02L95k13J80R6l87N07m22o
7728a69L82l66L06l16n1K10j66K43j38J33J38m96K90J7Q4r6j31J97k90J22M16
7749C19l78K08k88K42P1j92K80l11rK32l81L34k49N7J92m18M79l02K66l3l89M93
7771B23m87M13r3j86K52l08L02q8k12K79l61L14r1L4K03k20l2j6J2K36l35J47
7793a4q8j7M67m14L6J92M6j90j13J75q8o7K82n57M25k12O9J10j29J27j79J10l4
7816f3j01K52P0j86K17k12J92j84r1N5nj2J37n0j2j2oL7n6K03k63K61k81j15J43
7841h2j30K84n9J68r7k49L18l21L17j07q2J45j40k06K03J09l7j33O0J53j20rj45
$$ y = [217, -175, 107, 100, -101, 414, -138, 251, 35, -127, 204, -254, 69, 117, -127, 67, -107, 169, -107, -99, 347, -103, 227, -189, -152, 231, -217, 95, -22, -8, 298, -327, -105, 20, 72, 83, -319, 76, -137, 43, 139, -248, 259, -163, -169, 213, -153, 153, -163, -214, -4, -170, 73, -65, 68, 206, -290, 0, 17, 101, 5, -126, 71, -219, -97, 319, -59, 149, -139, 103, 174, -18, 262, -49, -58, 174, -207, 127, -122, -65, 127, -291, 188, -114, 152, 119, -270, 223, -264, 149, 56, -130, 122, -186, 116, 28, -184, 95, -266, 48, -43, -9, 194, -26, -58, -74, -62, 174, -161, -14, -102, -119, 348, -66, -30, 162, 208, 18, -95, 80, -8, -75, 207, -350, 75, -137, -68, 42, -87, 40, -139, -29, -63, -164, 88, 158, -28, 189, -23, 169, -15, -106, -51, -56, -68, 69, 19, 7, -5, -11, 26, -30, 173, -90, 171, -110, -225, -82, -212, 72, 13, 181, 84, -165, 153, -168, 149, 42, -40, 105, -35, -241, -38, 71, 34, -99, -39, 114, -6, -15, -160]
7864a60K55K7j03M1M4k7o8n4K09j67R1o1j10J63k93L69j72jJ82k63J22J9l20L91
7888A14l15K48j99J8K21m3q0P3k85K33q2M2J19M4n1J6J16j42r6J39k0J7q8j05
7912a06K45j40l2KJ76l74R8J89l33J27K24k03J15J77j29m6j14J53j79J68K09l84
7934a57K38j68q1j4J59R8j26o9L12n12L89j32o3J45m0k1j25K54j37J1Q8k10J24
7957c7R9m6q6J11M8j17p9K78j52N0R3k71J31j71J27j02R7J63k02M1R4j32M8oP3
7982E2j36j66K62N1l3kj58J57l22L66j43K9K68j65k38K78j13R3l21M91l73j0J48
8005A5j85K74k40J63Q0K8R7m61J57L5L7j43L39k78P7j10J71k38K5J81k21K87k08
8028a18l9J53k19L56l29L3K58k28J2p3K55r7LK42m47L18J17k57K65l10L9m2j92
$$ y = [-160, 95, 122, 19, 60, 104, 77, 9, -45, 164, -3, 88, 27, -83, 80, -213, 156, -16, -17, 165, -98, 24, 43, -277, 114, -201, 47, -152, -134, 87, 44, -36, 37, -248, -15, -97, -55, 64, 108, 57, 73, 189, 47, -49, 90, 70, 87, -1, -106, 139, -1, -33, -31, 145, -229, -131, 58, -275, -148, 76, -127, -12, 165, 36, -10, -124, 29, -150, 18, 227, -157, 81, -87, -168, -182, -23, 75, -51, -120, 192, -320, 69, -63, -126, 19, -21, -42, -167, 87, -50, -39, 49, -161, -37, 62, 16, -70, 41, 89, -28, -107, 171, 19, 69, 162, -109, 22, -149, -22, -124, -27, 136, -66, -25, 69, -63, -15, -21, 52, -84, -250, 12, 63, 30, 28, -130, 27, -295, 71, -72, -43, 225, 60, -178, 100, -13, 80, -241, 250, -123, -133, 15, -170, 104, -136, 27, 107, 135, 232, -229, -72, -37, 0, -143, 196, -82, -5, -115, 56, -182, -157, 24, -197, 90, -118, -157, -4, -223, 133, -196, -163, 95, -133, -121, -194, 61, -36, -33, 209, -238, 80, 197, -60, 205, -105, -66, -108, -300]
8051c00M05k53K66j48m9K59m64L31p3J4J82k43L39m12j35L25l12M96j83j61K31
8072A15k14K76k49o9K97n22M68j06r8M29m27K28k23O5K21l44K24Q8k73K79j05
8093F0Q8k62J6K63k34J0k4R1Q3n74M40j31J36K51m07J93O5j09Rj52K90k29O7R0
8117C0j02Q4j29J67p9o8K57l18K05p0MR6p1j46J76j82M74n82L61J30k63J50k59
8140a35K26j6k88N35m68L26k52QJ60k12L74o8k71J98l09O11m04j30K79m32M64
8161A96k23OR9m62K89l9J68k6k51N49l37j41L72m08K46k30J31J99l25M14k35k4
8183c2K07l95L19k56R8J77m63O28
$$ y = [-300, 105, -148, 118, -30, -79, 180, -284, 47, -26, -12, 170, -73, 266, -146, -281, 44, -268, 228, 45, -116, 115, -99, 177, -72, -141, 156, -366, 102, -4, -102, 327, -100, 128, -95, -30, 191, -153, 71, 159, -114, 165, 60, 148, -114, -98, 165, -69, -59, -83, 8, 91, -483, -43, -174, -38, 213, -194, -1, 64, -45, -36, -188, 102, -127, -60, 30, -72, 12, -117, 50, -29, -97, 160, -158, 47, -23, -19, 77, 6, -140, 36, -146, 328, -254, 107, 237, -26, 124, -135, 91, 75, -213, 322, -146, 180, -72, -64, 96, -116, 258, 190, -81, 117, -192, 419, 15, -115, 164, -268, 196, -27, -21, 78, -384, -95, -134, 34, 8, -243, 306, -31, -172, 200, -208, 38, -192, -61, 138, -187, 227, -8, -32, 175, -220, 99, -157, -59, 118, -345, 283]
8191B83
$$ Imaginary data points
##PAGE= N=2
##DATA TABLE= (X++(I..I)), XYDATA
0@%%%%%%Qj6J6k4L2m0M8n6P2r2J16j44J76k08K44k88L39l95M57n29O12p03Q00
29D25r12J039j173J323j493J676j873K092k333K593k877L187l523L889m288M724
45B476n201N726o299O924p613Q374r216J0155j1210J2403j3763J5325j7143J9285
59A0223k1849K4976k8872L3859m0461M9576o2877Q3861j21204K04544o46694R882
71e05036J289354j391271J165534j121033N56759O44360j253211R78688o57070
80b92926N54701r3917o02300O62779l39246L82132n54728J38772M33220k90748
90b261m7577k13918O07819k97094k53790K06844L5074J35981l28242O0672J52761
101E6269J42814l63032J18053R1599l0451K28052p49581P63317j20688l54229
$$ y = [0, 0, 0, 0, 0, 0, 0, 8, -8, 8, -16, 16, -24, 24, -32, 40, -52, 64, -80, 96, -112, 132, -156, 183, -212, 245, -284, 328, -375, 425, -487, 552, -621, 702, -791, 885, -988, 1104, -1229, 1364, -1513, 1674, -1849, 2040, -2248, 2476, -2725, 3001, -3298, 3626, -3987, 4387, -4829, 5326, -5884, 6519, -7244, 8081, -9062, 10223, -11626, 13350, -15522, 18337, -22124, 27452, -35425, 48436, -72768, 131776, -514918, -505036, 784318, -606953, 558581, -562452, -5693, 638667, -614544, 364144, -292926, 261775, 167858, -434442, 228337, -110909, 271223, -283505, -144733, 288487, -2261, -49838, -263756, 344063, 46969, -206821, 23, 35097, 171078, -157164, -96492, 56269, 199083, -163949, -45896, 45703, 15252, 243304, -506277, 257040, 136352, -217877]
111b17877L92520n72209R52939p55106k9145N88942o97661Q04482q95797M37143
121H231L01441o63738O78678p62345P39891j85800m33666N72730m82099O26786
131D00109o80658J67371M32442n83085M79040n17839M38050K4661m28724M56100
141A87467l39491L25111j53118k12657L34275j36555J5353j08091L9964J81490
151A33748j18753k09912L05444n4737j20978J26798k37093M02780k90626m3528
161a06857K49692l12849M18895m29381J54223J72107k81035L13652m59373M62346
171A81420j28660k37238L37941l31835M37318m23829J29330K10837l60130M16716
181B31870m79149L52265k8116k61015L80327m38125M28958j90997j46496L15713
$$ y = [-217877, 174643, -397566, 555373, -199733, -228878, 360064, -337597, 466885, -428912, 8231, 309672, -354066, 324612, -437733, 302158, 116358, -317308, 255422, -226677, 400109, -280549, -113178, 319264, -263821, 215219, -302620, 135430, 160091, -268633, 187467, -152024, 173087, 19969, -192688, 141587, 5032, 20385, -87706, -47742, 133748, 14995, -194917, 110527, 55790, -65188, 61610, -175483, 227297, -63329, -106857, 142835, -170014, 248881, -180500, -26277, 145830, -135205, 178447, -280926, 181420, 52760, -184478, 153463, -178372, 258946, -164883, -35553, 175284, -184846, 231870, -247279, 104986, 76870, -184145, 196182, -241943, 187015, -3982, -150478, 165235]
191A65235k76312K51570k44842Q6886J35863k09858J28792r9101J10067m7641
201F59l2428K0815K2692K8719r3595R2750q7614J29136j02356m7024J62118j53574
213e9702J19686j42688J12883J3926j29389J62566j78055K05298j49167Q903J27632
224I1893k04273K60412k62390J43280L3582j67730K30334k79490K61469j23194
234a6107p3525K14861k55620K49825j78019M6107R5952j72641J83129j71518J16905
245C9349l7704m0536Q3139j19221J49290j26487N9691J4938n1646Q2077j08243
256e5353J08841p6686K9083Q101n4755R2214j04351Q2871n0950J8044K5525o2567
268c9983Q4473q5854Q5671o6390J6367N3236j09453J25708j09045N9280k53n9251
$$ y = [165235, -111077, 140493, -104349, -17463, 118400, -91458, 37334, -61767, 48300, 659, -31769, -10954, 11738, 40457, -53138, 39612, -48002, 81134, -21222, -68246, 93872, -59702, 59984, -82704, 30179, 44105, -85284, 77282, -100773, 104525, -44642, -35739, 91893, -112380, 148032, -114358, 28922, 62504, -105226, 125108, -154382, 107087, -16107, -89632, 125229, -130391, 119434, -58585, -12478, 83474, -89167, 93962, -77556, 39349, 1645, -38891, 44248, -74973, 74317, -52170, 7521, 22459, -29187, 52890, -55353, 53488, -23198, 5885, 13986, -40769, 51445, -52906, 29965, -20985, -2941, 22584, -39983, 44490, -41364, 44307, -22083, -5716, 47520, -61933, 63775, -45270, 14010, 13757, -45494]
280d5494R7459j12014J02899o5276J2492M8500q7749J09077j00918O4157q293
291A4840m7626P4433q3631P1278n6419K8540J1413n0991Q0916p8321N9687k2936
303A183j0190L9128n7709N7907n0508K8918j1695j3847L9376o0009O3021l9109
315a3534P435K6015l8645M2116l6043K7038j5213m177J9393l4487L6577l1569
327a5094J5089L663j8946K7446k2387J7038j0170Q754l0j2658K6533l2570K0409
340G077k610j7828K3743k3006J1897j059m821J1855j2081J5114r211M361P707
353A1138j9585K2922j7883l663J7634k6746J9509r977N30R740j1323J8574k1364
366a0494K7113j4442j0649L2429m3402L5001k3006n471K9825m2315L7561k4374
$$ y = [-45494, 51965, -60049, 42850, -22426, -9934, 38566, -49183, 59894, -41024, 23133, 14840, -32786, 41647, -41984, 29294, -27125, 1415, 12828, -38163, 42753, -35568, 24119, 1183, -9007, 30121, -27588, 30319, -20189, 8729, -2966, -16813, 22563, -37446, 25575, -13534, -6099, 19916, -18729, 23387, -12656, 14382, -831, -5008, 14385, -20102, 16475, -15094, -5, 3658, -15288, 12158, -10229, 6809, -3361, 5393, 5363, -7295, 19238, -13332, 7077, 4467, -13361, 10382, -12624, -727, -1786, -6607, 5248, -6833, 8281, -930, 3431, 11138, -8447, 14475, -3408, -7071, 10563, -16183, 3326, -6651, -6121, 3619, -7704, 10870, -10494, 16619, 2177, -8472, 23957, -19445, 15556, -7450, -12921, 16904, -25411, 12150, -12224]
378a2224J3705R292k8037M0025l4751K4166n141k4114L7065k4627l420P278K129
391A346p172Q575j3437J2050J3029l5744M0795k9692J9691J500l3203N0132m9968
404b2098M6141m2432J228N8706q7040O8485m5820L5868L232n8873R3502q7300
416c6401P6400n4548r882Q6662j30255J22929r8207L2536P2348j47021J38453
427E3014q1539M7450J932q3840J40542j10353M1100n611k6685P0852q9442M6536
439C956m482R83P623k7730K0826J2400N613n6390N1464O165k1145j5705M202N3092
453D0872o7229K8594k4494M5681j1100o4115J00035r4243J01501p3493k9947J34682
465H6744j53389J37649j43199P8434R3802k43031K34669j50155Q4551J4927j71122
$$ y = [-12224, 1481, 10773, -17264, 22761, -11990, 12176, 7035, -17079, 19986, -4641, -8061, -783, 1346, -5826, 2749, -10688, 1362, 14391, -21353, 19442, -10250, 9441, 10941, -22262, 27870, -22098, 24043, -18389, -17161, 41545, -45495, 22990, -22830, 13038, 16270, -42603, 50899, -36401, 39999, -14549, -24431, 62231, -68024, 54905, -43302, -10766, 61582, -85439, 53014, -28525, 18925, 20857, -62983, 77559, -32794, 8306, 2695, -23990, 46862, -42580, 3956, -526, 457, 8080, -19650, 1176, 13576, 19189, -37201, 14263, 20428, -717, -16422, -12220, 40872, -26357, 2237, -22257, 23424, 12324, -51791, 48244, -45999, 55502, -17991, -47938, 86744, -66645, 71004, -72195, 6239, 100041, -142990, 91679, -58476, 26075, 41002, -130120]
476a30120K67610k07460R7664j5343p7779J82718k02715J19603o1293K9942O0081
487F2908j76411J70643o2901K4952m3113j6884J38706j49690N8510j8764K4032
498A1988L1913j12328Q5440m478r494l833l3284L6975O0184j09487N461J07372
510F6429r3131O9907j23504J07434O9408k25539K12539j44295J02095J530j89131
521a46258K82757k20726J35198n5087r7618K67932k63245J35359p5029N7644P0399
532I1326k50410K56891j41179Q0109n0410q7331K53835k52467J48583p0585j0391
543c2029J62776k50621J62459n4604K6138K7654j67943J99341m3162p5481L4998
554a0474J2827M1814m2149o2961R0362K2402j09103Q6528p6929Q7259K470j42753
$$ y = [-130120, 137490, -69970, 27694, 12351, -65428, 117290, -85425, 34178, -27115, 2827, 62908, -113503, 57140, -5761, 19191, -23922, -40806, 97900, -51790, 6720, -12044, 11988, 43901, -68427, 17013, 12535, 3041, -792, -34076, 2899, 63083, -46404, -40943, 66429, -26702, 43205, -80299, 27135, 96543, -128996, 83543, -60752, 41343, 42873, -146258, 136499, -84227, 50971, -4116, -101734, 166198, -97047, 38312, -36717, 20927, 91326, -159084, 97807, -43372, 36737, -13673, -101004, 152831, -99636, 48947, -21638, -32029, 130747, -119874, 42585, -12019, 14119, 41773, -126170, 73171, 30009, -45472, -10474, 2353, 44167, 2018, -60943, 29419, 51821, -57282, 29246, -47683, 39576, 42046, -100707]
566a00707J63061r3674R3612j06906k3843J99536k13856J23604j06808J07130
576D1149L7294k23521K61953j91831J43447o9413j16650K73603k80071K10414
586H6374j45212J137K32300l36118K37095j00244M0904N8918k26390K63456j28695
597a6475q98J4655m3616J24224j23239M0513l038L4271j254o2153L5633K0524
609A9147K3243j06080N9632L1966j4736m1383j4443J11203q7687K2611m2303P3688
621C4858M905j12952J33087j28551J48742r1401q1312K09771k04924J75472j62742
632g5047M3338J77252k98117K40222j46754Q4975M6323k24641K87266j94758Q6948
643B7007j1065j04189K06644j92251R6148n0144K2367P6075j61901J30673m5990
$$ y = [-100707, 62354, -31320, 62292, -44614, -68457, 131079, -82777, 40827, -65981, 41149, 78443, -145078, 116875, -74956, 68491, -922, -117572, 156031, -124040, 86374, -58838, -57701, 174599, -161519, 75576, -24668, 16236, 75154, -151236, 112220, -16475, -17373, -2718, -46334, 77890, -45349, -4836, -7874, 26397, 25143, -37010, -1377, 19147, 42390, -63690, -4058, 27908, 13172, -28211, -42654, 68549, -19138, 3473, -38830, 34858, 39763, -73189, 59898, -68653, 80089, -11312, -92624, 117147, -87777, 87695, -75047, -31709, 145543, -152574, 87648, -59106, 25869, 72192, -152449, 134817, -59941, 27007, 15942, -88247, 118397, -73854, 22294, -27850, -5483, 70592, -91309, 39364, -6626]
654f626L8966m0172m0588J18108r1112K3212k5945L0775J7809n3456K2933O88
666e408L5057m2835R046q605N1982l3233n7336R9169p6529O7918p9740J5207J04821
679G9514j59847J30959r0232N0027M2555j41700J66596j29723R0339l0993p7610
690g0115J63215j59160J07050p2495J9009Q1770j58072J46103r2858N7238n800
701A5885p7677J39302j28150Q3672m1332j8319Q3985j08291P4780m2644K4428
712E639Q787m9490N5376k5577J9326l1820K8383k414r507O323k5753N2714o1857
725b9870M4063k4804l961N1875q4966Q2296n3210K8887P079n8946R5305r1700
737c7952O2996l6265n134O0696j04369J06575p7451L5740J9397p3537J04526r7136
$$ y = [-6626, 32340, -7832, -48420, 69688, -21424, 1788, -24157, 6618, 24427, -29029, -6096, -5408, 29649, -13186, -4140, -12745, 39237, 6004, -51332, 47837, -28692, 39226, -40514, -25307, 79514, -80333, 50626, -39606, 10421, 52976, -88724, 77872, -51851, 38488, 7495, -70115, 93100, -66060, 40990, -31505, -12496, 69274, -88798, 57305, -35553, 21685, 15885, -61792, 77510, -50640, 33032, -8300, -26619, 57366, -50925, 23855, -18789, 5639, 14426, -35064, 20312, -5265, 14061, -17759, 10624, 8210, -1297, 5026, -20727, 31987, -29870, 14193, -10611, -14572, 37303, -47663, 34633, -18577, 10310, 17389, -41557, 53748, -37952, 25044, -11221, -16355, 44341, -60028, 46547, -30904, 4836, 24233, -49304, 55222, -41914]
749d1914P0582l2059j9623P1267r6947Q6363o1511K7049J6271n9841P7778o8496
761c1081M9912k6509j167L2378n0605N8670n6071M0844j2367j9890L7782m8290
773b6394N0803m5907K6560k245j8142L9177n4070N9812m4106J7779J3188m2318
785b5863N9478o2048M6202k5311l785L4688n9558O6507n1476K7612L711l1734
797b1577N3720n8625M8569l0500O318J7193m1603N5034n6730M2100j4708j6875
809a7684M2635n2227N0705l6055J6603P634k8997M1648m5756L8031k4053J031
821f485J9922l5738M0817l5921K6446j0661n381K5494l9321M4410l5763J6168
833C987N913k7718L7840l9803K8712j3087k696J6000k4175L1635l0022K2088n018
$$ y = [-41914, 28668, -3391, -23014, 48253, -48694, 37669, -23842, 3207, 19478, -40363, 37415, -31081, 18831, -7678, -8845, 23533, -27072, 31598, -24473, 16371, 4004, -15886, 21896, -26394, 24409, -21498, 5062, 2817, -15325, 23852, -30218, 29594, -14512, 3267, 16455, -25863, 33615, -28433, 17769, -7542, -11327, 23361, -36197, 30310, -21166, 6446, 10157, -21577, 32143, -26482, 22087, -8413, -2095, 15098, -26505, 28529, -28201, 13899, -809, -17684, 24951, -27276, 23429, -12626, 3977, 11611, -17386, 24262, -21494, 16537, -7516, -6485, 13437, -22301, 18516, -17405, 9041, -1620, -7001, 18493, -20828, 23582, -12181, 3987, 9900, -17818, 20022, -19781, 8931, -4156, -6852, 9148, -15027, 16608, -13414, 8674, 3656]
846C656j1113K2599k8427K6772k2710J0631K221j6870K6621l0429K8053j5264
858d260j399K0987l0723K9967j9045N700M100j3381J9389k3316J6923o607l804
871e469J0338j4417J6978j1177L400M585n222M558l999M959q368O410j899o177
885e500N970j979Q23m308P376k339J821k162P6R803j7026J3061n711m015J0090
900E980j6047J5761j2737Q043N022k2773L3249k0640Q31J2619k0144K9022k8824
913a0638O257K0216l1664K4676j6040M756J1901k5074K8366k2500J2605R633l1910
926a9416L5618j9348O038j544j5101L7297m0642J5923M673j1421K2832l9939M2313
939A7283j7341j0171L3484n0035M9025k0492j6708L1812l8452M5244l6254p536
$$ y = [3656, -7457, 15142, -13285, 13487, -9223, 1408, 3629, -13241, 13380, -17049, 11004, -4260, -5659, 15328, -15395, 14572, -4473, 1227, 5327, -8054, 11335, -11981, 4942, -1665, -5469, 4869, -9548, 7430, -3747, -347, 4238, -984, 3574, -425, 4534, -3834, 2576, 677, -5500, 470, -1509, -686, -4994, 2382, 43, 1864, -298, -222, 9581, -7445, 5616, -95, -4110, 5980, -10067, 5694, -7043, 1000, 6022, -16751, 16498, -4142, -3311, 9308, -10836, 18186, -10638, -4381, 15835, -15829, 8847, -7193, -2437, 9464, -15610, 12756, -9744, 2861, 12494, -19416, 16202, -3146, 2892, 1348, -13753, 23544, -17098, -1175, 3498, -7923, 14909, -25030, 17283, -58, -10229, 23255, -26780, 22245, 1753, -14955, 16857, -21595, 23649, -12605, -20141]
951b0141M8326m5496K3406j2314M456K6498m9712L4542j012j9726K8332l7063
963a9904K2890R833k7970K2473k3837L2266p951l6775N0001k4993J4973k1971
975a0965j284N1526p1313M5051j8202l320M0775p8816P4422l9974J0694K8685
987B7279q5562J12350o5841K16L2172n7289R8413j04689L3022M6474p2510O7470
999C1505o9128M8969J1728n4493N6384m7949M5055j0125m2769M8315j7723J0437
1011A0206k6739N28M7617m2252m786J9987p92J2795l9715K3523K2841m0839L7402
1024A9776m6730L3012K7987q1290P4107m8611L9685J142q8563J36888r1110K1841
1036a866J4265n5276J20963j37093O9120J2461n8905R5899j26787R5256j4810
$$ y = [-20141, 28185, -17311, 6095, -6219, -1763, 24735, -24977, 9565, 8553, -11173, 17159, -19904, 2986, 12819, -15151, 7322, -16515, 15751, 7800, -28975, 21026, -3967, 11006, -10965, -12249, 39277, -32036, 13015, -5187, -8507, 32268, -46548, 27874, -12100, -1406, 27279, -58283, 54067, -11774, -11558, 20614, -36675, 61738, -42951, -9929, 36545, -35965, 31505, -37623, 11346, 23074, -31419, 24965, -22984, 22071, 11946, -30823, 17492, -231, 10206, -16533, -16005, 31612, -10640, -15426, 4561, 3769, 16564, -23151, 372, 23213, -17626, 19776, -26954, 6058, 34045, -47245, 26862, -21749, 17936, 19078, -69485, 67403, -23707, -1866, 12399, -42877, 78086, -59007, 10113, 22574, -36331, 59568, -67219, 28037, 13227]
1047A3227m0116N7929q8036J13459o6004j7921N3119m5193O5991r2970N0297K9207
1059C2989o3069N0294n3029N1828l969m7784M9262k6215K4976o900m3209O0790
1071B5964j1974l4521K8102k6959N1069l5603m3062R7249p5127L5793j1672l2975
1083c3716R8584j12438O3926j5383k0010P6214j26920J04062l4372q398L2799
1094B4348q9836J36756r9183J4472L4229n3865R5851j21046P6153m68m2987O9232
1106D3656j04235R9476l4506l1180N0728o3721Q5267n8932j5762O0644l9664J9708
1118A1479k6630J1861L0833m1307K953K0353j5689J8786k7437J106M3757n0506
1130b0441L2229k4698J3632L6114q2958P1879l2350J1050O902n7402R8468q4775
$$ y = [13227, -26889, 31040, -56996, 56463, -9541, -27462, 25657, -19536, 46455, -46515, 3782, 32989, -30080, 20214, -32815, 19013, 15044, -32740, 16522, -9693, 15283, 8383, -34826, 25964, 13990, -20531, 7571, -19388, 31681, -3922, -46984, 50265, -24862, 10931, -741, -33716, 64868, -47570, 16356, 973, -19037, 57177, -69743, 34319, -53, -8451, 24348, -65488, 71268, -27915, -13443, 20786, -33079, 62772, -58274, 17879, 17411, -25576, 43656, -60579, 38897, 4391, -26789, 23939, -39782, 45485, -13447, -29209, 31435, -8229, 11479, -15151, -3290, 27543, -13764, -10811, 9542, -6147, 12639, -14798, -13692, 30065, -20441, 11788, -12910, 722, 36836, -46122, 25757, -6593, 4457, 11359, -46043, 52425, -32350]
1142c2350L9868k350l6413Q9335j12047Q0928k7403j7856O7249j12238J06850
1153D3573n1185n877L8614p2821J00830q1874K0820K9996m8727O1040o4739L9611
1165I261L351k6275K8332l2409L1390j2636q090N426J239P687j5249L934O786
1178B747P713k3427J7951l182L12N098k6767M1829l5678J7670l166k0630N1022
1191C1492o2835M8294k1807m477M2721p7763Q0253m6034L785K8311o0835Q1393
1203D2498p1057L1337R617l9232O3585p2008N3608j6809j4208L7765n6041N7748
1215B6803l6000N941J1568k4166L8551m4028K8826o918n787J5055k5148K8430
1227A3127j8317Q622n092R46P553j3186J3642j9316K4442j9055K421J0641j7896
$$ y = [-32350, 7518, 5168, -31245, 58090, -53957, 26971, -432, -18288, 48961, -63277, 43573, -7612, -13489, 25125, -47696, 53134, -28740, -7920, 22076, -26651, 34389, -30350, 9261, 12612, -13663, 14669, -17740, 13650, 1014, -7076, -1650, -411, 7276, -7973, -4039, 2747, 10460, -12967, 4984, 1802, 2114, 7212, -19555, 22274, -13404, 4266, 1100, -19530, 31492, -31343, 16951, -4856, -9333, 33388, -44375, 35878, -10156, -6371, 21940, -38895, 42498, -28559, 2778, 12395, -26837, 36748, -35260, 18348, 1539, -12669, 25096, -30945, 26803, -9197, -3256, 8312, -15854, 22697, -21331, 7495, 577, -5210, 9845, -15303, 13127, -5190, 3432, -1660, -714, 6839, -6347, 7295, -12021, 12421, -6634, -4213, 6428, -11468]
1240a1468K7801l5289L0578j1053p761K4388l9423M6101l6543J2827J0369l2180
1252b1653M7187m9753L5030j1225j0894L2957m8873N1703l4180P946J6036l5052
1264b0771M4946m2829K5960o393j1685K5326l3292L3724k5292J4553J04j5441
1276a1090K8232l1796K6992j8687P032O547k1686K9964l0382K3635j2157k237
1288e633J7092k5735K8441k3956J6233n175o644J7327k6688L0561k8363J5345
1300B805K298j9495L1312l5235L1170j6690j826K0452l1124L3844k8710J6293
1312E094l58j6424K6315l0184K5133j5921N258O315j6397K6159k8601K4115j1995
1325a491k208J5406k6561L0386k6652J3396J552j4501K1992k4970K4348j6397
$$ y = [-11468, 16333, -18956, 11622, 569, -7192, 17196, -22227, 23874, -12669, 158, 10527, -21653, 25534, -24219, 10811, -414, -11308, 21649, -27224, 24479, -9701, -1755, 14281, -20771, 24175, -18654, 7306, 913, -10772, 14554, -18738, 14986, -10306, 4247, 4351, -11090, 17142, -14654, 12338, -6349, 683, 7230, -14456, 15508, -14874, 8761, -3396, -5633, 11459, -14276, 14165, -9791, 6442, 1267, -5377, 11950, -14738, 15823, -12540, 2805, 5103, -14392, 16920, -18315, 12855, -3835, -5661, 14791, -16333, 17511, -11199, 5094, 4736, -11688, 14627, -15557, 9576, -6345, -1087, 5228, -11169, 14990, -13611, 10504, -1491, -3699, 11707, -14854, 15532, -11120, 2276, 3828, -10673, 11319, -13651, 10697, -5700]
1337e700M702R451j8715K2473k1148J6753j0583l36J1726k1263K3747k1493J5249
1350D863m607q876K2187k7017K3503j3124K403P169j5839K1977k3335J6253n551
1363Fn930J3154j7824K0333j8105J0666J729j0865J6276j8296J8475j4385L323
1376a443J0021k0264K1253j6539Q390o52o893J4216j6906J3890n271o12L536n461
1390b735R267j1698P860k920l36l46j681O930j2178J3387q029J407N479q510J1899
1405G796j4435J1585k936p291J0286j0411J1191j3578R483K219j2526J6970j4840
1418f487J2462p436r28J1906k1082K1995j4108k18J1058j6675J9209j8957R565
1431C04Q519k1541K0893r891J644L813r868J4651j2680K815O639j2078J0128m195
$$ y = [-5700, -998, 8453, -10262, 12211, -8937, 7816, -2767, -3103, 8623, -12640, 11107, -10386, 4863, 256, -8620, 13567, -13450, 10053, -3071, -668, 6501, -9338, 12639, -10696, 5557, 6, -5924, 7230, -10594, 9739, -8366, 2300, 4029, -6836, 9440, -8856, 9619, -4766, -1443, 8578, -11686, 9567, -6972, 1418, 766, -6127, 8089, -8817, 5073, -198, -810, 2726, -2735, 6532, -5166, 2694, -226, -562, -908, -2589, 4341, -7837, 5550, -2479, -1072, 4407, -4103, 7796, -6639, 4946, 2010, -5281, 5005, -5406, 5785, -7793, 1690, 3909, -8617, 8353, -6487, 5975, -1461, -2389, 9517, -11565, 10430, -3678, -3896, 7162, -9513, 9696, -9261, 304, 8823, -12718, 8175, -1716, -72, 3741, -6127, 8524, -4156, -1341, 5298, -6780, 3348, -847]
1445h47j714L823m854R037r206J362J0418j2310N977k203K911k57j0329J6458
1459H266j3655L811N667j3240J8017j5693J0050J135j5476K8002k5958P825R832
1472H583j8211K0205k3141J6943K588k3433L0069k1026Q473N488j7432K4309k2226
1485h811J2638J759j8750K6878k1072O906J889o805J7171k7328K2858l186j3510
1498i363K0383k2486K2692j3960m200K1716l1705K9831j6126n854K2614k8491
1510a4949K8221k2146M364K3114l8869L2127j2488l508J5760k7421K9842j7504
1522c457m591K0169k6058K2381r820n592J6722j9826K0904j4885k499K2561k7872
1535a1863J7200p413O1J1907k8586L2552j8667m55J7219l0044L7488k9545R044
$$ y = [-847, -2561, 1262, -3592, 5445, -3761, -2399, 8019, -4291, 1686, -517, 2394, 2137, -8192, 8266, -5389, -1578, 4089, -9151, 8866, -6827, 3223, 4358, -11118, 16884, -9074, -1249, 8583, -9628, 10577, -12564, 4379, 6967, -16466, 13603, -7423, 1050, 6538, -10894, 13415, -8811, 3827, 5586, -13164, 13714, -7358, -452, 1437, -5368, 11803, -15525, 7333, 4147, -9363, 11020, -11466, 11226, -2734, -6934, 14782, -16923, 12908, -3218, -9072, 13542, -14949, 13272, -8874, -4510, 18604, -20265, 11862, -626, -4134, 11626, -15795, 14047, -3457, -8048, 12121, -13937, 8444, -1376, -6968, 9754, -10072, 10832, -4053, -6552, 16009, -11863, 5337, -2076, -2015, 9892, -18694, 13858, -4809, -5264, 11955, -18089, 19399, -10146, -1102]
1548a102J4158l4692M7281m1480J3621J6773l4539M1425m2890K9187L738l5525
1560b4045M6989l9151K4984m256k1261L8545l7741K4476p266j3631K8569k8353
1572a2141J6074n967j210J4420k5575K0697j984j0222J2847j5204J6035n099j3615
1585a0944K2594k0571J2496O4j9024L2001k8084J6086j161j8454M1319m7047K7026
1598F301K144k4474L9540n0078M1504j1581k2294M2000m8065M3860k3300o273
1610a0716L1573m2899M4287l4672Q912K0895l7243L6545l1640K1123R74k5461
1622a8322L5296k8334J7958n678j0511K5279k6115J4798k805r143J8438j8560
1634g699N352Q899j3685J3154j1052J904J6477k7250K1246o302o812J9614l2280
$$ y = [-1102, 13056, -21636, 25645, -15835, -2214, 14559, -19980, 21445, -21445, 7742, 11480, -24045, 22944, -16207, 8777, 4521, -16740, 21805, -15936, 8540, 1274, -12357, 16212, -12141, 3933, -2034, -3244, 11176, -14399, 6298, 4314, -5908, 6939, -8265, 7770, 2671, -10944, 11650, -8921, 3575, 3639, -15385, 16616, -11468, 4618, 3457, -14997, 26322, -20725, 6301, 8445, -16029, 23511, -26567, 14937, 3356, -18938, 23062, -25003, 18857, -4443, -10716, 20857, -22042, 22245, -12427, -3515, 17380, -19863, 16682, -14958, 6165, 7139, -18322, 16974, -11360, 6598, 920, -9591, 15688, -10427, 4371, 1566, -7577, 10861, -7699, -2347, 6552, -7133, 6021, -5031, -3127, 13350, -13900, 7346, 1044, -5768, 13846, -18434]
1647a8434L2492j6233o556K3580l5502L9139k7188L404J8944l1993M0208l8873
1659a7012K0623Q251k9075L6788l9046L2649j1616j7249L5042l8530L3647k0711
1671f239j143K3737l3017L1095k3021Q782J1180k5139K3516j5534Q048K30j1630
1684i135J5976q427j84K644k042L840j390n568Q826n065n70N149j2355J7438j4106
1699d969K488P773j5153K2998k5224J5431L199j7307K5295k9199K5528j0608j0130
1712i878K5111l2427L1157k0702J536J7564k8053L0848k5993J3488N076j9810
1724a2083K5440k4507J9561r534n573J7033k1273J9174j3716M999N272j1904J4120
1737G009j2312R004l249j880M034m847N261o523N766m539M042l815J23O738j1978
$$ y = [-18434, 14058, -2175, -8731, 14849, -20653, 18486, -8702, -5298, 13646, -18347, 21861, -17012, 3611, 11862, -17213, 19575, -19471, 13178, 1562, -15687, 19355, -19175, 14472, -6239, -7382, 16355, -16662, 14433, -8588, 194, 11374, -13765, 9751, -5783, 2265, 2495, -9135, 6841, -1586, -1770, 874, -1168, 2672, 1282, -4286, 4540, -525, -1095, 4054, -8301, 9137, -4969, -2481, 5292, -9861, 13137, -12087, 3344, 6543, -10764, 14531, -14668, 10860, 252, -9878, 15233, -17194, 13963, -6739, -5203, 12361, -15692, 15156, -10837, 2651, 7727, -12083, 13357, -11150, 8411, -1123, -6696, 10337, -10936, 8238, -5478, -479, 4793, -7111, 7009, -5303, 3701, 452, -1428, 2606, -2241, 3020, -3503, 2263, -2276, 1766, -2049, -1926, 4812, -7166]
1752g166J4536j2460P110J805j1032J7505j9473J5514p601m214J4051j9738K0626
1765I463j6706Q362M590j5918K2093k1137J6286p657m586J5445k1822K1077j5336
1778e846N242N610j4276J8746j7822J3350m654m506J1104j3007J2658j1984Q360
1791B975k179n012R772j2469J2666j0860O667N37q013J3862j5055J2897q012J743
1805d81N403j2191J5122j3954Q468k864k478P943j2396J4770j3066Q042l0o986
1819d698J2773j6675J6505j1199J015Q778j5124J6189j4491R899j884p002J3599
1832G685j4504J1940p273K515K226p376J1251j2612R871n631J056L568r235J4400
1846G881j4950R988j412n304J0209j2826J3421j0424K861M695r676J0266r500
$$ y = [-7166, 7370, -5090, 2020, 3825, -7207, 10298, -9175, 6339, -1262, -5476, 8575, -11163, 9463, -7243, 1119, 5709, -10209, 11884, -9253, 7033, -624, -5210, 10235, -11587, 9490, -5846, -604, 5006, -9270, 9476, -8346, 5004, 350, -4156, 6948, -6059, 6599, -5385, 2975, 796, -4216, 5556, -6913, 5753, -5107, 1560, 2097, -5916, 7946, -7109, 5788, -2224, -481, 4922, -7269, 7853, -6101, 2367, -497, -2975, 4968, -7428, 7342, -5724, 2318, 2288, -4698, 8075, -8600, 7905, -3294, -2279, 6499, -8625, 7564, -6927, 2972, 1088, -5914, 7685, -6819, 5121, -2152, 363, 2589, -4787, 6464, -6148, 3723, -1908, -852, 2716, -6519, 7881, -7069, 2919, 1507, -3797, 6412, -6414, 7007, -3417, -556, 4139, -5537, 4729, -4771]
1859d771Q198n694O44N687q952R726q741Q365n822n27Q261j3939J3686r844M210
1874D87J408p945J3557j4353J0035k572l544P352r086J0400r669N156J182o216
1888c808P358p998Q792p934L119M320r496J0706q465N563j722k945P814r695O949
1903B558k335j636J625j320K791m531M352k154J652k466J967L023q326R552p165
1918b413K767J107n563R585j1876R463k851m624R315r275Q802p644M366K620r744
1933e965J2243j0350O235k991k073Q839j3581J2951o683j111P565j0531J1103
1946E651r262L891M699j2086J2107o248n20L929n740P025n959R15N423o927M158
1961A056O13l621M123l348K590j142l440Q112q682K968L246n249N640p265Q028
$$ y = [-4771, 3427, -2267, -1623, 4064, -4888, 4838, -3903, 4462, -1360, -1887, 6374, -7565, 6121, -3723, 487, 1895, -6050, 7507, -6846, 3189, 617, -2927, 4425, -4661, 5739, -3930, 1226, 2408, -3808, 3550, -4448, 4344, -3590, -471, 3849, -5647, 5059, -3406, 2157, 435, -2510, 5304, -4391, 2558, 223, -1413, 212, -1108, 1683, -2848, 1504, -650, 1002, -1464, 503, 3526, -4800, 4752, -2413, 354, 1461, -4102, 5483, -6393, 3070, 219, -4405, 4910, -4365, 4437, -3207, 1159, 3779, -5965, 6278, -4072, 2163, -828, -2901, 5938, -7643, 5308, -1375, -2486, 5079, -5452, 5651, -3611, 280, 4979, -7107, 5000, -1248, -1768, 2161, -3579, 3446, -2513, -1598, 3825, -3102, 1056, 1669, -1952, 2171, -1177, 1413, 271, -3169, 4943, -3739, -771, 2475, -2774, 2866, -4399, 3629]
1976C629l424m139J0138j1239R061n118q34P228j3199J5202j1339J110J0113j5419
1990h230J4615j0485M676N053j5345J9223j3347K677O179j2340J4655j2697N824
2003D58L682j2143J5638j1539L381M133p997J0505j1483P551J487j0002J2065
2016E736r507M895J3o173J1739j2676Q351j53q067J3100j2429P973j557o307J3593
2031H531j6725J1116k9r618J3982j4350J0721k155q399J6211j6604J0653k80r601
2045f547J4761j4749J0294l049p484J6116j7461J1017j701n711J2271j5851J4205
2058F111o158m409J2699j7038J5217q582j253J0414j7179J8734j2689J127J0954
2071G948j7043J7647j3055L914P838j6800J8089j3080L669O266j4048J5919j1518
$$ y = [3629, 205, -3934, 6204, -5035, 4026, -1092, -1926, 5302, -7897, 7305, -4034, -2924, 7189, -8230, 6385, -4100, 576, 5629, -9716, 9507, -3840, -1163, 5016, -7324, 7331, -5366, 458, 4140, -8003, 7635, -3904, -523, 3610, -4387, 6118, -5365, 2186, 3673, -6329, 5736, -3771, 1124, 1137, -5036, 6703, -5973, 2378, 2225, -5842, 7258, -5171, 2802, 1245, -5062, 8531, -8194, 2922, 2893, -6725, 7257, -7093, 3628, 1473, -6926, 9285, -7319, 3334, 3054, -6547, 8214, -6535, 3759, 710, -6774, 9342, -8119, 2898, 1197, -4514, 7757, -8094, 6111, -47, -4456, 8243, -8795, 6422, -2160, -3413, 7001, -10178, 8556, -4133, -3006, 7948, -9095, 8552, -4503, -589, 7249, -9551, 8538, -4542, -873, 5393, -8655, 7264, -4254]
2084d254L898N031j2357J4746r508J158N703r996J1832r481J825O303j1191J1429
2098E138q217J777O308j2006J3250j0252L533O701j4599J6379j2516M910M235
2111D641j3960J9476j7187Q012K940j2829J9681j9469J1950k4j0946J8426k0046
2124i335J4093k897q048J4667j7533J4693o620l606J1300j3554J2171p157k01
2137b027P561j0958R929n959J66N263q758P406l476r75N232p829O750j446l979
2152c100P931r137O922p69o784J1260j1710Q045j562o640J2891j4644J1191m216
2166c22m060J2448j6643J4651p676j140R610j5850J6812j1774L032N285j1859
2179g486J5447j3999P271J375q273J2722j2952R054j934m790Q647r900P943l409
$$ y = [-4254, -356, 4675, -7682, 7064, -2444, -1286, 4417, -5579, 6253, -3228, -1403, 4900, -6291, 5138, -3079, -1302, 5006, -7000, 6250, -4002, -469, 6232, -8367, 8012, -4504, 406, 4641, -9319, 10157, -7030, 982, 3922, -8907, 10774, -8695, 3255, 3231, -7715, 10711, -9335, 4758, 1861, -6187, 8480, -9053, 5640, -980, -4586, 6714, -6840, 5331, -1826, -2027, 5534, -5424, 4505, -1454, -1288, 3975, -4783, 2623, -853, -1828, 3404, -4425, 2325, 879, -3100, 4831, -4306, 2616, 1847, -4937, 6323, -5387, 2658, 1096, -5544, 7347, -7297, 3894, -322, -4382, 8066, -8577, 6074, -1602, -2742, 6868, -8982, 7830, -3944, -912, 4373, -7486, 7961, -6038, 1233, 2608, -5665, 7057, -5895, 3159, 1225, -3565, 5082, -4818, 3125, -284]
2193b84k679N972n744M521k575k99L547l640J385J040k329K655k072j194M235
2208B539n340M218k192r40N584q435P584m100P23L717q861J1294q761K959K691
2223B680q112J1794j1762P153o61n237J0415j2489J0000m026j857O675j0167J0634
2237E040p233J454L121o023P829p604M805j210j854M630n891N331l151R63O79
2252H86k296L426l434J961j256J063o29k70J290j951L268m078L721k356K33K634
2268B212n777P077n738K440R59m886Q315q830O171j520k852O351p963P677n218
2283a582J663K268o186P721o965M485j730j189M636o925P194n137K334N65l527
2298b375O006p036N781k964p09L500m876N094m705L365q20j838L501m097M567
$$ y = [-284, -2963, 3009, -2735, 1786, -789, -1088, 2459, -1181, 204, 1244, -1085, 1570, -502, -1696, 2539, -2801, 1417, -775, -1715, 3869, -4566, 3018, -1082, -359, 3358, -5503, 5791, -2970, -11, 2680, -5432, 6362, -5400, 1753, 1092, -4145, 6270, -6219, 3781, -245, -2102, 4573, -5594, 5040, -2193, -739, 2382, -3641, 4188, -3416, 1389, 179, -1675, 2955, -2936, 2395, -756, 207, 886, -1410, 2016, -1418, 543, -713, 350, -279, -549, 741, -1210, 2058, -2020, 1701, -655, -422, 2212, -3565, 3512, -2226, 214, 1173, -3713, 4602, -4228, 1943, 423, -2429, 3922, -4041, 3636, -1582, 81, 2349, -3837, 3884, -3081, 1404, -326, -1515, 3121, -3804, 3390, -1747, 587, 1152, -2375, 3631, -3405, 2376, -588, -1297, 2203, -2673, 2421, -2284, 1081, 261, -1577, 1924, -2173, 2394]
2313B394m405L435j105k067M637o021N645m356K231R63m433O778o698M505j691
2328a88r13L735n992O878n307K183M22k744M240n688O359m664J049K745n058O048
2344C105n608M395j625j878M828o162M775l057J355M09k906M998m954L832j986
2359d79O29Q46k877N084n876M074j494j013L059n096O150m986J885J725l753M197
2375B075l933L844k819N63J863l566L651l374L269k962Q10L069n601N938m559
2390a732K530k32k680O079p252M911j345j788L352m367M832l942J741J231l157
2405a819L245k530K607k718J478J487l693L340k368J967j557l83K642l487K791
2420A002j063jR1J85N28j812K275j666J016j757J712O57l884N005l739J978q1
$$ y = [2394, -2011, 1424, 319, -1748, 2889, -3132, 2513, -1843, 388, 1351, -3082, 3696, -3002, 1503, -188, -1101, 2634, -3358, 3520, -1787, 396, 818, -1926, 2314, -3374, 2985, -1679, -630, 2115, -2943, 3105, -2503, 1892, 267, -1611, 3217, -2945, 1830, -1227, 128, 537, -2369, 2629, -2325, 1507, -479, 150, 996, -1881, 3203, -2673, 1401, -93, -1106, 1953, -3143, 3007, -1979, -94, 1631, -2122, 2075, -1858, 1986, -833, -270, 1593, -1973, 1678, -1696, 1573, -1389, -579, 2490, -3111, 2827, -1732, 798, 566, -2114, 3965, -3287, 1624, 279, -1509, 1843, -2524, 2308, -1634, 107, 1338, -1819, 1426, -1104, 1503, -1215, 263, 1750, -1943, 1397, -971, 996, -561, -944, 1698, -1789, 1002, -61, -62, 29, 214, 742, -1070, 1205, -461, 555, -1202, 510, 1167, -2717, 2288, -1451, 527, 446]
2437D46k238M987o003M918k051k054N102n734M363l114J405K093n681O149l778
2452a190J541k78j336M301n652M351j852j218L437m280L723k588J156J550m414
2467b749M707j723j059J423j438K216j746q99L110k722P93J011k832L573k419
2482g54J13J582k498M377m654J031L391m555L811l927L463j24m471O146n371L941
2498A501j555k113N579o483N980l978m53N765q292O128l202R30K825p527Q333
2513C438m283m3K777n226O705n020R15K716m769N994n130P07L788n016M021l474
2529a900K019K354n975N527k269J43J790m843O105l695J54K387n102O728n219
2544a796O21L101m543O262o972L526K970o755O698n856L982R66o842Q563o507
$$ y = [446, -1792, 3195, -2808, 2110, 59, -1995, 3107, -2627, 1736, -1378, 27, 2120, -3561, 2588, -1190, 351, 73, -1263, 3038, -2614, 1737, -115, -1333, 2104, -2176, 1547, -1041, 115, 1665, -2749, 1958, 235, -824, 599, -839, 1377, -369, -1268, 1842, -880, -87, 924, -1908, 1665, -754, -641, 941, -1557, 2820, -1834, -803, 2588, -1967, 1844, -2083, 1380, 1256, -3215, 2931, -2440, 1501, -54, -2167, 3412, -3071, 2909, -1069, -1522, 4243, -4049, 2079, -1123, -193, 2632, -4895, 3438, -845, -888, 1889, -3337, 3368, -1652, -737, 1979, -2790, 3204, -1926, -1219, 2569, -2447, 1574, -1900, 119, 2473, -3502, 2025, -244, -101, 1689, -3154, 2951, -744, -590, 1797, -3305, 3423, -1796, -1175, 1926, -2617, 3645, -3327, 199, 3169, -3586, 3112, -2744, 1238, 2204, -4638, 3925, -2582]
2559b582L730j7n273Q830p265L247q2l403P668q495M416R83l871N656p963O539
2575B118j035l932N978o711O322k629l151O694o552N646l779j235O744q265N660
2590A873k929r8N035q345O714k273j161M004o775P290l581j593M392n685O505
2605C373m308j356N578o170N307m040L44N196p679N808k899N10L680p778P245
2620B811l605j43L323o634Q249n453J15L836n916P665o878K216L394o447P181
2635C714o963M158J627o547P359o152M205k41m991P708o007L266p20k899O390
2650C907o741L384j09k099M572o074L834N49k893L623m346L888l87l753M817l672
2666a500K586p10k959N610m978K332L1k703N882o332L324L49k513M653o606N450
$$ y = [-2582, 1148, 1131, -4142, 4688, -2577, 670, 588, -2815, 4853, -3642, 774, 1757, -2114, 3542, -4421, 2118, 1083, -2849, 3129, -3582, 2740, 111, -3040, 3654, -2898, 2748, -1031, -2266, 4478, -3787, 1873, -1056, -1154, 3881, -4464, 2250, -23, -1184, 2820, -3955, 3335, -246, -1839, 2553, -3132, 3373, -935, -2291, 3287, -2883, 2424, -1616, -1272, 3924, -3755, 2053, -846, -336, 3344, -4434, 2811, -794, -937, 2386, -4248, 4001, -1452, -1337, 2499, -3417, 4248, -2630, -414, 2980, -3467, 3714, -3249, 909, 2536, -4011, 3348, -2804, 1401, 1160, -3831, 3877, -2130, 1136, 416, -2483, 3907, -2834, 550, 441, -1658, 2914, -3160, 674, 1223, -1670, 1953, -2393, 1495, 1108, -2645, 2172, -1500, 1086, 376, -2583, 3027, -1951, 381, 412, -2291, 3591, -2741, 583, 932, -1581, 3072, -3534, 1916]
2682A916j095k811M593n712N651l023j550M888n609N559m107K92L935n478M615
2697B064l988J985J990n245M941k887J483N56l277M752l170Q82N33j801K960k778
2713a000M43J264j375J755k179P27J717k681J709o22N9J537l317L064q73r83J948
2730A193l088L614k212k75K023l115L897l486J101J773k950L532l752K548J48
2745I51k847L704l556L030j381j330L069l358L176k145K03J955l049K520j400
2760d58P54Q2j159J722j343L45L4j06J44n0j08n3N09n10N08p62P70j22r73J255
2780D79j292J554j187L09R21j945K160j734J223j84j394K606k967K301r15q95
2796i60K285k419K124j784P38O79j999K587j928J407o50l37J295k029J771j337
$$ y = [1916, 821, -1990, 2603, -3109, 2542, -481, -2031, 2857, -2752, 2807, -1300, -1008, 2927, -2551, 2064, -1924, 61, 2051, -3194, 1747, -1140, 343, 899, -2378, 2374, -796, 86, 619, -1182, 1778, -1000, -557, 707, -668, 1087, -1092, -365, 1352, -1329, 380, -242, -183, 1354, -1963, 1101, 228, -755, 1193, -1895, 1719, -493, -768, 1255, -1860, 2037, -1449, -348, 1425, -1525, 2007, -1745, 803, 951, -1896, 1808, -1748, 1282, -99, -1429, 1640, -1718, 1458, -687, -484, 1471, -1578, 942, -458, 296, 378, -781, 941, -402, -57, -23, -129, 15, -35, -143, -196, 313, -197, 311, -451, 319, 197, -776, 479, -813, 741, -446, -137, 784, -1161, 999, -735, 488, 304, -1090, 1516, -1451, 850, -65, -960, 1325, -1094, 1030, -754, -16, 663, -1336, 1251, -677, 730, 80, -257, 1038, -991, 780, -557]
2812e57N71J05o88J319j686J825j302kJ151j263J438j680J306l45o97J090j085
2829e00J087j199J128o79o8J040j753J812j372R37k83j073K151k418J794r77k3
2846c96J139j875K330j771O80L52p41R44j529J588j214M69M43j075J389j700J727
2863G60j193M7J448j942J477j161R34j76p12J528j701J076n91K09p8m15J156j392
2881g26J208n64J68K42q81J593k065J465k13p51J186j529J715j487P21N27j126
2898e17J120j202J449j198L52P07j645J923j555Q85k80o62J896k503K087r61j82
2915b86P66j313J753j459L91Q05j055R60r54M72l09L09J80o77O43k55N23q68P01
2934C27j28n86O13m02M57o08M83k87o1O98j008R21o65L71K39j151K033j752Q55
$$ y = [-557, 14, 119, -569, 750, -936, 889, -413, -415, 736, -527, 911, -769, 537, 192, -505, 585, -500, 587, -612, 516, -163, -231, 809, -944, 868, -504, 433, 150, -923, 1228, -1190, 604, -373, -396, 743, -1132, 1198, -573, 107, 459, -282, 662, -867, 721, -493, -24, 419, -656, 733, -967, 760, -433, -386, 1062, -880, 597, -564, 370, 194, -518, 1010, -691, 385, -206, 3, -75, -490, 666, -726, 482, -82, 86, 328, -553, 1040, -1025, 440, 227, -524, 662, -867, 848, -639, 82, 609, -517, 603, -599, 850, -348, 4, 711, -934, 989, -566, 319, 39, -623, 1273, -1230, 857, -104, -286, 480, -833, 920, -539, -148, 657, -398, 562, -392, 80, -229, 80, 260, -417, 226, -29, 494, -374, 327, 199, -387, 226, -176, 281, -327, 156, -131, -192, 506, -502, 419, -246, 125, 364, -787, 1246, -506, 349]
2953C49m25m29J707k691K282q97n78J720k134K191j668N38Q29k039K436j597K18
2970a88M85q65J531k034J515j63q86J107q97Q52l35o44R54o49O77m91n17Q44m52
2989a56n5K92l73J264j481K23J114j522J476j222L77J008k151J895j472R83M48
3006F48k061K685j691P19p8j336L088k958J034L90j092J986k924K457r41o58J721
3023I89k327K288j030k27J191j854K435j998kJ654j753J261j571O05J370k094
3039a063J674o33j72J125k448K223n73o58J160j970K384j072r68J898j545J521
3055H83j539j1K245k282J605j410M04J413k883K520j624J059K87k549L413k086
3071e55O27K74j548L215l165J168P02j337J909k739J933J95j629J933k258K133
$$ y = [349, -76, -505, 1202, -1489, 793, -104, -682, 1038, -1096, 1095, -573, -35, 794, -1245, 1191, -406, -188, 297, -568, 963, -1071, 444, 281, -605, 502, -395, 457, 122, -522, 432, -217, 460, -31, -548, 296, -156, -211, 81, -292, 972, -509, -286, 828, -694, 782, -440, -63, 945, -1206, 689, -783, 200, 648, -1413, 1272, -419, 300, 222, -1114, 1974, -984, 50, 440, -652, 1334, -1590, 867, -74, -732, 989, -1338, 950, -80, -307, 884, -970, 1465, -533, -535, 1119, -634, 627, -944, -339, 1031, -1063, 611, -22, -194, 931, -1517, 706, 133, -525, 635, -1335, 1049, -23, -991, 907, -638, 883, -656, -667, 1578, -704, 901, -509, -105, 1308, -1575, 945, -679, 380, 667, -1882, 1531, -555, 72, 346, -1202, 2013, -1152, 16, 718, -619, 1290, -1449, 484, 679, -950, 983, -1275, 858]
3087H58m40j897K393j591J326r35p65K675k278R43m68m71J898k656J683Q8q51
3104d88J630k613K202r1j578J651j808K259j368q62K114j887J574j354L3K104
3120A518k645J674p39J6J711l192K560r79k17R99k334L014j810l81J554j565K220
3137A404k081L57J475j873J601k042J254R77k267J813j231R23L39j964K482j323
3153a56K77J10j207K606k104L97K18o41J558k213J194M74j271J342j567J620J0
3170F47j499J627j187R95m10j415K183j397P74m47o12J866j991Q76K96n84J218
3187I40j995J569j22r70J214j576J646p87o91J504j253J058r04J23J294j843J377
3204E84r43M43P01j654J178n40J33M45j323J671p13O0K63q11J172q76j61P91p61
$$ y = [858, 418, -1479, 914, -677, 649, -286, -1051, 1624, -654, 289, -179, -650, 1248, -1408, 275, 363, -488, 1142, -1471, 731, 640, -938, 713, -1095, 1164, -204, -1066, 1048, -839, 735, -619, -586, 1518, -1127, 547, -192, -176, 1535, -1657, 903, -76, -293, 706, -1628, 1386, -424, -805, 749, -816, 1404, -677, -320, 1155, -718, 883, -1159, 95, 1072, -1195, 618, -613, 310, 649, -1315, 1167, -156, 121, 231, -976, 1630, -474, -77, 141, -500, 1058, -1155, 39, 513, -758, 584, -983, 637, 647, -852, 775, -412, 583, 173, -1242, 941, -456, 318, -129, -741, 1125, -866, 10, 306, -278, 940, -1055, 514, 392, -578, 636, -940, 706, -81, -772, 732, -521, 537, -367, -244, 1050, -793, 584, -359, 84, 785, -869, 309, -231, -98, 347, -976, 695, -18, 42, 305, -506, 666, -210, -371, 420, -341]
3223c41O75q94M82M32r57Q23n19L93J60r38J137l20p2J46o69J055j059K63K64
3242F1n91R83j034N52N84r35R84j014O76J0q58R81q20O31j82o75J100r32Q49l47
3262B3l37Q69r57O81m57K15K22o01O23l98J15l9k14N62n54J26K40k70M07l52P4
3283b2N11n09j25K90n22N89l95J37M05n39P38o06Q9J60o17J012p58N31k07l96
3303b34L61n04O07m00Q6J55n78Q04n10L37J01m54N43n53N06k47j58J87m92P11
3323B68o08M07J25k97L31k77J79k61K21j63J08K76n63N61m61J51j00J5L97o25
3343c16N23o1l0q1l8K64m44L53j95N2j7j83O67j185P45L39n61L73n39O33l24m0
3365f5L03p45P31n01J83K56l02M70o03N02R9k77J8k63K46k18K46j80oJ42k07K69
$$ y = [-341, 334, -560, -78, 354, -603, 220, -299, 94, 254, -684, 453, 133, 61, 207, -462, 593, -466, -203, 61, -530, 453, -581, -29, 555, -380, 604, -410, 266, 276, -582, 399, -421, 210, 28, -647, 453, -479, 370, 23, -314, 555, -402, 279, -178, 37, 259, -342, 281, -117, -2, -41, -255, 307, -247, -121, 119, -151, 256, -96, -22, 489, -20, -145, 145, -377, 212, -183, -46, 359, -180, 558, -48, 41, 201, -416, 596, -162, 369, 162, -234, 127, -377, 230, -170, -84, 71, -507, 297, -213, 124, 225, -229, 314, -239, 267, 20, -138, 49, -443, 268, -340, 67, 192, -105, 226, -51, 128, -133, 88, -75, 33, 309, -254, 307, -154, -3, -103, -88, 309, -316, 207, 146, 116, 35, -3, 261, -183, 170, -25, 27, 10, -173, 494, -691, 54, 393, -168, 205, -334, 299, -25, -65, 238, -507, 224, -277, -94, 162, -140, 330, -273, 229, 328, 51, 69, -194, 52, -166, 80, -100, -106, 36, -171, 98]
3387I8l92K69J19j36K49j44K08l57J88j28j01l8j08M06k00K72k00j76N92n48J91
3408F4r4J39L5n78Q54m81Q2K56p43O29p16O73m3p3N12r77R56m72K69j51p71J104
3430D74p44K78M8l36O09p69Q21l33j75M29l44O9Q3j9P6k44j14L97l24J51J12o11
3452d66N31j52K95q7l49N84n75K32M4k94O79r19Q05n96L85K61j038J086n89L34
3472A71l0m79J155j340O26J42n07P09j190J047l75j93P28r03J134n37n67P24p69
3491d54R31o27n8O01n97K10j80P6N59j096N02J35k47O76p76L29J77l55M60p69
3511e03R54o14n91J174p64O23n13j85J204j452R65l30j70R06j797J545r67K86
3529b29P74j842K404j487M33J88r09J731j513L31N60j064J264j545R32M68j195
$$ y = [98, -294, -25, 94, -42, 207, 63, 271, -86, 102, -26, -127, -165, -273, 133, -67, 205, 5, -171, 421, -127, 64, -30, 109, 144, -434, 420, -61, 21, 277, -466, 163, -553, 120, 77, 4, 516, -461, 495, 23, 292, 141, -630, 474, -270, 8, 56, -280, 329, -440, 381, 48, -127, 302, -42, 27, 110, 91, 167, -77, -191, 206, -118, 33, 145, -466, 65, -87, 208, 121, -228, 356, -219, 13, 57, -237, 442, -477, 328, -268, 117, 378, -660, 426, -163, 171, 141, -338, 817, -523, 103, 245, -262, 447, -743, 304, -71, -264, 464, -439, 695, 158, -409, 315, -454, 477, -150, -208, 393, -204, 6, -174, -98, 461, -635, -133, 2, -245, 431, -345, -16, 161, -194, 266, -503, 451, -163, -754, 420, -344, 279, -234, -419, 785, -667, 298, -32, -202, 704, -1093, 452, -515, -229, 545, -1297, 1107, -380, 53, 241, -668, 1063, -450, -119, 441, -623, 641, -904, 28, 496, -699]
3546f99J167j091J113k73p37J160o80K27R6j000J576j164K22J80n83J227j390
3563f49K99R13j064J185j536J057M94j345J335j445J309l59j052J680j504J049
3579C67o77k68J884k167J285j87n65J243k104J939m98p52J195j720J696n79p81
3596f89J322j284J522j139j29J124j217R44r25M49Q23j788J066k31K26K12j388
3613a102J933q35m08P10r65J677j313r8J054j199J341j687L59J634j797J208j105
3630e93P55N26j825J891r88M09J6j229K150j503L56K13o61J523j798R06K03p59
3648d08J228j799J133K49j043J071j181J494o56r15J682j240P46m29l38J587j766
3665e85P93k24k96R77j742J210j33o02R04j179J304k96p84R83q72J225r25l18
$$ y = [-699, 468, -623, 490, 217, -520, 640, -40, 187, 283, -717, 859, -305, -83, 97, -486, 741, -649, -350, 563, -501, 684, -852, 205, 699, -646, 689, -756, 553, 194, -858, 822, -682, 367, -310, -578, 1306, -861, 424, 237, -328, 915, -1189, 750, 252, -500, 695, -1025, 671, 92, -689, 633, -651, 871, -268, -397, 727, -490, 454, -471, -22, 801, -987, 79, -152, 74, 286, -1102, 831, -4, -412, 298, -667, 1010, -303, -401, 653, -546, 795, -892, -533, 1101, -696, 512, -593, 162, 688, -1137, 754, -234, 175, 191, -1038, 1112, -391, -35, 178, -483, 1040, -758, 148, 351, -408, 820, -979, 154, 403, -640, 431, -750, 744, 88, -827, 855, -385, 361, -68, -406, 1181, -585, 208, -16, -312, 665, -1077, 133, 0, -602, 302, -877, 427, 131, -653, 330, -542, 683, -242, -560]
3683e60J397j328R47q91j4J174j680J365o07JO42j290J407n66k96Q01j237J498
3701G63r07l90R53r70J391j328K46Q55r30R17r06N89M23j488J254o79L27P5q13
3720f18J043q56K78K26n14J157j053L02L92m77Q14j175N40K75q51O66m91M39J76
3739B73q46J045n27J88j48j67Q53p92qJj07Q68j164O60Q8n42O60p16Q02m80l15
3760c74Q51p89O98n04l99J058r88N34j76J21M45r41N42k59J64L85o47M19J8k45
3780h7K09o14O79m23P7J74j55M70m46J12M3k2R4j89Q6J98l18j5J7M9J27k57L50
3803A59j53j18J03k3K36j79ML90r04O67k06l0K72n08M66l84J59N3j08M38l31L7
3825D0J05l15N78o54K33j9m1P4k36M63j99O0l5J00J39j30k7j31L2jj49K2j67K27
$$ y = [-560, 837, -491, 456, -435, -449, 725, -955, 410, -197, -196, 446, -844, 563, -3, -299, 502, -735, 763, -144, -534, 419, -551, 840, -488, -242, 613, -317, 600, -306, 283, 706, -782, 472, -207, 120, 195, -618, 425, -431, -153, 73, -441, 716, -337, -35, 357, -120, 694, -481, 59, 334, -517, 149, -342, 97, 273, -573, 472, -55, 133, -15, -182, 671, -121, -129, -128, -235, 633, -531, 129, 217, -325, 335, -381, 421, -59, -374, 477, -312, 386, -118, -517, 541, -447, 87, -89, 32, 477, -464, 78, -181, -17, 368, -279, 140, 158, -87, 122, -492, 187, -236, -159, 15, -140, 330, -116, -4, 39, 17, 111, -78, 8, 206, -112, -127, -110, -61, 66, -191, 159, 6, -112, -9, -32, 204, 25, 29, 419, -485, 182, -24, -54, 218, -290, 176, -208, -49, 4, -104, 334, 3, 40, 145, -170, 408, -246, -13, -32, -73, 1, -235, 228, 29, 89, 54, 154, 293, 163, 136, 5, 37, 36, -113, -91, -258, -31]
3849c1o6K67k20J61q2n4J68k34K97j91k36L81m33K29n9J67l2j59L93k65J52K4
3871A77p0K52o58O22m59J04Q4m09M78j77L0J02k75M64n27N47l11j32K34l23M78
3892B31j79j8j76M4R7l15O16k39M0j23J40j56l3K54k85K89k14j23L1PK58m74L93
3915F5K2k38M76m68M95n64J84kk14L90n14N59r0l02P62q09M67k95j00L47m36O74
3937D09m49r4J64k96L40k77K81p9J9L34n83L15K00k67K46k06m7J14l06K12p6k55
3959c01K91m7J02j13j97N84n43L01J28m47M46m06L48k20JO32j008O21l74L4L00
3980A32m17J039j114M62L40p36Q38q98L93P1n86R17j138Q88r0m20O29n08P68n40
4000C0k02M89m95L56l29l4M21o93L60k9k1N10p54N54L7k05K42m23M44j2o65O74
$$ y = [-31, -97, 170, -50, 111, 29, -25, 143, -91, 206, 15, -221, 160, -273, -44, -103, 64, 32, -127, 266, 1, 153, 177, 107, 359, -299, 323, -136, -32, 52, -357, 121, -56, -26, 76, -199, 265, -262, 285, -26, -158, 76, -247, 231, 52, 34, -142, -98, -1, -316, 300, 61, 101, -22, 118, -38, -71, 183, -102, 187, -27, -150, -119, -112, 146, -328, 65, 87, -151, 325, -143, 352, -212, -28, -30, -244, 146, -368, 191, 101, -201, 561, -248, 219, -76, -176, 171, -265, 409, -40, -134, 30, -266, 74, -203, 78, -1, 18, 352, -231, 84, 284, 17, 263, 57, 10, 124, -182, 30, -46, -301, -10, -57, 45, -68, -265, 319, -224, 77, 205, -242, 204, -202, 146, -74, -73, 559, -449, 172, -202, -168, 132, -285, 754, -360, 102, 442, -294, 544, -354, 39, 110, -476, 441, -697, 191, 101, -319, 310, -198, 570, 30, -172, 317, -178, 178, -151, -185, 236, -457, -97, -126, -147, 363, -391, 163, 200, -5, 237, -186, 258, 246, -419, 255]
4022B55m57M07L4p91J115j048P97l17k27J032j166N55q5l29P73j466J464m47n78
4041d79N93p49J427j050J13N89o78Q45j059L93L69q50P23r22J183j75r19J090
4059D44o05L49k55n43J275p58O1L12o51J026j055n2P62p77Q86q90O21N48j483
4078g85J351q36O64J2j256J337p08M17k21o57J757j498M30K25m75J289j872Q92
4096F6K79p58R79j559J697n46q24J317j242J349j002l32J265r69N70p39M55P86
4114G92j518Q65j79j13N20j110J055j8n52N24r27J424q71k51P27q16J021j114
4132e41L14J089j535J054q02N01O03j702J472m39J54L02j489J885j143N9L55o08
4150d71J450j573L22P90r83J121j357R35K80j061P02o45R14l15r57J303o68N22
$$ y = [255, -202, 205, 239, -552, 563, -485, 312, -5, -232, 800, -366, 189, 104, -225, 548, -918, 546, 99, -479, 114, -635, 792, -258, -145, 444, -234, 611, -448, -55, 314, -536, 187, -735, 448, 273, -646, 444, -161, 188, -67, -610, 665, -93, -32, 280, -371, 655, -400, -452, 310, -467, 419, -471, 150, 698, -785, 566, -270, 394, 406, -850, 487, -221, 196, -25, -682, 1075, -423, 7, 232, -243, 1046, -826, 66, 345, -413, 566, -993, 704, 158, -666, 651, -591, 758, -244, -576, 689, -280, 290, -449, 6, 792, -726, 139, -40, -153, 367, -743, 312, 294, -258, 266, -661, 763, -108, -359, 368, -448, 573, -541, -227, 862, -673, 381, -421, 80, 683, -1019, 453, 14, 168, 470, -1019, 866, -277, -218, 137, -471, 979, -594, -272, 518, -465, 656, -701, 234, 514, -547, 155, -490, 424, 109, -848, 455, -213, 309]
4168C09m11m52J467j101K80p4j62J078j627Q71J85n62P06j170R59L1q30J005p77
4187b75O29j85p69J284q26M11l81l56J229j239O99l18o7P10j204J110l94k91N82
4206C49j157J545p70j93N72o68P62q28L9R04r58P63p69N34K74j109R78m40J59
4225a3J48o78J136p76M3K49n06Q18o49J49L16l56N74p97M21L40p44N24p36O65
4245A28M5o48Q24n11K79j13k62O40n77J64K60n77R27q83K05K86o64P14o07N44
4265A74L9m77N66m12N75j92o30P10m61L69j74m47Q63p56M49k70Q8M02p83M67j87
4286h7j23M81m25M92l86k01L69n22P20m24p2K52l32L36l02K56K8m09N24l34J80
4307B1Q6l04K80qK8jk11J77o6l9k1n5K92k61j50K72m06L52l66L45J78n54N96l19
$$ y = [309, -102, -554, 913, -188, 92, 18, -144, 934, -693, 178, 363, -199, 507, -663, 296, 327, -503, 502, -275, 354, 169, -600, 684, -142, 269, -112, -468, 761, -478, 221, -97, -164, 546, -658, 452, 58, -233, 349, -808, 737, -33, -226, 346, -322, 440, -388, -349, 555, -403, 360, -409, 125, 399, -710, 268, -172, -13, 135, -543, 593, -183, -140, 109, -397, 421, -228, -79, 237, -119, 455, -342, 79, 419, -325, 199, -537, 128, 173, -475, 349, -162, 117, 4, -258, 382, -195, -31, 229, -348, 579, -304, -99, 187, -477, 237, -370, 174, 213, -264, 302, -110, 465, 273, -357, 353, -108, 261, 87, -360, 503, -253, 196, -74, 14, 416, -367, 100, -87, -210, 271, -154, 338, -48, -249, 120, -402, 318, -106, -178, 74, -258, 78, -224, 32, 60, -349, 175, -159, 21, 107, -197, 83, 75, 103, 102, -109, 68, 2, -37, -58, -113, 179, -82, -232, 40, -366, -14, -380, -35, 143, -411, 185, -134]
4331a34K75J7k73J63k02J52L22n13K40k16O5K23o5p6j8J56q0p7l4O2M0o6n1P3
4355a7o4J5o6J97K08o8l21K64j96Q9R6k65L24k77K76k05q5L15m79J42Q0L6J23
4378A22l26N84m69L63k97j5Oj18L07o7l35J92l27N67l08K25M3k82J94l58M07j30
4400b2j49L37j72J89k20q9J67j24L05j67j24J18K04k68l2K9m6M9r5L45k11n9q7
4423a22N5K12l51L62j30n2K3K3L59l58j55L94l72K77k54J23Q2k11K33l22L24j09
$$ y = [-134, 141, 158, -115, 48, -154, -2, 320, -193, 47, -169, -104, 119, 54, -22, -40, 116, 36, -41, -75, -13, 27, -39, -90, -17, -81, -66, -132, 65, 273, 205, -116, 148, -48, 41, 137, -128, 196, -81, 195, -10, -95, 220, -259, -117, -37, -1, 122, -204, 380, -89, 274, -23, -38, -32, -150, 157, 90, -245, -53, -380, 187, -121, 104, 147, -135, 59, -299, 108, -22, -171, 166, -6, 183, -37, -126, 41, -83, 222, 55, -69, 49, 253, -15, -47, -18, -64, -15, -110, 235, 24, -35, -122, -67, 145, -206, 156, 26, -26, -3, 20, 379, 21, -134, 260, -112, 165, -89, 34, 116, -95, 138, -184, 140, 31]
$$ [...]
8190F7J
8191F8
##END NTUPLES=NMR FID
##END=
