##TITLE=1H_LR-753-R2-H-B
 D2O
 8 sc, 
 23.09.2022
##JCAMPDX= 6.0         $$ Bruker NMR JCAMP-DX V2.0
##DATA TYPE= NMR FID
##DATA CLASS= NTUPLES
##ORIGIN= UXNMR, Bruker Analytische Messtechnik GmbH
##OWNER= root
$$ XWIN-NMR		Version 3.5
$$ Fri Sep 23 13:26:15 2022 Russian Standard Time (UT+4h)  she@DPX200
##.OBSERVE FREQUENCY= 200.1313499994
##.OBSERVE NUCLEUS= ^1H
##.DELAY= (6, 6)
##.ACQUISITION MODE= SIMULTANEOUS
##.ACQUISITION SCHEME= undefined
##.AVERAGES= 8
##.DIGITISER RES= 18
##SPECTROMETER/DATA SYSTEM= spect
##.PULSE SEQUENCE= zg30
##.SOLVENT NAME= CDCl3
##.SHIFT REFERENCE= (INTERNAL, CDCl3, 0, 15.7039)
##AUDIT TRAIL= $$ (NUMBER, WHEN, WHO, WHERE, WHAT)
$$ ##TITLE= Audit trail, XWIN-NMR		Version 3.5
$$ ##JCAMPDX= 5.01
$$ ##ORIGIN= Bruker BioSpin GmbH
$$ ##OWNER= she
$$ F:/spectra/data/she/nmr/H-F/1/audita.txt
$$ ##AUDIT TRAIL=  $$ (NUMBER, WHEN, WHO, WHERE, WHAT)
(   1,<2022-09-23 13:24:54.25 +0400>,<she>,<DPX200>,
      <created by zg, POWCHK disabled, PULCHK disabled
       configuration hash MD5:
       00 E9 B6 7A A2 85 ED C7 34 08 36 98 17 FE 4E 26
       data hash MD5: 16K
       E9 93 DD 25 4C 9E 1E AC 17 68 AE 85 A2 C2 4B 7A>)
$$ ##END=
$$ 
$$ hash MD5
$$ 80 E8 CE A9 37 08 39 72 BB B9 2D 2E D6 41 48 7B
##$RELAX= 
##$RELAX= 
##$RELAX= 
##$RELAX= 
##$RELAX= 
##$RELAX= 
$$ Bruker specific parameters
$$ --------------------------
##$DU= <F:/spectra>
##$EXPNO= 1
##$NAME= <H-F>
##$PROCNO= 1
##$TYPE= <nmr>
##$USER= <she>
##$AMP= (0..31)
100 100 100 100 100 100 100 100 100 100 100 100 100 100 100 100 100 100 
100 100 100 100 100 100 100 100 100 100 100 100 100 100 
##$AQSEQ= 0
##$AQ_mod= 1
##$AUNM= <au_zg>
##$AUTOPOS= <>
##$BF1= 200.13
##$BF2= 200.13
##$BF3= 200.13
##$BF4= 200.13
##$BF5= 200.13
##$BF6= 200.13
##$BF7= 200.13
##$BF8= 200.13
##$BYTORDA= 1
##$CFDGTYP= 0
##$CFRGTYP= 5
##$CHEMSTR= <none>
##$CNST= (0..31)
1 1 145 1 1 1 1 1 1 1 1 1 1 1 1 1 1 1 1 1 1 1 1 1 1 1 1 1 1 1 1 1 
##$CPDPRG= <>
##$CPDPRG1= <>
##$CPDPRG2= <>
##$CPDPRG3= <>
##$CPDPRG4= <mlev>
##$CPDPRG5= <mlev>
##$CPDPRG6= <mlev>
##$CPDPRG7= <mlev>
##$CPDPRG8= <mlev>
##$CPDPRGB= <>
##$CPDPRGT= <>
##$D= (0..31)
0 1.2 0 0 0 0 0 0 0 0.06 0 0.03 0 0 0 0 0.0002 0 0 0 0 0 0 0 0 0 0 0 0 
0 0 0 
##$DATE= 1663925093
##$DBL= (0..7)
120 120 120 120 120 120 120 120 
##$DBP= (0..7)
150 150 150 150 150 150 150 150 
##$DBP07= 0
##$DBPNAM0= <>
##$DBPNAM1= <>
##$DBPNAM2= <>
##$DBPNAM3= <>
##$DBPNAM4= <>
##$DBPNAM5= <>
##$DBPNAM6= <>
##$DBPNAM7= <>
##$DBPOAL= (0..7)
0.5 0.5 0.5 0.5 0.5 0.5 0.5 0.5 
##$DBPOFFS= (0..7)
0 0 0 0 0 0 0 0 
##$DE= 6
##$DECBNUC= <off>
##$DECIM= 32
##$DECNUC= <off>
##$DECSTAT= 4
##$DIGMOD= 1
##$DIGTYP= 9
##$DL= (0..7)
0 120 120 120 120 120 120 120 
##$DP= (0..7)
150 150 150 150 150 150 150 150 
##$DP07= 0
##$DPNAME0= <>
##$DPNAME1= <>
##$DPNAME2= <>
##$DPNAME3= <>
##$DPNAME4= <>
##$DPNAME5= <>
##$DPNAME6= <>
##$DPNAME7= <>
##$DPOAL= (0..7)
0.5 0.5 0.5 0.5 0.5 0.5 0.5 0.5 
##$DPOFFS= (0..7)
0 0 0 0 0 0 0 0 
##$DQDMODE= 0
##$DR= 18
##$DS= 0
##$DSLIST= <SSSSSSSSSSSSSSS>
$$ [...]
##$SUBNAM2= <"">
##$SUBNAM3= <"">
##$SUBNAM4= <"">
##$SUBNAM5= <"">
##$SUBNAM6= <"">
##$SUBNAM7= <"">
##$SUBNAM8= <"">
##$SUBNAM9= <"">
##$SW= 18.0517283424941
##$SWIBOX= (0..15)
0 0 2 0 0 0 0 0 0 0 0 0 0 0 0 0 
##$SW_h= 3612.71676300578
##$TD= 16384
##$TD0= 1
##$TE= 0
##$TE2= 300
##$TE3= 300
##$TEG= 300
##$TL= (0..7)
0 120 120 120 120 120 120 120 
##$TP= (0..7)
150 150 150 150 150 150 150 150 
##$TP07= 0
##$TPNAME0= <>
##$TPNAME1= <>
##$TPNAME2= <>
##$TPNAME3= <>
##$TPNAME4= <>
##$TPNAME5= <>
##$TPNAME6= <>
##$TPNAME7= <>
##$TPOAL= (0..7)
0.5 0.5 0.5 0.5 0.5 0.5 0.5 0.5 
##$TPOFFS= (0..7)
0 0 0 0 0 0 0 0 
##$TUNHIN= 0
##$TUNHOUT= 0
##$TUNXOUT= 0
##$USERA1= <user>
##$USERA2= <user>
##$USERA3= <user>
##$USERA4= <user>
##$USERA5= <user>
##$V9= 5
##$VALIST= <valist>
##$VCLIST= <CCCCCCCCCCCCCCC>
##$VD= 0
##$VDLIST= <DDDDDDDDDDDDDDD>
##$VPLIST= <PPPPPPPPPPPPPPP>
##$VTLIST= <TTTTTTTTTTTTTTT>
##$WBST= 1024
##$WBSW= 4
##$XGAIN= (0..3)
0 0 0 0 
##$XL= 0
##$YL= 0
##$YMAX_a= 268077
##$YMIN_a= -365012
##$ZGOPTNS= <>
##$ZL1= 120
##$ZL2= 120
##$ZL3= 120
##$ZL4= 120
##$ABSF1= 10
##$ABSF2= 0
##$ABSG= 5
##$ABSL= 3
##$ALPHA= 0
##$AQORDER= 0
##$ASSFAC= 0
##$ASSFACI= 0
##$ASSFACX= 0
##$ASSWID= 0
##$AUNMP= <proc_1d>
##$AZFE= 0.1
##$AZFW= 0.1
##$BCFW= 1
##$BC_mod= 2
##$BYTORDP= 1
##$COROFFS= 0
##$CY= 11.3945322036743
##$DATMOD= 1
##$DC= 2
##$DFILT= <>
##$DTYPP= 0
##$F1P= 2.36226072786647
##$F2P= -0.459571619588291
##$FCOR= 0.5
##$FTSIZE= 0
##$FT_mod= 4
##$GAMMA= 1
##$GB= 0.15
##$INTBC= 1
##$INTSCL= 1
##$ISEN= 128
##$LB= 0.24
##$LEV0= 0
##$LPBIN= 0
##$MAXI= 10000
##$MC2= 0
##$MEAN= 0
##$ME_mod= 0
##$MI= 1.114404
##$NCOEF= 0
##$NC_proc= 0
##$NLEV= 6
##$NOISF1= 3.799351
##$NOISF2= 2.8
##$NSP= 1
##$NTH_PI= 0
##$NZP= 0
##$OFFSET= 15.70392
##$PC= 1
##$PHC0= -18037.22
##$PHC1= 9.000691
##$PH_mod= 1
##$PKNL= yes
##$PPARMOD= 0
##$PSCAL= 0
##$PSIGN= 0
##$REVERSE= no
##$SF= 200.130013532006
##$SI= 16384
##$SIGF1= 3
##$SIGF2= 2
##$SINO= 400
##$SIOLD= 16384
##$SREGLST= <1H.CDCl3>
##$SSB= 0
##$STSI= 0
##$STSR= 0
##$SW_p= 3612.71676300578
##$SYMM= 0
##$S_DEV= 0
##$TDeff= 0
##$TDoff= 0
##$TI= <>
##$TILT= no
##$TM1= 0
##$TM2= 0
##$TOPLEV= 0
##$USERP1= <user>
##$USERP2= <user>
##$USERP3= <user>
##$USERP4= <user>
##$USERP5= <user>
##$WDW= 1
##$XDIM= 8192
##$YMAX_p= 0
##$YMIN_p= 0
$$ End of Bruker specific parameters
$$ ---------------------------------
##NTUPLES= NMR FID
##VAR_NAME=  TIME,          FID/REAL,        FID/IMAG
##SYMBOL=    X,             R,               I
##VAR_TYPE=  INDEPENDENT,   DEPENDENT,       DEPENDENT
##VAR_FORM=  AFFN,          ASDF,            ASDF
##VAR_DIM=   8192,          8192,            8192
##UNITS=     SECONDS,       ARBITRARY UNITS, ARBITRARY UNITS
##FACTOR=    0.0002768,     1,               1
##FIRST=     0,             0,               0
##LAST=      2.2672688,     0,               0
##MIN=       0,             -365012,         0
##MAX=       2.2672688,     268077,          0
$$ Real data points
##PAGE= N=1
##DATA TABLE= (X++(R..R)), XYDATA
0@%%%%%%%%%%%Qj6J6j7K5l2M0m8N6p0Q0r3J12j34J56j80K11k45K81l20L64m16
33b22M73n33O02o78P60q52R51j059J178j308J449j602J771j957K159k381K624
50A375k890L184l509L870m272M725n240N827o504P299q245R393j0822J2660j5123
65h272J8615k3994L3459n5076K00484K5529k71479N021j1206K6310P4449J69859
77A83699Q4378j1419j22801j61118j41584J346Q5516P9343N4125R8139L5853j32528
89E2949k14011r1171L1622O5976P8462J14405Q4969J336r0465j37292j15156r610
101b27986R3305J19570Q6816O3251K5349o2190j40154j03946Q497Q6062R4744
112D3318Q2911N6487J927o9965j19664j03844j7773P3382J02337P5452L5163j1154
$$ y = [0, 0, 0, 0, 0, 0, 0, 0, 0, 0, 0, 0, 8, -8, 8, -9, 16, -16, 24, -24, 32, -38, 42, -51, 61, -73, 83, -97, 114, -131, 150, -170, 194, -222, 251, -282, 320, -358, 402, -450, 501, -558, 620, -688, 761, -841, 930, -1027, 1132, -1249, 1375, -1515, 1669, -1840, 2030, -2242, 2483, -2757, 3070, -3434, 3865, -4380, 5013, -5809, 6851, -8272, 10343, -13651, 19808, -35268, 165216, 190745, -80734, -75713, -86919, -60609, 13840, 183699, 268077, 256658, 133857, -27261, -168845, -167499, -81983, -2640, 51485, 149624, 185477, 52949, -161062, -252233, -220611, -154635, -76173, 38232, 123201, 124537, 34072, -103220, -218376, -227986, -134681, -15111, 71705, 134956, 160305, 98115, -42039, -145985, -137488, -51426, 43318, 126229, 182716, 184643, 114678, -4986, -108830, -126603, -53221, 49116, 124568, 159731, 148577]
124A48577p0167j14866r8744j8072O7763R8211P1733K5253j6668o1177j00377
135f8534r3049j9005P1575J06585P8847L0678j5655o0253q9873p8382j8022N8735
147i6353J02229Q4723K8758k1037n1483p4124p1834k1274N6457R8062P4709K0556
159A29389k8862o1464p7001o2138j3988N0979R1826P7807K2186l3462o4083p3785
171d2596o2660k0453M6199R0240P7715K3260l0276o0287o7996n3441j3196M2415
183g1076Q2721P4095K1280l3441n9670o1878m7642j0942M0985Q1004P3921K2011
195A11368l5229o3759o1811m1752p258L7486P4178P1725K2863l6346o4926n9092
207e2553l7872m648L8168P1470O9079K5813l2431o8163o3864l3107J596L4251
$$ y = [148577, 78410, -36456, -135200, -153272, -85509, 12702, 84435, 109688, 93020, 31843, -68534, -161583, -180588, -109013, -2428, 76419, 107097, 91442, 31189, -58684, -137066, -155088, -96353, 5876, 90599, 119357, 98320, 46837, -27287, -99121, -120395, -63938, 34124, 108833, 129389, 100527, 39063, -37938, -100076, -114064, -63085, 28741, 106548, 128734, 95272, 31189, -42596, -105256, -125709, -79510, 10730, 88445, 111705, 81429, 21142, -46854, -100295, -113491, -71076, 11645, 85740, 107020, 73579, 13909, -47969, -95611, -106553, -65568, 15436, 89357, 111368, 76139, 12380, -49431, -91183, -98441, -60955, 13223, 84948, 107811, 71465, 6539, -52553, -90425, -95073, -56905, 14565, 83644, 109457, 77026, 8863, -55001, -88108, -86512, -52261]
219e2261O2429O6181K9374k9154o4209n8686l2391P92L6338O1199N6115K1320
231I7047k7046o3149o4424k9436J2488L9548N3172N4878K5645k8333o6638o2202
243e8450l0759M338L7923O0156N3375J9687k2841n5505o2832l3286J2734M0865
255c4595M8232M5212K4787k0551n9934n8700k5810J0929L9963N4935M5822J4493
267H4783k1970n2025n9225l3174J4203M6396M8110L7141J7956j8316n4807n9186
279e0114k9042J1692M1626N3590L9649Q013k3151m6485n4758l5579J0106M7393
291b7060N0389L2886J1972j7608m7720n2743k7036R100L9455N2347L8511L585
303F6078k6662m0469m3551k9787Q981M6883N3237L1633M394k1809m5415m9683
$$ y = [-52261, 10168, 76349, 105723, 76569, 12360, -46326, -78717, -77925, -41587, 19612, 75727, 97047, 70001, 6852, -57572, -87008, -74520, -34972, 18200, 73078, 98723, 70390, 3752, -58450, -89209, -84871, -46948, 13208, 66583, 86270, 63429, 7924, -54908, -88194, -75460, -34595, 13637, 58849, 83636, 63085, 3151, -55549, -81359, -70430, -30467, 24468, 70290, 84783, 62813, 10788, -48437, -81611, -67408, -21012, 27098, 64239, 82195, 63879, 9072, -50114, -79156, -67464, -25838, 27752, 67401, 75414, 52263, 5778, -48980, -84559, -74453, -27060, 23329, 56215, 68187, 50579, 2859, -49884, -76920, -67820, -28365, 23982, 62493, 66078, 39416, -1053, -44604, -74391, -65410, -18527, 34710, 66343, 70737, 48928, 3513, -46170]
315d6170k5269J0521L9223N1145L8627N216k8818m2941m0658k5898M270L8678
327b2074N0951L1092R01k4559l9792m2586k3545J0206L8148M7827L3390J824k9445
340C2338m3079l6702j8658P969L5835M9093L4884J088k9104m0938l5162j8017
352f0453Q518L5509M7284L3347J366k9588m2624l5226j4867J0205L1971M2189
364B7631L2841M204k8751m3924l5789j3192J0455L0722M0057K9911J374k8589
376B6950m1753l3279j1565J3484L2365L7865K7761K777k6610m2887l5826j0714
388f1432J6177L2883L8178K8280K976k5724m0157l3394j0364J4343L1635L5519
400B8920K4402J899k3524l9245l3505r305J6941L1989L2620K1637J27k5580l9624
$$ y = [-46170, -71439, -60918, -21695, 29450, 68077, 73293, 44475, 1534, -39124, -65022, -60752, -22074, 28877, 59969, 60870, 36311, -3481, -46067, -69612, -59406, -21258, 26569, 59959, 61783, 32338, -10741, -47443, -66101, -58132, -22297, 26796, 61680, 62768, 33664, -7274, -42436, -60453, -51935, -16426, 30858, 64205, 65571, 35983, -6641, -41867, -56734, -46529, -14558, 27631, 60472, 64676, 35925, -7999, -43788, -56980, -46525, -15803, 24254, 54165, 55539, 26950, -14803, -48082, -59647, -46163, -13798, 24067, 51828, 54605, 27995, -14892, -50718, -61432, -45255, -12372, 25806, 54086, 57062, 31338, -8819, -42213, -52577, -38234, -6599, 28920, 53322, 55221, 31697, -7548, -41053, -50358, -33417, -1428, 31192, 52829, 52956, 27376, -12248]
413a2248l3029r828J7033L2427L1720K0314o0k3149l8280l3495r788J7821L3819
426f743L2208J7766j461k2291l4328l0694r789J7921L4347L2700J6809j943k0457
439B4045l2871l0273r711J7169L3866L2308J5918n221k2478l1250k6684r666J5401
452b9447L2592L2580J3858p286k3607l1653k7887r806J6214L2170L1458J4928
464D4114o765k3743l0622k5082q128J3517L0544L1858J6089p935k2932k7716k2735
477c9536p047J5743L2255L0751J3116q255k3427k7932k1459n082J4702L0046L0712
490C4587J5367q510k6304k9081j9412n377J2442K9069L0741J2995j0974k5501
502A0042k7187j9323m652J3628K7539K7306J3845p315k6180l0391j7742RJ4354
$$ y = [-12248, -45277, -55105, -38072, -5645, 26075, 46389, 46329, 23180, -15100, -48595, -58383, -40562, -6743, 25465, 43231, 41770, 19479, -14849, -45543, -55332, -37411, -3064, 29636, 46445, 44502, 24045, -8826, -39099, -48810, -31641, 2225, 34533, 50451, 45230, 22752, -8498, -35182, -44848, -29447, 3145, 35725, 49583, 42297, 18690, -12963, -40850, -50656, -34442, -2272, 29186, 44114, 37349, 13606, -17016, -42098, -50226, -36709, -6165, 25693, 41782, 33847, 10915, -16801, -39536, -46583, -30840, 1415, 32166, 45282, 37027, 13600, -14332, -35791, -40873, -26171, 3875, 34587, 49954, 41444, 15140, -13941, -33353, -38730, -26288, 2781, 33522, 46517, 35543, 10042, -17145, -36468, -41120, -27492, 47, 27353, 41198, 33883, 7703, -22688, -40430, -40421, -26067]
515b6067K4498K7986J5281r096k6555k6752j5596j398J4413K7042K6544J1928
527D2228q075k3929k9277j8780J955J7312K3908K3729J3831p082k6232k9443j5871
540c5726J083J4232K3536K4931J1872q774k4147k6817j7013J399J7690K3767K0714
553B6747J0316o856k3779k8450j6100L290J8685K2860K0957J0919p590k4234k7469
566b0704j5726K318J8068K4074J9670P662p382k1579k6224j6930K102J9116K4459
579H924J7596O849p264k1411k6191j5560L218J8856K4415J8707N322r332k0190
592C939k3185j4715J992J8540K5236J8552L832r586j9981k3373j4717K966J9254
605a1246K4092J7471L752j0215k0795k2040j4050K280J7520K3710J7784L093j1456
$$ y = [-26067, -1569, 26417, 41698, 32602, 6047, -20705, -36301, -37699, -23286, 3756, 30300, 42228, 34153, 10224, -19053, -37833, -35878, -18566, 5342, 29071, 42902, 35820, 9588, -19855, -35726, -34643, -20411, 3125, 28056, 39928, 31154, 7007, -19810, -36823, -35424, -17734, 6033, 26747, 37063, 30207, 6428, -22022, -38122, -34832, -16147, 6713, 27670, 38589, 30999, 6765, -20704, -36430, -34112, -16044, 8030, 27700, 35362, 27980, 6401, -19823, -36753, -34651, -15535, 8924, 26520, 33369, 26105, 4694, -21497, -37057, -33839, -14983, 9432, 28139, 33461, 24129, 3939, -19246, -33961, -31969, -13429, 11807, 30359, 34191, 24605, 4624, -18749, -33466, -30500, -11246, 12846, 30317, 34069, 23854, 3059, -18981, -33031, -30751, -13231, 10479, 28263, 31356, 19900]
618A9900j9462k1096j3306K306J8614K3983J6283J937j1222j9171j9825j1848
630c2907K725J8070K4031J7721K024j2306j9533j9063j1258L071J7316K3887J6830
643C0608J338j2870j8881j8299j0455K856J6245K2635J7057J273j4177k0167j7825
656b0662q667L686J5880K1306J6304J305j3547k0327j7234p803L999J5667K1214
669A1121J6414J622j3844k0680j7246o416N760J5511K0374J5145J550j2933k0179
682c801j7384o637O353J5005J9366J5161J496j3258k0847j7052n390O401J5463
695e124J7845J3834J043j2908k0404j7091n354P628J5872J7515J2765J413j3165
708A3869k0245j6992m832P738J6372J7150J1961R70j1794j9381j7338n179Q455
$$ y = [19900, 438, -20658, -33964, -31658, -13044, 10939, 27222, 29159, 17937, -1234, -21059, -32907, -30182, -12112, 11919, 29640, 31664, 19358, -175, -19238, -30496, -27425, -10109, 13778, 30608, 31946, 19076, 195, -18104, -28559, -25703, -9458, 13177, 30234, 31507, 17330, -2837, -20662, -29329, -25643, -9763, 11543, 27847, 29152, 15605, -4722, -21956, -29759, -25760, -10093, 11121, 27535, 29157, 15313, -5367, -22613, -29029, -23269, -7758, 12616, 27761, 29311, 16378, -3801, -21185, -27822, -21469, -6464, 12902, 28063, 29559, 16301, -4546, -21598, -26988, -20587, -5124, 12721, 26555, 27598, 14690, -5714, -22805, -28159, -20531, -4659, 12856, 25621, 27034, 13869, -6376, -23368, -28200, -20462, -4090, 13060, 25021, 25991, 14197, -5184, -22522, -27701, -19246]
721a9246J6849J6691J0846J24j1969j9380j6017m942Q412J6649J7431R382j127
734B3703j1304j8088j6538n318Q548J7318J6669R623r81j2575j7955j5339m376
747b6613Q330J6757J7237R233k641j1824j6838j4881n176Q772J7291J6469Q584
760B4700k430j2161j7154j4091l826Q351J6284J6643Q281l171j2673j6266j3757
773b1270m119Q234J7613J6233P861m287j2156j6631j3140l287Q668J6573J6293
786A6585P622m206j2783j5962j2049l043Q053J6394J6411P545m882j3634j5286
799i235j1522k041Q403J5891J5586P084m280j3597j5810j1263j597Q765J5513
812A897J5076O917m503j4126j5736j0423r23Q600J5340J4683O307m621j3666j5711
$$ y = [-19246, -2397, 14294, 25140, 25264, 13295, -6085, -22102, -27044, -18632, -1983, 15448, 24830, 23703, 12399, -5689, -22227, -27545, -18997, -1679, 14990, 24613, 23632, 11057, -6898, -22237, -26613, -18283, -1526, 15711, 24944, 22303, 10479, -6359, -21240, -26416, -17644, -353, 16116, 24700, 22270, 10109, -7045, -21136, -24962, -16611, -327, 16316, 24597, 21426, 8753, -7513, -21270, -25389, -17155, 458, 16691, 24552, 20265, 8109, -8522, -21662, -24949, -16281, 292, 16585, 24207, 20001, 7218, -8744, -20793, -23836, -15783, 611, 17022, 24567, 19685, 6051, -9235, -20757, -22798, -14395, 1496, 17082, 24166, 19886, 6289, -9521, -20784, -22381, -13616, 1897, 16973, 23890, 19387, 5261, -10475, -20898, -21821, -13221, 2119, 16802, 23109, 18488, 4822, -10889]
826a0889j0362r60R350J5329J4072O550n029j3947j5124r338n97Q862J4807J4010
840A6734O408n400j3779j4888r520P2R263J4952J3285N792n425j3754j5270r107
854b0637P85R756J3794J2891N179m885j3469j5223q709O85R939J4104J2325M203
868B0738m986j3360j4325q992J461J0435J3986J1506M250n383j3171j4034q624
881b0499J321J0441J4211J1557L770n916j2702j3848q344K043J0350J3498J1127
894A7009L161n689j2999j3375q139K225J0157J4113J0330K881n973j2812j3570
907a2681p721K280J0861J3539J0215K318o004j2458j2965p342K137J1148J3772
920G099R914K084o937j1751j2673o856K270J1004J3520R658J695o673j2103j1884
$$ y = [-10889, -21251, -22211, -12861, 2468, 16540, 23090, 18061, 4114, -11010, -20348, -20945, -12083, 2724, 16734, 23142, 17742, 3963, -10925, -20445, -20373, -11110, 3842, 17127, 22919, 17494, 3740, -11530, -20637, -19852, -10096, 3698, 16589, 21768, 16883, 3414, -11809, -20518, -19833, -9894, 4210, 16535, 20738, 15752, 2392, -11933, -20925, -19464, -9029, 4957, 16463, 20713, 15330, 2159, -11875, -20499, -19178, -8737, 5474, 17031, 20801, 14885, 2183, -11665, -20009, -17966, -7616, 5882, 17009, 20170, 14481, 1482, -11893, -20032, -17807, -7650, 6463, 16793, 19674, 13701, 889, -12681, -20402, -18122, -7261, 6278, 16493, 18811, 12807, 349, -12616, -19958, -17821, -6673, 7099, 17013, 19097, 12160, 409, -12264, -19120, -16850, -5846, 7674, 17332, 19027, 12354, 251, -11633]
934a1633o967K298J0530J3629R586J121p339j1886j1763o090K572J0177J2988
947G223R770J089p640j2156j1468n569K670J0541J2928R166J074p642j2040j1227
961a3281m935L009J0245J2823Q883J167p705j1952j0847n202L335J0551J2847
974H938Q533K41p583j1979j0912m506L435J0202J2282Q433j07p931j1816j0830
988a3600m163L825J0204J1801Q511p51p679j1764j0241l700M171R904J1575Q182
1002A6275k05p729j2086r871l729M664R988J1504P711m87p711j1776r621l515
1016a6588M989R976J0938P193k45q208j1568r843l073M602J0036J1095O971j034
1030A5241q085j1331r441k785M610R673J0950O718r86q225j1038r270k563N312
$$ y = [-11633, -18600, -16302, -5772, 7857, 17443, 18564, 11225, -661, -12424, -18514, -15942, -5765, 7223, 16993, 18082, 10442, -1714, -13182, -18751, -16081, -5540, 7388, 16554, 17628, 9986, -2054, -13281, -18216, -15207, -4962, 7861, 16744, 17911, 10206, -1746, -12593, -17795, -14460, -3909, 8938, 17471, 17712, 10129, -1850, -12762, -17268, -13833, -3631, 8651, 17084, 16977, 9046, -2770, -13600, -17763, -13938, -3734, 8067, 16578, 15827, 8148, -3616, -13857, -17557, -13386, -3482, 8093, 16275, 16070, 8341, -3745, -13616, -17345, -12681, -2693, 8811, 16522, 16035, 8324, -3452, -13073, -16588, -11599, -1623, 9315, 16508, 16263, 8055, -3513, -13356, -16429, -11827, -1791, 9304, 16275, 15241, 7156, -4175, -13616, -16401, -11791, -2118, 8832, 15550, 14564, 6339, -4699, -13969, -16532, -11220]
1044a1220R762J0594O444j174q022j0995q773k335N170J0225R503O556j225p789
1058F721j1233r042j766N218J0140J0046N163j264q016j0832q747j706N178R995
1072a45R929N011j626p996j0340q395k030N771R988R620M792j899p793j0685p192
1087a2990j994N486R901R658M716j958q063j0357p676j231N735J0169R217M266
1101A4879k541p835j0069p360j059N486R516R302M230k567q046r928p481n92N561
1116h504R987Q650L831k679q343r314o758o89N708R502Q747L958k734q378r480
1131f496o322m23N774R205Q903L481l057q083r261o108o20N997R175Q523L442
1146A4130l087q235r316n855j90N557Q970Q095L272l114p943r064n884%O025Q943
$$ y = [-11220, -1458, 9136, 15580, 14406, 6384, -4611, -13384, -15719, -10549, -324, 9179, 15735, 14510, 6721, -4512, -13554, -15320, -10102, 38, 10084, 15247, 13983, 5967, -4865, -13612, -15318, -10140, -145, 9784, 14795, 13169, 5173, -5167, -13562, -15592, -9821, 167, 9787, 14579, 12680, 4887, -5798, -12990, -14984, -9498, 403, 10061, 14777, 12819, 4756, -5601, -13277, -14508, -8773, 1396, 10613, 14879, 12338, 4503, -5566, -12926, -13985, -8499, 1017, 10319, 14549, 11982, 3936, -5992, -13473, -14065, -8504, 1483, 10133, 13964, 11285, 2942, -6372, -13130, -13819, -8111, 1391, 10138, 14096, 11362, 2984, -6496, -12818, -13241, -7467, 1738, 10641, 14122, 11065, 2982, -6279, -12387, -13007, -7010, 2165, 10688, 14130, 11043, 2808, -6508, -12363, -12553, -6996, 1974, 10069, 13341, 10227, 2284, -6780, -12664, -12664, -6639, 2304]
1162B304P925K800l170q033r102n716O45O273Q969P363K857l433p992q618n455
1177a2383N13N581R013P672K760l692p806q608n233P54O019Q747P123K171l700
1192H931p799q272m845P53O116Q401P087K312m019p658q243m671J134O239Q186
1207C652O184K328l839p773p884m509J033N842Q645O539J522l692p667p878m284
1222a1781J238N925Q478O135J780m417p381p690l857J383N653Q350O300J584m227
1237G473p643p644l234J449N908Q108N969J256m238p388p838l567J871N855P766
1252D103O058J086m263p278p165l645J809O026P415N446O46l817p374o941l700
1267a1594K243O029P784N359M91l936p417o868k879J575O329P640N273L97m194
$$ y = [2304, 10229, 13029, 9859, 1826, -7276, -12992, -12347, -6074, 2895, 10258, 13115, 9682, 1690, -6928, -12383, -11870, -6289, 2724, 10396, 13156, 9464, 1658, -6950, -12183, -11429, -5410, 3337, 10460, 12631, 8931, 1132, -7140, -11985, -11232, -5116, 3285, 10372, 12684, 8665, 1007, -7236, -11907, -10773, -4534, 3652, 9836, 12164, 8325, 552, -7332, -11841, -10808, -4966, 3679, 10218, 11740, 8048, 381, -7497, -11781, -10543, -4618, 3860, 9995, 11775, 7358, -23, -7713, -11570, -10187, -4534, 3816, 10116, 11700, 7473, -170, -7814, -11048, -9599, -3691, 4417, 10386, 11642, 7404, 16, -7822, -11389, -9518, -3663, 4103, 10161, 11247, 6984, -294, -7459, -11104, -9295, -3269, 4146, 9592, 10238, 6421, -953, -7894, -11594, -9351, -3322, 4462, 9821, 10312, 6376, -1041, -7909, -10788, -9213, -2884, 4756, 10029, 10426, 6232]
1282F232p265o386l316K281O219P144N217K74m376p011o865k711K400N961P138
1297D936M680N59m702o632o497k604J937O018P113M698J3m433p026o126k577K570
1313h073O271O848M416K92m859o553o265k355K613N551P052M426N3m862o519n822
1329g786j717K009O353O351M118k91m184p100n745j424K473O010O444M106l52
1344I265m760o658n640j954K593O355O145M025l64m912o565n604j694K763O094
1359i11O231L694q21m488o631n071k045L375N965O318L171q36m158o625n363r96
1375i191K970N763O135L392q88m581o531m675j068K960O000N846L328j157m624
1390C679o337m908j205L313N658N856L066j057n187n823m756j281K983N808N705
$$ y = [6232, -1033, -7419, -10735, -8454, -2235, 4909, 10126, 10400, 6024, -987, -7852, -10563, -8163, -2202, 4936, 9616, 10175, 5473, -1159, -7656, -10260, -8323, -2305, 4808, 9506, 9519, 5086, -1940, -8066, -10643, -8073, -1802, 5046, 9462, 9754, 4895, -1658, -7923, -10278, -7665, -2114, 4938, 9364, 9417, 4555, -1964, -7786, -9503, -7494, -1141, 5210, 9328, 9037, 4853, -2247, -7992, -9416, -6943, -933, 5511, 9617, 9265, 4505, -2153, -7793, -9747, -7154, -799, 5346, 9371, 9007, 4095, -2470, -8074, -9768, -7005, -911, 5320, 9014, 8193, 3705, -2926, -7997, -10042, -6667, -702, 5616, 8787, 7951, 3793, -2832, -8195, -9191, -6221, -458, 5677, 9069, 8181, 3600, -2931, -7606, -8674, -5714, 286, 6132, 9460, 8303, 3679, -2658, -7566, -8771, -5458, 200, 6056, 9122, 8065, 2878, -2945, -7701, -8982, -5999, -191, 5514]
1405E514K597j290m424n995m380r41K990O065N510K923j607m826n553m488q34
1420h739L198O057N810K536j354m746n768m054r13L360N564N447K747j751m804
1435B590n851l958p77L374N466N165K290j326m998n890m184j52L059N710M733
1450E251K329j362m773n541l738l06L464N434N061K119j438m814n628l720j1L627
1466d046N586M485K451j698m687n409l762K63K883N190N020J815j781m689n248
1481c627l513Q9L377N062M544J716j636n163n250k999q4L359N238M478J839j600
1497E830m859m978l421J14L903M867M176K033k122m678m838l352P11L401N064
1512A851M329J256j910m202n412k875M07L388N170M059J431k227m385m949k799
$$ y = [5514, 8111, 6821, 2397, -3598, -7978, -8919, -5929, 136, 5646, 8569, 6962, 2136, -3417, -7905, -8739, -5541, 516, 6326, 8862, 7508, 2762, -3006, -7060, -7973, -4613, 951, 6398, 9145, 7394, 2590, -3261, -7219, -7996, -4622, 844, 6009, 8299, 6973, 1975, -3915, -8099, -8251, -5192, 518, 5251, 7580, 6218, 1445, -4096, -7834, -8140, -4676, 758, 5819, 7938, 6500, 1686, -3942, -7662, -7673, -4046, 1540, 6025, 8476, 6778, 2091, -3318, -7080, -6817, -3934, 1256, 6276, 8091, 6310, 1621, -3627, -7140, -7051, -3674, 1388, 5932, 7648, 6012, 849, -4401, -7400, -7484, -4125, 1113, 5591, 7430, 5830, 971, -4007, -7428, -7314, -3411, 1456, 5632, 7665, 5543, 865, -3973, -7325, -6614, -3213, 1851, 6180, 7436, 5526, 1324, -4088, -6963, -6556, -3168, 2002, 6061, 7492, 5265, 880, -4069, -6868]
1527f868M97L286N125L938J319k255m690m550k713K69L594M987M074J258k344
1542D927m572m725k563O14L600M973L493J063k256m519m342k561Q34L743M928
1557B637L359Q73k588m543m238k281R24L494M859L617Q19k495m377m472k222N05
1573f129L894M722L649N11k375m484l929k353J219L404M637L394K90k458m586
1588e94l864k059J141L477M770L122O36k901m043m334k161J336L754M414L032
1603E726L72k507m157m290j877J246L582M660L091J83k385m448l655j817J091
1618e185L676M273L214K90k748m008l585j702Q73L831M147L033o4k605m325l818
1634d703j450J321L944L787K928l3k708m190l839j204J158L359M611K401j76k338
$$ y = [-6868, -6371, -3085, 2040, 5978, 7297, 5042, 352, -4198, -6911, -6642, -3048, 1939, 6013, 7271, 4927, 355, -4370, -6933, -6319, -2719, 2254, 5747, 6810, 4554, 35, -4307, -6868, -6034, -2291, 2637, 5996, 6869, 4281, -262, -4500, -6781, -5857, -2363, 2496, 6113, 6932, 4437, 60, -4412, -6634, -6129, -2235, 2487, 6136, 6647, 4272, -212, -4141, -6494, -5275, -1871, 2766, 6160, 6450, 3992, -594, -4458, -6517, -5376, -1899, 2871, 5993, 6629, 3728, -315, -4649, -6810, -5474, -1720, 2694, 5726, 6098, 3591, -566, -4856, -6733, -5487, -1905, 2755, 5846, 6029, 3644, -804, -4459, -6276, -5185, -1509, 2764, 5978, 6268, 3520, -488, -4073, -5775, -4902, -1071, 3076, 6109, 6045, 3440, -885, -4703, -6153, -4832, -888, 2899, 5827, 5794, 3086, -1104, -4943, -6147, -4989, -1630, 2981, 5382, 5206, 2868]
1650B868l872l429j741J482L754L846K419L18k817l979l510j018J379L350M328
1665C378K532k79k552l894l474j637J813L515L797K407k3k723l960l284j536J820
1681d100L237L994K262K1k967m052l284j091J659L414L663K406j59k745l982l190
1697d914r85J904L603L707K501o99k724l854k837j085J473L806L628K327n86k698
1713B567l783l168j161J855L329L717K104l78k918l769l002p53J708L316L379
1728C043J874o84k823l618k568o75J751L494L466J754l67k665l964k764l66J829
1744c283L156L529J770n05k787l625k778m23J847L311L409J622q51k591l577k538
1760d314o56J997L122K980K005p37k823l639k379o71K006L014L447J550q32k796
$$ y = [2868, -1004, -4433, -6174, -4692, -938, 2908, 5327, 5645, 2828, -1151, -4661, -5679, -4300, -950, 3378, 5910, 5631, 3079, -815, -4289, -5926, -4113, -598, 3199, 5606, 5583, 2860, -1100, -4384, -5920, -4100, -863, 3131, 5393, 5414, 2447, -1605, -4889, -5980, -4321, -907, 2756, 5162, 5003, 2258, -1724, -4914, -5899, -3995, -392, 3315, 5816, 5117, 2393, -1461, -4298, -5383, -3910, -104, 3524, 5851, 5265, 2567, -1216, -4384, -5545, -3690, -361, 3356, 5460, 5082, 2164, -1605, -4607, -5360, -3652, -336, 3043, 4917, 4233, 1410, -2208, -4776, -5451, -3700, -206, 3260, 5014, 4647, 1982, -1982, -4746, -5112, -3283, -127, 3402, 5172, 4667, 1880, -1745, -4523, -4946, -3099, 212, 3621, 5243, 4392, 1801, -1776, -4314, -4970, -2973, 149, 3129, 5134, 4397, 1574, -2065, -4444, -5115, -3109, -95, 3352, 4902, 4070, 1274]
1776A274l607k084n60J998L333L094J542q01l018l293k557l02K048L086L008J830
1792D991r98k529l276k476k12J856L340K895J196q19k617l681k073K33J772L157
1808G59K857J148j014k780l319k137M3J584L442K987J333j420k302l653j969k55
1824d696K431K745K808R99j092k553l217k057K73J909L310K556J353j227l052
1839D90k921j866L39K031L078K376J165j391k484l112j889K30K017L038K571R51
1855D623j275k754l019k150N01K016L247K338M34q02k615l204j602j53K504K916
1871A005K515O76j057k897k848j744L39K319K896K454P98j254k905k977j293K02
1887c771K105L000K250P30j311k610k678j719L84J913K915K338N28j556k121k914
$$ y = [1274, -2333, -4417, -4977, -2979, 354, 3448, 4990, 4189, 1171, -2122, -4679, -4981, -2933, 153, 3161, 4991, 3993, 1464, -1812, -4288, -4500, -2644, 696, 3591, 4787, 3968, 1351, -2330, -4403, -4170, -2398, 759, 3616, 4764, 3750, 970, -2349, -4486, -4443, -2859, 583, 3570, 4903, 3483, 1181, -2472, -4441, -4696, -2265, 480, 3288, 4287, 3195, 642, -2575, -4632, -4359, -2450, 860, 3416, 4769, 3542, 490, -2431, -4297, -3958, -1927, 1151, 3527, 4692, 3301, 817, -2295, -4184, -3954, -1937, 1101, 3672, 4623, 3348, 594, -2425, -4575, -4074, -2058, 1189, 3527, 3961, 3159, 544, -2660, -4262, -4415, -1911, 1005, 3520, 4196, 3139, 242, -2606, -4350, -4011, -1692, 1204, 3658, 4456, 3202, 297, -2680, -3973, -3771, -1666, 1334, 3584, 4314, 3003, 393, -2285, -4004, -3620, -1707, 1208, 3546, 4074, 2518, 397, -2517]
1903b517j748N09K082L165K057O08j276k883k671j531L43K317K736K280M97j385
1919B583k446k869j210L03K356K845J934O20j303l001k682j084M35J977K943K171
1935C572L23j483k474k424j500N34K042K553K256K51j401k353k560j095O22K121
1951a016K734J593L72j223k754k402j017M77K263K575K199k6j400k478k287j331
1967c721O77K083K467J752J16j025k973k099r99N43K158K639J685K77j821j958
1983a99k683r43Q54K151K680J405J82j549k440j951j042R39K161K274J665J0j612
2000A902k494k117r16P21K335K497J530L09j683k749j890j057J036K087K045J989
2016C545j82j772k187k174q64J120J962K337J491n5j728k425j648j015Q13K581
$$ y = [-2517, -4265, -3756, -1674, 1491, 3548, 4156, 2880, -3, -2674, -4205, -3862, -1545, 1191, 3471, 3968, 2583, 137, -2732, -3942, -3639, -1283, 1562, 3496, 4116, 2813, -188, -2870, -3954, -3519, -1542, 1401, 3572, 3895, 2412, -62, -2486, -3986, -3452, -1410, 1143, 3399, 3650, 2249, -104, -2664, -3759, -3137, -1016, 1718, 3311, 3683, 2460, -294, -2696, -3713, -3236, -973, 1602, 3801, 3775, 2375, -103, -2390, -3721, -3044, -961, 1506, 3258, 3374, 2349, -624, -2723, -3722, -3179, -1021, 1618, 3303, 3580, 1759, -199, -2882, -3825, -2971, -820, 1860, 3265, 3447, 1898, -542, -2493, -3535, -2596, -435, 1839, 3504, 3514, 1902, -592, -2709, -3625, -2904, -569, 1928, 3458, 3767, 2084, -665, -2555, -3612, -2576, -489, 1556, 3545, 3363, 1591, -596, -2770, -3634, -2514, -552, 1785, 3276, 3221, 1493, -932, -2580, -3595, -2782, -201]
2032b01J956J808n13j569k306j984p63J266J814K410J517l68j715j815k390k92
2048c145O94K356K301J074q7j852k191j909p58J310J932K465Q66K7j713k196j942
2065b768o19J204J884K292J375m96j893j868j826j44M32K007K436J029j6j784
2081A245k164j549p30J044J990K188J201l55j858j973j740m63R75K373J970J177
2097C331o72j473j997j970k78J057J837K119R46j86j722k252j250l42P11K199
2113E8K073R68n67j392k184j599m11J117J922J968J160m68j797k160j465p1J167
2130a681J896J857P55k89j624j913j923J40J212J692J995Q62l80j775k133j292
2146b601m02J273K069J763Q74m81j678k116j159l38J332J811J739N96m50j519
$$ y = [-201, 1755, 3563, 3050, 1481, -825, -2809, -3572, -2306, -492, 1918, 3435, 3067, 1352, -463, -2853, -3145, -2451, -95, 2206, 3280, 3193, 1341, -850, -2759, -3517, -2207, -275, 2190, 3056, 3083, 1370, -826, -2768, -3387, -2183, -299, 1993, 3368, 2872, 979, -889, -2715, -2859, -2427, -420, 2016, 3045, 3029, 1245, -919, -2468, -3198, -2154, -164, 2024, 3225, 2870, 1012, -961, -2701, -3164, -2189, 184, 2154, 3331, 2659, 1186, -811, -2781, -3059, -2002, -165, 1954, 2900, 2714, 992, -1260, -2510, -2852, -2141, 58, 2131, 3099, 2532, 1140, -1044, -2643, -3054, -1937, -15, 1953, 3113, 2645, 848, -1312, -2777, -2848, -1681, 215, 2072, 2827, 2538, 914, -999, -2922, -2782, -1570, 122, 2117, 2979, 2599, 824, -1309, -2601, -3003, -1730, 339, 2102, 2976, 2495, 817, -1299, -2458, -2796, -1464, 347, 2086, 2682, 2232, 713]
2162G13j935j561O3J393J632J631R96o02j809j774j538M12Q71J788J774Q13o88
2179B179j673j720j559J89J150J973J465O08m59j480k042j154J66Q93J966J431
2195A933N33k62j679k011j172o0J349J734J734P38q47j758j668j295j15J670J874
2212F98J571M91q33j454j943j173M01J113J930J658J62n68j675j808j081j65J761
2229i15J723J347N50p31j784j544j148J2J590J501J615M71q29j645j928r36K03
2246b448J377J810J372L21o73j694j486j134K25J085J889J741J26q04j508j684
2262a485j095N25J148J705J253M00n95j922j386r26K19J242J731J272J79o23j628
2279A4j616r39L17J585J241J548Mn42j493j714o59RJ287J829J160K30p50j530
$$ y = [713, -1222, -2783, -2720, -1327, 305, 1936, 2932, 2330, 521, -1253, -2791, -2379, -1508, 280, 2054, 2867, 2179, 506, -1214, -2773, -2584, -1434, 539, 2004, 2612, 2153, 673, -1369, -2523, -2357, -1464, 502, 1933, 2466, 2204, 525, -1486, -2658, -2718, -1369, 365, 2099, 2837, 1990, 232, -1436, -2731, -2846, -1176, 698, 2269, 2760, 1927, 473, -1470, -2643, -2242, -1129, 801, 2459, 2621, 2053, 378, -1430, -2511, -2676, -915, 808, 2155, 2705, 1974, 190, -1354, -2502, -2490, -900, 601, 2216, 2687, 1858, 213, -1715, -2651, -2448, -1071, 739, 2111, 2432, 1759, 65, -1421, -2555, -2330, -1245, 644, 2385, 2511, 1707, 199, -1485, -2580, -2055, -907, 798, 2051, 2451, 1856, -66, -1452, -2378, -2159, -917, 814, 2086, 2265, 1642, 14, -1602, -2541, -2224, -639, 602, 2150, 2154, 1612, 119, -1595, -2254, -2245, -958, 871, 2031, 2261, 1511, -19]
2297a9j573r05M91J075J717J236J5m12j826j442p51N21J184J332J490K76j195
2314A214j383j680n38M78J017J697J347J27r99j338j523q43P63Q97J765J082O8
2331B151q22j557j332o95N31J097J683J127J86j270j333j540n66L39J629J427
2347A055J042J20p55j529j620n03L70J098J656J050K63r96j603j400n22O35Q43
2364g96J955Q02L35j150j294j540n62N80J499J232Q35J37p67j583j255m26M75
2381a523J158J365J080j38q59j349j388o16O93J170J570P90N5j081j429j201n12
2398b215P62J001J651P71k02p79j398j283n12P70R57J304J043K7q90j352j316
2415a661j33K4J626J068J236k22q15j657q21o75M93J486J024J179q3j240j233
$$ y = [-19, -1592, -2497, -2006, -931, 786, 2022, 2037, 1625, -201, -1643, -2394, -1873, -689, 643, 2133, 2409, 1214, -169, -1849, -2387, -1909, -892, 805, 2152, 2279, 1280, -58, -1581, -2424, -1661, -764, 1001, 2083, 2151, 1329, -228, -1560, -2255, -1724, -627, 1056, 2183, 2369, 1099, -234, -1774, -2340, -2001, -372, 1055, 2097, 2217, 1462, -67, -1687, -2190, -1820, -722, 934, 1984, 2247, 1251, -352, -1752, -2274, -1639, -796, 1159, 1961, 2296, 1146, -148, -1688, -2250, -1670, -171, 1061, 1896, 2033, 1266, -317, -1572, -1998, -1523, -365, 1000, 2080, 1942, 1083, -266, -1654, -2270, -1577, -407, 1163, 1953, 2008, 927, -502, -1703, -2215, -1453, -452, 1199, 1970, 1768, 989, -409, -1692, -2204, -1434, -477, 827, 1870, 1897, 1007, -345, -1661, -1794, -1770, -144, 924, 2160, 1938, 1123, -534, -1355, -2030, -1537, -51, 973, 2152, 2069, 829, -404]
2432d04j394k34O75Q92J537Q29l6r09j380j081n01O13J205J100J028J7j089j333
2450d65j368j8O13R42J602O36l7j087j181j112m79M40J263J475O90k92o93j383
2468d54j111k90O88J112J267P75l07r78j453o76l75N44J300J090O80k73j061r89
2486e11j241q6M66J349J283N80k26p31j558r94n0N23J098J331L14J89p39j607
2504f10j028k02O96J022J158P77l65j047r86j112n5Q89Q52J579P4p1r20j261r17
2523a527l11Q91R95J178L76k5j197j218p80p4O57J143J221P50l70j199r57j400
2541a847K10M91J264J006P54m58r43j174q82%M21J195J232K76j95q62j483n49
2559a544J2L47J449Q54N80k65j037j138q77M1N92J232J101L25m02q30j117j101
$$ y = [-404, -1798, -2032, -1357, -465, 1072, 1901, 1865, 956, -424, -1505, -2006, -1393, -188, 912, 1940, 1957, 868, -465, -1833, -1851, -1238, -296, 1306, 1942, 1905, 818, -363, -1475, -1954, -1514, -251, 1224, 1914, 1622, 929, -454, -1565, -1855, -1167, -55, 1212, 1987, 1680, 702, -751, -1427, -1802, -1258, 42, 1132, 1812, 1539, 478, -511, -1752, -1838, -1372, -23, 1260, 1840, 1614, 883, -675, -1669, -1719, -1196, -98, 1233, 1547, 1736, 997, -610, -1638, -1840, -1144, -122, 1036, 1813, 1448, 401, -585, -1697, -1752, -863, -11, 1568, 1642, 1571, 651, -610, -1527, -1838, -947, 48, 1226, 1602, 1577, 380, -838, -1618, -1692, -1035, 108, 1329, 2079, 1709, 510, -447, -1847, -1637, -1146, 118, 1124, 1878, 1420, 477, -697, -1579, -1579, -1158, 37, 1269, 1545, 1350, 488, -995, -1544, -1532, -1185, 264, 1118, 1698, 1433, 396, -742, -1619, -1578, -986, 246, 1347, 1672, 1270, 440, -677, -1778]
2577a778K0Q26J462R20P8k41q12j048j010J46M80J367Q93J67k08q89j464m31l44
2596a866J165R67P09P52o10p68j222n55k2Q35J108P85L08k39j135j130q07K95
2614a430Q63Q86Q12L08l92q59j068p65j03J242J176M81L48m80o47j247m97n9N45
2633h86J416Q92K80p48p40j148n53J14O48J240Q30M02o21q00j065o01R1M25J046
2652B22P81M43m22o98j101o86qO68R50J393Q5o69r30q65q12K75O35J284O61K12
2672A418m19r57p70o28j27Q52J171O54L24p89m85j275o28L55P25J302N25L82n40
2691A090r27j087m99O9Q81P55J014J61o49p13j013n70MR52R47P99J84p70p08p86
2711h66n38R4O82R71J017Q1n58j155o47m99M21M49J148P99j94l44r25r11m40p2
$$ y = [-1778, -1758, -932, 530, 1450, 1528, 1287, 475, -573, -1583, -1437, -957, 410, 1303, 1470, 1262, 373, -1091, -1522, -1866, -701, 266, 975, 1727, 1117, 349, -873, -1428, -1450, -615, 493, 1278, 1586, 1347, 212, -918, -1725, -1430, -567, 319, 1131, 1439, 1047, 188, -880, -1645, -1748, -506, 670, 1151, 1499, 1019, 372, -875, -1372, -1431, -886, 530, 1422, 1702, 954, 214, -934, -1487, -1373, -725, 515, 1345, 1747, 1126, 326, -739, -1340, -1249, -824, 222, 1003, 1446, 1024, 326, -775, -1461, -1469, -801, 149, 1542, 1627, 958, 28, -837, -1649, -1374, -739, 545, 1206, 1418, 999, 42, -728, -1356, -1483, -631, 540, 1194, 1518, 729, 244, -1031, -1659, -1304, -579, 723, 1248, 1630, 1090, 163, -924, -1423, -1354, -473, 282, 1296, 1457, 808, 95, -918, -1488, -1484, -532, 415, 1214, 1398, 628, -80, -866, -1404, -1310, -628, 343, 1360, 1441, 883, -272, -919, -1418, -997, -548, 600, 1399, 1205, 861, -64, -975, -1415, -1487]
2731a487J201J091N94k45o97o14o96n87L26Q14N50J348j22p08q80q54m06J43P95
2750d34R28P70J24q79q05j050j01R3R33J057N46K39m69r64j031l98M36Q10R21
2769G26L80jm06q35r02k26K16N55J126O13j6m93j105p35m8K1P73P89P50J15n41
2790G56j240n19l94M41O62Q27Q54j41o01r60o64J3K32P40O92M53j07m35r81p48
2810a120L2K68R35Q16K39L09r02q94p43L0L26N38P88O00K0p88r70p24K8K17J005
2831A0M79Q02j30p49n86p90l36L15Q02J020M88J89j024q39p16j13M3Q32R13M34
2851A044L27r92j093k21L1L4Q92N61M79p7n07j030l16l38L6J165O22M38j23m80
2871D52q54o36l77O02N74R87K55J30p51q28m47j84N07O24Q81L30l33n50q48o22
$$ y = [-1487, -286, 805, 1399, 1154, 457, -157, -853, -1440, -1114, -300, 250, 1598, 1476, 768, -112, -966, -1372, -1229, -434, 494, 1264, 1388, 509, -296, -1346, -1447, -1354, -421, 636, 1182, 1421, 952, -12, -1043, -1441, -1005, -195, 726, 1106, 1105, 699, -136, -1038, -1264, -1048, -493, 633, 1246, 1230, 737, -368, -1103, -1151, -1130, -357, 432, 1182, 1297, 756, -484, -1003, -1397, -956, -294, 533, 1387, 1246, 645, -315, -979, -966, -734, 6, 698, 1151, 1044, 609, -372, -1120, -1088, -820, 115, 931, 1170, 1479, 577, -317, -1060, -1030, -704, -166, 622, 1222, 1242, 454, -516, -1240, -1212, -995, 10, 489, 1291, 1161, 412, -174, -964, -1300, -985, -183, 837, 1325, 1514, 490, -349, -1065, -1178, -1135, -303, 610, 1044, 1371, 379, -714, -935, -904, -870, 22, 583, 1062, 985, 478, -552, -868, -1206, -1170, -5, 617, 1055, 932, 452, -402, -1038, -1415, -813, -239, 748, 1003, 1133, 382, -446, -893, -1077, -570, 54, 935, 1265, 932, 382, -466, -1088]
2891a088j40M49O50Q60L95j29o57q47o69L03J38R63N65L86j22o93q02o31R4M18
2911e57Q59N09L7J46p82p43m41Q9K22O67O86M92J14j035j055k21j93N50Q80L86
2931F10N32k20q53m34n41j32L58Q39Q66O3j53p34o02o38OL10N53R10M32k28n38
2952D06r92k94k45P85M80O57K28k80n17q50k05j88P14O46N94J2k01l80p31p13
2972a074Q9M71O39Q36J59l84l01r94n94K43L94P72N14J6k63l95p59l32j5N02Q19
2993C43L02M35k88n49j006o7l23N17Q83M29N38p80k38r30K7j93L78R06M98K60
3013A142l57p74n87m17j95J001M06P39p5l60o51n23j53J52P9J026M42P2J6r92
3033io28j07j03L50R20L61O4l70o77m77j9lL67N44P83k51l98n51l18n08K62K85
$$ y = [-1088, -1228, -779, -129, 731, 1126, 997, 340, -507, -1176, -873, -735, 228, 793, 1179, 1057, 364, -438, -1069, -975, -557, 302, 811, 848, 994, 212, -531, -972, -883, -661, 6, 692, 1184, 1298, 263, -792, -1013, -1206, -656, 224, 610, 1142, 922, 69, -365, -906, -1038, -680, 159, 1025, 1088, 935, 201, -401, -1039, -1033, -723, -170, 740, 1172, 944, 406, -586, -880, -1125, -340, 140, 797, 1025, 745, 228, -622, -827, -1015, -301, 345, 939, 951, 750, 370, -361, -1074, -985, -514, 125, 961, 1120, 736, 435, -559, -1153, -910, -516, 256, 770, 786, 523, 128, -631, -963, -978, -476, 343, 645, 1080, 792, 243, -763, -830, -1153, -636, 247, 676, 1214, 434, 196, -734, -707, -900, -522, 384, 882, 1142, 785, 11, -576, -993, -1188, -187, 219, 958, 883, 523, -128, -651, -804, -652, -573, 453, 895, 967, 983, -9, -637, -744, -847, -497, 423, 784, 848, 478, -199, -676, -695, -698, -331, 213, 996, 745, 347, -204, -522, -1030, -768, -483]
3055d83Q85M52l4j50p66n26k31J10M31R51L1M26m77n07r31L5j34Q69N42N00k04
3076G89l33n98o65J42j36N97M41N97l4k22o79p57PL13K76N50M82L2p3r16m14m04
3098a005K24N70R85J72j09l86m83n85k11k27P90P19M40k05k96l85p64k63J70O51
3118a98N85O25Q8p31m29p18k53K86P73M86m8M55p54k30n04k47R1N41P80J89j85
3139F02k90o80o31pM17N36P85M2j0k05p63l65k88L27N30M69O10j95n36m49q67
3160i68J94K09O63M38L89Mn20q14n81J60L46O22L83N71l78n35k25p98K11J11M18
3181a00O48K14k03m23j76n95j41L36L62Q64k00L4l66m19m13n1J84L86L94L27P4
3202G36m35p23l01j35M03L05P23K27j33n15o41j73j02L18O53L65J65j0n55m16
$$ y = [-483, 402, 854, 820, 670, -96, -622, -853, -743, -312, 639, 670, 1096, 619, 112, -819, -784, -918, -49, 493, 993, 789, 456, -142, -807, -665, -801, -204, 237, 834, 800, 578, -101, -858, -851, -538, -262, 288, 770, 802, 729, -187, -601, -1005, -781, -211, 774, 946, 837, 451, -32, -617, -828, -1055, -265, 454, 894, 689, 393, 8, -756, -1019, -849, -198, 387, 1012, 1100, 369, -60, -778, -1031, -745, 28, 514, 466, 921, 167, -63, -567, -814, -723, -182, 598, 787, 602, 312, -368, -999, -1006, -589, -53, 732, 774, 764, 559, -204, -569, -857, -530, 0, 469, 1079, 884, 348, -101, -968, -774, -565, 98, 536, 925, 929, 409, -405, -986, -826, -480, 142, 525, 1096, 718, 183, -42, -840, -629, -518, -100, 548, 762, 559, 136, -40, -635, -776, -440, -78, 786, 586, 620, 254, -165, -578, -629, -445, -59, 335, 662, 736, 301, -422, -723, -858, -455, -150, 573, 800, 667, 152, -489, -662, -764, -446, 207, 572, 737, 727, 172, -244]
3222b44m83j00K55M90O16K27k21l29n09n84o1O00M54K31L31k52j23o21n71J83
3242g11K58P08M40m1k49l14n21l02r2M22O77L88j50J62l55r31j09m2M23N06N36
3263G03k72K41n82n55l55K24M39K15M14J28m4n43n96Ok04O00L50K78J10j30l52
3284G5m12k09j43J81P21M19J76q6o05o44l74J98K78N58M83j94N5m16o80n6P5J42
3306d58O96M08M8k13p29j15m66L51K01M81N59k6l81j85p05j98J01M01N40K83k0
3327E73j0n22m83K24k55L89M58J6L27m48m30j82m30K87ON75O06K84n27l97n25
3348d64j65J73N21P6M00M1j90m01n95j86R1O88L87L19o8k50l87l31k00L4N38J87
3370B18L10K2j38n79l00J5j70K64N43M15L40n00k95n22k38j36M85M81N05r1j07
$$ y = [-244, -727, -827, -572, -82, 534, 761, 540, 211, -298, -882, -943, -343, 111, 342, 673, 421, 298, -323, -894, -711, -453, 255, 695, 654, 405, 91, -430, -732, -824, -402, 275, 663, 513, 675, 320, -611, -720, -762, -339, 167, 703, 431, 672, 90, -465, -820, -596, -157, 58, 472, 600, 556, 13, -583, -577, -781, -181, 169, 447, 557, 427, 75, -337, -546, -689, -508, 213, 632, 808, 722, 117, -527, -901, -703, -425, 133, 616, 422, 477, 61, -619, -675, -600, -458, 238, 646, 694, 481, -248, -363, -829, -478, -277, 204, 763, 737, 356, 171, -534, -732, -631, -230, 310, 593, 573, 563, 41, -442, -218, -473, -84, 374, 390, 717, 269, -161, -343, -773, -486, -480, 95, 701, 985, 458, 61, -464, -629, -456, 65, 141, 541, 582, 392, -9, -604, -790, -699, -11, 376, 695, 627, 377, -10, -341, -541, -507, 31, 218, 528, 550, 412, -167, -467, -452, -622, -358, 185, 600, 940, 440, 145, -377, -615, -751, -266, 215, 720, 629, 522]
3391E22m02n88j53J97L11L27N68k90l02j02o91j41l4M16Q88K4J11l64l88j98l42
3412f31J33M84K34K76K76m17m78k12m73K35L54O02K63Q4k85p70k82K57k09N38
3432b1M90J27n0m22k01n13j24J96L94M14L9N40p35k51m90l3P9N00M38K66k24k77
3454A42m39j54j12m5L67Q39L3lm72l26o95K88rN37M93K09n0l38k25o53k5K43K32
3477a63L70L04K69n73k88k82k15J45N61L23J29j88j55l87m78mO5O98L69Kp6l65
3499F1k40k34l30O8P90N77K06j33m95m77l96K6K39L14K83L90k17l35l80n59L26
3520e16J80L32M20L14k92k40o73j77j0K07O45J14J94p8o4p73q6k1J23N16L46J06
3542E67n5n52j32l28r6J20N00L45R1n4l20l91j44k83J82O82J13O02l08n66p6m11
$$ y = [522, 120, -468, -621, -424, -113, 214, 782, 492, 190, 88, -603, -744, -778, -362, 526, 550, 661, 297, -91, -289, -631, -498, -14, 220, 496, 772, 355, -123, -335, -808, -573, -219, 383, 646, 730, 445, -325, -607, -350, -559, -21, 469, 596, 546, 124, -77, -590, -714, -518, -124, 290, 329, 869, 134, -117, -607, -640, -561, -61, 377, 643, 419, 142, -297, -451, -563, -608, -241, 598, 631, 628, 156, -170, -865, -577, -586, -49, 444, 653, 603, 265, 40, -613, -638, -395, -163, 207, 511, 780, 207, -81, -363, -578, -433, 128, 451, 580, 392, 237, -150, -628, -632, -567, 131, 500, 502, 426, 61, -179, -413, -743, -675, 115, 692, 898, 765, 270, -207, -603, -577, -338, -24, 259, 649, 432, 97, -283, -842, -516, -336, -4, 416, 730, 438, 198, -475, -652, -662, -455, 190, 304, 498, 420, 356, -417, -503, -524, -401, 115, 461, 567, 512, -40, -172, -500, -596, -476, 24, 369, 460, 406, 86, -305, -449, -732, -550, 132, 245, 847, 539, -27, -103, -514]
3564e14Q7M6M16K38K52mn23l09r9k70K87M82J75L42L8l09n29k72j22J84N22M18
3586E36J4J40n73n10j15K8O5M04O29J87k70n63k72J66l05K07J80L57M61l33k15
3607B18n16m41J92M48L4N61K59J14j005r0k66J27J94J82O36j53j18j22o17k43
3627f06k0J77P03K66n4L7m66m26n93L83K70O54K1K8j89k10l74p1k33N57J70N78
3649F02j55k3l02o32m9J29J63J38M83K69l46k37m06R0P3j5M66K66o7j63k90m88
3671d94j46J80J61N83K80m7j80o33K38o04R6O45J69J00K36m95r5l16j80k8M82
3692d8J48N10j13%p14j29j96R2J56M77K76j24K9n30k68O3r4L57K49J88O9k7k76
3715I5q63L64j44J39O02L27J70j25p66J72o31K40L26N28J16J8l95k70m12p4K09
$$ y = [-514, -427, -381, 35, 273, 525, 521, -2, -311, -410, -680, -393, 89, 264, 606, 644, 335, -194, -466, -588, -404, 118, 536, 550, 690, 117, -393, -508, -480, -415, -11, 618, 805, 535, -28, -300, -134, -439, -232, -52, 305, 766, 433, 218, -298, -739, -547, -99, -65, 496, 755, 869, -136, -226, -492, -365, -171, 11, 647, 494, 376, 254, -363, -606, -626, -449, 254, 520, 466, 503, 37, -389, -982, -599, -329, 325, 346, 374, 185, -25, -399, -470, -703, -146, 24, 602, 447, 424, 122, -510, -559, -430, -267, -129, 354, 623, 277, 40, -366, -276, -203, -218, 248, 514, 447, 284, -6, -494, -640, -460, -299, 284, 564, 517, 337, -296, -58, -662, -566, 79, 248, 348, 584, 89, -6, -322, -502, -530, -48, 100, 610, 497, 497, -217, -346, -542, -450, -294, 183, 459, 335, 364, -166, -434, -371, -465, -108, 141, 329, 398, 371, 95, -768, -404, -548, -409, 193, 520, 690, 565, -201, -29, -660, -420, -94, 434, 550, 568, 173, -97, -509, -583, -374]
3736c74J80N10L99p7l31m20k80k22l6P47NN23pj55n94l85k17K03L26N84K13q5
3758E07j91l74k52k89J66K99M54K13K30n42j57l88l85J25O04M42r0N4l07j96m02
3779d79N0L7J87M12K89M7l54k33l57p1K88q2N44J61K07n26j63m40J21j15M25J98
3801A46L97k9m58j34k54k22R9K65M11J07J93l66k72m12K1j08N14M82M2k9k16j36
3823D1k77l69m8O54K21J81p3p2k52j97m27m3L37O62J9J04n1m94j13m78M7N93M02
3846C67Q0K45j72p06k76l51K70N14K12L30n5j84m64k97q1J9M82L25J26l9j27l66
3868a48j26j78K15J80M01J43R4l86Ml88m14K85J81M46P8r2J1n84k09j98L79J11
3890a95L35K82R9m94j88l23J19Q3L43K14J33J23k07n96j19q4j6P06K65j59m2k81
$$ y = [-374, -194, 316, 715, 638, 307, -113, -393, -615, -651, 96, 101, 624, 617, 462, -132, -517, -734, -531, -205, 379, 592, 507, 316, -58, -310, -599, -433, -134, 320, 533, 763, 221, 64, -324, -709, -584, 20, 462, 372, 426, 119, -77, -479, -429, -392, -205, 207, 496, 543, 189, -44, -401, -472, -184, -266, 278, 439, 646, 120, -43, -483, -362, -477, -52, 146, 543, 514, 56, -78, -332, -554, -455, -190, 221, 328, 521, 155, -117, -529, -508, -616, -102, 380, 422, 393, 177, 41, -236, -605, -653, 1, 222, 403, 330, 258, 6, -191, -618, -661, -324, 338, 357, 461, 410, -84, -197, -675, -628, -35, 367, 447, 692, 520, -186, -462, -813, -543, -29, 183, 513, 458, 274, -190, -487, -568, -549, -67, 258, 384, 345, 218, -148, -274, -452, -237, -57, 344, 487, 581, 195, 199, -189, -603, -318, -137, 309, 387, 295, 306, -278, -487, -685, -306, -195, 140, 422, 521, 27, -161, -484, -365, -282, 61, 275, 408, 531, 324, -272, -391, -475, -491, 215, 480, 321, 279, -2]
3912bk54l75LK96j82O43K97j52o3j78m32k02N39J87L01k6k20N7n22j88j49J46
3934d76M65J31L35j02km71o91L43J27K89R5M81j39k03l66j05q5P7M20M09j23K6
3956D35k23n56J34k47K63K33J76K91l44j35J20m74n9K65J55K33K31l60r1l75P3
3977b55k71J15J91N53R8J02k45m05k76j81K20M35K65M6ok76j43l20n0J91L46Q4
3999B18J73l7J03m90o00L15R7L97p4L28j61%m36l79R6K65L90L46k2l31r8j90k80
4022c70kO3K06N87j12K17n11m12J20k22K00Q7M27J56p7k1p84J86p9J48Q3N44J45
4045E79l64o3l88k48K89k7K64N11k94J17k56j61j56j87L39J48O1J54k6m47J77
4066B2m47K21J95j66N77j24l9r9m77J4j46L11L26P4q0J44K4l27l87k3M37j91K00
$$ y = [-2, -256, -631, -628, -332, -514, 129, 426, 274, 211, 33, -399, -601, -62, 125, 426, 400, 180, 237, -285, -473, -622, -476, -11, 120, 455, 353, 351, -120, -811, -468, -341, -52, 43, 524, 385, 182, -184, -289, -374, -297, 123, 532, 409, 435, 212, -344, -210, -457, -194, 39, 215, 506, 162, 27, 147, -327, -386, -121, 34, 267, 498, 138, 47, -328, -255, -526, -411, -220, 333, 431, 533, 288, -117, -393, -574, -354, 81, 346, 392, 386, 110, -33, -353, -403, -212, 134, 218, 391, 354, 457, -33, -633, -318, -221, 176, 102, 430, 269, 269, -167, -546, -450, -185, 205, 551, 529, 198, 100, -90, -370, -372, -309, -103, 484, 372, 589, 78, -334, -214, -436, -236, -149, 278, 434, 357, 336, -448, -262, -341, -193, -110, 434, 579, 215, 152, -236, -484, -195, -222, 42, 553, 259, 376, 120, -41, -197, -384, -45, 103, 164, 318, 292, -155, 22, -425, -204, -9, -175, 402, 278, 239, 140, -337, -323, -469, -158, 168, 242, 162, 306, 330, 3, -384, -407, 30, -161, 39]
4089C9K73Mr9l61l35n0M83J15K40k27J51k48j66j78J93m2N62K7k0l6l34j18l52
4112d79L00o0J90L89Nj89m0k73l48J56O4L40K29m4j72J46m07k09j7P3M88K65k67
4135A40j11l3k14k08k44K51O19J94k02k70L25l63l13L06j14J49L82l0J55k54j60
4156Em67J76K44J83L22j24j38m0n05p3J19J32L81l4K19k90k10l0j63N3J75p8N33
4179C90j41J86m47j84K1j87K26P8K38Q5J73m62l37K48j13P0K65L67m0j60k18k98
4201b40j07j90N11M8J49p9J70m29j34J20n1K26J99r7L31l13k24q8joL16K5K60
4224C96k55k10K63k48l07L22j1J3K94N0j33j04k0l79Q8L50j27M20J96l07n48R
4246b48J56l70M11P9L66l55R2k49l2k54K08J4K89J10k7J13k38j14j49P4p7K15
$$ y = [39, 312, 316, 217, -144, -479, -529, -46, 69, 309, 82, 233, -15, -181, -359, -166, -208, 354, 381, 361, 325, -9, -127, -479, -179, -239, -49, 340, 345, 156, 116, -157, -505, -349, -285, 55, 284, 240, 68, 214, -193, -402, -419, -346, 142, 407, 140, 29, -4, -218, -426, -670, -419, 200, 394, 192, -78, 247, -116, -429, -123, -237, -88, 294, 264, 419, 165, 5, -462, -286, -42, 141, 463, 339, 201, 161, -344, -417, -298, -166, 215, 181, 400, 110, -100, -130, -293, -240, -65, -143, 390, 249, 435, -12, -196, -175, -362, -136, -58, 180, 265, 438, -24, -361, -113, -226, -156, 109, 476, 436, 276, 58, -240, -347, -537, -26, 22, 171, 92, 262, -167, -301, -181, -232, -6, 193, 96, 427, 114, -110, -198, -199, -205, 111, 136, 396, 141, -69, 194, -54, -361, -39, -50, -37, 257, 307, 174, 70, 50, -329, -241, 109, -18, 402, 598, 291, -257, -248, -92, -462, -51, 28, 394, 39, 131, -118, -150, -404, -196, -182, 107, 217, 190, 303, 65, -49, -198, -124, -201, 14]
4268A4J62J17k94j06j66K19k22M6K56J03K11j76j48j86L5j39J94J28K38Q0p8k69
4290A9j63k97L02M5J87Q2j49L7J09P5n69J78M9J51O3R4P1l96j1k30J60jL51P8
4314B35j22M8j44K45l70k02L14j52K68K7K63n21k06K72m57N70O8Q6P2k47J69m15
4336a99N8L8J12j43L41m2n3j43J38l64K71j17n9L79N9j19j37m31L08k06J27P0
4358a12N71j11k44o0j04j88j8R5K84J10Qk24n6m1l9j20M6N11l69M71j83k42R5
4381H0r7j7k04J15K70P9k00m1r7l9j30P5L06n4J43J44m79Q4k88L46j54J41K19
4404B02Q3j91J38p90N41j19l23O08K80k2l95J31l63O8j72M55q6M02j54j67j28
4425br4K19l68j1K20J55J11K0j4r8n27K00J61J61q3J04J09l92j14R5lJ03J09K04
$$ y = [14, 176, 293, -1, -107, -273, -54, -276, -230, 26, 129, 340, 164, 16, -170, -135, -274, -80, 48, 286, 366, 288, 19, -144, -441, -139, -94, 93, 175, 26, 63, 172, 247, -322, -144, -95, 56, 119, 213, 284, -112, -123, -353, -193, -194, 157, 235, 113, 161, 17, 262, -108, -310, 4, -148, 120, 147, 410, -111, -317, -45, -502, 68, 136, 222, 294, 47, 216, -199, -141, -103, 9, -134, 207, 165, 112, -31, 107, -257, 14, -103, -162, 217, 276, 157, 20, -411, -103, -309, -182, -112, 459, 348, 104, 44, -60, -248, -266, -171, 113, 223, 231, 7, -49, -90, -129, -249, -203, 308, -61, 410, 227, -15, 80, -17, -34, -238, -123, 147, 226, 26, -15, -112, -151, -281, -206, 100, 46, 189, 333, -146, -62, -350, -4, -158, -17, 202, 285, 94, 232, -558, -17, -136, -459, 149, 429, 407, 12, 143, -220, -152, -324, 131, 45, 447, 293, 126, -2, -96, 123, -245, -256, -36, 119, 230, 250, 236, 138, -389, -189, -28, 133, 50, 154, 263, -129, -243, -148, -151, -48, 61, 265]
4449B65k81q1K1n5jQ1Q9n3K04n2ok61K11j91j32J48j3RK18P5l69K22l32J16K63
4474I5N0J07nk18l41M3K90j39J25P0L8q6J52j16q0k63q5K31N3K48p7l1k26P5L5
4499e5k59J17M3M3J66J28o5k29j4l9K7L4M02j87j47oo3j37J41J31L6J26K66j87
4523B72j4k24j64j48k9K02J83J94J58k73l99K27j96K2J97N4K10q2j81j32q4j82
4545c89J49L04J96k36L40l99j89k4K93k43J79K86k62P0kj44j6j20J75O5K35J51
4567D19j20k26K1r9n3k40j1M49o1J0l4k21J5k42L22K13j16L62m34Qj2k01L6j95
4591d10O17K5O0k97l5j64j76mM10k1J99J29j46j08k76j1J2N8J62N1J45J38q0l30
4615e2k27o5J83j77L23J94J82k88O1k36j24L2P6L92j34O6q2j67j85K67k73L64
$$ y = [265, -16, -97, -76, -131, -132, -51, 38, -15, 189, 137, 131, -130, 81, -110, -242, -94, -107, -98, 120, 195, -174, 48, -284, -168, 95, 145, 252, 247, 29, -312, -269, 21, -118, 7, 77, 115, 29, 181, 65, -15, -278, -363, -132, -79, 169, 92, 61, -165, -90, -55, -314, -197, -154, -111, 55, 183, 118, -111, -125, -164, -137, -103, 299, 112, -35, -41, -104, -241, -100, 31, 67, 193, 459, 272, 258, 34, -130, -278, -307, -105, 78, 272, 430, 157, -242, -15, -211, -189, 8, 62, 272, 190, 9, -123, -207, -389, -240, 64, 260, 24, 364, -35, -224, -248, 45, -198, -19, 267, 5, 75, 73, -71, -87, -207, -32, 33, 268, 419, 299, 73, 94, -5, -58, -298, -309, 140, 79, 89, 55, -166, -151, -393, -71, 142, 26, 388, -46, -38, -50, -251, -215, -410, 207, 232, 292, -5, -40, -204, -380, -384, 26, 5, 204, 333, 187, 79, -197, -208, -196, -138, 24, 75, 220, 358, 278, -52, -279, -344, -161, -338, -15, 179, 361, 73, 134, -102, -226, -194, -118, 274, 140, 206, 124, -43, -228, 39, -234, 130]
4637A30j11n3K79k29k08J39q8J48L45j24Jo8j91k38kL40l39L01K57qk03L06m23
4660c9Pj03kM3M09j8p3l55p0P3n8m3L82R2m4J2k40j79J68Q0l74K78k0J99p2K2
4686G5l64Q4r7J40L99J00j94j6j07O0k41j12J73m5L26J86l16r8k29J36n7j23N54
4709B34J14k07K8k72P4k09l12O50j13N0J59Rk81kk07k15L24J43L95J78l27j34
4731G9N6m39K72J1m1M31L8l51l25K30l72K53J40k3L52kQ1m48M4j34l5j11L60K30
4755B96j72L6l53J05o9o2M8L36K57k49j12P9k48k58J36J43J99J70K7n7l52J6j23
4778b07Lj5K97J82n6j16j4j33k46p1J42K53J93J0Nk27k4l23K20J8jK29K07J05
4802D31l28j15m68J66O8K59L6R0K23m58j56J00K6k02L33n4J83O6j06k82p1k8J80
$$ y = [130, 19, -34, 245, 16, -192, -53, -141, 7, 352, 228, 229, 161, -30, -268, -270, 70, -269, 32, 289, 281, 78, 384, -39, -32, -135, -137, -94, 315, 297, 224, -131, -201, -128, -186, -229, 153, 245, 201, 213, -27, -206, -38, 42, -332, -54, -74, 125, 53, 75, -289, -205, -302, -162, 237, 337, 143, 127, 20, 80, -161, -273, -100, -145, 181, 367, 51, -47, -276, -140, -197, -320, 234, 348, 141, 169, -103, -29, -238, -550, 100, -13, 37, 196, 205, -76, -78, -285, -500, -176, -33, 362, 540, 213, 79, 135, -304, -32, -21, -62, 369, 407, 56, -269, -39, -411, -158, -18, -41, 311, 309, 390, -58, -14, -148, -183, -294, 66, 296, 124, 160, -193, -88, -157, -219, -171, 165, 422, 173, 61, 140, -108, -366, -230, -87, 112, 282, 309, 252, -100, -84, -207, -204, -219, 78, 260, 204, 88, 74, -59, -305, -376, -234, 19, 212, 222, 227, 0, -24, -347, -127, -109, -110, 119, 326, 431, 103, -12, -480, -314, -246, 13, 49, 139, 362, -96, -252, -152, -126, -328, 5, -49, 134, 200, 94, -188, -259, -287, -107]
4825a07M68k12J68p9m01J63k90J94q1K67L1K88m74R5o0j28r8J79j02L84K59l47
4847A17P6l69J3o6L10k43N68j60n2j98j40r9J36M3J42K12J42l49N4j93k63L20
4869Ak99M18K18k36K25j08j38m86K18K47J12J54k27j74j5m2k2r3r0K44JK48p3
4892H3r0m29K18M9J37J00K77p7j5l61K12m66O9J96M3J40L00j5m34l7l65K96R7
4915g2M0L18j4j38k97J2j95K39J3K21K1k8J2l64k4LK9J81p2L71o8k42j00k38Q7
4940c05N6K17k15N47j98J27o5p3l53o8M85QJ60k06J24l24k75J53j0R1J37L59k66
4963A06L9J16k32k76J81RK04N00k71m92m2l51K38m7J67M33n3K30k89k79J2k79
4985c76J36R8J97J56O8k47k13J02P5k29j36O63J3J05l19k12P8l40J82J66r9N44
$$ y = [-107, 361, 149, 317, 238, -163, 0, -290, -96, -177, 90, 121, 409, -65, 30, -30, -158, -256, -77, -179, 205, 464, 117, 193, -176, -163, -229, 81, -162, 406, 246, 194, -4, -144, -243, -107, -64, 78, 290, 432, 83, 137, -56, -319, 1, -298, 120, 338, 102, 327, 219, 81, -405, -187, 60, 172, 326, 99, -75, -90, -132, -154, -247, -337, -93, -92, 156, 83, -7, -436, -218, -169, -32, 68, 345, 268, 253, -108, 104, -362, -293, -97, -54, 86, 386, 371, -63, -100, -465, -169, -72, -32, 286, 272, 134, -163, -151, -346, -107, -94, 127, 148, 120, 132, -232, -256, -253, -224, -43, -115, 256, 188, -54, -154, -392, -305, -249, -32, -247, 300, 102, 229, 164, 91, -262, -330, 155, 163, 323, 117, 241, -83, -358, -205, -215, -124, 13, 372, 106, 145, 261, 29, -247, -66, -57, 147, 647, 376, -116, -158, -509, -271, -318, -151, 282, 229, 459, 170, -109, -97, -376, -240, -142, 55, 211, 279, 32, -181, -79, -4, -233, -369, 294, 307, 412, 93, -119, -41, -381, -199, -33, -132, 412]
5007D12k82p3j89l08J80K85j19M62j4j86j82j60K25m15R9L27K17k03J76N4l57
5028e1m87L91k53K79K68Q5K4k46k10l08L77k00K12M2L94j18J3j06m30j9M7M43
5050A47o8L79o0k98l03l16M13l49M25K57l6M5O1p18O2m4L78n9K47K33l2k24n64
5073d24J19j54M50J64J7J79q6jl19k15m5J65L60n3J48o6k73M4m70M04j87P2L36
5096A65L1j7k68l57Q8J54m0J77L32J93J2m45j97j5j28N6K28K57K33j59k75J08
5118A33l54r9J31L15L2K27J01n49j57O9m07K42K98J88L9L0j59k80l76K86j31L59
5140f2R3L21J4j48m04l32O6L50RL59L1K5m04q5l54k94O33J28K23J26k69K69o56
5163c61j74L09K21j05L05J04J4l40l24p9J61J7M78J72P9%l55j79j59j18O8M61
$$ y = [412, 130, 57, -132, -440, -260, 25, -94, 368, 354, 168, -14, -174, 51, -364, -265, 62, 279, 76, 252, 306, -51, -538, -147, -400, -121, 147, 232, 256, 10, -200, -508, -131, -331, -119, -77, 317, 199, 212, 106, -324, -343, -296, 147, 79, 458, 398, 100, -203, -519, -106, -455, -30, 227, 191, 236, 297, -421, -359, -403, -25, -84, 163, 396, 364, 140, -424, -305, -459, -9, 155, 172, 351, 265, 264, -55, -270, -315, -150, 210, 157, 305, 239, -34, 10, -460, -56, -243, -171, 165, 196, 179, -89, -446, -358, -204, -244, -67, 265, 458, 470, 25, -172, -187, -315, -259, -31, 226, 459, 300, 25, 133, -221, -320, -189, 126, 158, 385, 486, -63, -220, -151, -558, -316, -18, 170, 209, 239, 80, -200, -576, -290, -421, -62, 31, 352, 366, 218, -186, -518, -452, -102, -93, 266, 297, 322, -82, -167, -521, -815, -182, -54, 169, 295, 26, 295, -361, -535, -226, -5, -110, 195, 299, 313, -27, -351, -430, -269, -252, 226, 398, 477, 477, 122, -57, -216, -334, -266, 195]
5185A95L2Q1O9m24r6k6j46J09J15O89k65k6m07j00k37m2J68K67M45P1l25j93j10
5208a56k45L50rR0J72O0J80l40n19pJ24K27K10J37J76jj79k47n64K27O4N55j08
5231A97J55r7J3m56l04K29j1L42K28j7K38n89j96j87N1L95K40J04K14k01l89l87
5253d28J29j97N47m8M26Q8j24n67L4k06j0M04kL51l7j48l55k57m4J69p5K82N08
5276D40Q1m15K7k30j35j77Q1L46M70p4l21jk31r7l5J21K06L46k73K2k11l82M3
5299c99r0K71M52J78K07k24j52m93l56M92l1K60K00J66m8n22j48k92J92J39N30
5320C32j62J28k12j81k03m02K87J97Q8N40n2q4j46l75j90J4K32J89M38J64n94
5341Hj99K3k40pJ38L50K63N59n20n46k80j65M36J27K07l1J93Mm13k64r2L06J94
$$ y = [195, 227, 308, 377, -47, -143, -169, -315, -206, -91, 598, 333, 307, -100, -200, -437, -479, -311, -44, 401, 472, 147, -46, -156, -401, -51, -60, 30, 202, 262, 442, 102, -417, -424, -300, -73, 137, 274, 450, 449, 270, 23, -541, -314, -250, 305, 197, 352, 255, 268, -188, -492, -263, -274, 68, 296, 279, 517, -72, -268, -455, -404, -9, 231, 335, 549, 348, -41, -428, -299, -496, 51, 3, 429, 517, 393, -174, -140, -346, -356, 48, 46, 397, 360, 212, -143, -400, -444, -275, -350, -68, 440, 521, 106, 133, -97, -232, -409, -328, 18, 488, 414, 93, 92, -139, -236, -271, -150, 56, 402, 129, 151, -60, -442, -399, -489, -218, 234, 412, 619, 395, 243, -250, -606, -114, -145, 115, 315, 481, 433, -89, -237, -529, -337, -198, 332, 170, 298, 86, -95, -298, -700, -413, -216, -128, 412, 360, 276, 130, -245, -435, -421, -189, 0, 438, 602, 8, -191, -168, -408, -415, -277, 73, 336, 895, 375, -171, -451, -616, -180, -53, 154, 123, 316, 320, -93, -357, -449, -143, 51]
5364E1L83k4k01K95q47m3j53R8N44K86J5K2k19j5o50j85M32J98j14P14j01k23
5386B63m18j38l10J98L56K80L00J3m20j10k08l28J14L36J14K38J75j10n88j88
5406d31N4kJ22N72O9K92k59m40k27j90j11N83L10J16K1j20m23j07j98q1N04J42
5428A96J26R5m08q9M8l28l0L38K15K07j8k91q3m60m5K60K97M05N6k5k71k08m77
5451d90R8k46O67K55J20q5j81k38j40m07K80L24J24M40k31Lj44m98p1j09O70J81
5473C22J38J35l13l02m40J11J52L34P0R9J35k43k87l12K8m3L21L82l5ol35j15
5495b04k06K16%K70L34q2J35l73j30j96k57M5M06M24L54l78m03j09k82j29M57
5516a08rN13J56j30n36n2l66M11K4K56J97K43p9j12n55q1k34p3N51N98r6R9p13
$$ y = [51, 434, 410, 209, 504, -343, -386, -539, -441, 103, 389, 404, 426, 207, 192, -458, -643, -211, -13, -127, 587, 486, 263, -155, -293, -603, -405, -49, 231, 531, 544, 124, 14, -194, -522, -408, -72, 42, 280, 455, 345, -243, -431, -377, -379, -257, 315, 384, 676, 417, -23, -250, -440, -551, 32, 342, 458, 479, 359, -64, -171, -369, -450, 54, 196, 322, 417, 9, -80, -32, -360, -390, -52, 163, 370, 352, 61, -22, -482, -527, -267, 30, 435, 491, 466, 195, -13, -490, -392, -638, 29, 284, 404, 319, 138, -100, -240, -647, -367, -43, 81, 521, 290, 293, 149, -349, -420, -529, 141, 322, 460, 595, 282, -20, -460, -349, -197, 137, 207, 306, 441, 198, -89, -401, -373, -416, -95, 287, 252, 246, -89, -204, -410, -194, -194, 76, 410, 328, 463, 90, -40, -236, -493, -448, -42, 382, 736, 358, -45, -154, -436, -565, -108, -117, 396, 552, 422, -114, -166, -532, -121, -97, 159, 356, 599, 520, 408, -147, -228, -462, -535, 16, 614, 518, 617, -96]
5539i6m6j88k46L51M95MK32l6j35m84l18j43M02N8L91K72j16m31k61n7k4j29L88
5562a17L66J36j73j06k64l39J7M26O4K93L37l18j49l24j83j51J27L35L10L04m5
5583E46n95j55k07j88M38J78L02R4K0l55m43l51K74K4P57J56J02k07k67m01k32
5604e10R5K72J05M68Q6k63K5m03m83N7J80M62K17K53k75m60p8l15K33p2M56J32
5626A82M27j52m08m39j95P7K90J50K81J91k58p8m39j92q4M38J24L59K33l25j95
5647a3k73k49j39M03L28K24K27N3m93l55r3qK09J59L84J63l06k89l43k38K70R5
5669b84M94K92j03nm12n03J71j02r2P42M07k04j34r1l03k71J34j01N33M21l03
5690B86L01n65l84l35L56K12L39K33J36M6p26j53j20M8J72N21k68J28L5k73j69
$$ y = [-96, -142, -330, -576, -225, 270, 274, 506, 470, 335, -149, -467, -610, -208, -150, 241, 513, 397, -34, -295, -352, -376, -505, -117, 249, 385, 212, 106, -158, -497, -480, -54, 10, 303, 640, 322, 173, -151, -334, -485, -358, -23, 287, 591, 546, -49, -204, -411, -599, -161, 17, 319, 413, 433, 78, -365, -716, -442, -418, 339, 495, 597, 390, 123, -278, -510, -415, -143, -38, 430, 516, 253, 278, -125, -608, -551, -371, 91, 308, 561, 286, -174, -252, -567, -334, -406, 50, 182, 609, 457, 49, -390, -585, -508, -218, -68, 213, 404, 146, 68, -371, -563, -647, -209, -85, 274, 507, 182, -13, -286, -535, -674, -271, 57, 281, 508, 561, 68, -287, -380, -388, -179, -20, 364, 527, 221, -68, -411, -649, -379, -284, 210, 502, 399, 394, -18, -521, -350, -452, -544, 198, 605, 401, 267, 176, -127, -398, -264, -365, 168, 589, 286, 587, 22, -362, -697, -341, -129, 210, 443, 579, 625, -101, -254, -374, -326, -154, 367, 99, 227, 262, -11, -180]
5711a80k45j56L24K34M10K37j22l32j52o01J12L62K10J23J39Ml75k07m57K30M77
5732C5K20J58J99k90k42l45l9j53M63m4L95P0r5o50k95K14M9K25N10J58n6k02
5754B85j67m29l38j7L93N69K62k34j03l22l23oO5K12M36J96J46j95n71q4l99J85
5776d39M41L64J75J19m29o46Q6k04R0K25N69R0L6l38k41k76m9Q4J04K19N81j01
5798D60j31l45o12jK50O10qK22k74k1j65m60J17o3L11L99J18J81l65l98k43r3
5820e11o4P59J72o1m8q6j79m80KL38J47K91J63j5k47m57qj36K14Q3L55M3J38o2
5844C51l68l75j28L3M33L27J66j03L29n57r11M88p2N17K48K14j35l15m44k91J14
5865d79PM99M37j02l3po11qr6L6K87J93N34j73l44l82j58Q9k51M41K30M04j3m30
$$ y = [-180, -425, -581, -257, -23, 387, 624, 502, 170, 18, -583, -471, -109, 101, 224, 363, 367, -8, -215, -672, -442, 35, 255, 413, 612, 322, 80, -265, -304, -457, 6, -38, 357, 427, 332, -318, -613, -399, -350, -125, 385, 543, 487, 285, 118, -311, -649, -666, -273, 296, 558, 324, 221, -101, -424, -430, -365, -153, 283, 479, 625, 430, -141, -225, -624, -439, 2, 366, 541, 660, 231, -415, -329, -533, -443, -218, 351, 441, 477, 139, -102, -378, -427, -343, -239, -20, 561, 460, 329, -16, -628, -629, -379, 231, 223, 445, 171, 150, -15, -475, -358, -421, -110, 289, 407, 588, 223, -175, -418, -511, -575, 184, 356, 295, 247, 161, -18, -498, -496, -158, -11, 280, 443, 428, 181, -276, -284, -420, -206, -123, 232, 275, 413, 351, -17, -392, -520, -487, -54, 273, 439, 336, 665, 108, -803, -315, -387, 130, 378, 592, 457, 142, -302, -593, -479, -472, 27, 464, 362, 329, 322, -289, -297, -393, -357, -70, 123, 657, 484, 140, -242, -400, -311, -562, -121, 109, 513, 500, 70]
5889G0l65k17j03N28J98L08K3L0l72m08K2k80M28K15L91J57j50m12l54k82Q0K92
5911b01K47K93J58k03jm10k17j52L93K56K86j20j24k79l57j25j59M45M82K15j33
5932B94J55k38m03j46J2N1J5N04L21j16n72n1k76k2L97p9P30l3j09j86m74l27
5954e53J18J72MO43K32m12k85l8n58J53J59M83L21L87l36m64l57j68M19k19N41
5975B42J94Q1l47j94k23k59N9K93R4M71K75k80k12n14oj53L59O0N92R3l42k51
5997C2j89l64J15K52N63j31J67l4m77k06m43M64r6M38M76o8k01j64n98O2j59J86
6019c75M33M11J3j44m51kk35PL5N67J80j6k6l34p20O3K05J04L79K00L30l74j89
6042F1m56j74K36j2K72L55R8kl03n35J74M2P1N16J11O2j31l16qm51p1M39r6P07
$$ y = [70, -295, -512, -615, -87, 111, 419, 442, 472, 100, -308, -286, -566, -138, 77, 468, 625, 475, 63, -291, -573, -493, -201, 46, 339, 497, 294, 293, -117, -334, -486, -93, 163, 449, 329, 205, -74, -431, -556, -715, -270, 212, 427, 294, 449, 211, -192, -338, -326, -275, -260, 244, 565, 449, -123, -174, -450, -472, -75, -154, 576, 543, 434, 248, -226, -553, -435, -263, -259, 384, 616, 204, -81, -119, -677, -524, -365, 118, 439, 826, 490, 26, -331, -499, -80, -299, 242, 436, 517, 170, -24, -247, -506, -447, -154, -60, 411, 686, 406, 194, -320, -326, -479, -120, -60, 532, 625, 283, 32, -157, -521, -406, -154, 409, 278, 445, 411, -66, -272, -715, -251, -347, 91, 567, 499, 298, 134, -464, -402, -561, -375, 58, 469, 482, 338, -113, -115, -350, -343, -308, 259, 439, 423, 397, 63, -657, -594, -389, -285, 94, 294, 624, 250, 61, -395, -569, -333, -345, -73, 282, 380, 378, 75, -460, -286, -244, -173, 343, 454, 516, 385, 69, 61, -390, -461, -22, -118, 589]
6066E89o5j03m14m52r0Q1N59K66K11j76l34o7m39k07K30L34K74L11n1j40m19k44
6088c46J9J4K63R0K94K1j3n03l34J29j52L96K69K22J32l98l46p4p9K95J6Q3N09
6111E07n1k97k28n24J20L26M05K4r2K94l68k07k31j05J25K45L29J85N6l71l33
6132a91k32j39R0L66L32J62j35J5l55m04k58M27N69O7L82l59n13L44o42m2K73
6153b43K18L71K18k33r1k86m69n4KM32O20M0o4n04j9m11K22k05N32J03K27R7k96
6176B07r0p32K46J1L87K33K51J53n39l41m20J22J67J68M00L37j31k57m37j33m8
6197d46L63K01J63J6j2k82m94L57n61L41J25N71J26k04j47n41R8k50K17M60Q9
6218A90K4J15j32l48k90k55O65K7L65K99l64k28k42k03j22N5L97M84J14K0n13
$$ y = [589, 524, 421, 7, -445, -535, -454, 105, 371, 582, 406, 72, 5, -434, -641, -411, -77, 197, 508, 457, 317, -102, -346, -327, -313, -50, 40, 334, 355, 342, -161, -495, -366, -518, -122, 147, 369, 501, 103, -243, -317, -396, -101, -85, -2, 507, 456, 159, -69, -593, -473, -147, 258, 282, 190, 484, 116, -91, -322, -427, -302, -57, 272, 457, 513, 142, -191, -423, -562, -472, -106, 226, 388, 253, 268, -87, -491, -749, -322, 247, 314, 696, 337, -176, 168, -474, -516, -243, -25, 346, 564, 331, 240, -46, -515, -569, -567, -135, 485, 525, 461, -43, -62, -473, -251, -456, 76, 179, 406, 503, 207, 117, -615, -369, -358, 29, 262, 513, 666, 127, -214, -634, -512, -345, -177, 223, 560, 429, 172, -265, -398, -446, -83, 118, 281, 297, 285, 3, -491, -134, -695, -354, -229, 342, 468, 264, 117, -424, -326, -576, -359, 101, 190, 214, 329, 197, -151, -441, -696, -31, -4, 361, 660, 296, 68, -174, -377, -499, -444, -47, 437, 551, 571, 58]
6239E8l95P1k94M28J20J95L32p5l85r3m95Q1L32K5M11k7Q7k15o36J24q5J42N15
6262B21J77K86k99l37n03j79K77L3K64N83J01j94k69l66j95K9lJ54O51k50J76
6283C57l05l11k45K91R9P8L94K70k45n34Q8m75L29K97J43J46P3j95p5k62o30K29
6305d83K45K54M02j27J13n11L2m45K36q0M73L20j55P9n19l12N2n7M51K57K02r4
6327C33K09o95j35k09j5L45J85N60j10k87k9l81j73j60M56K69K90J69k59k5o75
6348c37N0o9J72K87L63j7k07l40j64k68L45J21K76M02j21k41p6m48j8k21O65J88
6370C42Q7o6J9l04l36k30J67J95J31K75K69k48l30k48l14M37K52J9K31J21j49
6391C20l82k03k19J80J32M03Q0J42l90k44Qo68N94L25L58Jj31l4l43k78j0J33
$$ y = [58, -337, -266, -560, -132, -12, 183, 515, 440, 55, -38, -533, -452, -120, -95, 316, 289, 376, 161, -475, -351, -436, -294, 221, 398, 684, 385, 48, -455, -634, -357, -324, -60, 523, 624, 430, 161, -205, -400, -371, -374, -220, 431, 181, 357, 52, -259, -504, -213, -114, -36, 358, 628, 383, -151, -63, -538, -209, 88, 231, 377, 450, 255, 180, -82, -712, -483, -238, 16, 418, 291, 404, -107, -75, -520, -284, -364, 109, 429, 274, 353, -166, -478, -426, -483, -32, 225, 427, 333, 542, -153, -288, -497, -512, -167, 18, 578, 468, 181, 152, -229, -402, -562, -106, 163, 453, 622, 363, 338, -337, -287, -356, -184, 103, 466, 449, 242, -98, -262, -530, -185, -64, 212, 614, 493, 252, 176, -272, -290, -511, 154, 342, 429, 363, 382, 78, -258, -488, -321, -126, 5, 280, 549, 301, -29, -277, -591, -154, 98, 117, 348, 469, 320, -62, -265, -484, -304, -172, 231, 311, 453, 63, -181, -173, -841, -247, 78, 436, 437, 306, 272, -71, -349, -359, -226]
6413b26m9N02L00n8k05k18k87j58j08N94J76P2j03N1q4l22m23J09M66K43L55k32
6435C95j83l00j65j04N0J07M48J61N6l49k18l76J0J92K41K22K31K76n92k21k32
6456c51j00K58L30q8K54J26l2l65n40K28J51L49J18K83j96k35k17l54r0K48J05
6477a18L11o3L20j92k49m01R0Q8M51p9J82L0j80k70m01o7J05K27O51n8N9k98l91
6500b53J90l65J82K89Q0L77j93l32j04n11K24K42K93L1J72J53n31L4m33j74M00
6521b29K33L30K1J31m19j17J9o29K21K13N40L86k78j08o47k8J20j34L96K86L07
6542F14k68j16m08k48j18K25K72J94L84k23q7o54J35M1O3K99Q9M63n26%j86l97
6564d52L5M7M87K06O0j07l51m4l68O2J25L97J30J24J91k18l57k90j03K15L29J63
$$ y = [-226, -275, 227, 527, 469, 264, 46, -241, -399, -507, 87, 263, 335, 232, 283, 199, -123, -546, -437, 29, 272, 627, 395, 212, -88, -253, -357, -307, -200, 248, 409, 465, 116, -102, -478, -468, -276, -35, 187, 418, 694, 102, -119, -351, -451, -193, 137, 49, 303, 429, 397, 32, -508, -280, -129, 220, 338, 621, 425, 190, -27, -381, -471, -223, -118, 193, 130, 450, 258, 9, -392, -302, -214, 237, 158, 340, 370, 190, -80, -481, -548, -443, -216, 435, 377, 436, 138, -253, -63, -428, -246, 43, 123, 500, 307, -25, -129, -640, -416, -174, 119, 150, 322, 475, -56, -22, -455, -629, -229, 4, 334, 355, 486, 67, -50, -31, -660, -439, -226, 314, 700, 422, 314, -333, -361, -241, -375, 21, 307, 614, 346, 230, -178, -426, -544, -319, -47, 147, 531, 308, 221, -433, -298, -257, -194, 105, 194, 657, 131, 131, -55, -452, -417, -370, 117, 323, 383, 276, -75, -119, -487, -425, -300, 97, 227, 351, 542, 324, -33, -323, -426, -211, 118, 281]
6586B81L34k98l15k55q7n0K01J7M21R6j52j37k11l31J84L12n8L24J77J28l66m73
6608b58n4L5J25L72J4O5L58m83m77j45O7JM94J15K55o3l84k81J6n8p9K96L47M18
6632F96j64k51p11J89p7k0L60M24k15j42k38J02k42j18K11K12M44j14o5k84k98
6653c01r6P9J13J11M58Q8J57n22m67j41R2J04L74N11m71J7k75M7m78K12K25K10
6675D7L45K13k11j64l29j38l60L62K32N08N9k86k98j20m38L71nK26M43k2N6k16
6697B75o99j78pM96J38O4O16l65n09J3m45J93K54K44J76L6m0k46n70Q8K16m3L64
6720G1L45J00j96k13m60r0J74J09K35L29q6q2k42k72k25k8M27J51M25j69Qn6p12
6743d57Q7M0K41K39M19J59m49k46j95l21oK68L25L36j93j45j15ok39q1K59K58
$$ y = [281, 615, 317, 2, -253, -340, -390, -189, -172, 249, 345, 193, 56, -155, -486, -302, 10, -48, 276, 453, 581, 215, -258, -312, -277, -152, 220, 234, 299, 657, 174, -303, -448, -381, -380, 114, 229, 484, 421, 37, -244, -228, -286, -365, -69, 278, 696, 532, 281, -430, -241, -318, -338, 22, 446, 231, 89, -149, -47, -289, -407, -196, 16, 460, 346, 281, -3, -301, -397, -318, -205, -94, 364, 452, 609, 87, -380, -521, -429, -325, 49, 560, 89, 106, -169, -122, -600, -388, -163, 47, 392, 605, 394, 230, -99, -237, -597, -235, -3, 505, 564, 278, -20, -140, -578, -207, -212, 14, 457, 435, 491, 275, -424, -602, -609, -113, 25, 89, 705, 340, -169, -156, -601, -408, -154, 90, 266, 302, 262, 16, -554, -466, -250, -293, 71, 416, 516, 320, 107, -353, -443, -269, -160, 75, 404, 318, 236, -6, -278, -503, -531, -104, 47, 472, 303, 311, 255, -457, -370, -330, -89, 150, 569, 728, 279, 33, -162, -483, -489, -221, 104, 440, 247, 102, -13, -19, -258, -339, -80, 178]
6765A78J70L02n46k8n10j98M28O9L76r4K0n4k39k01j61N4L42K98j18N98n74r7
6787A5k58j48nL54K31M41m06K3j77l48k84J08L01L38J99l58J9n2l43l3N5J93L81
6810B46J84M2l68j44o37L84J9N4L40J04K21k12j53l67q2M2K48K30L6N1oJk74k32
6834b73J57l7N50k6J10l55q6m66J44K01Q2J11O9L99m59k49k85k5K12L3L67K34
6856D08M8m76n0l62n7J82K74K56J80j81P4l53j29k13L7L62J32M8K36l00n16K15
6878a85k92K02L60K24K5K82m94j78j50k57L23M9L79K11l40J58m78l68K64j73N89
6899A51K73o1j76Km20L8L3k33J49O81J3j86r6l01m8mJ10k4M07K90j22m23k41p0
6923b58k31K60J08L57j2lj61L5k45l42L23K64K93j13J25m9m57K29m78K13J57K72
$$ y = [178, 348, 650, 104, 76, -434, -632, -204, -135, 241, 147, 167, 113, -126, -327, -488, -434, -92, 206, 88, 686, 112, 15, -243, -391, -396, -42, 189, 630, 224, 247, 70, -278, -562, -454, -153, 185, 384, 26, 45, -7, -350, -383, -328, -135, 246, 430, 472, 104, -40, -677, -293, -274, -220, 120, 224, 445, 233, 80, -287, -369, -327, -79, 151, 187, 238, 232, 233, -41, -273, -116, -153, 397, 371, 481, 126, 40, -426, -282, -81, 1, 112, 181, 580, 121, -128, -413, -438, -226, -193, 174, 408, 456, -20, -70, -432, -489, -307, -33, 223, 403, 222, 296, -57, -186, -399, -362, 0, 132, 180, 416, 116, -400, -185, -477, -275, 85, 309, 334, 616, 122, -56, -206, -463, -140, -91, 288, 499, 159, 317, -161, -529, -265, -438, 151, 424, 363, 187, 189, -231, -193, -160, -393, -244, 437, 450, 264, 168, -133, -181, -185, -75, -99, 308, 598, 476, 53, -188, -258, -489, -229, -121, 236, 224, 221, 60, 95, -150, -492, -169, 95, 388, 275, 400, 351, -106, 123, -355, -142, 15, 287]
6945B87K39k41j44l46l34J46J77K22K88K53j53k52l03k83J71j6M52l5L31j08l03
6966D8m00q3O3L6N15K23K39l52j05j98n9m34L81N13J85l66K65k70l96j81r2L57
6988a11J42M7K23j57p8j55l0j60k9L65L28M6r7k41l65j9L1K6J71J73L7nk74o7
7012a99J8NP0K87J08J31j20j79m33J1j37M20K71M9Q1k11p0l31k74K32K52Q9L59
7035D29K89m47l57k99R9J16j30M79o1q2J53r0m58m2M1J40J07N15q1l11J64j67
7057Gk98k95N45J08M00j05m8l06k93J70l88L68P6K04J07L2m11o9o9l47M68M84
7079C40Q2j10j50j98k33j65J40J48K11L36o1Pl06l40m1oK06L09K79n2k52k65j26
7102b47n7k48M07M83j2K47k83k47j58k07J34k08N34j11J58j53j89p9j82P7N50
$$ y = [287, 526, 285, 141, -205, -539, -393, -216, 6, 294, 547, 394, 142, -161, -444, -273, -289, 163, 128, 459, 351, 48, -352, -435, -372, -336, 179, 402, 641, 289, 184, -14, -73, -507, -126, 387, 572, 206, 471, 201, -195, -376, -468, -111, 31, 78, 301, 144, 66, -89, -119, -279, -308, 57, 385, 431, 334, 93, -272, -291, -260, -234, -63, 110, 147, 142, -132, -199, -181, -176, -106, 181, 289, 420, 300, 121, -312, -301, -438, -18, 253, 302, 383, 172, 102, -229, -503, -271, -19, 70, 429, 718, 271, -86, -385, -286, -170, -300, 179, 118, 36, 189, 99, -359, -401, -360, -220, -113, 402, 321, 10, 174, 7, -291, -586, -41, 67, 467, 362, 314, 8, -285, -115, -503, -135, -59, 145, 252, 284, -127, -196, -265, -612, -144, 340, 422, 312, 162, -36, -269, -434, -294, -146, 65, 401, 340, 347, 41, -299, -340, -346, -140, 169, 448, 396, 144, -121, -247, -304, -552, -145, 338, 326, 573, 290, 43, -115, -322, -188, -396, 138, 27, 185, 32, -157, -236, -418, -341, 209]
7123B09j9J03l5j15j9m01QK17J04J32NJ92n8m3o65K63l20M37J51R0L32n15l9k24
7147b10n7K8Q1L12j61N49l93l05J9j33o6K46M05j63L66l15l11k41M3J69K23J01
7169A87P3p4k66L5l84M5PL37J91J0K42m61N4k54j28J01K80j45K33L79o82Pn0k58
7193e21J86J27M73J84R7o33o6j66N8J52J4M35r9L14k77j50m23K25j24p0K74N15
7215E25p5l76j88j11k42J61L4J68K33N1J97m00r0l37P6J69L95k6L6J09n03Mn5
7238b45J0N2M35O7j2l30L6l11K6J48K0L11n5K29l56j43k46J53p3L58p1M40j09
7261C34l07j1k55J17n5L2L12J11k2j37k50L8k77J53M59j49R1K65k39k23l59L2
7283c40PN71l5P1J22l27k53N5k93K04K35O7L12L7l56j25k33L8J23J67j22M21P6
$$ y = [209, 190, 293, 258, 143, 124, -277, -269, -52, 52, 184, 189, 381, 323, 280, -385, -122, -442, -5, 146, 236, 568, 53, 14, -210, -267, -239, -158, 154, -7, 542, 149, -156, -137, -270, -336, -90, 315, 152, 518, 203, -108, -349, -306, -137, 86, 187, 260, 186, -80, -45, -429, -384, -377, -40, 151, 161, 403, -58, -4, -258, -386, -285, -5, -150, 83, 462, -220, -213, -263, -521, -335, -208, 265, 449, 546, -87, -153, -319, -261, -109, -95, 340, 241, 555, 278, 128, -295, -70, -194, -264, 10, 525, 450, 74, -114, -225, -467, -306, -272, -104, 129, 180, 377, -23, -113, -450, -374, -205, 190, 164, 200, 309, -194, -190, -245, -235, -183, 252, 319, 307, -23, 13, -298, -272, -124, -104, 207, 152, 381, 25, -118, -364, -211, -284, 74, 3, 443, 334, 27, 16, -239, -122, -177, -145, 167, 278, 256, 119, -131, -93, -370, -217, 242, 93, 184, 449, 210, -13, -372, -340, -333, 238, 203, 274, 396, 69, -184, -129, -422, -218, 17, 84, 396, 433, 77, -48, -281, -243, -120, 47, -75, 346, 422]
7306D22l71k92k9O8j96O66o7J80k29M3l35j80J16M33j86o6N4K8k8m16N8p5K10
7329a92J67Q5J70k8m47J75l91J81PM42q0L28j32j54k56k75j87L37N50r0J8j55
7351G3l4j68M1k72J76O38k78J97R0k13m96J44j16k4K60Q4N50n29k53j61k00K50
7373b41J71J09J28J10K15l51n30k6K0K94K91q3N74n93j87j83J5j45N02J35k10
7394A5Q6J82l16J68o15M17J53K00k60K45J43m41m3k98J19J90J44M7K03k16o1j65
7416a03l39K5K73K99K43m4l20j23j42j88K57R3K19R0J40Jm81j17J93k09j66L54
7438d5J32L37l64q4j99m06L64J52K61K19j10L4j60m18k16L38l8L85N9K57l36r3
7460F9k76k20L43KJ73O2k05L57m94k5l03L66K3K66N2k8j6j08k04N9O6j95L68J97
$$ y = [422, 51, -241, -270, -202, -398, 268, 201, 381, 152, 195, -140, -320, -204, 229, 43, -23, 31, 59, 31, -385, -327, -402, -192, -25, 60, 230, 202, -245, -70, -461, -280, -273, 169, 89, 417, 285, 131, -125, -400, -587, -250, 300, 210, 228, 73, 39, -129, -88, -360, -184, 454, 176, 373, 463, 250, -246, -102, -218, -242, 18, 102, 652, 123, -130, -291, -491, -241, -70, 39, 167, 277, 492, 141, -389, -415, -395, -101, 190, 107, 681, 88, -99, -282, -267, -412, 90, 225, 15, 101, 283, -33, 135, -480, -63, 90, 290, 30, 275, 418, -23, -66, -364, -245, -55, 89, 136, 339, 123, 62, -103, -442, -417, -144, 155, 398, 354, 34, -89, -231, -419, -162, -69, 150, 240, 380, 381, -100, -217, -24, -233, -399, -45, 87, 424, 60, -24, -223, -629, -265, -113, 148, 367, 257, 291, 131, -287, -503, -165, -203, 182, 241, 498, 162, 69, -207, -427, -84, -82, 91, 153, -52, 305, -189, -214, -517, -151, -128, 138, 190, 162, 146, 38, -166, -107, -41, -236, 132, 329]
7484C29k7k98l27J00J24l03L97K39KJ44n8n09r2j66M72q4Q9M6Q9nk78j25Q9q1
7508b33K86J04J11J27j27j70k35k14K10J21M8K94m8J0m63r1K48m07L16K49J54
7529B90M1j22j16m42l8J31K70J89O4O7j48k19j92r1M36j04Q6K50k61J27k45k86
7551c13M1J12j29L61J28M1Q7k01k54k2Mj39O31j22l1n5m13NNJ40pK42K63j29k46
7576ap9lj21j65J11O22L2j75k06k04j75j0Q1K29J64J74k5J96m38j58n8j42L61
7599A0L04jM4m85r1j5k12J37J76J22L16j43p2k68j15j26L37J21M04l9k06R9k60
7622C7l36j61L38K34K37o6M0k45k77L4J7j29L51M9J69j12k25q4R0m40J83L56O1
7645A21J28Qk49j74o3p5JJ55M94K69l90l00j28m4J67L62l07K90R4J52l66l35j16
$$ y = [329, 302, 4, -323, -223, -99, -402, -5, 234, 236, 380, 322, -187, -279, -445, 27, -57, 32, 78, 167, 162, -116, -241, -152, -233, 53, 157, 268, 395, 268, 98, -137, -351, -141, -20, 28, 322, 274, 284, -179, -270, -22, -429, -113, 136, 290, 331, 209, 93, -349, -387, -256, 14, 203, 267, 334, 186, -33, -225, -316, 120, 16, 102, 352, 91, 218, -27, -313, -272, -160, -289, 72, 200, 241, 328, 127, -127, -149, -145, -284, 347, 225, 194, 139, -274, -269, -264, -124, -131, 111, 374, 245, -1, -80, -83, -204, -369, -258, 364, 396, 221, 15, -189, -364, -374, -293, -64, 100, 274, 249, 445, 7, -151, -209, -351, 10, 314, 313, 357, -128, -219, -234, -446, -309, -133, -11, 305, 162, 90, -178, -293, -419, -82, 39, 443, 404, 198, 297, 37, -299, -460, -122, 112, 349, 283, 323, 78, -199, -165, -148, -277, 74, 123, 292, 180, -45, -129, -39, -479, -296, 60, 121, 249, 257, 8, -166, -229, -304, -303, -148, 346, 615, 225, -75, -203, -247, -80, 282, -25, 265, 359, 511, 145, -190, -306]
7668c06j0M5K68P3L0j0j76j32j50O3j9L32K71p5Jj60l9j63k20L03J13K19q3N6
7692B31k29q1j57r2L10M5J15K20l6n26p6R5j91J07L47K28Lk77j59k97J73L5J20
7715i2k7L54q4k3R8l95q1o6M27j24L47j00k08J11j54n03Q4L61J49O6j60P3j98
7738a45Jl41L82M43m25J30K41P2m27J9j62J78k1R2Q4K64j25k70j59L3J66k00K69
7761I9j01L79l10k38J28l35K03l2M79K13j02l3j13l91M2k9N3J23K45J17j15k72
7783A0k56J68j83n8M74J31k19m6l65J06K7J70j79L06J3J96k4m27J1N8k26J49L27
7806A63K51J75n09Kl27J08k96K86N13k59K12k06j80p7j07jM05p4K66j46k65lj55
7829b24k8P5K27J38J14j14n5j80K52l34l59N64R2J24j37l4j30l38k3J42M50J80
$$ y = [-306, -316, -271, -3, 70, 100, 90, -86, -218, -368, -305, -324, 8, 279, 204, 205, 45, 6, -157, -377, -74, 39, 258, 175, 231, 2, -79, -236, -328, -18, 27, 142, 362, 326, -200, -276, -181, -372, -265, 82, 310, 313, 36, -123, -420, -247, -212, -92, -119, 235, 151, 128, 226, -169, -250, -316, 111, -13, 334, 234, 26, 137, -17, -520, -436, -75, 74, 140, -20, 53, -145, -144, -485, -103, 340, -85, 45, 286, 358, -69, -50, -212, -34, -55, 37, 121, 385, 260, -10, -169, -136, 30, -170, 99, -2, 377, 67, -171, -43, -378, -175, -207, 272, 485, 383, 350, 237, -154, -112, -141, -88, 35, 280, 397, 282, 10, -246, -78, -261, -319, 155, 286, 67, 21, -344, -238, -211, -41, -220, 86, 99, 295, 271, -156, -145, -87, -313, -164, 163, 414, 589, 80, 82, -245, -137, -433, -147, 366, 107, 319, 113, -67, -144, -251, -252, 153, 79, 345, 199, -66, -69, -224, -252, -177, 50, 188, 302, 188, 133, -47, 205, -129, -488, 76, 168, 292, 155, 121, -9, -347, -370, -228, 222, 402]
7851D02j53Q2O6n79K18k52j15M81m4o4Q5p6l72j10L95r8M07j81J72J44l17k49
7873a58m6j46K24J05J03J16J35k70k77J23Rj13J91J61qj04j20J04k88J23K02k46
7895a80L43K17l41M3k03Q0m3m0L34R8j40M54l98l40l18J64P0K87J47K99l05n9
7917A69j09m60K20K40l7K8Q9J21o2j37j24k95M25l46L94l14K12J95k65k63m7L35
7939c1Q2J57p7K06l07p2j82r1J61J52J78J52m6j26k67j73K6J46K70J58j63J54
7961C07m19k60kj7J94J67K57R5k76L3J09l89M2L2K08j34M02k43l34R7k58J75J03
7984a11K49N5O4j43j37P4j9j79P2p7N34j97l0l2L1l74j23L25Q7K9L12k39P3m06
8008a62l0j42K62J25m5K23k8m13J11n9j19L32M5L52j90k0k68r9k09J67R2K15P2
$$ y = [402, 249, 331, 397, -182, 36, -216, -331, 150, 106, 42, 127, 51, -321, -431, -36, -134, 273, 92, 264, 408, 91, -158, -204, -350, -126, -21, 82, 198, 333, 63, -214, -91, -82, -195, -4, 157, 149, 45, -75, 29, -259, -136, 66, -180, 163, 380, 39, 82, -121, -41, -84, -124, 210, 308, 168, 622, 224, -116, -434, -270, -200, 87, 234, 533, 228, 169, 60, -400, -180, 60, 23, 51, 140, 261, 199, 62, -62, -357, 68, -278, 116, -198, 14, 209, -56, -319, -366, -31, 51, 208, 131, 337, 30, -42, -224, -315, -154, -2, 176, 328, 282, 156, -111, -284, -258, -112, 158, 316, 153, 307, -112, -372, -374, -391, -197, -30, 227, 322, 46, 79, 188, -201, -159, -127, 81, -53, 349, 106, -228, -131, -389, -214, -111, 138, 193, 257, 114, -23, 51, 32, -147, -75, -152, 382, 185, 155, 123, 154, -220, -343, -18, 69, 98, 410, 171, 244, -162, -192, -334, -72, 53, 8, 231, 203, -210, -99, -158, -277, 55, 100, 452, 262, 242, -26, -125, -334, -167, -75, 140, 212]
8031B12q6m3J08k29j20m5J5M48n3J87l83m4r4q9l80N60k36L77K21k41K13n62k49
8054e13q4M05Q6L06o1K0J15m02j68J90P3J72k8J47Pl80r6J4j18R6L42r4O3K42
8078C34m01q0q6L3j5N81q9j12J24l37Q5k36rK46L21k8m3k44j6j97p2J31L2L79
8102C01j45J72k16k81J9k24J67L34P2J93k23p7L4l28P4j5J22J00K77k12KM0k39
8125e3j95K37N7j9J48j28Q4k60j82K11j37J04L38J94m1k07k46j05j39K68J08K70
8147C07q1J08k68j20j25j45J30J01K17J52j39k2l46J56m05K67J72K15M2M38n26
8168A28r0L6l57Q9L57p3K2J97r5k40P8k40j11L55Kl0K17m3k41j44KP8K63
$$ y = [212, 126, 83, 191, -38, -158, -203, -188, 260, 207, 394, 11, -33, -127, -216, -596, -36, -272, 105, 326, 85, 298, -264, -513, -597, -192, -106, 200, 139, 159, 274, -128, -296, -106, -33, 139, 111, 258, 265, -115, -211, -197, -315, -219, 123, 29, 92, 334, -67, -147, -233, -200, -215, 366, 277, 165, 289, -48, 37, -199, -208, 38, 359, 331, 288, 44, 28, -169, -241, -110, -78, 301, 156, 328, 112, -169, -150, -374, -207, 127, 199, 392, 169, 92, 126, -202, -128, -143, -21, 79, 356, 144, 146, 186, -53, -248, -11, 46, 27, 175, 47, 131, -129, -311, -100, -237, -133, 205, 399, 358, 151, -95, -200, -339, -71, 37, 307, 226, 334, 66, -54, -179, -324, -194, -93, 124, 276, 137, 115, -231, -75, -480, -213, -41, 174, 216, 654, 128, 38, 74, -283, -194, 163, 90, 112, 309, 214, -26, 52, -188, -299, 56, 58, 28, 245, 202, -39, -183, -181, -103, 160]
8191A60
$$ Imaginary data points
##PAGE= N=2
##DATA TABLE= (X++(I..I)), XYDATA
0@%%%%%%%%%%%jJqJ6j6J6k2L0l4M2n0N8p0Q1r3J08j25J43j66J91k17K47k79L18
35A70l57L99m48N00n60O24o93P71q52R42j043J151j268J397j541J697j868K059
53A080k272K511k779L081l433L841m317M892n593O474p622R180j1440J5025k1601
68a2973L7628j50740k38927J56341J47551J00151Q7624J13704j0809j18181j54911
79d3542r9536j1115J22074J63767Q9642J020m194n7860j71301j71630R293J41336
91c2046J17007N4435L4952j8595j00095j40620j08372k6198Q1071J36439R4829
102I2807O475m1864o4308r9176j05794j6374J05700J40279Q1299J5211l0064p0523
114A3668r7267p9252q734Q6433J37538J02662K0929m1765p3193q8902p6864j6400
$$ y = [0, 0, 0, 0, 0, 0, 0, 0, 0, 0, 0, 0, -1, 0, -8, 8, -8, 8, -14, 16, -18, 24, -26, 32, -38, 43, -50, 58, -67, 76, -90, 101, -116, 131, -148, 170, -187, 212, -236, 264, -296, 328, -365, 406, -446, 496, -547, 604, -664, 733, -808, 889, -979, 1080, -1192, 1319, -1460, 1621, -1812, 2029, -2288, 2604, -2989, 3485, -4137, 5043, -6397, 8628, -12973, 24655, -126085, -365012, -208671, -61120, 39031, 126655, 240359, 229550, 111369, -43542, -143078, -154193, -32119, 131648, 221290, 222310, 218116, 160256, -11045, -182675, -173382, -32046, 84961, 139396, 174348, 155753, 55658, -84962, -193334, -219532, -138461, -2022, 92807, 99282, 57418, -6890, -106066, -211860, -228234, -122534, 17745, 99044, 114255, 84191, 13668, -83599, -162851, -171585, -85152, 52386, 155048, 175977, 134212, 61019, -27883, -104747, -121147]
126a21147O9659J17169Q8175J3389m8348p4596p8297o6497k0563N6955J09847
137D5746Q4897P135n6178q0467q0218n8115o726N8428J00775Q6565J9550n1711
149F9681q2640p1697m4058o103N0436R9530Q9380K1157m9149p8003o9422m1336
161a12224K796N3627Q7825P9772K3947m4998q0572p0398l6714K243M4887Q0369
173C0560P6445K1224m7158p8994o7221l2361P784M7096P4076O7832J8827m6863
185G1247q1036o7208k8132J0707M7678P3282O9705K3407m1885q0890o9688k9031
197a01844J3448M5630O4885O1261K4181l5947p5685o5892k3384J6895M3772O0236
209B7556N4128J7980l5905p3861o8821k5373K4533N2981N7787M7999J8563l0220
$$ y = [-121147, -51488, 65681, 153856, 167245, 118897, 44301, -33996, -100493, -121056, -64101, 45746, 130643, 137778, 81600, 1133, -79085, -137200, -143926, -85498, 15277, 101842, 121392, 69681, -12959, -84656, -128714, -134817, -84381, 15149, 104529, 125686, 76537, -1466, -70888, -112224, -109428, -55801, 32024, 111796, 135743, 90745, 10173, -60225, -96939, -94696, -49809, 30560, 107005, 128229, 81071, 2077, -65144, -97505, -89721, -42625, 31451, 99283, 118110, 71247, -9789, -76997, -105129, -94422, -46744, 26538, 96243, 119650, 77765, -3125, -72813, -101844, -88396, -42766, 22119, 83380, 107561, 71614, -4071, -69963, -93347, -76452, -32680, 27556, 81684, 99664, 63759, -10102, -78923, -104296, -79763, -26782, 31005, 79004, 97567, 67347]
221F7347p1485o9830k5613K1809M9815N8831M8760J4754l1612o3093o4116k9558
233i3991K1515N6389N6789L7183J1673k4371o2058o6559k7269K1896M9562N4278
245C5037M2337R576l2875n7990n6255k8851J7229N4484N6806L1277J507k5428
257D6854n4229o1655k7655K3621N3746N4780L7636N475l2234n4585n2867k8049
269h9162J4059N3937O0271L1884j343k4628m4614n2299k7705J8593N0801N2769
281D2563L2746q43l4839m9562m2428k1469J1982M9647N9979L1674q329l2916m5248
294g043m7243k5340J5825M7175N2267L4040j45l6653n1008l8720j5799J1572M0823
307b0249N5948L3979p215l4493m3008l9447j9271J6292M5119M9595L0490k36l3757
$$ y = [67347, -4138, -73968, -99581, -77772, -27957, 30874, 79634, 94388, 62776, -317, -64433, -93991, -72476, -16087, 40702, 77885, 89558, 65187, 3129, -63430, -90699, -68803, -19241, 35037, 77374, 86950, 54075, -3915, -60170, -89021, -71792, -17308, 39498, 70775, 72282, 46854, -7375, -69030, -96685, -73064, -19318, 35462, 73098, 78573, 46339, -8246, -61113, -89162, -75103, -21166, 39105, 70989, 69646, 45018, 404, -51895, -79600, -61007, -10206, 42563, 75309, 74466, 39627, -9935, -52363, -73832, -61850, -12203, 47776, 79450, 71121, 38205, -7043, -54286, -79626, -63801, -16626, 35641, 69681, 69536, 32883, -18125, -56845, -72644, -61072, -20249, 35699, 69678, 62463, 27970, -15038, -54485, -73756, -57464, -12345, 37250, 67740, 67504, 33747]
320C3747m9353l6900j0161J5882L7442M8831L2718n270l7698m4949l4486j3338
332f3535J4980M1747M7612K9053m171l5177m9059l7800r604J7505L6305M2392
344C0248L0725n86l4518m7105l3634p552J7385L5107M1343K7412k773l3657m6011
357b3616l2666m772K2133L8061L7940K4471j586l0732m6031l6653o390K2985L7513
370F57L6876K3944k144l0703m4437l4191o387K0967L6054L5041J9422m497k8546
383B2056m1197l4166q165K2650L8526L3569J7639n033k8334m0484l1665n409K2961
396c7052L6922L3711J7096o661k7012l7181k9924n888K2998L9448L4287J4756
408E5500p506k6864l7157k9452o531K2229L7776L2915J3799q255k5636l4696k9032
$$ y = [33747, -15606, -52506, -62667, -46785, -9343, 39488, 72206, 66936, 29238, -15711, -50197, -63535, -48555, -6808, 40804, 69857, 65686, 30509, -18550, -56350, -65954, -48449, -12144, 30248, 60973, 60387, 25869, -21236, -54870, -62422, -45037, -9930, 31413, 58825, 56052, 22395, -23616, -56282, -61054, -38921, -860, 37080, 61551, 59965, 29233, -16798, -53451, -59841, -36856, 657, 37533, 61477, 59333, 28630, -15807, -49998, -56385, -35418, 636, 35677, 55099, 50602, 22056, -19141, -53307, -61472, -38822, -296, 33273, 50912, 45879, 17545, -22939, -54604, -60013, -37052, -130, 33581, 50677, 44016, 17004, -20177, -50101, -55989, -32991, 6457, 40744, 55500, 47994, 21130, -16027, -45479, -52010, -29781, 7995, 40910, 54709, 46454, 20818, -13878, -42910]
421d2910p302J9945L6479L2118J1243j1754k7545l2381k5504n361J9984L6214
433C226L2849J1305j2971k7883l1444k4173n784J9662L6917L3777J3516j2104
445C6893k7707l0635k1163k873J8438L3061L2173J4198j2096k8982k9656j9179
457c7528l025J8040L3534L0585J1263j3386k8694l1077j9499j117J7862K9483
469F441K8428J2691j2436l0484l1071j8082J18J7211L0283K9576J1283j3500k9449
482A009k9103j7295J318J8905K9675K7074J2350r920k7984l0621j6459M176J9245
495a7630K6309K6036J2675j1830l0049k8753j3929M539J8310K7221K3909Q957
507D5765j1832k7297l0980j8345M699K2476K6428K0725R362r393k7973l1641j5099
$$ y = [-42910, -50212, -30267, 6212, 38330, 49573, 37819, 10274, -22107, -47611, -52972, -32988, 3226, 36075, 47380, 34409, 6526, -24918, -49091, -54875, -35213, 1704, 35481, 48997, 36893, 9186, -21449, -42612, -45485, -27047, 6014, 38187, 52385, 40289, 11307, -18349, -37528, -40553, -22513, 11021, 41606, 52869, 39483, 10789, -20288, -39787, -40904, -23042, 6441, 34869, 47560, 35124, 4640, -26431, -44513, -44395, -27184, 3099, 32675, 43958, 30458, 1009, -28094, -45389, -44071, -25166, 4509, 31583, 43933, 34013, 6029, -24592, -41051, -36875, -17630, 8679, 34715, 47390, 35560, 5511, -23242, -37171, -32632, -14322, 12899, 36808, 45765, 33933, 6636, -24344, -42689, -37990, -15514, 10914, 31639, 41001, 31608, 3635, -28006, -43105]
520d3105O193J9490K4539K2365R039j1494k5992k7045j5875M145K3045K7801J8969
533C2075N374r680k3763k9063j5884O833K3110K4436J8835P090j0392k6312k7142
546b4483j4247N214K1244K6829J8902L232j1638k3389k5804j5859N277K2974K6510
559A4762J6823L034j0102k2563k5997j4775O305K1639K6017J7659J727j2786k1828
572h5k2479j3188M642K1300K6658J7356j21j4170k0725k2764j3830N032K1872
585a0502K6233J7104N37j4805k2359k0830j0888M484J9782K4487J8113P41j5043
598A7054k2083j8927j0023N456K0009K5317J6529o42j4798k2034j9017q856O254
611b5761J9456K3687J6177M15j5622k2383j8847q318N842J8431K3519J5967j066
$$ y = [-43105, -36912, -17422, 7117, 29482, 38521, 27027, 1035, -26010, -41885, -37740, -14695, 13106, 32075, 37449, 27769, 4006, -25057, -40941, -34108, -10998, 13438, 32273, 39363, 28971, 2659, -24483, -38730, -33516, -12272, 14557, 33459, 36691, 25053, 1664, -24140, -39999, -34722, -11748, 14762, 31585, 34619, 24517, 1954, -24043, -38818, -32513, -10874, 15143, 32802, 34529, 21743, -85, -22564, -35752, -31110, -9810, 16848, 34204, 34083, 19913, -812, -23576, -37406, -32374, -10502, 15731, 32835, 33372, 18567, -3792, -24622, -35510, -31026, -11244, 13243, 31356, 32097, 17054, -5029, -23956, -33979, -28523, -8514, 16803, 33332, 32690, 17892, -4142, -23159, -32015, -25761, -6305, 17382, 33559, 33974, 18352, -4031, -22878, -31196, -25354, -6923, 16596, 32563, 31497]
624C1497j6507k1833j8069p219O130J7636K2683J5838l70j6353k2256j7457n815
637c2095O947J7988K1779J5397l08j6445k2095j6271m264P539J7362K0752J4830
650C1116J07j5957k2841j7370l988R074J7924J9532J3375n60j5352k2598j7333
663b4871m227R299J6898J8637J2521j98j5205k2569j7049l258J0482J7498J7575
676A5533J1707j605j4450k0906j6553l998J0622J8378J7889J0590r72j3988k1132
689h885j6975k742J1126J8039J7371R622j749j4449j9794j6025l453J0513J8724
702A323J7235Q003k189j3488j9875j6433k700J1031J8559J6946P658l514j3715
715H841j8413j5276l079J0772J8866J7174P145m554j3313j8168j4473k702J1021
$$ y = [31497, 14990, -6843, -24912, -32131, -26001, -8365, 14318, 30156, 29786, 13433, -8823, -26280, -32095, -25148, -7160, 14619, 30016, 29708, 13263, -8832, -25103, -29367, -21828, -4466, 16286, 31116, 31223, 15266, -7575, -24945, -28933, -19859, -1935, 17597, 30972, 30412, 15060, -7538, -24871, -29098, -19799, -2901, 15736, 28257, 28059, 12854, -9715, -26764, -30022, -19540, -2042, 15533, 27240, 25635, 11185, -9721, -26274, -30272, -19650, -1272, 16617, 27207, 26235, 12247, -8885, -25860, -28602, -17476, 563, 17934, 27556, 25807, 11358, -8436, -24461, -27914, -17401, 1323, 18558, 26561, 24372, 10884, -8991, -25424, -28124, -17093, 1466, 18412, 26070, 22556, 8841, -9572, -24848, -27927, -17155, 1711, 18885, 26030, 21476, 8163, -10005, -24478, -27180, -16159]
728a6159J8346J7054P766n113j4827j6868j3044l306R948J8837J6979O767n309
741B1071j4515j7013j3163k045J0873J7562J6217O993n676j5536j6371j1748j686
754b5037R738J8099J6678O539o443j4400j6518j2308r25J0729J7600J5784O289
767B5825o113j4783j6481j0746o51R496J7191J6226O144o805j5376j6212j0319
780b2604J5R978J6930J4991N555o585j4974j6617r435M23J0369J5967J4593O094
794B4700o759j5848j6425q936J594J0952J5542J3876N515o888j5226j5559r200
807b2662J547J1072J5727J3480M647o598j4992j5999q806K572J1332J4973J2721
820A9014M375o693j5178j5419q455K432J1258J5335J2433L642o963j5259j5370
$$ y = [-16159, 2187, 19241, 27007, 21894, 7067, -9801, -22845, -26151, -16203, 2634, 19613, 26380, 21071, 6556, -10457, -23620, -25665, -14792, 2770, 18987, 25980, 20304, 4768, -11603, -23351, -25037, -15299, 2800, 19478, 26017, 19574, 5174, -11344, -23652, -24577, -13848, 3752, 19536, 25825, 19712, 4929, -11552, -22298, -22949, -13453, 3738, 19964, 26108, 19303, 3927, -12285, -22604, -22589, -12611, 4319, 19310, 24865, 18280, 3306, -13311, -22746, -22323, -11954, 4013, 18606, 24700, 17941, 2093, -14332, -23268, -21674, -10722, 4820, 18696, 24211, 17323, 2097, -13462, -22662, -21115, -10043, 5684, 19164, 23811, 17213, 2221, -13778, -22584, -20012, -8680, 6293, 19014, 23389, 16696, 1518, -13901, -22356, -19924, -8666, 6669, 19102, 22744, 15781, 522, -14848]
833a4848q181L171J1526J4795J1797L787o815j4650j5053p903L106J1388J4964
846G084J1570K884o890j4112j4921p641L365J2098J4803J0410K567p159j3625
859D33j4395p558L357J1827J4834J0457J926p980j3310j3940p307L480J2258J4625
873H707J0145J005p611j3725j3246o746L634J1834J4704R981P91p822j3681j2655
887a4685o089L527J2170J4202R677O30q398j3032j2414n705L746J1983J4156R420
901A9188J8q374j3266j1833n609M035J2071J3811Q736k44q374j3097j1537n283
915a9758L730J1941J3633R174n73r384j2622j1130m777M175J1852J3430Q698p11
929A7678r065j2809j0551m179M181J1583J3249Q756p02r263j2926j0694l538N090
$$ y = [-14848, -23029, -19858, -8332, 6463, 18260, 22047, 15232, 582, -14471, -22374, -19268, -7880, 7084, 18654, 21538, 14648, 536, -14385, -22026, -18661, -6563, 8240, 18650, 21217, 14058, 433, -13962, -21520, -18163, -6336, 8498, 18955, 20881, 12901, -409, -14349, -21656, -18176, -5918, 8707, 18852, 19857, 12246, -1479, -14725, -21471, -17837, -6003, 8701, 18682, 19473, 11651, -2030, -14685, -20774, -17247, -5077, 9125, 18802, 19432, 11034, -1998, -14412, -20117, -16371, -4388, 9768, 19188, 19206, 10832, -2434, -14267, -19876, -15841, -3770, 10041, 18777, 18533, 10159, -2938, -14475, -19758, -16028, -4087, 9546, 18720, 18147, 8763, -3859, -14989, -19766, -15591, -3739, 9691, 18389, 17678, 8613, -4196, -14747, -18926, -14745, -3162, 10087, 18843, 18141, 8878, -4048, -14742, -18280, -13190]
943a3190J1119J2669P938m66r088j3234j0567l394M732J1328J2759P765j309r291
957G771j3127j0025l246N595J1224J1667P461j495q734j2627j0204k596N274J1517
971a545J2116P044j394r652j1962r734k251N698J0968J1861O684j213r456j2460
985e296r389k381O015J1194J1038O592j943r497j2041r334j882O112J1166J0669
999A1023N818k073q744j2155r581j707O104J1163J1115N575k249r343j1740q695
1013a5489j558O590J1059J0775N192k418r032j1493q267j565O609J0975J0501
1026A1879M744k370r204j1280q151j055O218J0890J0090M618k845q944j1151q556
1040a5117r53O854J0883R886M225k927r135j1455p541p65O745J0981R784L743
$$ y = [-13190, -2071, 10598, 18536, 18070, 8982, -4252, -14819, -18213, -13481, -2153, 10606, 18371, 17062, 7771, -5356, -15381, -18627, -13032, -1808, 9859, 17320, 15825, 7091, -5536, -15740, -18336, -13062, -1545, 10571, 17615, 16221, 6569, -5393, -15127, -17378, -11680, -712, 11149, 17833, 16620, 7164, -5296, -14685, -17066, -11051, 143, 11181, 17773, 15830, 6333, -5708, -15042, -16924, -10812, 354, 11023, 16841, 14768, 6024, -6131, -15712, -17419, -11315, -152, 10963, 16538, 14289, 4946, -6794, -15489, -17047, -10457, 602, 11377, 16569, 14151, 5119, -6374, -14641, -16206, -9597, 1378, 11879, 16623, 14253, 5049, -6231, -14382, -15437, -9219, 1671, 11761, 16379, 13534, 4590, -6561, -15117, -16070, -9216, 1667, 11553, 15778, 12851, 3716, -7739, -15280, -16045, -9300, 1681, 11465, 15208]
1054A5208k741q642j1126p599o64P312J0372R866L809l737q719j0528p049m18
1068a4656P048J0466R334L578l845q935j0441o785l56O773J0926Q957L230l777
1082A1517r382r978o540K99O443J0335Q777L364l620r411j0039o437N04P166J0123
1097C121Q564L094m066q897j0009n722O24O763J0308Q274K856m216q995r713n485
1112a3499P21O783R913Q330K297m413r198r137n543Q60P163R444Q029K114m118
1127I746q959r353n415J576O644R451P671K333m546r123q982m528J417P205R195
1142D332P396J956m670q511r127m822J808O946R435O836J816m489q812q353m725
1157a2984J476P073R286O658J548m690q647q584m386J900P214Q810O531J325m705
$$ y = [15208, 12467, 3825, -7301, -14900, -15564, -8252, 2120, 11986, 15795, 12058, 3339, -7189, -14238, -14656, -7608, 2858, 12192, 15770, 11925, 2990, -7451, -14236, -14592, -7819, 3107, 12064, 15294, 11517, 2135, -7843, -14383, -14084, -7641, 2694, 11471, 14835, 11215, 1804, -8235, -14672, -14168, -7002, 3121, 11685, 14779, 10713, 1816, -8193, -13915, -13291, -6528, 3780, 12054, 14910, 10694, 1699, -8014, -13499, -12778, -5995, 3918, 12248, 14545, 10132, 934, -8203, -13746, -12886, -5723, 3721, 11750, 13864, 9746, 787, -8566, -13981, -12405, -5761, 3690, 11361, 13694, 9148, 25, -8957, -13485, -12068, -4863, 4332, 11728, 13684, 9014, 503, -8624, -13446, -11638, -4692, 4743, 11579, 13395, 8906, 94, -8259, -12984, -11508, -4435, 4851, 11509, 13057, 8367, -280, -8864, -13250, -11350, -4136, 4674, 11205, 12530, 7825]
1172G825q609q165m117K038O794R108O436J092m783q548p875m010K363O715R171
1187E435O183O91m995q487p760l561K277P044Q520O349O59n286q340p503l669
1202a2443K418P172Q451N693M30m883q251p330l234K309O983Q290N786L48n337
1217F402q105p378l261K758P218Q307N301J84n307p810p140l245K873O622P981
1232E400N447M85n424q195o935k415K719O921P891N015k90n201p565o816k626
1247a1589L070O930P715M658J3n134p655p063j922L072O708P443M946q72n175
1262E145p561o213k442K861P135P433M226m72n143p960o114k241L309O945P109
1277F017M281p54n070p673n891j510K922O529P272M236j153n269p022o109j492
$$ y = [7825, -784, -8949, -13066, -11028, -4234, 4874, 11310, 12402, 7619, -929, -8804, -12814, -10451, -3736, 5435, 11618, 12309, 7314, -1173, -8933, -12494, -10217, -3173, 5347, 11696, 12355, 7069, -1271, -8774, -12443, -10025, -2853, 5598, 11291, 11721, 6838, -1413, -8743, -11977, -9668, -2685, 5605, 11391, 11739, 6402, -1703, -9081, -12342, -9584, -2366, 5941, 11242, 11426, 6119, -1691, -8831, -12076, -9203, -2581, 5400, 10847, 11332, 5908, -2287, -9222, -11637, -8918, -1997, 5894, 10909, 10619, 5418, -2147, -8963, -11589, -8519, -1589, 6126, 10784, 10797, 5663, -1992, -9055, -10977, -7905, -1197, 6246, 11192, 10320, 5145, -2416, -8629, -11071, -8210, -1075, 6358, 10584, 10112, 4969, -2991, -9105, -11346, -8037, -1092, 6017, 10298, 9544, 4474, -3199, -9090, -10600, -7678, -1149, 6123, 10359, 9206, 3937, -3085, -9194, -10686]
1292a0686L404P177O833L793p82n443p224n900j307L201O640O558M434j363n455
1307C880o916n673j330L608O112O590L861j339n592o945n250j212L756O544O143
1322F237L913j459n620p117n079o85L431O493O628L020j591n133o812n112r58
1337i844L809O767N986K990j394n392o609m925r21L851O463O128K841j949n006
1352B795o195m976n94L684O083O087K720k121n087o647m174o25L857O328N851
1367F986K423k112n413o343m107q31L920O340N626K742k138n358o249l988k73
1382h775L930N885N773K205j812n786n701m158j63M438O040N511K142k375n720
1397A434n622m078L08M211N785N303J852k649n059n637m020k1L924N509N357K024
$$ y = [-10686, -7282, -105, 6728, 10521, 9739, 4296, -2928, -8828, -10135, -6934, -294, 6264, 10698, 9335, 3880, -3036, -8709, -10039, -6431, -319, 6271, 10132, 8793, 3201, -3744, -8994, -10206, -6450, 94, 6237, 10150, 8691, 3071, -4046, -9125, -9810, -6379, 114, 6742, 9762, 8171, 3038, -3774, -8886, -9844, -6035, 732, 6718, 9708, 8314, 2922, -3687, -8612, -9533, -5682, 781, 6909, 9750, 7801, 2795, -3400, -8376, -8970, -5286, 797, 6884, 9604, 7483, 2396, -4251, -8425, -9050, -5193, 1135, 6986, 9409, 7297, 1884, -4459, -8566, -9397, -5477, 863, 6489, 9231, 7093, 1735, -4514, -8502, -8775, -4845, 1040, 6813, 9018, 7206, 1420, -4281, -8439, -8602, -4164, 1876, 7387, 9529, 7154, 1434, -4188, -8266, -7958, -3747, 2038, 7341, 9193, 6544, 1485, -4152, -8172, -8193, -4269, 1240, 6597, 8621]
1413H621k314n377n955l589J22M233N621M950K095k399n466n527l187K79M118
1428c775N674M717J801k422m999n963k879O49M125N579M695J831k715n216n429
1443d327l381M96L895N990M435J391k549n153n715l050Q83L529N786M104J145
1458G479k588n051n173k891P51M012N710M312J085k396n475n109k891J286L921
1473c018N580M292R17k389n260m781k943Q93L995N658M225O51k559n158n011k471
1489g379Q49M162N281L775Q08k574m886n204k121P09L954N334L803N04k632m915
1505e32m792k368J337M125N116L452P22k853m554n048k433J314M240N291L791
1520F808L08k658m946m351k242Q92M321M824L789L20l055m665m138k239J315M040
$$ y = [8621, 6307, 930, -5025, -8614, -8492, -4259, 1362, 6312, 8407, 6008, 542, -4985, -8172, -7893, -3775, 1899, 6616, 8417, 5995, 996, -4967, -7846, -7197, -3072, 2507, 7202, 9033, 6318, 1102, -4327, -7708, -7212, -3317, 2673, 7108, 8499, 5950, 797, -4918, -7968, -7085, -3556, 2230, 6334, 7479, 4891, -160, -5333, -8224, -7473, -3461, 2249, 6561, 7646, 5250, -225, -5334, -8225, -6939, -3018, 2562, 6854, 7771, 5382, 122, -4659, -7602, -6709, -2714, 2944, 7169, 7820, 5261, 103, -4908, -7379, -6530, -2368, 2913, 6688, 7496, 4922, 36, -5168, -7289, -6580, -2626, 2708, 6511, 7015, 4383, -532, -5324, -7692, -6355, -2230, 2886, 6338, 7060, 4207, -347, -5395, -7828, -6514, -2274, 3017, 6808, 7116, 4458, -488, -4839, -7081, -6189, -1868, 2956, 6745, 7065, 4010, -655, -4793, -7032, -5717, -1677]
1536a677M918L511J70l118m551m679j725J353M193M891L096L55l048m691m148
1551e150k029J674M082M795L053O6l078m815l727k013J603M242M677L200o9l129
1567C382m724m205j291J706L980M510K976j80k839m883l810j474J688M334M418
1582C588K935k34k955m932l869j283K096L825M605K621m3l094m704l913q50J577
1598d630L901M512K532k83l580l880l619j361J975L911M247K452q32l290m200
1613b145l584q39K108L693M258K444k18l236m474l243j090J929M178L990K212
1628E983m10k810m483l489q22J966M214L820K315n05l166m405l136q98J879L818
1644a29M056K269p42l202m437k938q08J813M114L595K149n50l041m550l305o39
$$ y = [-1677, 3241, 6752, 6922, 3804, -747, -5426, -7151, -5798, -1605, 3286, 6382, 6737, 3689, -1002, -5150, -7179, -5505, -1423, 3372, 6425, 6491, 3413, -1402, -5129, -7142, -5539, -1297, 3380, 6580, 6511, 3382, -1342, -5547, -6838, -5132, -1152, 3358, 6334, 6154, 3315, -1568, -5378, -6852, -5164, -830, 3588, 6523, 6289, 3334, -1598, -5467, -6750, -4654, -829, 3776, 6397, 6354, 3260, -1444, -5357, -6207, -4630, -729, 3783, 6315, 6032, 2452, -1428, -5047, -6408, -4433, -522, 3725, 6177, 5345, 2055, -2145, -5729, -6568, -4460, -767, 3491, 5935, 5717, 2481, -1993, -5236, -6326, -4397, -219, 3771, 5983, 5573, 2763, -1720, -5209, -6031, -4065, 149, 3969, 6284, 5779, 2613, -1792, -4928, -5826, -3947, -129, 3927, 6196, 5454, 2252, -2185, -5123, -5931, -4118, -4, 3591, 5740, 5190, 2149, -2401, -5706, -6345]
1660f345K383L707L635K635r45l214m004l057m16K065L695M030J520q44k698m049
1676a902l021o23K395L756L500J834j074k886m093l131l81K230L665L792J378
1691E439o62l039l888l165o55K409M028L037J594p48l235l691k683l63K020M114
1707E12L487J692j277l017l769k635k33K137L868L237J494p43l469l788k225j04
1723d833K255L485L463J006o27l791l673k246k47K179L603L513J090r00l483l486
1739b692k304j5J809L915L036J450j223l356l179k401j74K494L659L128R49j382
1755C714l210l470j974L14K250L575L092Q84j423k755l533k140n8K467L515K890
1771D138Q76j200l284l223j953M8K366L530K672Q84j417l059l328k209O82K343
$$ y = [-6345, -3962, -255, 3380, 6015, 5070, 1856, -2148, -5205, -5621, -3556, 139, 4169, 5689, 4845, 2147, -1902, -4923, -5546, -3151, 605, 4105, 5939, 4865, 1979, -2114, -5245, -5626, -3396, 269, 4061, 5439, 4777, 1738, -2150, -5315, -5970, -3561, 467, 3504, 5098, 4350, 1115, -2576, -5259, -5622, -3602, 512, 3999, 5691, 4414, 1397, -2372, -5007, -5240, -3103, 765, 4002, 5496, 4753, 1284, -2504, -4729, -4833, -2578, 907, 4370, 5376, 4749, 958, -2715, -4961, -5208, -3029, 574, 4087, 5177, 4277, 794, -2692, -4996, -5011, -3202, 713, 3749, 5199, 3976, 620, -2559, -4960, -5134, -2640, 1019, 4147, 5096, 3714, 504, -2966, -4940, -4626, -2376, 1199, 4291, 5175, 3752, 997, -2536, -4676, -4734, -2267, 1248, 4138, 5014, 3814, 530, -2693, -4646, -4598, -2232, 1298, 3970, 4854, 3437, 378, -2950, -5159, -4477, -2134]
1787b134L120L072P46j422l317k934j969N45K218L279K754R15j552l044l153j586
1803d462Q6K841L072K436J054j726l111l077j699N15K507L178K567N73j129l084
1819E41l201j585L51K294L123K420O16j484l006l382j322O50K448K998K335O03
$$ y = [-2134, 986, 4058, 4804, 3382, 65, -2869, -4838, -4293, -2075, 1204, 3958, 4873, 3321, 277, -2876, -4462, -4376, -1535, 1537, 3973, 5027, 3301, 190, -2887, -4586, -4071, -1564, 1614, 4181, 4754, 3625, 541, -2660, -4245, -3894, -1600, 1523, 3943, 4559, 3075, 69, -3313, -4635, -3985, -1537, 1461, 3796, 4399]
$$ [...]
8191A53
##END NTUPLES=NMR FID
##END=
