##TITLE=1H_LR-753-R2-C1
 CDCl3
 8 sc, 
 26.07.2022
##JCAMPDX= 6.0         $$ Bruker NMR JCAMP-DX V2.0
##DATA TYPE= NMR FID
##DATA CLASS= NTUPLES
##ORIGIN= UXNMR, Bruker Analytische Messtechnik GmbH
##OWNER= root
$$ XWIN-NMR		Version 3.5
$$ Tue Jul 26 15:57:17 2022 Russian Standard Time (UT+4h)  she@DPX200
##.OBSERVE FREQUENCY= 200.1313499994
##.OBSERVE NUCLEUS= ^1H
##.DELAY= (6, 6)
##.ACQUISITION MODE= SIMULTANEOUS
##.ACQUISITION SCHEME= undefined
##.AVERAGES= 8
##.DIGITISER RES= 18
##SPECTROMETER/DATA SYSTEM= spect
##.PULSE SEQUENCE= zg30
##.SOLVENT NAME= DMSO
##.SHIFT REFERENCE= (INTERNAL, DMSO, 0, 15.7039)
##AUDIT TRAIL= $$ (NUMBER, WHEN, WHO, WHERE, WHAT)
$$ ##TITLE= Audit trail, XWIN-NMR		Version 3.5
$$ ##JCAMPDX= 5.01
$$ ##ORIGIN= Bruker BioSpin GmbH
$$ ##OWNER= she
$$ F:/spectra/data/she/nmr/H-F/1/audita.txt
$$ ##AUDIT TRAIL=  $$ (NUMBER, WHEN, WHO, WHERE, WHAT)
(   1,<2022-07-26 15:55:55.45 +0400>,<she>,<DPX200>,
      <created by zg, POWCHK disabled, PULCHK disabled
       configuration hash MD5:
       00 E9 B6 7A A2 85 ED C7 34 08 36 98 17 FE 4E 26
       data hash MD5: 16K
       C4 3C 48 06 F5 7E AD E0 59 CF A6 FE E5 AC DD F8>)
$$ ##END=
$$ 
$$ hash MD5
$$ 3F 32 83 22 C0 85 02 2C EF 3C 00 52 22 07 68 81
##$RELAX= 
##$RELAX= 
##$RELAX= 
##$RELAX= 
##$RELAX= 
##$RELAX= 
$$ Bruker specific parameters
$$ --------------------------
##$DU= <F:/spectra>
##$EXPNO= 1
##$NAME= <H-F>
##$PROCNO= 1
##$TYPE= <nmr>
##$USER= <she>
##$AMP= (0..31)
100 100 100 100 100 100 100 100 100 100 100 100 100 100 100 100 100 100 
100 100 100 100 100 100 100 100 100 100 100 100 100 100 
##$AQSEQ= 0
##$AQ_mod= 1
##$AUNM= <au_zg>
##$AUTOPOS= <>
##$BF1= 200.13
##$BF2= 200.13
##$BF3= 200.13
##$BF4= 200.13
##$BF5= 200.13
##$BF6= 200.13
##$BF7= 200.13
##$BF8= 200.13
##$BYTORDA= 1
##$CFDGTYP= 0
##$CFRGTYP= 5
##$CHEMSTR= <none>
##$CNST= (0..31)
1 1 145 1 1 1 1 1 1 1 1 1 1 1 1 1 1 1 1 1 1 1 1 1 1 1 1 1 1 1 1 1 
##$CPDPRG= <>
##$CPDPRG1= <>
##$CPDPRG2= <>
##$CPDPRG3= <>
##$CPDPRG4= <mlev>
##$CPDPRG5= <mlev>
##$CPDPRG6= <mlev>
##$CPDPRG7= <mlev>
##$CPDPRG8= <mlev>
##$CPDPRGB= <>
##$CPDPRGT= <>
##$D= (0..31)
0 1.2 0 0 0 0 0 0 0 0.06 0 0.03 0 0 0 0 0.0002 0 0 0 0 0 0 0 0 0 0 0 0 
0 0 0 
##$DATE= 1658836554
##$DBL= (0..7)
120 120 120 120 120 120 120 120 
##$DBP= (0..7)
150 150 150 150 150 150 150 150 
##$DBP07= 0
##$DBPNAM0= <>
##$DBPNAM1= <>
##$DBPNAM2= <>
##$DBPNAM3= <>
##$DBPNAM4= <>
##$DBPNAM5= <>
##$DBPNAM6= <>
##$DBPNAM7= <>
##$DBPOAL= (0..7)
0.5 0.5 0.5 0.5 0.5 0.5 0.5 0.5 
##$DBPOFFS= (0..7)
0 0 0 0 0 0 0 0 
##$DE= 6
##$DECBNUC= <off>
##$DECIM= 32
##$DECNUC= <off>
##$DECSTAT= 4
##$DIGMOD= 1
##$DIGTYP= 9
##$DL= (0..7)
0 120 120 120 120 120 120 120 
##$DP= (0..7)
150 150 150 150 150 150 150 150 
##$DP07= 0
##$DPNAME0= <>
##$DPNAME1= <>
##$DPNAME2= <>
##$DPNAME3= <>
##$DPNAME4= <>
##$DPNAME5= <>
##$DPNAME6= <>
##$DPNAME7= <>
##$DPOAL= (0..7)
0.5 0.5 0.5 0.5 0.5 0.5 0.5 0.5 
##$DPOFFS= (0..7)
0 0 0 0 0 0 0 0 
##$DQDMODE= 0
##$DR= 18
##$DS= 0
##$DSLIST= <SSSSSSSSSSSSSSS>
$$ [...]
##$SUBNAM2= <"">
##$SUBNAM3= <"">
##$SUBNAM4= <"">
##$SUBNAM5= <"">
##$SUBNAM6= <"">
##$SUBNAM7= <"">
##$SUBNAM8= <"">
##$SUBNAM9= <"">
##$SW= 18.0517283424941
##$SWIBOX= (0..15)
0 0 2 0 0 0 0 0 0 0 0 0 0 0 0 0 
##$SW_h= 3612.71676300578
##$TD= 16384
##$TD0= 1
##$TE= 0
##$TE2= 300
##$TE3= 300
##$TEG= 300
##$TL= (0..7)
0 120 120 120 120 120 120 120 
##$TP= (0..7)
150 150 150 150 150 150 150 150 
##$TP07= 0
##$TPNAME0= <>
##$TPNAME1= <>
##$TPNAME2= <>
##$TPNAME3= <>
##$TPNAME4= <>
##$TPNAME5= <>
##$TPNAME6= <>
##$TPNAME7= <>
##$TPOAL= (0..7)
0.5 0.5 0.5 0.5 0.5 0.5 0.5 0.5 
##$TPOFFS= (0..7)
0 0 0 0 0 0 0 0 
##$TUNHIN= 0
##$TUNHOUT= 0
##$TUNXOUT= 0
##$USERA1= <user>
##$USERA2= <user>
##$USERA3= <user>
##$USERA4= <user>
##$USERA5= <user>
##$V9= 5
##$VALIST= <valist>
##$VCLIST= <CCCCCCCCCCCCCCC>
##$VD= 0
##$VDLIST= <DDDDDDDDDDDDDDD>
##$VPLIST= <PPPPPPPPPPPPPPP>
##$VTLIST= <TTTTTTTTTTTTTTT>
##$WBST= 1024
##$WBSW= 4
##$XGAIN= (0..3)
0 0 0 0 
##$XL= 0
##$YL= 0
##$YMAX_a= 436466
##$YMIN_a= -505548
##$ZGOPTNS= <>
##$ZL1= 120
##$ZL2= 120
##$ZL3= 120
##$ZL4= 120
##$ABSF1= 10
##$ABSF2= 0
##$ABSG= 5
##$ABSL= 3
##$ALPHA= 0
##$AQORDER= 0
##$ASSFAC= 0
##$ASSFACI= 0
##$ASSFACX= 0
##$ASSWID= 0
##$AUNMP= <proc_1d>
##$AZFE= 0.1
##$AZFW= 0.1
##$BCFW= 1
##$BC_mod= 2
##$BYTORDP= 1
##$COROFFS= 0
##$CY= 11.3945322036743
##$DATMOD= 1
##$DC= 2
##$DFILT= <>
##$DTYPP= 0
##$F1P= 2.36226072786647
##$F2P= -0.459571619588291
##$FCOR= 0.5
##$FTSIZE= 0
##$FT_mod= 4
##$GAMMA= 1
##$GB= 0.15
##$INTBC= 1
##$INTSCL= 1
##$ISEN= 128
##$LB= 0.24
##$LEV0= 0
##$LPBIN= 0
##$MAXI= 10000
##$MC2= 0
##$MEAN= 0
##$ME_mod= 0
##$MI= 1.114404
##$NCOEF= 0
##$NC_proc= 0
##$NLEV= 6
##$NOISF1= 3.799351
##$NOISF2= 2.8
##$NSP= 1
##$NTH_PI= 0
##$NZP= 0
##$OFFSET= 15.70392
##$PC= 1
##$PHC0= -18037.39
##$PHC1= 8.80068
##$PH_mod= 1
##$PKNL= yes
##$PPARMOD= 0
##$PSCAL= 0
##$PSIGN= 0
##$REVERSE= no
##$SF= 200.130013532006
##$SI= 16384
##$SIGF1= 3
##$SIGF2= 2
##$SINO= 400
##$SIOLD= 16384
##$SREGLST= <1H.CDCl3>
##$SSB= 0
##$STSI= 0
##$STSR= 0
##$SW_p= 3612.71676300578
##$SYMM= 0
##$S_DEV= 0
##$TDeff= 0
##$TDoff= 0
##$TI= <>
##$TILT= no
##$TM1= 0
##$TM2= 0
##$TOPLEV= 0
##$USERP1= <user>
##$USERP2= <user>
##$USERP3= <user>
##$USERP4= <user>
##$USERP5= <user>
##$WDW= 1
##$XDIM= 8192
##$YMAX_p= 0
##$YMIN_p= 0
$$ End of Bruker specific parameters
$$ ---------------------------------
##NTUPLES= NMR FID
##VAR_NAME=  TIME,          FID/REAL,        FID/IMAG
##SYMBOL=    X,             R,               I
##VAR_TYPE=  INDEPENDENT,   DEPENDENT,       DEPENDENT
##VAR_FORM=  AFFN,          ASDF,            ASDF
##VAR_DIM=   8192,          8192,            8192
##UNITS=     SECONDS,       ARBITRARY UNITS, ARBITRARY UNITS
##FACTOR=    0.0002768,     1,               1
##FIRST=     0,             0,               0
##LAST=      2.2672688,     0,               0
##MIN=       0,             -505548,         0
##MAX=       2.2672688,     436466,          0
$$ Real data points
##PAGE= N=1
##DATA TABLE= (X++(R..R)), XYDATA
$$ plain form
0 0 0 0 0 0 0 0 0 0 -8 8 -8 8 -16 16 -19 24 -32 40 -48 56 -65 80 -96 112 -133 153 -178 209 -240 275 -315
31 -315 361 -409 464 -523 588 -661 741 -830 924 -1031 1145 -1270 1408 -1557 1719 -1899 2095
48 2095 -2309 2542 -2798 3084 -3400 3752 -4145 4588 -5091 5668 -6338 7127 -8072 9227
62 9227 -10679 12567 -15129 18831 -24675 35353 -61316 266750 187680 -109859 256636 154821
74 154821 100951 269229 217364 -13755 141266 154180 -110631 -112338 92134 -31018 -119442
85 -119442 -98373 -280700 -293104 54805 -2817 -319747 -221167 -79680 -247410 -181536 35935
96 35935 -38041 -71244 120166 30834 -155028 54054 247843 131539 166205 248262 53068
107 53068 -3896 168886 97578 247 186901 219650 -3385 -53204 -23951 -106555 -48196
$$ packed form
0@%%%%%%%%qJ6j6J6k4L2l5M3n6P2q8J04j21J45j76K08k45K86l31L87m49N15n90
31c15O76p70Q73r87J111j249J402j571J754j955K176k415K678k965L276l618L994
48B095m404M851n340N882o484P152p897Q733r679J0759j2006J3465j5199J7299
62I227j9906K3246k7696L3960m3506O0028r6669L28066p9070k97539L66495j01815
74A54821n3870J68278n1865k31119J55021J2914k64811j707K04472j23152q8424
85a19442K1069j82327j2404L47909n7622l16930R8580J41487j67730O5874K17471
96C5935p3976l3203J91410q9332j85862K09082J93789j16304L4666Q2057j95194
107E3068n6964J72782p1308r7331J86654L2749k23035m9819K9253q2604N8359
$$ plain form
118 -48196 71533 -36808 -117653 -18962 -53833 -152223 -66553 -52646 -169643 -82831 37180
129 37180 -76302 -95912 52992 29767 -52588 12043 20588 -28559 66052 155696 82194 19941
141 19941 32512 3891 9278 82556 51068 -15848 32382 28764 -61916 -45374 4704 -11112
153 -11112 11392 33126 -32260 -70153 -21833 3392 -23977 -22906 -7517 -17337 8484 36186
165 36186 -3295 -18720 2167 -22822 -17811 45300 64879 54117 39804 -10898 -46294 -21123
177 -21123 7565 5192 3497 7936 -8571 -28057 -35225 -55040 -46494 5713 10339 -17157 -4357
190 -4357 -122 -12866 7519 9310 -14572 10944 47930 29728 4554 6174 4517 15333 47659
203 47659 42945 8611 16365 33872 12560 7628 15419 -22853 -37215 3413 4571 -16982 -4490
$$ packed form
118d8196J19729j08341q0845R8691l4871r8390Q5670J3907j16997Q6812J20011
129C7180j13482j9610J48904k3225q2355O4631Q545m9147R4611Q9644p3502o2253
141A9941J2571k8621N387P3278l1488o6916M8230l618r0680J6542N0078j5816
153a1112K2504K1734o5386l7893M8320K5225k7369J071J5389r820K5821K7702
165C6186l9481j5425K0887k4989N011O3111J9579j0762j4313n0702l5396K5171
177b1123K8688k373j695M439j6507j9486p168j9815Q546N2207M626k7496J2800
190d357M235j2744K0385J791k3882K5516L6986j8202k5174J620j657J0816L2326
203D7659m714l4334P754J7507k1312m932P791l8272j4362M0628J158k1553J2492
$$ plain form
216 -4490 -25219 -74305 -66524 -34542 -29126 -11855 19495 8212 -24181 -23445 -22117 -27382 15541
229 15541 50338 24599 15974 23458 3543 16131 43713 16863 -319 32456 45458 25409
241 25409 21951 21170 -7943 -13032 18891 6364 -27212 -8385 -2001 -32807 -38735 -38059 -41500 -17237
255 -17237 1751 -8027 -20418 -25509 -24413 -11792 6566 7549 -1861 15979 32515 10157 2161
268 2161 12638 -4286 -6823 26976 39230 27806 25871 19423 -2115 -11761 2320 12347 6450
281 6450 5087 4854 -6214 -17688 -23578 -25373 -16257 -10693 -15487 -13742 -10042 -9865 1631 4056 -17715
296 -17715 -23215 4487 27992 21800 502 -12549 -10924 1324 21700 25466 6270 2595 13292
309 13292 10889 2060 -3851 1421 16421 16421 4185 -1918 -6136 -5396 -7096 -20713 -24401 -12310 1811
$$ packed form
216d490k0729m9086P781L1982N416J7271L1350j1283l2393P36J328n265M2923
229A5541L4797k5739q625P484j9915J2588K7582k6850j7182L2775J3002k0049
241B5409l458p81k9113n089L1923j2527l3576J8827O384l0806n928O76l441K4263
255a7237J8988r778j2391n091J096J2621J8358R83r410J7840J6536k2358p996
268B161J0477j6924k537L3799J2254j1424j935o448k1538r646J4081J0027n897
281F450j363k33j1068j1474n890j795R116N564m794J745L700J77J1496K425k1771
296a7715n500K7702K3505o192k1298j3051J625J2248K0376L766j9196l675J0697
309A3292k403q829n911N272J5000%j2236o103m218P40j700j3617l688J2091J4121
$$ plain form
324 1811 10531 -318 -15580 -16905 -18020 -9783 8626 10341 6576 5636 -508 -2279 1712 7310 9084
339 9084 -2076 -1912 15968 17366 6723 1013 -1300 6260 10939 5675 5012 3570 -2477 -3437 -9356
354 -9356 -17840 -13177 1503 10851 -1867 -22852 -21857 -9885 -3360 3054 4492 68 1173 3348
368 3348 3970 3017 -4631 -8078 1449 10521 12541 10445 6716 2062 -2748 -2984 2926 5856 6308 11973
384 11973 11182 -613 -11473 -12943 -1605 5945 -3426 -9840 -5693 -3817 809 3107 -8793 -14003
398 -14003 -2313 9967 13219 6470 -4075 -9183 -6681 2663 5039 4801 11081 2297 -13880 -6448
412 -6448 -1345 -6054 5525 10303 -2955 -2709 5181 -2138 -7598 621 1071 -11111 -4689 9432 3261
427 3261 7302 13880 -12528 -21837 7558 15529 7682 16170 8238 -10328 2719 16310 -4434 -11379
$$ packed form
324A811Q720j0849j5262j325j115Q237J8409J715l765r40o144j771L991N598J774
339I084j1160J64J7880J398j0643n710k313P560M679n264o63j442o047r60n919
354i356q484M663J4680R348j2718k0985R95J1972O525O414J438m424J105K175
368C348O22r53p648l447R527R072K020k096l729m654m810k36N910K930M52N665
384A1973p91j1795j0860j470J1338P550r371o414M147J876M626K298j1900n210
398a4003J1690J2280L252o749j0545n108K502R344K376k38O280q784j6177P432
412f448N103m709J1579M778j3258K46P890p319n460Q219M50j2182O422J4121o171
427C261M041O578k6408r309K9395P971p847Q488p932j8566J3047J3591k0744o945
$$ plain form
441 -11379 10396 5851 -10633 1961 -2353 -21723 1172 13795 -20793 -21408 7378 -3292 -12276
454 -12276 6580 -8652 -29880 1088 17696 -9457 -4058 15489 -9843 -13965 19326 9574 -6531
467 -6531 27147 27950 -8836 9139 27441 -9928 -6739 31591 12368 -6927 16851 1445 -30354
480 -30354 -2052 15726 -18684 -14613 12233 -18777 -32482 3011 -10879 -30615 11855 10487
492 10487 -41295 -26133 8304 -6494 3353 29232 -5365 -33068 8032 25460 5383 29699
504 29699 38101 -10685 -7560 26139 3871 6734 50113 24757 -22213 -8291 -3031 -22514 7242
517 7242 36906 -2518 -30555 -14444 -27373 -31568 11201 9423 -26331 -12009 -5557 -34377 -16890
530 -16890 16525 -764 -9004 13676 -52 -21700 7246 29097 13277 16485 21898 -4627 -6216
$$ packed form
441a1379K1775m545j6484J2594m314j9370K2895J2623l4588o15K8786j0670q984
454a2276J8856j5232k1228L0968J6608k7153N399J9547k5332m122L3291r752j6105
467f531L3678Q03l6786J7975J8302l7369L189L8330j9223j9295K3778j5406l1799
480c0354K8302J7778l4410M071K6846l1010j3705L5493j3890j9736M2470j368
492A0487n1782J5162L4437j4798R847K5879l4597k7703M1100J7428k0077K4316
504B9699Q402m8786L125L3699k2268K863M3379k5356m6970J3922N260j9483K9756
517G242K9664l9424k8037J6111j2929m195M2769j778l5754J4322O452k8820J7487
530a6890L3415j7289q240K2680j3728k1648K8946K1851j5820L208N413k6525j589
$$ plain form
543 -6216 19081 17136 14217 26838 6760 -21074 -6994 6065 -3498 4989 13878 -7387 -20528
556 -20528 -14089 -17224 -15168 5324 11133 -4454 -15520 -22489 -20933 2495 16959 2726 -4646
569 -4646 -226 -5175 -888 10881 7427 6128 10807 2395 -3603 3678 7041 9546 12839 -3 -17396
584 -17396 -8204 10418 5415 2446 7725 -10196 -19596 1851 5247 -1396 9752 1937 -17935 -5407
598 -5407 10185 292 1467 10689 -6370 -15487 9551 10937 -8910 6326 13073 -16230 -11458 10237
612 10237 -3047 -1950 17794 -4649 -27758 -3911 6695 -7457 7518 15613 -16335 -15976 13587
625 13587 -1705 -13613 17949 15333 -10419 7736 11072 -19688 -3653 28005 6838 -4721
637 -4721 13518 -5337 -22247 11736 19648 -10311 590 13055 -19207 -19294 12792 -421 -11730
$$ packed form
543f216K5297j945k919J2621k0078k7834J4080J3059r563Q487Q889k1265j3141
556b0528O439l135K056K0492N809j5587j1066o969J556K3428J4464j4233p372
569d646M420m949M287J1769l454j299M679q412n998P281L363K505L293j2842j7393
584a7396R192J8622n003k969N279j7921r400K1447L396o643J1148p815j9872J2528
598e407J5592r893J175R222j7059r117K5038J386j9847J5236O747k9303M772K1695
612A0237j3284J097J9744k2443k3109K3847J0606j4152J4975Q095l1948L59K9563
625A3587j5292j1908L1562k616k5752J8155L336l0760J6035L1658k1167j1559
637d721J8239j8855j6910L3983P912k9959J0901J2465l2262q7L2086j3213j1309
$$ plain form
650 -11730 15501 1868 -32623 -9947 10049 -7392 4640 20217 -13286 -26088 4959 6020
662 6020 -4366 20484 18536 -19023 -10984 12498 -3589 1952 28201 6074 -14101 5880 1516
675 1516 -15739 8958 23553 -2129 -7569 2937 -13053 -12422 18154 9413 -17847 -3115 3509
688 3509 -14817 -2098 10566 -9104 -8401 9445 -3501 -14386 3643 7191 -6139 2435 7774
701 7774 -9223 -4926 12071 927 -3488 12343 4788 -9029 2593 6436 -3636 3199 10588
714 10588 -624 -2571 5292 -3754 -10289 3979 9282 -353 -1441 -3076 -11234 -2087 9137 -890
728 -890 -8261 -1138 -1326 -3507 2597 1378 -4745 -939 1635 -3648 -2746 4924 5060 118 -841 -2469
744 -2469 -3245 4389 7130 882 629 602 -3535 -600 4324 2660 1061 -583 -3303 -1494 3146 4094
$$ packed form
650a1730K7231j3633l4491K2676J9996j7441J2032J5577l3503j2802L1047J061
662F020j0386K4850j948l7559Q039K3482j6087N541K6249k2127k0175J9981m364
675A516j7255K4697J4595k5682n440J0506j5990O31L0576q741k7260J4732O624
688C509j8326J2719J2664j9670P03J7846j2946j0885J8029L548j3330Q574N339
701G774j6997M297J6997j1144m415J5831p555j3817J1622L843j0072O835P389
714A0588j1212j947P863r046o535J4268N303r635j088j635q158R147J1224j0027
728h90p371P123j88k181O104j219o123L806K574n283R02P670J36m942r59j628
744b469p76P634K741o248k53k7m137K935M924j664j599j644k720J809M640R48
$$ plain form
760 4094 -1322 -6141 -2450 977 1946 1855 -2945 -3355 822 -1193 -2710 -393 395 1617 1631 -2381 -3735
777 -3735 -910 3110 3559 -719 -2294 -619 1285 4054 2368 -1756 -507 -196 -67 3616 3935 -969
793 -969 -3017 -1399 906 1827 252 -731 -2060 -1716 -228 -986 -2083 -305 618 143 -1546 -3726 -1858
810 -1858 3286 3381 -956 -2889 -1003 2244 3605 2309 -542 -1690 -614 2086 3755 2273 495 -1495
826 -1495 -1638 95 732 870 1280 -1845 -3057 -720 -189 -1491 -2065 -1362 734 -848 -2883 -695 745
843 745 1506 709 -2864 -2548 1159 3549 4884 933 -5174 -2021 3226 3835 2210 -38 -1038 -628 74
860 74 1758 469 -1476 155 -650 -1007 1074 -27 -1265 944 -1212 -3161 -257 1117 697 1336 921
877 921 -2543 -4091 474 3465 1258 698 -975 -4282 -190 4533 413 -3017 -939 -1143 -222 3392
$$ packed form
760D094n416m819L691L427R69r1m800m10M177k015j517K317P88J222J4m012j354
777c735K825M020M49m278j575J675J904K769j686m124J249L11J29L683L19m904
793i69k048J618K305R21j575r83j329L44J488p58j097J778R23m75j689k180J868
810a858N144R5m337j933J886L247J361j296k851j148J076K700J669j482j778j990
826a495j43J733O37J38M10l125j212K337N31j302n74P03K096j582k035K188J440
843G45P61p97l573L16L707K390J335l951o107L153N247O09j625k248j000M10P02
860G4J684j289j945J631q05l57K081j101j238K209k156j949K904J374m20O39m15
877I21l464j548M565K991k207n60j673l307M092M723m120l430K078k04R21L614
$$ plain form
893 3392 1818 -3532 -1512 2047 -825 -209 3584 747 -1019 2931 783 -3667 1122 4334 -397
908 -397 168 2089 -3101 -1822 4784 651 -4674 -1346 -596 -2117 2123 2763 -4780 -6033 1349 544
924 544 -1683 2553 -1228 -6275 1403 3548 -1461 2187 4229 -1660 -1431 3204 1280 166 5023 4032
940 4032 -3866 -2274 2189 -356 2584 5999 -2617 -6569 -1658 -1265 413 4884 317 -6340 -4246
955 -4246 -1165 -2053 72 3096 -745 -2987 936 -2342 -3820 3657 4818 809 1706 -810 -4450 1670
971 1670 6025 2365 1179 2132 -2134 -2270 2415 654 -1177 3382 2242 -3817 -1741 -985 -4631 237
987 237 5789 -970 -4103 -816 -4790 -4450 5928 4915 -3533 -467 -846 -6908 284 8741 2246 -65
1003 -65 4815 -3011 -8826 3734 8242 679 4500 3474 -10318 -5873 7836 1909 -732 5875 -3837
$$ packed form
893C392j574n350K020L559k872O16L793k837j766L950k148m450M789L212m731
908c97N65J921n190J279O606m133n325L328P50j521M240O40p543j253P382q05
924E44k227M236l781n047P678K145n009L648K042n889K29M635j924j114M857r91
940D032p898J592M463k545K940L415q616l952M911L93J678M471m567o657K094
955d246L081q88K125L024l841k242L923l278j478P477J161m009Q97k516l640O120
971A670M355l660j186R53m266j36M685j761j831M559j140o059K076P56l646M868
987B37N552o759l133L287l974L40J0378j013q448L066l79o062P192Q457o495k311
1003f5M880p826n815J2560M508p563L821j026j3792M445J3709n927k641O607r712
$$ plain form
1018 -3837 -11230 1522 5424 -4847 570 5682 -8829 -7813 8197 -490 -7538 7798 3519 -10869
1032 -10869 1648 7511 -5384 1219 11655 -3551 -8792 7783 4636 -5478 6779 5360 -11559
1045 -11559 -337 11250 -6075 -5786 8662 -3614 -10307 7549 2772 -11785 2450 8566 -10318
1058 -10318 -6453 8909 -3993 -6814 12244 3040 -13158 2638 6660 -8381 3233 13975 -4853
1071 -4853 -6295 9586 -1482 -8778 9822 7843 -8309 2462 6226 -12576 -5513 12889 326
1084 326 -6480 6742 -3987 -16963 3832 11687 -5689 -211 7196 -10977 -9821 9768 3895
1097 3895 -3646 9616 4376 -13530 -2920 8466 -1489 4102 14259 -4266 -13573 2919 2640
1110 2640 -3273 9567 7371 -11621 -7659 3073 -4120 -2320 9892 919 -10346 -271 372 -8233
$$ packed form
1018c837p393J2752L902j0271N417N112j4511J016J6010q687p048J5336m279j4388
1032a0869J2517N863j2895O603J0436j5206n241J6575l147j0114J2257j419j6919
1045a1559J1222J1587j7325K89J4448j2276o693J7856m777j4557J4235O116j8884
1058a0318L865J5362j2902k821J9058r204j6198J5796M022j5041J1614J0742j8828
1071d853j442J5881j1068p296J8600j979j6152J0771L764j8802P063J8402j2563
1084C26o806J3222j0729j2976K0795P855j7376N478P407j8173J156J9589n873
1097C895p541J3262n240j7906J0610J1386r955N591J0157j8525r307J6492k79
1110B640n913J2840k196j8992L962J0732p193J800J2212q973j1265J0075O43q605
$$ plain form
1124 -8233 3566 10488 -2525 -3202 2923 -4988 -4582 8978 6817 -2341 1946 1973 -6187 -67 7571
1139 7571 -169 -1236 5753 -1119 -6949 197 192 -3085 3065 3535 -6723 -6879 -745 -1293 77 4503
1155 4503 -529 -6045 -1587 -29 -1014 3621 5111 -465 -1108 890 -1195 726 5846 3531 742
1170 742 830 -923 -1637 2583 3805 873 -808 -2272 -3486 -668 2448 -364 -3331 -3029 -3143 -2115
1186 -2115 801 -717 -3236 -270 -368 -3098 -139 1719 -320 1717 2414 -1366 -1208 3407 3482 1118
1202 1118 2346 1616 -1715 1577 4640 247 -192 1674 -1889 -2047 2790 698 -3006 -512 1 -3492
1218 -3492 -1300 635 -3261 -2536 1984 -907 -3887 345 110 -2754 1378 2113 -2107 -20 3920 244
1234 244 -1422 2524 1613 -355 2609 2484 -2149 -429 2804 405 190 2518 -985 -3419 749 1717
$$ packed form
1124h233J1799O922j3013o77O125p911M06J3560k161r158M287K7q160O120P638
1139G571p740j067O989o872n830P146nl277O150M70j0258j56O134n48J370M426
1155D503n032n516M458J558r85M635J490n576o43J998k085J921N120k315k789
1170G42Q8j753p14M220J222k932j681j464j214K818L116k812k967L02j14J028
1186b115K916j518k519K966r8k730K959J858k039K037O97l780J58M615P5k364
1202A118J228p30l331L292L063m393m39J866l563j58M837k092l704K494N13l493
1218c492K192J935l896P25M520k891k980M232k35k864M132P35m220K087L940l676
1234B44j666L946r11j968K964j25m633J720L233k399k15K328l503k434M168R68
$$ plain form
1250 1717 -818 632 331 -4122 -1841 1961 -386 -1594 546 -253 -2713 -486 420 -1373 995 2837
1266 2837 -1292 -2810 779 1172 960 2321 -195 -2702 185 2545 1261 310 638 -523 -624 1524
1282 1524 1089 -629 724 493 -1317 -91 1201 -464 -326 319 -860 -866 -221 364 -485 -594 -23 -1468
1300 -1468 -1664 667 752 -118 -153 -1437 -861 1443 1744 292 -704 -750 308 1304 1544 486 -566 115
1318 115 766 414 487 790 38 86 -359 -696 -251 503 583 102 -739 -1042 -1003 16 625 128 -1374 -1359 -613
1339 -613 620 1362 373 -1110 -1283 244 936 1197 462 -392 -318 741 467 123 106 185 590 -43 -409 -416
1359 -416 400 637 310 -863 -582 -77 282 1345 220 -947 -682 -264 580 1360 486 -603 -873 -570
1377 -570 676 984 103 -584 -1194 -217 501 -136 -7 -317 -1088 -367 -467 -1035 560 837 68 -579 -938
$$ packed form
1250A717k535J450l01m453K281L802k347j208K140p99k460K227R06j793K368J842
1266B837m129j518L589L93k12J361k516k507K887K360j284r51L28j161j01K148
1282A524m35j718J353k31j810J226J292j665J38O45j179oO45N85q49j09N71j445
1300a468j96K331Q5q70l5j284N76K304L01j452r96m6J058R96K40j058j052O81
1318A15O51l52P3L03p52M8m45l37M45P54Q0m81q41l03L9J019O09m97j502J5P46
1339f13J233P42r89j483j73J527O92K61p35q54P4J059k74l44j7P9M05o33l66p
1359d16Q16K37l27j173K81N05L59J063j125j167K65M18Q44P80q74j089k70L03
1377e70J246L08q81o87o10R77P18o37J29l10p71P21j00n68J595K77p69o47l59
$$ plain form
1396 -938 -456 685 1929 1267 -433 -528 771 400 1427 1722 -117 -599 871 610 207 483 366 -1478
1414 -1478 -62 1028 -845 -1290 -105 -1289 -1262 291 -437 -2300 -453 493 -1661 -668 1353 -108
1430 -108 -440 1493 -717 -1845 2231 2952 132 1093 990 -1809 152 3979 1352 -1204 1165 -303
1446 -303 -2704 1438 3142 -1796 -1180 1118 -2789 -2584 2053 5 -2223 915 -28 -4305 -1248 2684
1462 2684 -670 -664 2667 -2287 -3841 3386 2507 -1905 1468 2097 -2693 159 3767 -612 -2078 3154
1478 3154 935 -3171 1885 2396 -3107 328 3604 -2754 -2343 2934 -663 -2780 2674 806 -4076
1493 -4076 441 2497 -2632 -908 3377 -1807 -2433 3687 361 -4202 1507 2873 -2570 -45 2233
1508 2233 -3049 -1731 4560 553 -3375 706 182 -3611 1291 3869 -1720 -1510 2177 -2382 -2883 3349
$$ packed form
1396i38M82J141J244o62j700r5J299l71J027K95j839m82J470k61m03K76j17j844
1414a478J416J090j873m45J185j184K7J553p28j863J847R46k154R93K021j461
1430a08l32J933k210j128M076P21k820R61j03k799J961L827k627k556K369j468
1446c03k401M142J704m938O16K298l907K05M637k048k228L138r43m277L057L932
1462B684l354OL331m954j554P227q79m412L373O29m790K852L608m379j466N232
1478C154k219m106N056N11n503L435L276o358M11N277l597k117N454j868m882
1493d076M517K056n129J724M285n184o26O120l326m563N709J366n443K525K278
1508B233n282J318O291m007l928M081n24l793M902K578n589K10L687m559n01O232
$$ plain form
1524 3349 2447 -1379 1599 708 -4478 -344 4378 842 580 2321 -2224 -4035 1548 3479 460 1380
1540 1380 504 -4861 -2946 2450 1181 52 2020 -1612 -4807 -1273 164 -286 2173 2075 -2279 -3369
1556 -3369 -973 -49 1383 3868 1537 -1948 -1112 -319 184 2601 3269 781 -116 -340 -1231 -2 1954
1573 1954 2079 1424 503 -2002 -2929 -952 674 1137 1902 -765 -4107 -2485 -652 -1004 1229 2075 -1430
1590 -1430 -2359 -1165 -2133 -1209 3604 3013 -999 -668 -678 -2480 1677 5404 1285 -738 910 -1295 -2085
1607 -2085 3383 3782 -829 650 607 -3845 -1279 3540 329 -1433 1454 -1339 -4895 294 2148 -1928
1623 -1928 238 2224 -3523 -3511 2748 959 -2403 2196 525 -4274 1120 3692 -1698 -755 3799 -776
1639 -776 -2280 3288 1152 -3415 2475 3257 -3646 -801 3595 -1825 -1433 3581 -618 -4170 1775 2164
$$ packed form
1524C349r02l826K978q91n186M134M722l536k62J741m545j811N583J931l019R20
1540A380q76n365J915N396j269j129J968l632l195L534J437m50K459r8m354j090
1556c369K396R24J432K485k331l485Q36P93N03K417O68k488q97k24q91J229J956
1573A954J25o55r21k505r27J977J626M63P65k667l342J622J833l52K233Q46l505
1590a430r29J194r68R24M813n91m012L31j0j802M157L727m119k023J648k205p90
1607b085N468L99m611J479m3m452K566M819l211j762K887k793l556N189J854m076
1623a928K166J986n747J2O259j789l362M599j671m799N394K572n390R43M554m575
1639g76j504N568k136m567N890P82o903K845M396n420L92N014m199l552N945L89
$$ plain form
1655 2164 -3344 168 2896 -2840 -1560 3206 -1394 -3445 2649 1141 -3215 1189 1838 -3638 -190
1670 -190 3815 -1313 -2076 2649 -739 -3492 2605 2938 -2646 -26 1786 -2627 -1355 4110 677 -1906
1686 -1906 2236 648 -3489 644 2872 -893 277 2270 -2509 -2902 2442 1867 -949 1045 -97
1701 -97 -4008 -408 2752 -842 -982 1555 -1349 -2699 1210 758 -1640 1201 1537 -1641 -1156 1323
1717 1323 18 -97 2411 833 -1694 1132 1475 -404 747 1439 -913 -478 1478 -103 -1139 296
1733 296 -207 -910 81 475 -1747 -1338 184 -673 -702 235 -758 -1852 -182 504 18 428 605 98 -124
1752 -124 978 416 410 1319 1325 339 98 371 111 1139 1000 -242 -807 -437 -177 167 -56 -849 -1451 -844
1772 -844 -467 -683 -34 -442 -551 -526 -678 -447 21 452 587 133 19 246 263 1145 963 403 211 545 593
$$ packed form
1655B164n508L512K728n736J280M766m600k051O094j508m356M404O49n476L448
1670a90M005n128p63M725l388k753O097L33n584K620J812m413J272N465l433k583
1686a906M142j588m137M133K228l765J170J993m779l93N344n75k816J994j142
1701i7l911L600L160l594j40K537k904j350L909m52k398K841L36l178M85K479
1717A323j305j15K508j578k527K826L43j879J151O92k352M35J956j581j036J435
1733B96n03p03R91L94k222M09J522q57k9R37r93j094J670O86m86M10J77n07k22
1752a24J102n62oR09Or86k41K73k60J028j39j242n65L70K60L44k23p93o02O07
1772h44L77k16O49m08j09K5j52K31M68M31J35m54j14K27J7Q82j82n60j92L34M8
$$ plain form
1793 593 1134 1082 -30 -356 -291 -79 239 227 -204 -1181 -953 -297 -443 -301 -40 -626 -658 -64 -39 -232 138
1814 138 137 -19 -43 87 560 355 929 457 -483 -7 355 437 1053 97 -777 -562 414 492 5 -263 -706 -437
1836 -437 7 499 -22 -65 129 -298 38 354 -65 238 570 29 -232 11 203 624 332 232 -447 -522 51
1857 51 292 158 -236 -666 -725 52 52 -111 -434 -289 -444 -100 771 25 -387 26 292 277 538 661 381 652
1879 652 515 181 -180 816 1082 -11 310 -212 -818 203 555 -120 -846 -452 -769 -742 41 -96 -1090 -871
1899 -871 -231 -654 -497 685 -187 -839 254 -182 -448 396 951 -118 188 645 118 39 976 1118 -386
1918 -386 269 395 -515 318 1192 -719 -974 232 -370 84 870 121 -1056 -393 485 -746 -232 235 -682
1937 -682 -885 497 -152 -844 374 83 -852 44 747 -346 -53 699 -280 -606 675 516 28 485 266
$$ packed form
1793E93N41n2j112l26O5K12L18j2m31r77K28O56j46J42K61n86l2N94K5j93L70
1814A38jj56k4J30M73k05N74m72r40M76L62Q2O16r56q74K15R76P8m87k68m43K69
1836d37M44M92n21m3J94m27L36L16m19L03L32n41k61K43J92M21k92j00o79p5N73
1857E1K41j34l94m30n9P77%j63l23J45j55L44Q71p46m12M13K66j5K61J23k80K71
1879F52j37l34l61R96K66j093L21n22o06J021L52o75p26L94l17K7P83j37r94K19
1899h71O40m23J57J182q72o52J093m36k66Q44N55j069L06M57n27p9R37J42j504
1918c86O55J26r10Q33Q74j911k55J206o02M54P86p49j177O63Q78j231N14M67r17
1937f82k03J382o49o92J218k91r35Q96P03j093K93P52r79l26J281j59m88M57k19
$$ plain form
1956 266 -970 -34 1074 870 -243 281 -824 -699 1040 982 -121 -11 -314 -982 247 1013 388 638
1974 638 -146 -1127 -898 90 552 15 352 -493 -1741 -660 210 70 577 168 -1485 -1085 141 -40 416
1993 416 864 -96 -1186 -29 197 -212 968 1531 43 43 812 -919 -267 2404 1086 -332 793 -121
2011 -121 -1709 421 1657 -497 -148 1014 -1652 -2242 516 191 -1156 1154 651 -2779 -1464 624
2027 624 -1155 17 2699 -772 -2593 84 171 -979 2305 3111 -1593 -1012 1352 -833 -424 3605
2043 3605 1407 -1892 667 394 -2601 802 4100 -704 -1747 1022 -2029 -2390 2496 1773 -2281 -234
2059 -234 621 -3275 -808 3219 -488 -2115 1943 -636 -3404 1671 2334 -1840 689 2600 -1884 -1717
2075 -1717 2962 371 -1440 2169 794 -3087 647 2773 -1883 -444 2822 -1368 -2474 1919 130
$$ packed form
1956B66j236R36J108k04j113N24j105J25J739n8j103J10l03o68J229P66o25K50
1974F38p84r81K29R88M62n37L37q45j248J081Q70j40N07m09j653M00J226j81M56
1993D16M48r60j090J157K26m09J180N63j488%P69j731O52K671j318j418J125r14
2011a21j588K130J236k154L49J162k666n90K758l25j347K310n03l430J315K088
2027F24j779J172K682l471j821K677Q7j150L284Q06m704N81K364k185M09M029
2043C605k198l299K559k73k995L403L298m804j043K769l051l61M886p23m054K047
2059b34Q55l896K467M027l707j627M058k579k768N075O63m174K529J911m484J67
2075a717M679k591j811L609j375l881L734K126m656J439L266m190j106M393j789
$$ plain form
2090 130 -2550 1450 1874 -2707 -960 2011 -1495 -1160 3100 -322 -2698 1342 701 -2390 1275 2506
2106 2506 -1984 -1166 1848 -1205 -1608 2700 1102 -2352 659 1167 -2303 555 2967 -686 -1172 969
2122 969 -838 -1694 2218 1920 -1359 75 498 -2008 -276 2539 348 -638 872 -408 -2010 897
2138 897 1905 -78 168 731 -1828 -1353 1509 701 -315 860 -516 -2244 -278 1125 12 96 688
2155 688 -1095 -1206 276 264 65 773 767 -1017 -397 53 -346 852 1451 109 -329 -72 -293 -163 1023
2174 1023 917 -117 112 -219 -798 150 424 118 304 46 -975 -956 -224 -347 458 672 -364 -1351 -483
2193 -483 -4 57 1215 670 -714 -297 165 -324 183 1341 385 -464 109 -78 -280 686 1414 -28 -398
2212 -398 49 -741 -348 1383 439 -858 -38 -23 -655 431 880 -424 -572 570 -451 -694 672 379
$$ packed form
2090A30k680M000M24m581J747K971l506L35M260l422k376M040o41l091L665J231
2106B506m490Q18L014l053m03M308j598l454L011N08l470K858K412l653m86K141
2122I69j807q56L912k98l279J434M23k506J732K815k191r86J510j280j602K907
2138H97J008j983K46N63k559M75K862q08j016J175j376j728J966J403j113Q4N92
2155F88j783j11J482j2j99P08oj784O20M50l99J198N99j342m38K57k21J30J186
2174A023j06j034K29l31n79R48K74l06J86k58j021J9P32j23Q05K14j036r87Q68
2193d83M79O1J158n45j384M17M62m89N07J158r56q49N73j87k02R66P28j442l70
2212c98M47p90L93J731r44j297Q20J5o32J086M49j304j48J142j021k43J366k93
$$ plain form
2230 379 -956 529 635 -705 -16 722 -258 -426 685 156 -839 379 645 -492 -177 771 -444 -111
2248 -111 836 -498 -900 306 402 -352 34 199 -754 73 1087 75 -533 458 -13 -533 620 678 -659
2267 -659 104 310 -245 -120 503 491 -322 119 194 -658 -18 515 -315 -315 16 -895 -442 323 182 -263 -221 114
2289 114 -702 149 409 -146 -468 42 -455 -244 470 537 -23 161 27 211 238 442 283 -242 383 176 -351
2310 -351 385 606 131 -353 -107 123 -126 231 -34 -345 -245 -70 -442 -129 77 -263 -220 145 -196 63
2330 63 51 99 127 -149 -38 22 256 386 56 -148 143 176 322 546 -102 -261 -214 104 25 428 109 -369 -495
2353 -495 125 -70 88 2 -207 -156 -307 0 -234 165 -13 -297 61 46 152 180 324 279 -301 -75 187 184
2375 184 608 -106 -244 -211 113 184 186 186 -191 -314 -176 274 282 -28 -46 -459 -29 211 100 164 -127 -214 60 140
$$ packed form
2230C79j335J485J06j340O89P38r80j68J111n29r95J218K66j137L15R48j215L33
2248a11R47j334m02J206R6p54L86J65r53Q27J014j012o08R91m71n20J153N8j337
2267f59P63K06n55J25O23j2q13M41P5q52O40N33q30%L31r11M53P65j41m45M2L35
2289A14q16Q51K60n55l22N10m97K11P14O7n60J84j34J84K7K04j59n25O25k07n27
2310c51P36K21m75m84K46K30k49L57k65l11J00J75l72L13K06l40M3L65l41K59
2330F3j2M8K8k76J11O0K34J30l30k04K91L3J46K24o48j59M7L18p9M03l19m78j26
2353d95O20j95J58q6k09N1j51L07k34L99j78k84L58j5J06K8J44m5n80K26K62l
2375A84M24p14j38L3L24P1K%l77j23J38M50Ql10j8m13M30K40j11O4k91q7K74Q0
$$ plain form
2399 140 220 217 217 295 -396 102 426 306 116 49 -357 -354 67 75 57 147 -494 -439 -385 365 9 -58 -75 -437 -488 243
2425 243 234 -226 301 333 -386 -29 601 34 -128 587 108 -244 64 678 -225 240 580 -164 -198 413 -152
2446 -152 -344 401 269 -606 89 460 -805 -306 197 -422 -646 593 -153 -1310 -19 519 -540 18
2464 18 563 -413 -810 1004 -357 -446 1340 1011 -764 -51 677 -534 192 1312 -315 -1149 388 85
2482 85 -443 910 816 -1201 -504 568 -725 -396 1161 58 -1339 16 67 -1248 575 1173 -805
2499 -805 -570 694 -654 -652 1461 836 -883 467 606 -793 425 1506 -292 -766 848 -269 -886
2516 -886 844 582 -947 268 855 -1112 -806 812 -311 -542 1163 -59 -1287 -26 653 -658
2532 -658 160 1188 -536 -780 552 104 -532 985 853 -778 -70 204 -289 55 1308 -365 -843 59
$$ packed form
2399A40Q0l%P8o91M98L24j20j90o7m06LM21Qj8R0o41N5N4P50l56o7j7l62n1P31
2425B43rm60N27L2p19L57O30n67j62P15m79l52L08O14r03M65L40p44l4O11n65
2446a52j92P45j32q75O95L71j265M99N03o19k24J239p46j157J291N38j059N58
2464A8N45r76l97J814j361q9J786l29j775P13P28j211P26J120j627q34J537l03
2482H5n28J353r4k017O97J072j293L29J557j103j397J355N1j315J823N98j978
2499h05K35J264j348KK113o25j719J350J39j399J218J081j798m74J614j117o17
2516h86J730k62j529J215N87j967L06J618j123k31J705j222j228J261O79j311
2532f58Q18J028j724k44J332m48o36J517j32j631P08K74m93L44J253j673m78R02
$$ plain form
2550 59 -217 -743 559 530 -1047 -679 167 -627 20 918 -2 -731 -46 86 -241 566 1107 15 -116 -120
2570 -120 -577 -61 908 956 -37 -234 -640 -706 189 712 84 168 -448 -990 -281 293 170 365 196 -604 -625
2591 -625 23 -91 348 729 150 -1004 -122 93 -22 821 1186 -252 -439 280 -744 -258 1097 328 -642
2610 -642 282 153 -1218 -360 1102 50 -485 464 -575 -1395 473 750 -182 628 669 -1469 -461 966
2628 966 110 100 1445 -119 -1649 -55 904 -562 1087 1764 -975 -1313 667 -34 -378 1472 522
2645 522 -1513 -738 637 -934 135 1635 -350 -1664 478 -23 -1042 1097 1427 -896 -189 942
2661 942 -765 -359 1805 173 -1157 558 64 -1127 476 1397 -648 -444 1060 -578 -1219 915
2677 915 236 -1121 664 779 -1409 -366 1080 -273 -531 1224 -109 -1075 751 670 -845 165 1077
$$ packed form
2550E9k76n26J302k9j577L68Q46p94O47Q98r20p29O85J32l27Q07N41j092j31m
2570a20m57N16R69M8r93j97m06o6Q95N23o28Q4o16n42P09N74j23J95j69q00k1
2591f25O48j14M39L81n79j154Q82K15j15Q43L65j438j87P19j024M86J355p69r70
2610f42R24j29j371Q58J462j052n35R49j039q20J868K77r32Q10M1k138J008J427
2628I66q56j0J345j564j530J594R59j466J649O77k739l38J980p01l44J850r50
2645E22k035P75J375j571J069J500j985j314K142n01j019K139L30k323P07J131
2661I42j707M06K164j632j330J715m94j191J603R21k045K04J504j638o41K134
2677I15o79j357J785J15k188J043J446j353k58J755j333r66J826q1j515J010R12
$$ plain form
2694 1077 -715 -509 926 -175 -669 989 482 -977 115 204 -856 -8 1099 -353 -687 -2 -397
2711 -397 -666 670 834 -1067 -269 178 -578 -59 1110 95 -521 324 285 -574 380 891 -338 -235 308
2730 308 -428 8 785 328 -348 1 -188 -463 87 550 128 -374 81 -6 -25 605 148 -675 -111 62 -123
2751 -123 201 172 -11 -5 367 68 -199 92 230 -93 -52 82 -88 73 197 -17 -209 -64 247 153 -51 -82
2773 -82 -401 -252 210 114 -37 249 -113 -172 273 139 99 282 -135 184 -26 214 622 46 380 133 -173
2794 -173 71 176 177 116 -196 -163 -31 -207 65 130 -101 -292 10 -26 -233 14 147 -360 -465 7 151 272
2816 272 67 83 -71 313 -48 159 84 116 -1 49 175 284 108 18 3 -276 -216 18 15 126 -79 -236 -613
2839 -613 -69 129 -218 -407 -5 -152 -280 341 145 -117 -63 23 -130 98 105 -45 42 -15 84 235 291 224 61
$$ packed form
2694A077j792K06J435j101m94J658n07j459J092Q9j060Q48J107j452l34O85l95
2711c97k69J336J64j901P98M47p56N19J169j015o16Q45l9q59R54N11j229J03N43
2730C08p36M36P77m57o76L49j89k75N50M63m22n02M55q7j9O30m57q23N64J73j85
2751a23L24k9j83OL72k99k67K91J38l23M1J34j70J61J24k14j92J45L11r4k04l1
2773h2l19J49M62r6j51K86l62n9M45j34m0J83m17L19k10K40M08n76L34k47l06
2794a73K44J05Jo1l12L3J32j76K72O5k31j91L02l6k07K47J33n07j05M72J44J21
2816B72k05J6j54L84l61K07p5L2j17N0J26J09j76r0j5k79O0K34lJ11k05j57l77
2839f13N44J98l47j89M02j47j28O21j96k62N4Q6j53K28Pj50Q7n7R9J51N6o7j63
$$ plain form
2862 61 206 -63 -60 217 282 180 -245 -276 -325 -291 11 -200 -99 -308 -96 -292 2 249 -274 -160 258 21
2884 21 20 338 117 92 -75 149 153 -83 311 152 -84 205 152 -158 88 206 -268 -89 32 87 -163 276 26
2907 26 -233 -129 232 -232 -36 234 -377 168 78 34 125 436 376 -10 -192 341 69 272 572 -195 -360 150
2929 150 153 4 320 303 -395 -344 201 -8 -166 327 -378 -462 -138 62 -430 -19 277 -181 -89 165 -50 -5
2951 -5 125 204 272 187 238 -74 213 158 -104 63 251 -134 -79 -91 -227 -64 -19 -42 -71 -62 -136 -364 -172 147 -334
2976 -334 -156 -240 -331 69 205 60 1 187 -246 -322 189 283 -146 93 205 -196 -112 524 338 6 179 -373
2998 -373 -310 509 386 -200 56 -336 -518 -293 635 10 -267 199 -368 -573 22 342 -205 566 525 -711
3018 -711 -258 564 104 -27 727 302 -451 274 476 -322 71 782 -504 -796 521 -99 -642 546 283
$$ packed form
2862F1J45k69LK77O5j02m25l1m9L4L02k11J01k09K12j96K94K47n23J14M18k37
2884B1jL18k21k5j67K24Mk36L94j59k36K89n3l10K46J18m74J79J21N5k50M39k50
2907B6k59J04L61m64J96K70o11N45r0m4R1L11o0l86j82N33k72K03L00p67j65N10
2929A50Lj49L16j7o98N1N45k09j58M93p05q4L24K00m92M11K96m58R2K54k15M5
2951eJ30P9O8q5N1l12K87n5k62J67J88l85N5j2j36J63M5k3k9Rp4k28J92L19m81
2976c34J78q4r1M00J36j45n9J86m33p6N11R4m29K39J12m01Q4O36j86l32J73n52
2998c73O3Q19j23n86K56l92j82K25R28o25k77M66n67k05N95L20n47P71m1j236
3018g11M53Q22m60j31P54m25p53P25K02p98L93P11j286k92J317o20n43J188k63
$$ plain form
3037 283 -673 22 299 -661 -174 748 229 -619 594 2 -723 428 879 -461 -31 872 -665 -657 1005
3056 1005 103 -668 598 161 -1059 91 719 -241 -84 836 -604 -1157 451 392 -721 563 658 -1338
3074 -1338 -526 731 -89 -68 948 149 -1065 117 585 -457 529 1213 -864 -532 738 65 -305 1083
3092 1083 490 -1072 -127 433 -622 -9 1247 -256 -957 312 -157 -779 699 724 -955 -24 848 -475
3110 -475 -590 900 158 -413 415 96 -968 250 1085 -347 58 925 -655 -533 771 319 -600 330
3128 330 464 -665 -164 691 19 -184 520 -41 -824 -46 117 -776 300 403 -536 -320 265 -135 -274
3147 -274 792 108 -527 -12 80 -307 486 756 -396 -174 108 -66 -333 501 387 -223 -258 -131 -218 148
3167 148 463 105 -198 -88 8 -144 469 210 -198 263 117 127 109 317 160 -99 24 -59 -125 82 62 100
$$ packed form
3037B83r56O95K77r60M87R22n19q48J213n92p25J151M51j340M30R03j537QJ662
3056A005r02p71J266m37j220J150O28r60J57R20j440n53J608n9j113J284R5j996
3074a338Q12J257q20K1J016p99j214J182M68j042R86O84k077L32J270o73l70J388
3092A083n93j562R45N60j055O13J256j503p01J269m69o22J478K5j679R31Q72j323
3110d75j15J490p42n71Q28l19j064J218Q35j432M05Q67j580J22J304m52r19R30
3128C30J34j129N01Q55o72k03P04n61p83P78J63q93J076J03r39K16N85m00j39
3147b74J066o84o35N15R2l87P93K70j152K22K82j74k67Q34j14o10l5J27q7L66
3167A48L15l58l03J10R6j52O13k59m08M61j46J0j8K08j57k59J23q3o6K07k0L8
$$ plain form
3189 100 151 -414 -418 -162 264 -111 26 -96 -345 -243 15 -115 -201 272 -7 -193 239 -191 -206 345 327 -50
3211 -50 54 337 -198 -105 441 0 -95 345 9 -321 -28 119 -58 -36 97 -625 -618 149 -37 -233 428 95
3233 95 -663 -60 353 -48 154 460 -214 -306 242 109 31 243 249 -110 51 318 -32 -138 253 193 -183 130
3255 130 68 -148 -93 -13 -475 -203 -52 -327 -252 230 52 -374 0 242 -385 -356 380 -30 -148 465 41 -128
3277 -128 -14 225 43 4 123 -163 -41 368 59 -153 184 76 -213 -191 213 -34 58 67 218 -150 206 -5
3299 -5 -103 148 15 -31 -105 145 42 197 130 42 168 177 27 84 1 251 -198 -24 223 -19 -19 245 -80 66
3323 66 -233 -66 167 -12 -59 -160 -187 -225 -130 -120 183 31 -139 214 352 -108 52 435 36 -157 18 275
3345 275 -17 98 -50 163 199 22 -74 -157 -20 -115 -27 -219 62 -149 -19 -190 -221 -228 -145 153 229 87 98 103
$$ packed form
3189A00N1n65mK56M26l75J37j22k49J02K58j30q6M73k79j86M32m30j5N51j8l77
3211e0J04K83n35R3N46m41r5M40l36l30K93J47j77K2J33p22PP67j86j96O61l33
3233I5p58O03M13m01K02L06o74r2N48j33p8K12Ol59J61K67l50j06L91o0l76L13
3255A30o2k16N5Q0m62K72J51k75P5M82j78m26L74K42o27K9P36m10j18O13m24j69
3277a28J14K39j82l9J19k86J22M09l09k12L37j08k89K2M04k47R2RJ51l68L56k11
3299er8K51j33m6p4K50j03J55o7q8J26Rj50N7q3K50m49J74K47k42%K64l25J46
3323F6k99J67K33j79m7j01k7l8R5J0L03j52j70L53J38m60J60L83l99j93J75K57
3345B75k92J15j48K13L6j77r6q3J37r5Q8j92K81k11J30j71l1pQ3K98P6j42J1N
$$ plain form
3369 103 -117 -61 143 183 21 -71 75 17 -156 33 274 -21 -26 54 18 -111 261 -155 21 -306 58 -129 -39
3392 -39 156 132 -424 50 -198 -224 166 -351 -117 57 -102 -343 93 76 157 -14 66 227 297 178 -3 -75 261
3415 261 1 -419 -80 141 -244 96 282 -140 -482 73 -555 -195 107 -43 -245 -409 -3 -192 -74 401
3435 401 410 14 -41 -53 -57 13 71 -77 104 32 -38 -22 211 84 -241 447 39 -212 33 162 54 -343 224 205
3459 205 -406 -7 300 -153 -63 200 -223 14 579 -146 -147 189 175 -426 388 19 -77 279 360 -305 -87 427
3481 427 -72 -277 366 137 -407 -172 230 -369 -133 244 -406 -1 261 -120 -401 248 269 -425 -10 182
3501 182 -336 -286 219 -99 -313 297 261 -516 -105 472 -117 120 446 -450 -185 265 129 -170 274 -18 -629
3522 -629 -99 585 -34 -132 468 -198 -176 74 135 -219 389 194 -239 -338 300 196 -160 429 64 -164 85
$$ packed form
3369A03k20N6K04M0j62r2J46n8j73J89K41k95nQ0l6j29L72m16J76l27L64j87R0
3392c9J95k4n56M74k48k6L90n17K34J74j59k41M36j7Q1j71Q0J61P0j19j81p2L36
3415B61k60m20L39K21l85L40J86m22l42N55o28L60L02j50k02j64M06j89J18M75
3435D01Rl96n5j2mP0N8j48J81p2p0J6K33j27l25O88m08k51K45J29j08l97N67j9
3459B05o11L99L07m53R0K63m23K37N65p25jL36j4o01Q14l69r6L56Q1o65K18N14
3481D27m99k05O43k29n44K35M02n99K36L77o50M05K62l81k81O49K1o94M15J92
3501A82n18N0N05l18k14O10l6p77M11N77n89K37L26q96K65M50j36k99M44k92o11
3522f29N30O84o19r8O00o66K2K50O1l54O08j95m33r9O38j04l56N89l65k28K49
$$ plain form
3543 85 146 -4 -122 179 -81 -291 104 168 -94 219 -64 -73 -101 85 -176 -88 184 -74 -37 238 87 -343 89
3566 89 62 192 39 -91 -424 -276 159 119 23 64 -157 -192 30 118 282 48 75 -187 -336 -256 -135 -54 85
3589 85 -174 -454 -92 -211 213 93 134 -253 -47 -317 53 -6 63 43 99 52 -76 312 122 138 47 220 -3
3612 -3 -468 131 429 47 -176 401 -178 -439 -7 142 -314 -58 42 -425 -127 186 -115 -173 301 203 -246
3633 -246 -134 45 -385 186 489 -439 -60 12 -233 -127 635 215 -250 386 266 -643 62 386 -339 46
3653 46 390 -278 -348 340 103 -431 -5 135 -417 -180 355 -60 -387 410 242 -302 299 311 -352 154 278
3674 278 -300 -107 457 28 -73 179 72 -243 369 236 -253 63 196 -212 -141 93 62 -388 358 101 -403
3695 -403 -70 286 -103 86 436 9 -459 9 167 -143 289 453 -87 -9 102 -259 -179 213 94 -80 59
$$ packed form
3543H5O1j50j18L01k60k10L95O4k62L13k83rk8J86k61Q8K72k58L7K75j51m30M32
3566H9k7J30j53j30l33J48M35m0r6M1k21l5K22Q8J64k34K7k62j49Q0J21Q1J39
3589H5k59k80L62j19M24j20M1l87K06k70L70n9O9k0N6m7j28L88j90J6r1J73k23
3612cm65N99K98l82k23N77n79k61M32J49m56K56J00m67K98L13l01n8M74r8m49
3633b46J12J79m30N71L03r28L79P2k45J06P62m20m65O36j20r09P05L24p25L85
3653D6L44o68p0O88k37n34M26J40n52K37N35m15l27P97j68n44O01J2o63N06J24
3674B78n78J93N64m29j01K52j07l15O12j33m89L16J33m08P1K34l1m50P46k57n04
3695d03L33L56l89J89L50m27m68M68J58l10M32J64n40P8J11l61Q0L92j19j74J39
$$ plain form
3716 59 97 -597 -39 265 -234 -156 516 -23 -160 99 359 -99 133 212 -301 48 380 -143 46 338 -109
3737 -109 -324 50 150 178 179 156 -151 -327 75 -76 -52 121 -227 -201 194 159 -64 -28 145 136 57 103 -66 388
3761 388 52 -211 -178 -67 19 81 53 -61 15 -21 32 -22 38 107 44 -167 -113 -12 -25 -10 -94 133 58 -20 31 120
3787 120 -111 -10 53 87 -183 101 93 106 65 123 -103 70 -10 82 195 -65 5 67 14 57 25 -143 232 -86 189
3812 189 215 -112 225 -17 -117 39 86 141 201 -174 43 289 22 130 -18 -45 191 71 0 -170 -6 60
3834 60 -114 -162 -11 215 49 -2 -212 -266 45 108 -215 245 192 -172 -95 337 110 -76 -94 -51 34 -172 -99 -52
3858 -52 -47 -52 24 -11 222 -103 -148 -35 90 -17 69 313 311 78 -240 28 -143 -63 57 -82 -210 87 106 -120
3882 -120 152 -215 -159 -35 -97 84 -30 -48 -74 35 89 -110 8 244 -40 -104 -4 117 52 41 24 -74 -227
$$ packed form
3716E9L8o94N58L04m99P8O72n39j37K59K60m58K32P9n13L49L32n23J89K92m47
3737a09k15L74J00K8Jk3l07j76M02j51K4J73l48K6L95l5k23L6J73rp9M6j69M54
3761C88l36k63L3J11Q6O2k8j14P6l6N3n4O0O9o3k11N4J01j3J5q4K27p5p8N1Q9
3787A20k31J01O3L4k70K84qJ3m1N8k26J73q0R2J13k60P0O2n3M3l2j68L75l18K75
3812A89K6l27L37k42j00J56M7N5O0l75K17K46k67J08j48k7K36j20p1j70J64O6
3834F0j74m8J51K26j66n1k10n4L11O3l23M60n3l64P7M32k27j86j8M3Q5k06P3M7
3858e2NnP6l5K33l25m5J13J25j07Q6K44kk33l18K68j71Q0J20j39j28K97J9k26
3882a20K72l67N6J24o2J81j14j8k6J09N4j99J18K36k84o4J00J21o5j1j7r8j53
$$ plain form
3905 -227 -68 -26 -46 166 -107 -29 -6 86 42 -44 238 -78 -49 259 22 -150 -166 26 -93 -14 203 170 139 60
3929 60 12 119 340 253 -256 126 71 -393 -173 -41 -74 -160 -57 -189 -84 -117 117 -155 -101 -118 87 -240 99
3952 99 65 21 54 87 -260 -83 92 -22 134 269 -16 -145 124 -103 -139 -170 121 -13 -91 27 -154 -246 69
3975 69 -211 -181 -209 -298 16 -71 24 79 81 -202 66 22 -244 226 1 -16 -117 225 130 -127 -135 130 -247 58 -136
4000 -136 150 -141 67 -238 -306 240 -173 -363 32 120 -376 -355 168 98 -139 147 220 -158 -333 128 77 -151
4022 -151 268 -99 -265 48 53 -49 236 384 -254 -7 72 -164 63 276 -71 -487 183 125 -92 168 123 -290
4044 -290 -141 297 -80 -115 162 62 -101 228 222 -290 105 478 355 -27 367 50 -392 183 260 -233 66
4065 66 309 -312 -399 143 -169 -175 308 57 -287 103 206 -197 140 584 -252 -254 207 -166 -283 197 258 -215
$$ packed form
3905b27J59M2k0K12k73P8K3R2m4q6K82l16K9L08k37j72j6J92j19P9K17l3l1p9
3929F0m8J07K21q7n09L82n5m64K20J32l3q6J03j32J05l3K34k72N4j7K05l27L39
3952I9l4m4L3L3l47J77J75j14J56J35k85j29K69k27l6l1K91j34p8J18j81r2L15
3975F9k80L0k8q9L14q7R5N5Kk83K68m4k66M70k25j7j01L42r5k57qK65l77L05j94
4000a36K86k91K08l05o8N46m13j90L95Q8m96K1N23p0k37K86P3l78j75M61n1k28
4022a51M19l67j66L13Nj02K85J48o38K47P9k36K27K13l47m16O70n8k17K60m5m13
4044b90J49M38l77l5K77j00j63L29on12L95L73j23l82L94l17m42N75P7m93K99
4065F6K43o21q7N42l12oM83k51l44L90J03m03L37M44q36kM61l73j17M80O1m73
$$ plain form
4087 -215 -140 304 -320 -11 974 148 -399 -79 39 -352 107 323 -188 -11 239 -253 -441 291 -4 -201
4107 -201 130 -18 -454 -236 494 8 -207 296 -76 -290 332 258 -264 -28 95 -171 -411 311 187 36
4127 36 308 -167 -450 40 265 -82 -153 471 -242 -419 327 71 -348 245 -106 -154 -44 270 -185 -90 226
4148 226 -105 -411 -203 -20 21 433 215 -9 -55 89 -35 -265 243 -54 -344 224 99 -234 345 16 119
4169 119 -88 -76 -85 -94 226 -59 -19 -109 -55 -186 87 31 -59 139 46 -54 -218 -52 147 61 49 74 -137 -80 143
4194 143 75 419 207 -156 45 -58 -46 -112 79 109 -117 67 -19 -133 409 -51 -132 -87 -3 -48 25 327 134
4217 134 -64 141 51 -64 -61 255 -135 -22 554 -201 81 12 -119 -47 5 -235 -336 181 -101 -52 228 98
4239 98 -198 -228 89 -107 -118 215 218 -125 61 107 -109 2 208 -55 -272 119 67 -227 98 50 -6 215 254
$$ packed form
4087b15P5M44o24L09R85q26n47L20J18l91M59K16n11J77K50m92j88P32k95j97
4107b01L31j48m36K18P30m86k15N03l72k14O22p4n22K36J23k66k40P22j24j51
4127C6K72m75k83M90K25l47p1O24p13j77P46k56m19N93l51m8J10L14m55R5L16
4148B26l31l06K08J83M1M12k18k24m6J44j24k30N08k97k90N68j25l33N79l29J03
4169A19k07J2rrL20k85M0r0N4j31K73n6r0J98r3j00j64J66J99q6j2K5k11N7K23
4194A43o8L44k12l63K01j03J2o6J91L0k26J84q6j14N42m60q1M5Q4m5P3L02j93
4217A34j98K05r0j15LL16l90J13N76p55K82o9j31P2N2k40j01N17k82M9K80j30
4239I8k96l0L17j96j1L33Ll43J86M6k16J11K06k63k17L91n2k94L25m8n6K21L9
$$ plain form
4262 254 -153 -422 6 66 -157 98 274 -181 -81 -110 -157 -75 159 34 -38 212 -26 -25 -79 -19 -201 61 259
4285 259 4 -11 238 61 11 275 264 -111 -84 128 105 70 -65 275 -107 -30 276 -28 -178 146 -457 -52
4307 -52 103 -311 -153 138 6 53 -112 -24 -31 -60 84 -43 -90 -68 -7 161 262 87 98 -57 -172 110 -15
4330 -15 81 -134 97 14 5 -180 -203 -16 -86 292 -44 -56 212 64 -131 -33 125 -63 -117 41 -95 -459 80
4353 80 176 -77 -99 162 91 195 104 -182 276 192 8 36 -322 79 20 -202 -55 11 145 -90 71 -76 -132
4376 -132 -20 157 -223 24 -172 32 158 129 -181 -105 34 1 337 -134 -230 -158 244 180 -205 -109 35 100 138
4399 138 122 -294 158 6 -133 137 173 99 -26 92 -89 156 -76 -57 240 84 29 -86 -79 -75 63 -110 196
4422 196 -80 -111 30 70 -25 -39 -95 35 160 3 173 9 113 49 -58 -5 -214 11 183 -98 -91 80 -178
$$ packed form
4262B54m07k69M28O0k23K55J76m55J00k9m7Q2K34j25p2K50k38Jn4O0j82K62J98
4285B59k55j5K49j77n0K64j1l75K7K12k3l5j35L40l82P7L06l04j50L24o03M05
4307e2J55m14J58K91j32M7j65Q8pk9J44j27m7K2O1J68J01j75J1j55j15K82j25
4330a5R6k15K31q3rj85k3J87p0L78l36j2K68j48j95R8J58j88n4J58j36l64N39
4353H0R6k53k2K61p1J04r1k86M58q4j84K8l58M01n9k22J47O6J34k35J61j47n6
4376a32J12J77l80K47j96K04J26k9l10P6J39l3L36m71r6P2M02o4l85R6J44O5L8
4399A38j6m16M52j52j39K70L6p4j25J18j81K45k32J9K97j56n5j15PMJ38j73L06
4422A96k76l1J41M0r5j4n6J30J25j57J70j64J04o4j07N3k09K25J72k81PJ71k58
$$ plain form
4445 -178 -124 -215 -168 -90 -236 20 186 -4 -243 104 135 -41 106 237 -281 178 116 69 -205 280 -187 -21
4467 -21 61 -73 211 336 -191 72 -78 56 -5 -84 15 -10 -136 264 -79 28 164 240 -96 57 -19 -134 156
4490 156 261 -253 -161 -5 -94 144 -89 145 -59 173 172 -49 107 5 65 179 150 -120 -262 67 50 -27 203
4513 203 -69 -47 12 41 56 -168 52 152 272 -154 -66 -84 265 132 -196 -196 56 -20 -92 -106 261 78 -73 177
4537 177 -118 -72 47 -101 -195 138 144 7 -237 -72 -67 33 20 -129 -160 -56 321 -118 186 7 -255 24 20
4560 20 -42 77 98 -89 -341 119 -53 -55 -52 25 -91 105 81 45 83 285 -86 70 82 50 -147 42 65 -74 114
4585 114 -134 44 -38 -150 -101 -289 -34 319 -121 -177 -162 40 137 -140 -6 -11 144 -91 44 68 -281 31 19
4608 19 -282 249 -43 -192 21 -32 -40 10 250 -138 -307 101 235 -171 6 87 44 -142 -60 159 140 224 39
$$ packed form
4445a78N4r1M7P8j46K56J66j90k39L47L1j76J47J31n18M59o2m7k74M85m67J66
4467b1Q2j34K84J25n27K63j50J34o1p9R9k5j26M00l43J07J36P6l36J53p6j15K90
4490A56J05n14R2J56q9K38k33K34k04K32jk21J56j02O0J14k9k70j42L29j7p7K30
4513B03k72K2N9K9J5k24K20J00J20m26Q8j8L49j33l28%K52p6p2j4L67j83j51K50
4537A77k95M6J19j48r4L33Oj37k44J65NJ00j3j49l1J04L77m39L04j79k62K79m
4560B0o2J19K1j87k52M60j72kLP7j16J96k4l6L8K02l71J56J2l2j97J89K3j39J88
4585A14k48J78q2j12M9j88K55L53m40n6J5K02R7k77J34nJ55k35J35K4l49L12j2
4608A9l01N31k92j49K13n3qN0K40l88j69M08J34m06J77Q1m3j86Q2K19j9Q4j85
$$ plain form
4631 39 -347 -340 169 -128 159 385 -7 -4 6 225 -229 -61 176 172 -69 202 -84 21 269 157 -43 -108 280
4654 280 -215 -80 -31 162 -117 -59 27 -114 5 36 -121 -99 359 -155 -256 490 224 87 218 93 64 4
4676 4 -84 -151 -146 288 36 -199 12 43 36 99 -138 87 165 -75 -241 -259 220 167 -293 362 -19 -93 -12 111 -16
4701 -16 -78 280 179 139 321 21 -47 -170 55 -195 57 75 -7 -109 48 -184 -101 154 199 107 -87 116 -238
4724 -238 16 96 13 182 105 -92 -485 152 226 -14 -101 -143 37 -231 114 168 208 -25 5 -181 -18 -12 -150 -182
4748 -182 -127 -75 -77 24 -33 251 -168 56 -142 -31 139 -47 -20 63 267 22 -17 21 -84 -7 -79 216 45 -236
4772 -236 126 -117 -128 217 49 -178 -58 -264 -3 -32 -119 19 170 -67 -197 122 -95 94 216 139 26
4793 26 163 10 -213 255 84 29 143 173 -5 224 -22 -305 -113 245 18 -106 224 111 -97 177 -11
$$ packed form
4631C9l86PN09k97K87K26l92LJ0K19m54J68K37mk41K71k86J05K48j12k00o5L88
4654B80m95J35M9J93k79N8Q6j41J19L1j57K2M58n14j01P46k66j37J31j25k9o0
4676Dq8o7NM34k52k35K11L1pO3k37K25P8k40j66j8M79n3m60O55l81p4Q1J23j27
4701a6o2L58j01m0J82l00o8j23K25k50K52J8q2j02J57k32Q3K55M5r2j94K03l54
4724b38K54Q0q3J69p7j97l93O37P4k40q7m2J80k68L45N4M0k33L0j86J63Oj38l2
4748a82N5N2kJ01n7K84m19K24j98J11J70j86K7Q3K04k45l9L8j05P7p2K95j71k81
4772b36L62k43j1L45j68k27J20k06K61k9q7J38J51k37j30L19k17J89J22p7j13
4793B6J37j53k23M68j71n5J14L0j78K29k46k83J92L58k27j24L30j13k08K74j88
$$ plain form
4814 -11 -83 -79 120 -237 -60 -74 -7 -136 -163 94 -134 95 98 -128 -122 57 151 -17 238 -10 -41 50 72 -156 -18
4839 -18 24 -114 -113 165 -100 -139 -19 -258 100 -218 34 -76 -32 -293 165 37 -151 -14 26 -58 75 -11 -32
4862 -32 299 -99 -86 -84 25 0 23 204 -11 111 -85 -184 -158 104 254 153 77 -96 -4 -99 -2 151 25 182
4886 182 -13 42 32 145 -96 221 -185 8 86 68 137 104 -82 52 76 -28 -107 194 166 205 85 28 346 -57
4910 -57 5 -93 5 139 76 33 -9 -40 -10 100 -306 -16 139 35 -66 -67 -269 -66 227 -42 -62 -9 117 74 200
4935 200 -90 -153 -35 -68 -123 127 40 55 -75 128 -63 170 -199 -117 -41 31 74 -225 -43 74 77 127 -63 102
4959 102 40 -53 -159 -228 -50 283 108 139 -59 68 -136 -62 141 -97 189 188 -41 -50 63 235 -33 1 -158
4982 -158 74 15 4 120 169 -18 -69 194 64 179 27 -81 116 129 7 62 -99 192 -67 -16 65 248 -252
$$ packed form
4814a1p2MJ99l57J77j4O7j29k7K57k28K29Lk26OJ79R4j68K55k48l1R1K2k28J38
4839a8M2j38JK78k65l9J20k39L58l18K52j10M4k61M58j28j88J37M0q4J33q6k1
4862c2L31l98J3KJ09k5K3J81k15J22j96r9K6K62J50j01p6j73R2r5R7J53j26J57
4886A82j95N5j0J13k41L17m06J93P8j8O9l3j86J34K4j04p9L01k8L9j20n7L18m03
4910e7O2r8R8J34o3m3m2l1L0J10m06K90J55j04j01jk02K03K93k69k0N3J26m3J26
4935B00k90o3J18l3n5K50q7J5j30K03j91K33l69Q2P6P2M3k99J82J17LN0j90J65
4959A02o2r3j06o9J78L33j75L1j98J27k04P4K03k38K86jk29rJ13J72k68L4j59
4982a58K32n9j1J16M9j87n1K63j30J15j52j08J97J3j22N5j61K91k59N1Q1J83n00
$$ plain form
5005 -252 -209 -77 -126 -90 291 -97 -28 35 -146 40 170 4 -150 162 -54 96 107 37 -74 -17 -3 102 -110
5028 -110 -27 150 -282 161 88 19 -234 -48 -28 65 39 37 38 17 -330 -43 -125 -9 -74 -155 236 -140 3 -257 37
5053 37 -38 40 52 -24 -200 -112 188 -270 34 197 -80 -4 -90 -226 144 161 47 -41 166 -84 -89 -14 211 -347
5077 -347 20 -100 25 30 67 142 -38 199 55 59 -119 57 -79 39 -13 40 -46 -48 -37 -135 220 1 -94 122 43
5102 43 107 269 95 134 98 -200 29 -363 -237 -12 -148 -164 308 -307 -177 5 222 -85 44 93 -24 184
5124 184 169 25 4 42 132 -171 162 62 124 72 55 -217 -91 77 -153 -251 188 -6 -404 164 -126 -147 68
5147 68 -100 203 -7 -17 117 -154 169 132 -3 -45 192 -52 73 21 75 84 101 159 -213 -171 45 1 11 -67 -159
5172 -159 -33 53 22 -22 -113 -80 45 200 11 117 -1 76 -22 12 -25 -148 -125 -77 84 -291 -103 -189 209 66
$$ packed form
5005b52M3J32m9L6L81l88O9O3j81J86J30j66j54L12k16J50J1p0j11N7J4J05k12
5028a10Q3J77m32M43p3o9k53J86K0R3k6kJk1l47K87q2J16o5q1L91l76J43k60K94
5053C7p5P8J2p6j76Q8L00m58L04J63k77P6q6j36L70J7j14q8K07k50nP5K25n58
5077c47L67j20J25NL7P5j80K37j44Mj78J76j36J18n2N3q6kJ1r8L55k19r5K16p9
5102D3O4J62j74L9l6k98K29l92J26K25j36j6M72o15J30J82K17l07J29M9j17K08
5124A84j5j44k1L8R0l03L33j00O2n2j7k72J26J68k30r8M39j94l98N68k90k1K15
5147F8j68L03k10j0J34k71L23l7j35m2K37k44J25n2N4RJ7N8l72M2K16m4J0p8r2
5172a59J26Q6l1m4r1L3J25J55j89J06j18P7r8L4l7j23K3M8J61l75J88q6L98j43
$$ plain form
5196 66 -130 -208 -104 -243 -176 0 226 -119 -136 258 72 122 -74 227 56 26 -146 20 35 145 -73 54
5218 54 52 -251 57 58 106 -168 170 7 -109 83 220 310 -204 -159 86 -170 80 32 -5 -71 -120 -194 30 85 -201
5243 -201 23 226 124 120 160 -72 -273 23 332 485 114 85 210 154 37 64 -75 41 -12 -89 -164 -91 -190 -12
5267 -12 49 -29 -57 -6 77 186 -178 251 -315 -300 -77 146 -224 206 129 -55 -160 125 52 62 98 110 -49 180
5291 180 338 14 -127 -215 57 82 -50 194 -180 87 -30 56 112 112 31 -32 -47 -37 -258 179 99 23 148 0
5315 0 15 -35 72 89 43 84 -53 -228 -62 -205 -26 -32 -184 226 -130 -25 147 -139 193 139 35 -246 -182 -38
5339 -38 105 24 -2 -40 282 -223 -103 -68 -73 126 -87 44 70 138 6 266 -139 -204 -135 -66 217 110 187 -209
5363 -209 -77 -48 104 -236 60 -35 50 -21 20 -131 -124 -69 -25 -80 1 92 266 -10 -42 99 38 57 -195 149 -128
$$ packed form
5196F6j96p8J04j39O7J76K26l45j7L94j86N0j96L01j71l0j72J66J5J10k18J27
5218E4kl03L08JM8k74L38j63j16J92J37R0n14M5K45k56K50m8l7o6m9p4K24N5k86
5243b01K24K03j02mM0k32k01K96L09J53l71k9J25n6j17K7j39J16n3p7p5P3r9J78
5267a2O1p8k8N1Q3J09l64M29n66J5K23K23l70M30p7j84j05K85p3J0L6J2j59K29
5291A80J58l24j41q8K72K5j32K44l74K67j17Q6N6%q1o3j5J0k21M37q0p6J25j48
5315@J5n0J07J7m6M1j37j75J66j43J79oj52M10l56J05J72k86L32n4j04k81O4J44
5339c8J43q1k6l8L22n05J20L5nJ99k13J31K6O8j32K60m05o5O9O9K83j07P7l96
5363b09J32K9J52l40K96r5Q5p1M1j51PN5M4n5Q1R1J74k76l2J41o1J9k52L44k77
$$ plain form
5388 -128 75 -75 327 213 -76 -101 53 -100 143 -74 22 28 70 -40 91 -132 -107 -203 -152 -15 314 122 -21
5411 -21 7 116 85 -53 -190 -275 66 -7 81 -78 -7 259 103 122 -84 42 -8 85 -58 250 22 -42 82 -335
5435 -335 -73 -14 16 98 -21 17 -36 -195 83 25 -213 132 11 84 -4 37 296 3 -19 -118 -79 103 286 -210
5459 -210 110 -120 -232 -258 85 -87 1 -270 96 28 205 -65 140 54 -46 -70 90 -80 203 -4 -74 110
5481 110 18 218 129 -4 -184 116 49 -156 -85 -102 86 -20 19 -243 -48 92 -15 -15 -54 -325 102 -29 84
5504 84 -58 -82 395 -90 97 187 137 -26 262 392 -276 -195 104 151 111 -58 -144 9 -30 -122 -265 -47 224
5527 224 -136 257 86 -131 11 7 -281 33 -45 -92 -29 -288 11 84 -21 -5 -24 30 -192 149 39 275 -309
5550 -309 106 -18 -16 -15 38 -167 -34 75 -72 -37 19 -161 -42 120 -189 89 -116 253 77 95 47 -160 -105
$$ packed form
5388a28K03j50M02j14k89k5J54j53K43k17R6OM2j10J31k23K5r6N1J37L29j92j43
5411b1K8J09l1j38j37q5L41p3Q8j59P1K66j56J9k06J26n0R3j43L08k28o4J24m17
5435c35K62N9L0Q2j19L8n3j59K78n8k38L45j21P3q8M1K59k93k2r9L9J82J83m96
5459b10L20k30j12k6L43j72Q8k71L66o8J77k70K05q6j00k4J60j70K83k07p0J84
5481A10r2K00q9j33j80L00o7k05P1j7J88j06L9k62J95J40j07%l9k71M27j31J13
5504H4j42k4M77m85J87R0n0j63K88J30o68Q1K99M7m0j69q6J53l9r2j43K18K71
5527B24l60L93j71k17J42mk88L14p8m7O3k59K99P3j05J6j9N4k22L41j10K36n84
5550c09M15j24KJN3k05J33J09j47L5N6j80J19J62l09K78k05L69j76J8m8k07N5
$$ plain form
5573 -105 -69 -151 80 -16 74 143 41 42 -18 -136 -76 15 -45 -138 384 -62 42 158 294 27 64 189 -54 55
5597 55 -29 46 93 -96 86 -202 21 231 -102 41 15 215 -156 204 -28 -64 5 -90 146 122 82 -88 93
5620 93 21 -18 107 34 11 -75 -72 115 -103 -139 291 65 136 -187 -189 126 124 -52 -119 332 70 -306 255 -137 113
5645 113 62 124 -111 488 42 -41 -114 51 -120 211 -192 -23 -111 -102 -1 -82 -88 139 -208 -14 1 -114 -182 -17
5669 -17 -106 30 -132 41 107 -13 157 84 5 168 28 -129 76 26 -84 -24 82 -130 -57 -120 -74 -2 134 55
5693 55 -95 201 93 4 -264 -146 90 47 -173 19 -67 -80 22 -52 -52 30 223 139 3 -36 1 -327 142 288
5717 288 201 294 -94 -241 17 14 -30 -92 134 -69 178 153 41 -73 -185 227 53 -74 189 241 -20 -17 50 -225
5741 -225 -14 140 40 -44 -128 124 -331 -99 -206 -107 26 131 176 -131 -76 99 158 -46 -169 -10 221 -344
$$ packed form
5573a05L6q2K31r6R0O9j02Jo0j18O0R1o0r3N22m46J04J16J36k67L7J25k43J09
5597E5q4P5M7j89J82k88K23K10l33J43k6K00l71L60k32l6O9r5K36k4m0j70J81
5620I3p2l9J25p3k3q6LJ87k18l6M30k26P1l23kL15kj76o7M51k62l76N61l92K50
5645A13n1O2k35N99m46q3p3J65j71L31m03J69q8RJ01q1oK27l47J94J5j15o8J65
5669a7q9J36j62J73O6j20J70p3p9J63j40j57K05n0j10O0J06k12P3o3M6P2J36p9
5693E5j50K96j08q9k68J18K36m3k20J92q6j3J02p4%Q2J93q4j36l9L7l28M69J46
5717B88q7R3l88j47K58lm4o2K26k03K47k5j12j14j12M12j74j27K63N2k61LO7k75
5741b25K11J54j00q4q4K52m55K32j07R9J33J05M5l07N5J75N9k04j23J59K31n65
$$ plain form
5763 -344 -128 60 149 -276 106 223 49 -226 57 -60 76 -13 178 100 -44 -132 -52 19 -50 -115 24 83 -31
5786 -31 21 -165 4 8 -230 121 -220 -109 138 -3 77 41 -153 91 -142 -54 -188 51 -333 58 -28 111 -32
5809 -32 2 55 -110 -89 -95 -75 -122 38 56 190 -226 -42 63 146 84 -97 4 -190 -129 102 55 -63 -78 -98 35
5834 35 -46 82 92 -192 92 209 -22 12 74 17 -47 159 -164 -61 239 -63 -49 -86 -129 -73 43 -77 87 -60
5858 -60 174 -301 52 164 -97 -276 186 -27 -58 -441 146 47 -273 -54 274 33 -31 -178 18 81 -82 -74
5880 -74 -130 69 128 81 36 10 70 106 19 -109 -142 46 72 26 45 98 -5 -31 126 238 187 88 172 -153 8 17 58
5907 58 14 93 168 309 45 29 172 26 -94 73 2 102 40 -15 -336 152 -2 4 -194 65 16 78 44 115 383
5932 383 103 -147 136 133 14 42 45 32 -93 153 -26 122 203 -188 -87 -134 -94 66 204 91 -162 -64 41
$$ packed form
5763c44K16J88Q9m25L82J17j74k75K83j17J36q9J91p8j44q8Q0P1o9o5J39N9j14
5786c1N2j86J69Mk38L51l41J11K47j41Q0l6j94K44k33Q8j34K39l84L91q6J39j43
5809c2L4N3j65K1oK0m7J60J8J34m16J84J05Q3o2j81J01j94O1K31m7j18j5k0J33
5834C5q1J28J0k84K84J17k31L4O2n7o4K06l23J03L00l02J4l7m3N6J16j20J64j47
5858f0K34m75L53J12k61j79M62k13l1l83N87r9l20K19L28k41o4j47J96O3j63Q
5880g4n6J99N9m7m5k6O0L6q7j28l3J88K6m6J9N3j03k6J57J12n1r9Q4l25J61RM1
5907E8m4P9P5J41k64j6J43j46j20J67p1J00o2n5l21M88j54Oj98K59m9O2l4P1K68
5932C83k80k50K83lj19K8Lj3j25K46j79J48Q1l91J01m7M0J60J38j13k53R8J05
$$ plain form
5955 41 211 57 72 -51 -139 37 112 73 290 -25 -149 -210 -130 103 -104 151 261 -52 135 -175 -44 88
5977 88 56 -147 -138 27 -107 -28 124 -56 29 27 -42 -97 170 -34 75 -223 -29 -65 73 -222 -128 -53 35 162 -166
6002 -166 6 -165 -78 88 154 -193 84 69 112 -444 -60 62 -76 41 -128 49 -40 -141 217 169 -128 -42
6024 -42 -9 49 -128 -176 -140 -169 157 47 110 -147 -136 69 -75 150 -115 178 -263 -117 -119 108 10 -82 -224 -148
6048 -148 105 7 -272 -229 116 0 -33 51 -267 127 -3 -91 -17 98 -123 -5 -5 -25 -24 234 10 -46 -46 -13 0
6073 0 -103 -124 -85 14 47 -91 7 1 -18 14 103 -47 -239 13 -73 -92 258 134 -4 -55 97 118 -97 6 23 49
6099 49 63 221 -82 156 -196 19 -225 -331 55 -248 24 -57 68 45 125 -170 -16 191 -40 -78 25 -45
6121 -45 -126 -34 19 -214 -4 -100 98 -177 -160 134 41 -21 -267 118 -123 23 -70 -120 -397 32 -39 -114 -1 -53
$$ packed form
5955D1J70j54J5j23q8J76P5l9K17l15j24o1Q0K33k07K55J10l13J87l10J31J32
5977H8l2k03RJ65j34P9J52j80Q5ko9n5K67k04J09k98J94l6J38k95R4P5Q8J27l28
6002a66J72j71Q7J66O6l47K77j5M3n56L84J22j38J17j69J77q9j01L58m8k97Q6
6024d2L3N8j77m8L6k9L26j10O3k57J1K05j44K25k65K93m41J46kK27r8r2j42P6
6048a48K53r8k79M3L45j16l3Q4l18L94j30q8P4J15k21J18%k0JK58k24n6%L3J3
6073@j03k1L9R9L3j38R8oj9L2Q9j50j92K52q6j9L50j24j38n1J52K1k15J03J7K6
6099D9J4J58l03K38l52K15k44j06L86l03K72q1J25k3Q0k95J54K07k31l8J03p0
6121d5q1R2N3k33K10r6J98k75J7K94r3o2k46L85k41J46r3n0k77M29p1p5J13n2
$$ plain form
6145 -53 -125 190 162 -229 38 172 -68 -15 98 30 87 -202 45 102 -15 189 90 -40 -11 59 -265 93 13 -149
6169 -149 79 -112 127 -35 -41 299 -85 158 139 64 173 -46 -6 -38 -46 -212 48 -153 -95 -11 7 42 -131 117
6193 117 27 1 -153 -206 20 50 156 -69 -53 47 74 -195 -207 193 202 11 5 211 86 -169 -56 -184 -199 -151
6217 -151 -15 -45 -24 -88 71 48 -74 92 -113 42 72 -136 53 19 -45 -224 16 41 -120 -130 -8 -168 33
6240 33 -67 -120 7 163 -142 -252 250 199 120 -44 -214 159 -90 -80 -135 -24 -161 253 45 -91 170 -15
6262 -15 -86 6 47 -26 -11 6 35 62 163 -25 -26 -180 -99 126 -28 -130 -102 -64 69 -123 99 108 45 -20 -68 -45 191
6289 191 59 -43 178 -180 -48 16 -38 165 -11 95 139 107 189 63 93 9 -59 -90 23 -99 -4 108 -72
6312 -72 153 68 -144 -96 -60 0 -274 -129 -103 -81 -210 98 -147 -82 34 -127 67 -137 -15 -47 44 110 120 71
$$ packed form
6145e3p2L15k8l91K67J34k40N3J13o8N7k89K47N7j17K04r9j30K9P0l24L58q0j62
6169a49K28j91K39j62oL40l84K43j9p5J09k19M0l2qj66K60k01N8Q4J8L5j73K48
6193A17r0k6j54n3K26L0J06k25J6J00K7k69j2M00Rj91oK06j25k55J13j28j5M8
6217a51J36l0K1o4J59k3j22J66k05J55L0k08J89l4o4j79K40K5j61j0J22j60K01
6240C3j00n3J27J56l05j10N02n1p9j64j70L73k49J0n5J11j37M14k08j36K61j85
6262a5p1R2M1p3J5J7K9K7J01j88jj54Q1K25j54j02K8L8J33j92K22Ro3o5m8K3K36
6289A91j32j02K21l58J32O4n4K03j76J06M4l2Q2j26L0q4o8l1J13j22R5J12j80
6312g2K25q5k12M8L6O0k74J45K6K2j29L08k45O5J16j61J94k04J22l2R1O6J0m9
$$ plain form
6336 71 -135 -154 -296 47 204 -50 3 124 47 -266 92 -136 -70 7 -9 181 28 110 89 20 13 -67 -115 -14 -228
6361 -228 -88 89 -75 82 37 -139 6 22 208 116 60 44 158 -32 103 -35 -203 -4 12 -297 -111 -89
6383 -89 33 -44 75 63 254 145 -225 -126 56 199 -114 -240 89 -186 17 110 -121 14 -65 -56 193 134 24
6406 24 -276 -38 33 -97 -202 11 79 74 149 -73 74 -118 46 3 -158 -162 -67 -207 71 -131 -93 -85 119 272
6430 272 -134 74 -82 -37 -151 -87 -95 -15 244 50 -77 -132 -107 -55 -212 -63 34 135 108 60 53 122 194 -54 -158
6455 -158 26 31 7 -17 -79 -40 106 -36 -10 -201 181 -18 -122 -55 -72 201 -170 173 167 3 24 107 -40 -15 211
6480 211 -119 -12 -191 107 180 -16 -17 -208 240 -57 129 279 -124 72 122 -117 260 -107 -189 39 70 199
6502 199 -123 220 -7 -163 233 -19 157 -219 -127 -163 77 21 -18 221 74 -87 -143 169 256 185 -83 63
$$ packed form
6336G1k06j9j42L43J57k54N3J21p7l13L58k28O6P7j6J90j53Q2k1o9pq0m8J01k14
6361b28J40J77j64J57m5j76J45J6J86r2n6j6J14j90J35j38j68J99J6l09J86K2
6383h9J22p7J19j2J91j09l70R9J82J43l13j26L29k75K03R3k31J35p9RK49n9j10
6406B4l00K38P1j30j05K13O8nP5k22J47j92J64m3j61mR5j40K78k02L8QK04J53
6430B72m06K08j56M5j14O4qQ0K59j94j27n5K5N2j57J49R7J01k7m8pO9P2k48j04
6455a58J84Nk4k4o2L9J46j42K6j91L82j99j04O7j7K73l71L43oj64K1Q3j47K5K26
6480B11l30J07j79K98P3j96jj91M48k97J86J50m03J96N0k39L77l67q2K28L1J29
6502A99l22L43k27j56L96k52J76l76R2l6K40n6l9K39j47j61n6L12Q7p1k68J46
$$ plain form
6524 63 94 191 134 72 158 139 123 -53 -143 -105 31 -337 -42 24 -312 -115 -90 -235 -118 -332 -74 116 -196 -133
6548 -133 85 134 -43 -50 207 -67 -120 16 -165 -80 156 176 -206 193 -13 -35 -53 -27 237 73 -129 63 -61
6571 -61 -129 179 -327 -442 337 43 -109 21 -7 -19 198 -18 -57 -7 -37 283 108 88 99 -74 -90 -65 149 94
6595 94 -93 -106 43 -28 44 -152 -13 252 11 -9 127 -164 -107 -114 -35 -115 -221 93 324 226 263 -34 -224 -33
6619 -33 186 170 -215 -44 -228 -42 13 -12 -30 165 42 -6 120 -147 110 -75 132 -250 -292 -56 -52 62 22
6642 22 64 -139 78 213 -28 -138 -63 -32 21 -127 83 -121 -139 -146 1 -334 -15 74 -81 -267 117 -3 41
6665 41 154 -136 -46 -153 54 -189 -20 191 -368 -62 -90 -7 -103 45 165 -279 159 -23 159 158 -86 92
6687 92 -98 85 -245 -23 189 -8 -65 -70 -158 125 295 49 -15 -208 -53 -45 -114 25 171 -92 9 78 -151
$$ packed form
6524F3L1R7n7o2Q6j9j6j76r0L8J36l68K95O6l36J97K5j45J17k14K58J90l12O3
6548a33K18M9j77pK57k74n3J36j81Q5K36K0l82L99k06k2j8K6K64j64k02J92j24
6571f1o8L08n06j15P79k94j52J30k8j2K17k16l9N0l0L20j75k0J1j73j6K5K14n5
6595I4j87j3J49p1P2j96J39K65k41k0J36k91N7pP9q0j06L14K31r8L7k97j90J91
6619c3K19j6l85J71j84J86N5k5j8J95j23m8J26k67K57j85K07l82m2K36MJ14m0
6642B2M2k03K17J35k41j10P5L1N3j48K10k04j8pJ47l35L19Q9j55j86L84j20M4
6665D1J13k90R0j07K07k43J69K11n59L06k8Q3r6J48J20m44M38j82J82jk44J78
6687I2j90J83l30K22K12j97n7nq8K83J70k46o4j93J55Qo9J39J46k63J01O9k29
$$ plain form
6710 -151 -74 -94 153 -11 -35 133 254 81 212 -76 176 56 158 84 -94 -30 -142 62 132 33 -72 -11 -54
6733 -54 -103 -10 -98 2 46 37 -140 -251 136 -208 0 -4 23 192 -196 -139 -112 57 131 313 -140 -26 -136 -35
6757 -35 47 172 -254 10 31 -51 -211 -77 97 85 57 17 -173 -276 110 -45 -115 206 55 105 243 288 28
6780 28 38 -20 40 -54 -56 118 63 69 -55 -174 99 -199 110 29 -7 -133 71 -19 166 114 31 -34 -81 67 -50 -227
6806 -227 105 -314 -115 1 -197 -145 102 -43 -4 -188 99 -186 149 33 38 81 73 123 162 -26 -151 -47 -290
6829 -290 96 16 -159 -159 80 196 79 -42 298 19 172 -222 46 47 106 106 -86 85 -56 75 -8 5 -88 -55
6853 -55 -20 -102 -112 295 38 -112 -32 28 -119 -50 -110 78 177 -9 66 41 189 13 95 329 -67 -225 -91 240
6877 240 160 126 16 13 210 -109 -78 -159 -5 -126 -153 -100 -32 -265 -23 14 -223 -118 32 57 -38 -8 97 147 -192
$$ packed form
6710a51P7k0K47j64k4J68J21j73J31k88K52j20J02p4j78O4j12K04P0r9j05O1m3
6733e4m9R3q8J00M4rj77j11L87l44K08mK7J69l88N7K7J69P4J82m53J14j10J01
6757c5Q2J25m26K64K1q2j60J34J74j2k8m0j90j03L86j55p0L21j51N0J38M5k60
6780B8J0n8O0r4kJ74n5Oj24j19K73k98L09q1l6j26K04r0J85n2q3o5m7J48j17j77
6806b27L32m19J99J16j98N2K47j45L9j84K87k85L35j16NM3qN0L9j88j25J04k43
6829b90L86q0j75%K39J16j17j21L40k79J53l94K68JN9%j92J71j41J31q3J3r3L3
6853e5L5q2j0M07k57j50Q0O0j47O9o0J88R9j86P5k5J48j76Q2K34l96j58J34L31
6877B40q0l4j10lJ97l19L1q1J54j21k7N3O8k33K42L7k37J05J50K5r5L0J05N0l39
$$ plain form
6902 -192 111 -87 11 182 -143 176 -186 -47 -63 -4 185 -290 -70 53 -138 234 -204 104 -19 355 -186
6923 -186 -17 6 -166 34 181 -211 -85 -45 -106 51 -18 93 -34 -51 61 -130 -64 107 -99 15 144 77
6945 77 3 433 35 -120 60 45 -36 -64 -98 180 207 -133 -180 -74 229 -257 -23 27 -158 -222 208 53 -127
6968 -127 -17 90 117 5 105 12 -212 -159 95 78 -78 -82 -41 108 -11 13 82 119 143 -229 32 61 62 -85 -25
6993 -25 -61 27 33 -227 -213 161 -97 -87 -250 -87 135 116 -44 136 -128 105 71 -10 3 -173 -24 51 117 -25
7017 -25 -82 -277 -41 -98 235 -59 -332 -120 -163 40 -177 -64 38 130 -78 -285 -81 185 99 -114 -78 -112 -119
7040 -119 51 155 -38 -154 -16 51 -299 12 151 -87 -71 -44 -170 -134 -41 167 -97 -37 -90 24 -51 -73 -67 -26
7064 -26 -46 68 -74 226 43 -203 -86 279 -159 133 131 -6 -9 -40 112 -169 297 193 -80 -23 123 161 -412
$$ packed form
6902a92L03j98R8J71l25L19l62J39j6N9J89m75K20J23j91L72m38L08j23L74n41
6923a86J69K3j72K00J47l92J26M0o1J57o9J11j27j7J12j91O6J71k06J14J29o7
6945G7p4M30l98j55J80j5q1k8l4K78K7l40m7J06L03m86K34N0j85o4M30j55j80
6968a27J10J07K7j12J00r3k24N3K54j7j56mM1J49j19K4O9L7K4l72K61K9Jj47O0
6993b5l6Q8Ok60J4L74k58J0j63J63K22j9j60J80k64K33l4q1J3j76J49P5O6j42
7017b5n7j95K36n7L33k94k73K12m3K03k17J13J02R2k08k07K04K66q6k13L6l4p
7040a19J70J04j93j16J38O7l50L11J39k38J6K7j26L6R3K08k64O0n3J14p5k2OM1
7064b6k0J14j42L00j83k46J17L65m38K92kj37ll1J52k81M66j04k73N7J46L8n73
$$ plain form
7087 -412 -21 -94 -33 -157 -97 -95 34 91 -141 -101 238 -57 -80 -73 98 120 -11 -63 -230 233 200 146 -156 -9 204
7112 204 -37 -48 -6 -53 -183 98 227 -194 -19 -20 16 114 -178 53 124 90 63 -183 -89 -204 -306 155 309 -252
7136 -252 22 -39 96 -35 -74 -18 15 -119 185 28 -354 153 -170 111 -23 47 -105 -34 52 -6 50 -37 58 -111
7160 -111 -113 -103 -204 -92 92 49 -296 -39 133 71 -20 271 -111 -145 -80 4 -91 -97 239 77 -31 -141 -92 37
7184 37 60 -173 0 57 85 475 42 -31 -13 12 137 -85 -57 6 24 364 48 221 -96 47 -9 -149 -110 -102 -65
7209 -65 -194 -23 -51 -61 81 -70 -101 121 -133 -196 -67 -133 -164 -51 -151 153 66 60 -206 -48 -241 152 -59
7232 -59 196 -79 -128 110 158 -149 333 -93 -12 -39 25 -104 -16 22 53 10 16 13 -47 32 -103 32 -67 200 -158 -55
7258 -55 -10 9 -1 -93 -70 232 -159 -166 -7 -97 132 -184 -104 234 -317 -66 20 -193 112 -156 -40 45 -103 118
$$ packed form
7087d12L91p3O1j24O0KJ29N7k32M0L39k95k3PJ71K2j31n2j67M63l3n4l02J47K13
7112B04k41j1M2m7j30K81J29m21J75jL6R8k92K31P1l4k7k46R4j15j02M61J54n61
7136b52K74o1J35j31l9N6L3j34L04j57l82N07l23K81j34P0j52P1Q6n8N6q7R5j69
7160a11kJ0j01J12J84m3l45K57J72o2r1K91l82l4O5Q4r5oL36j62j08j10M9J29
7184C7K3k33J73N7K8L90m33p3J8K5J25k22K8O3J8L40l16J73l17J43n6j40L9QL7
7209f5j29J71k8j0J42j51l1K22k54o3J29o6l1J13j00L04q7ok66J58j93L93k11
7232e9K55k75m9K38M8l07M82m26Q1k7O4j29Q8L8L1m3Olo0P9j35J35r9K67l58J03
7258e5M5J9j0r2K3L02l91pJ59r0K29l16Q0L38n51K51Q6k13L05k68J16Q5j48K21
$$ plain form
7282 118 -59 1 -10 120 197 -153 107 -81 -35 118 -85 248 -50 -92 94 -142 149 -89 -327 121 29 -48
7304 -48 -200 217 -147 152 -194 133 -104 32 -205 -24 84 8 9 -38 208 -172 -59 -146 -60 89 148 86 44
7327 44 -56 164 -84 -49 312 5 83 182 215 82 175 -27 -104 159 43 113 133 -131 -33 59 -87 -159 -126 224
7351 224 -110 -46 -18 79 68 188 -239 -53 -20 -86 -49 96 42 -12 -46 -171 107 -237 116 -137 61 -118 37
7374 37 -83 -51 -37 -66 -78 3 18 -25 -35 22 -172 18 92 -65 -255 -196 60 -64 285 349 211 -228 113 90 -104
7399 -104 116 11 183 -146 -28 157 150 -50 207 -9 -35 -2 -193 -49 107 -107 -316 363 -34 -167 -33
7420 -33 69 74 -25 -18 54 -96 10 120 37 -92 4 268 55 105 23 59 299 -107 112 -236 57 -51 124 89
7444 89 37 -127 75 -18 -9 -79 -96 102 27 -38 -53 -147 -94 -122 -16 23 23 -14 20 9 -23 204 137 26 281 75 94
$$ packed form
7282A18j77O0j1J30P7l50K60j88M6J53k03L33k98m2J86k36K91k38k38M48r2p7
7304d8j52M17l64K99l46L27k37J36k37J81J08p6Jm7K46l80J13q7Q6J49N9o2m2
7327D4j00K20k48L5L61l07P8R9L3j33R3k02p7K63j16P0K0k64R8R2j46p2L3L50
7351B24l34O4K8R7j1J20m27J86L3o6L7J45n4n4l4j25K78l44L53k53J98j79J55
7374C7j20L2J4k9j2Q1J5m3j0N7j94J90P4j57j90N9K56j24L49O4j38m39L41k3j94
7399a04K20j05J72l29J18J85pk00K57k16k6L3j91J44J56k14k09O79l97j33J34
7420c3J02Nr9PP2j50J06J10q3j29R6K64k13N0q2L6K40m06K19l48K93j08J75l5
7444H9n2j64K02r3Rp0j7J98p5o5j5r4N3k8J06L9%l7L4j1l2K27o7j11K55k06J9
$$ plain form
7471 94 52 -139 170 -60 21 36 92 49 86 -20 64 -44 -36 106 103 -44 -134 180 -103 -127 -9 341 312 -199 75
7496 75 -22 23 -156 -64 172 18 121 51 -60 231 -15 67 163 -60 16 -151 140 179 47 -131 301 -305 -114
7519 -114 70 -191 -22 -115 -49 -103 93 -86 -71 1 305 95 262 -74 -222 33 -2 -188 -19 103 -153 147
7541 147 266 -23 -59 -6 63 -43 -85 -159 -115 188 52 -23 9 -36 205 13 2 -79 -173 -52 -114 66 -137 -23
7565 -23 65 160 -23 134 -45 -122 215 38 41 -77 -131 -138 102 -137 -146 -84 55 -180 -314 63 42 183 -81 -75 -66 134
7591 134 70 104 166 292 69 39 -4 71 -191 -4 -81 20 79 -319 19 101 -19 -24 -89 132 101 -189 71 198
7615 198 161 -2 6 167 -228 -43 75 373 94 -120 -105 -219 20 -36 74 -60 -337 118 47 -44 132 -38
7637 -38 24 -67 10 -13 95 35 -291 18 -31 27 -68 -195 156 58 -208 -71 70 -15 -115 -40 -60 -106 80 -26 -78
$$ packed form
7471I4m2j91L09k30Q1J5N6m3L7j06Q4j08QJ42lj47r0L14k83k4J18L50k9n11K74
7496G5r7M5j79R2K36j54J03p0j11K91k46Q2R6k23P6j67K91L9j32j78M32o06J91
7519a14J84k61J69r3O6n4J96j79J5P2L04k10J67l36j48K55l5j86J69J22k56L00
7541A47J19k89l6N3O9j06m2p4M4L03j36p5L2m5K41j92j1q1r4J21o2J80k03J14
7565b3Q8R5j83J57j79p7L37j77Lj18n4pK40k39rO2J39k35j34L77k1J41k64ORK00
7591A34o4L4O2J26k23l0m3P5k62J87p7J01N9l98L38Q2j20no5K21l1k90K60J27
7615A98l7j63QJ61l95J85J18K98k79k14J5j14K39n6J10j34k77M55p1r1J76j70
7637c8O2r1P7k3J08o0l26L09m9N8r5j27L51r8k66J37J41q5j00P5k0m6J86j06n2
$$ plain form
7662 -78 122 58 -57 50 -75 -212 -76 -27 138 156 -68 25 -83 64 3 -143 80 129 5 -67 -261 -112 51
7685 51 187 2 -118 -98 23 235 286 62 -9 238 122 -121 65 -115 -44 62 240 211 76 55 -4 -70 9
7708 9 -17 -303 -116 359 -24 -60 -17 -241 -188 -168 136 59 -207 -188 266 66 106 -23 89 -35 291 11 -158
7731 -158 70 -90 -173 -357 109 131 -45 29 143 66 -40 32 -80 -59 237 68 104 87 69 -198 -24 87 74
7754 74 -73 -25 23 27 -73 -188 56 -93 -297 196 -112 326 -35 -155 142 17 68 -88 191 118 87 21 35
7777 35 314 174 51 31 166 -38 99 367 -20 24 -65 -27 147 148 -134 83 270 203 103 301 -136 -134 -17
7800 -17 182 166 13 73 -90 163 -8 137 -161 68 -71 86 71 -38 -119 140 -121 -233 -163 -98 -14 -113 222
7823 222 109 -89 -59 145 25 274 -111 -125 -88 -49 -152 92 -120 168 -23 -67 -7 -228 235 -114 203 -61
$$ packed form
7662g8K00o4j15J07j25j37J36M9J65J8k24R3j08J47o1j46K23M9j24p2j94J49J63
7685E1J36j85j20K0J21K12N1k24p1K47j16k43J86j80P1J06J78k9j35k1n9o6P9
7708Ik6k86J87M75l83l6M3k24N3K0L04p7k66J9M54k00M0j29J12j24L26k80j69
7731a58K28j60q3j84M66K2j76P4J14p7j06P2j12K1K96j69L6j7j8k67J74J11j3
7754G4j47M8M8Mj00j15K44j49k04M93l08M38l61j20K97j25N1j56K79p3l1o6J4
7777C5K79j40j23k0J35k04J37K68l87M4q9L8J74Jk82K17J87o7j00J98m37KJ17
7800a7J99j6j53O0j63K53j71J45k98K29j39J57j5j09q1K59k61j12P0O5Q4r9L35
7823B22j13j98L0K04j20K49l85j4L7L9j03K44k12K88j91m4O0k21M63l49L17k64
$$ plain form
7845 -61 44 -37 -166 -81 -53 -218 -99 -118 47 227 316 -268 108 -9 -198 -12 -121 97 -8 -61 195 10
7867 10 109 7 125 1 -72 91 158 190 -122 -53 -119 -311 -191 195 179 -125 67 -117 341 -1 -175 37 -14
7890 -14 31 -59 -10 -286 -290 -43 -94 -44 22 325 -114 -222 -206 -186 175 51 41 161 55 -74 -221 215 168 -118
7914 -118 -106 -50 143 102 -59 255 98 -127 214 126 93 -176 -173 8 10 112 -228 20 -80 120 13 270 15
7937 15 -53 2 -185 197 -93 158 124 -74 -59 246 -18 40 102 239 26 79 -6 -32 -46 -103 -56 -51 -20 44 141 -25
7963 -25 209 -5 -46 -133 25 78 -52 -135 11 164 172 -260 114 131 -42 5 -135 129 -291 -127 12 -83 -160 -144
7987 -144 -37 66 -68 56 43 -58 145 270 -59 10 136 70 95 -26 -100 -4 21 200 156 104 86 -87 21
8010 21 -228 -57 178 -202 29 -85 -164 -198 -8 -12 -48 -128 -67 219 313 263 -61 62 -22 -80 18 147 -102 -4 20
$$ packed form
7845f1J05q1j29Q5K8j65J19j9J65J80Q9n84L76j17j89J86j09K18j05n3K56j85
7867A0R9j02J18j24p3J63O7L2l12O9o6j92J20L86j6l04J92j84M58l42j74K12n1
7890a4M5r0M9k76mK47n1N0O6L03m39j08J6K0L61j24j0J20j06j29j47M36m7k86
7914a18J2N6J93m1j61L14j57k25L41q8l3k69LJ81KJ02l40K48j00K00j07K57k55
7937A5o8N5j87L82k90K51l4j98J5L05k64N8O2J37k13N3q5k6j4n7M7NL1O4R7j66
7963b5K34k14m1q7J58N3j30q3J46J53Qm32L74J7j73M7j40K64m20J64J39r5p7J6
7987a44J07J03j34J24j3j01K03J25l29O9J26o6K5j21p4R6K5J79m4n2j8j73J08
8010B1k49J71K35l80K31j14p9l4J90ml6q0O1K86R4n0l24J23q4n8R8J29k49R8K4
$$ plain form
8035 20 -174 6 115 134 -68 334 -222 -38 8 111 294 69 -22 120 -112 20 -202 -173 5 -51 260 110
8057 110 237 -155 107 181 -93 71 -324 -63 79 -62 137 25 238 168 -101 150 -128 -41 197 106 -10
8078 -10 50 76 80 -45 -5 58 -56 258 -25 152 -9 -165 452 29 79 35 -30 -177 -23 -239 -63 160 -232
8101 -232 50 -58 -27 -171 7 -31 -59 7 -55 29 -12 69 49 -4 2 -137 -293 -16 55 118 78 97 25 113 65 -204
8127 -204 -105 -64 142 271 -21 215 43 38 66 -110 86 46 18 -240 139 3 -186 -167 30 2 103 -36 -65
8150 -65 227 -90 48 -74 -117 131 46 183 -79 -64 -464 51 16 134 -190 -27 -334 -2 77 9 10 -233 -198
8173 -198 3 -168 -122 -5 -120 -56 -418 137 9 80 -155 55 -59 -7 273 -139 -288 -144
$$ packed form
8035B0j94J80J09J9k02M02n56J84M6J03J83k25r1J42k32J32k22K9J78n6L11j50
8057A10J27l92K62P4k74J64l95K61J42j41J99j12K13p0k69K51k78Q7K38r1j16
8078a0O0K6Mj25M0O3j14L14k83J77j61j56O17m23N0m4o5j47J54k16J76K23l92
8101b32K82j08L1j44J78l8k8O6o2Q4m1Q1k0n3Oj39j56K77P1O3m0J9p2Q8m8k69
8127b04R9M1K06J29k92K36j72nK8j76J96m0k8k58L79j36j89J9J97k8J01j39k9
8150f5K92l17J38j22m3K48q5J37k62J5m00N15l5J18l24J63l07L32P9o8Jk43L5
8173a98K01j71M6J17j15O4l62N55j28P1k35K10j14N2K80m12j49J44
8191a44
$$ Imaginary data points
##PAGE= N=2
##DATA TABLE= (X++(I..I)), XYDATA
$$ plain form
0 0 0 0 0 0 0 0 0 0 0 0 5 -8 8 -8 8 -16 16 -24 26 -32 40 -48 56 -69 80 -93 107 -124 142 -163 187 -211 241
33 241 -271 306 -344 386 -432 483 -537 600 -664 736 -815 900 -994 1096 -1209 1330 -1465
50 -1465 1614 -1780 1961 -2165 2396 -2655 2951 -3295 3695 -4173 4749 -5465 6380 -7594 9286
65 9286 -11814 15995 -24113 45627 -222831 -505548 91710 207308 58903 163398 145159
76 145159 -91990 70372 260087 131284 173956 436466 313072 79988 79151 -6624 -36998
87 -36998 266300 247989 -131211 -120661 39140 -170264 -232556 -25306 -75275 -190040 -50837
98 -50837 -102035 -325033 -182601 28050 -110588 -141484 19141 -58516 -109864 86535 66122
109 66122 -79874 75835 188142 31201 41129 193136 154573 123312 177125 49187 -67066
$$ packed form
0@%%%%%%%%%%Nj3J6j6J6k4L2m0N0n8P2q8J04j25J49j73K00k31K66l05L50l98M52
33B41n12N77o50P30q18R15j020J137j264J400j551J715j894K090k305K539k795
50a465L079l394L741m126M561n051N606o246O990p868Q922j0214J1845j3974J6880
65I286k1100K7809m0108O9740k68458k82717N97258J15598j48405J04495j8239
76A45159k37149J62362J89715j28803M2672K62510j23394k33084q37q5775l0374
87c6998L03298j8311l79200J0550J59801k09404o2292K07250m9969j14765J39203
98e0837n1198k22998J42432K10651j38638l0896J60625p7657n1348J96399k0413
109F6122j45996J55709J12307j56941R928J52007l8563l1261N3813j27938j16253
$$ plain form
120 -67066 60157 111617 19840 67540 80725 -90716 -110403 -13703 -110967 -148002 31097
131 31097 46612 -85527 -69265 -54949 -125779 -60437 46330 -7017 -60939 -7845 3750 -11307
143 -11307 36596 23627 -34514 33338 90596 24604 24801 72857 25167 -2177 24902 -978
155 -978 -10699 52132 62487 -14788 -64608 -60593 -59121 -26173 28727 17142 -3999 12595 -20728
168 -20728 -52635 -9952 13525 7461 25864 23908 8886 26181 29121 -5627 -23092 -3689 12164
181 12164 17647 28762 18368 3266 16928 -2242 -48810 -34396 -1429 -5621 675 -7763 -53042
194 -53042 -52911 -16953 -22477 -31767 -4379 10944 7424 13948 1636 -25647 -680 50481 53214
207 53214 45100 50119 11677 -21516 11196 26065 11781 38061 46374 3567 -5485 7699 -14831
$$ packed form
120f7066J27223N1460r1777M7700J3185j71441j9687R6700r7264l7035J79099
131C1097J5515j32139J6262J4316p0830O5342J06767n3347n3922N3094J1595j5057
143a1307M7903j2969n8141O7852N7258o5992J97M8056m7690k7344K7079k5880
155i78r721O2831J0355p7275m9820M015J472L2948N4900j1585k1141J6594l3323
168b0728l1907M2683K3477o064J8403j956j5022J7295K940l4748j7465J9403J5853
181A2164N483J1115j0394j5102J3662j9170m6568J4414L2967m192O296q438m5279
194e3042J31L5958n524r290K7388J5323l520O524j2312k7283K4967N1161K733
207E3214q114N019l8442l3193L2712J4869j4284K6280Q313m2807r052J3184k2530
$$ plain form
220 -14831 -26779 -4861 -5421 -26814 -18651 -9512 -29749 -27806 -19512 -57373 -67056 -23908 -7473
233 -7473 6536 29766 -3793 -37346 -4366 24949 18727 26763 42499 25312 11923 34309 27162
246 27162 -5502 17615 44645 19049 7619 11094 -4392 -3289 5335 -6796 -12041 -2846 -437
259 -437 -6432 -18000 -38059 -54647 -35241 -2974 -8394 -13865 1765 -12252 -29290 -7209 4318
272 4318 -5386 7873 26824 24689 19009 22627 16686 -1363 -3691 10729 17301 17485 17911 12102 7188
287 7188 1177 -10282 -10061 916 5774 10756 5437 -22692 -36752 -14382 4284 -4141 -18950 -20017
301 -20017 -11706 -5513 -1531 -4831 -18033 -9383 17804 24030 13392 5183 2369 5830 2412 -5451
315 -5451 3882 19255 26020 21239 -1595 -17328 -10792 1120 10712 8731 31 2848 1374 -5179
$$ packed form
220a4831j1948K1918n60k1393Q163R139k0237J943Q294l7861r683M3148J6435
233g473J4009K3230l3559l3553L2980K9315o222Q036J5736j7187j3389K2386p147
246B7162l2664K3117K7030k5596j1430L475j5486J103Q624j2131n245R195K409
259d37n995j1568k0059j6588J9406L2267n420n471J5630j4017j7038K2081J1527
272D318r704J3259J8951k135n680L618n941j8049k328J4420O572J84M26n809m914
287G188o011j1459K21J0977M858M982n319k8129j4060K2370J8666q425j4809j067
301b0017Q311O193L982l300j3202Q650K7187O226j0638q209k814L461l418p863
315e451R333J5373O765m781k2834j5733O536J1912R592j981q700K817j474o553
$$ plain form
329 -5179 -3696 -12446 -22940 -16943 -9287 -2358 4709 2103 -7700 -21754 -20971 3747 15524 8211
343 8211 5953 4740 5394 7165 2050 4149 11467 10458 10037 5987 -3724 -2753 6318 9287 1019 -9067
359 -9067 819 15016 8179 -5459 -15037 -20797 -12695 768 5791 3656 -6933 -16437 -12728 -6907
373 -6907 -6648 -4084 2196 8217 9892 7236 4866 -61 -4491 1434 8899 6030 2176 3990 8681
388 8681 7577 -5201 -11980 -1140 6882 8727 8245 -3978 -12286 -2667 5209 3718 -1549 -5900 -5257
403 -5257 -2053 197 -2541 -6703 282 2956 -4611 4478 13170 1451 238 2870 -10092 -7981 8797
418 8797 8952 2412 4220 -1427 -19247 -18411 742 2213 2728 11780 -6768 -21162 5147 12714 -5662
433 -5662 -1569 2228 -7765 5536 22000 1969 -12967 6927 9987 -5848 8322 18558 -601
$$ packed form
329e179J483q750j0494N997P656O929P067k606r803j4054P83K4718J1777p313
343H211k258j213O54J771n115K099P318j009m21m050r711R71R071K969q268j0086
359i067R886J4197o837j3638r578n760Q102J3463N023k135j0589r504L709N821
373f907K59K564O280O021J675k656k370m927m430N925P465k869l854J814M691
388H681j104j2778o779J0840Q022J845m82j2223q308R619P876j491n267m351O43
403e257L204K250k738m162O985K674p567R089Q692j1719j213K632j2962K111J6778
418H797J55o540J808n647j7820Q36J9153J471N15R052j8548j4394K6309P567j8376
433e662M093L797r993J3301J6464k0031j4936J9894L060j5835J4170J0236j9159
$$ plain form
446 -601 7880 20120 -12635 -18513 18294 14681 -6876 4579 -3879 -29775 -7758 12162 -16671
459 -16671 -20343 6708 -7741 -22451 4427 -1419 -28434 -1733 15041 -15294 -3141 26004
471 26004 -5662 -16017 23449 13082 -12906 14578 20922 -5492 17949 40997 2432 -10147
483 -10147 20346 3279 -15205 22342 20590 -15609 5894 9048 -43883 -33198 15007 480
495 480 -13510 3940 -23060 -52628 -11809 16190 -10740 -3710 13442 -25178 -28955 16642 5871
508 5871 -5306 34880 23382 -22241 -736 26128 8745 21858 46482 8400 -23229 6755
520 6755 15929 4600 29543 23850 -26786 -23603 -1381 -21225 -11522 21387 -1579 -30253 -14262
533 -14262 -18029 -37407 -8926 18689 -2938 -12215 -2125 -17958 -19728 11394 16312 5579 16757
$$ packed form
446f01Q481J2240l2755n878L6807l613k1557J1455q458k5896K2017J9920k8833
459a6671l672K7051j4449j4710K6878n846k7015K6701J6774l0335J2153K9145
471B6004l1666j0355L9466j0367k5988K7484O344k6414K3441K3048l8565j2579
483a0147L0493j7067j8484L7547j752l6199K1503L154n2931J0685M8205j4527
495D80j3990J7450k7000k9568M0819K7999k6930P030J7152l8620l777M5597j0771
508E871j1177M0186j1498m5623K1505K6864j7383J3113K4624l8082l1629K9984
520F755R174j1329K4943n693n0636L183K2222j9844R703L2909k2966k8674J5991
533a4262l767j9378K8481K7615k1627r277J0090j5833j770L1122M918j0733J1178
$$ plain form
546 16757 7924 -14641 2808 24517 13506 13648 23918 6569 -8139 3396 6259 1948 13629
559 13629 13234 -8042 -18858 -14072 -6870 8540 12662 -11222 -25314 -14011 -8124 -3593 8416
572 8416 3069 -7303 -4583 -8747 -11118 1810 10526 9376 8563 -848 -13292 -2899 16350 10104
586 10104 -283 5933 -1577 -10719 8170 12410 -4571 3 357 -15415 -3326 15073 2108
599 2108 -6828 2317 -6869 -15353 8942 17660 -5401 473 12766 -13115 -14695 14762 7950 -1034
613 -1034 15799 281 -25635 -2691 15000 -3601 -541 11013 -14276 -19193 12739 3975 -18758
626 -18758 5223 9659 -19791 -6338 11645 -13261 -6532 25315 4355 -18615 4098 3124 -13329
639 -13329 15934 28942 -6067 -6577 14212 -8498 -14268 22326 16393 -7727 10257 4906 -29884
$$ packed form
546A6757q833k2565J7449K1709j1011J42J0270j7349j4708J1535K863m311J1681
559A3629l95k1276j0816M786P202J5410M122k3884j4092J1303N887M531J2009
572H416n347j0372K720m164k371J2928Q716j150q13r411j2444J0393J9249o246
586A0104j0387O216p510r142J8889M240j6981M574L54j5772J2089J8399j2965
599B108q936R145r186q484K4295Q718k3061N874J2293k5881j580K9457o812q984
613a034J6833j5518k5916K2944J7691j8601L060J1554k5289m917L1932q764k2733
626a8758K3981M436k9450J3453J7983k4906O729L1847k0960k2970K2713r74j6453
639a3329K9263J3008l5009n10K0789k2710n770L6594n933k4120J7984n351l4790
$$ plain form
652 -29884 -10233 21039 2080 -2419 12695 -15070 -32024 2466 12169 -7636 5320 8897 -24889
665 -24889 -19359 14101 2342 -6731 15869 1514 -22080 2863 12499 -6871 7807 23011 -4592
678 -4592 -14495 5977 2424 -2266 21436 15022 -17465 -6609 10462 -6400 -1966 15446 -2243
691 -2243 -10120 7679 -1673 -17149 325 9351 -6207 -3660 4496 -10387 -10902 7960 629 -9738
705 -9738 5124 4114 -11422 -624 8406 -3509 -1331 8950 -80 -4028 6861 2470 -5830 5353
719 5353 11360 -741 -3453 1046 -2471 2681 12159 1098 -9911 -1648 2175 -2514 2416 2905 -4419
734 -4419 -2894 157 -5078 -4990 3420 3670 -3060 -4221 -2907 -3138 2207 4956 -2000 -3431 614 -1325
750 -1325 773 5771 1947 -2162 -2022 -1642 2192 6461 5326 -1295 -5724 -1327 3612 3311 2035 -1021
$$ packed form
652b9884J9651L1272j8959m499J5114k7765j6954L4490R703j9805J2956L577l3786
665b4889N530L3460j1759r073K2600j4355k3594K4943R636j9370J4678J5204k7603
678d592r903K0472l553m690K3702o414l2487J0856J7071j6862M434J7412j7689
691b243p877J7799r352j5476J7474R026j5558K547Q156j4883n15J8862p331j0367
705i738J4862j010j5536J0798R030j1915K178J0281r030l948J0889m391q300J1183
719E353O007j2101k712M499l517N152R478j1061j1009Q263L823m689M930M89p324
734d419J525L051n235Q8Q410K50o730j161J314k31N345K749o956j431M045j939
750a325K098M998l824m109J40L80L834M269j135o621m429M397M939l01j276l056
$$ plain form
766 -1021 -2232 1936 546 -2647 -343 502 -105 80 -2110 -2694 50 2023 61 -3926 -4330 54
782 54 2868 2769 471 -4113 -2641 606 717 3081 3677 -1248 -2113 1333 2897 1900 -296 -992 327
799 327 1326 2801 1323 -1137 -876 -221 -770 -1627 -2065 -435 3308 1679 -4077 -5381 -2082 1060 2022
816 2022 230 -1840 -1537 -564 1472 2047 634 -396 -289 293 2356 2442 1438 1406 -283 -1597 1385
833 1385 2528 631 -292 35 92 -1368 -3176 -420 1901 934 -993 -4008 -4139 340 2150 1362 -1765
850 -1765 -5790 -1921 4551 3412 -385 -2317 -1855 547 2185 3129 1921 -900 -407 280 -563 1588
866 1588 2020 -377 808 -476 -2706 132 1924 799 -125 -335 -2137 -2379 1847 4298 -79 -2440
882 -2440 -1528 -2303 1127 5068 -93 -4748 -1417 246 208 2860 929 -4251 -2342 2083 -546 -1675
$$ packed form
766a021j211M168j390l193K304Q45o07J85k190n84K744J973j962l987m04M384
782E4K814r9k298m584J472L247J11K364N96m925q65L446J564r97k196o96J319
799C27R99J475j478k460K61O55n49q57m38J630L743j629n756j304L299L142R62
816B022j792k070L03R73K036N75j413j030J07N82K063Q6j004l2j689j314K982
833A385J143j897r23L27N7j460j808K756K321r67j927l015j31M479J810p88l127
850a765m025L869O472j139l797j932M62K402J638R44j208k821M93O87q43K151
866A588M32k397J185j284k230K838J792j125r24k10j802k42M226K451m377k361
882b440R12p75L430L941n161m655L331J663l8K652j931n180J909M425k629j129
$$ plain form
898 -1675 1557 -216 -2257 1591 1389 -3083 -161 4042 -801 -1488 3017 20 -316 5448 2027 -4149
914 -4149 -340 2725 341 2271 2904 -3346 -4753 2777 2410 -3127 -294 -1275 -5866 6 3498 -3198
930 -3198 -2409 1227 -3587 -3704 2191 1404 -1237 2095 2178 -4527 -2954 4632 3265 2986 5749 -1222 -5890
947 -5890 1642 3884 2824 5107 1272 -5511 -2800 2019 953 -44 1893 -1909 -5151 -699 -990 -3304
963 -3304 1957 3193 -3486 -3541 -2528 -3817 1650 5752 718 -2569 -367 -1436 -1604 3366 3319 -138
979 -138 3188 3386 -2982 -1685 2594 -276 2344 6631 -406 -6203 -1341 -1520 -2401 5853 4629 -6365
995 -6365 -4836 -568 -4873 -742 7613 337 -5949 86 -2135 -7319 4083 9943 -1165 -1950 2140
1010 2140 -6985 -3559 11927 6115 -2778 2910 -1234 -8625 3879 10104 -2328 -2305 5230 -5780
$$ packed form
898a675L232j773k041L848k02m472K922M203m843o87M505k997l36N764l421o176
914d149L809L065k384J930O33o250j407P530l67n537K833r81m591N872L492o696
930c198P89L636m814j17N895p87k641L332Q3o705J573P586j367k79K763o971m668
947e890P532K242j060K283l835o783K711M819j066r97J937l802l242M452k91k314
963c304N261J236o679n5J013j289N467M102n034l287K202j069j68M970m7l457
979a38L326J98o368J297M279k870K620M287p037n797M862j79q81Q254j224j0994
995f365J529M268m305M131Q355p276o286O035k221n184J1402N860j1108p85M090
1010B140r125L426J5486n812q893N688m144p391J2504O225j2432K3P535j1010
$$ plain form
1024 -5780 -8191 7813 3180 -9176 3585 4448 -11855 -2807 8386 -4636 -4135 8338 -3418
1037 -3418 -11418 5798 7456 -6231 1883 6737 -8930 -1778 14015 -902 -7220 8963 1803
1050 1803 -9479 6575 8076 -8951 195 10672 -7847 -9282 9204 454 -9348 7003 3496
1063 3496 -15270 -1591 9155 -6988 -2816 11131 -4685 -11333 7257 3123 -8709 7284 10561
1076 10561 -8608 -1862 8673 -6737 -4864 15684 4937 -9456 3487 1176 -12509 4716
1088 4716 15740 -4974 -6968 4387 -8330 -10789 10711 7024 -7728 1655 2378 -14060 -4957
1101 -4957 11852 1885 -1716 8862 -4516 -14600 4920 10334 -1381 5402 6806 -10833 -7080
1114 -7080 8777 2931 -2073 7961 1657 -12007 -1855 4472 -4990 1324 9034 -4952 -9359 971
$$ packed form
1024e780k411J6004m633j2356J2761Q63j6303R048J1193j3022N01J2473j1756
1037c418q000J7216J658j3687Q114M854j5667P152J5793j4917o318J6183p160
1050A803j1282J6054J501j7027R146J0477j8519j435J8486q750r802J6351l507
1063C496j8766J3679J0746j6143M172J3947j5816o648J8590m134j1832J5993L277
1076A0561j9169O746J0535j5410J873K0548j0747j4393J2943k311j3685J7225
1088D716J1024k0714j994J1355j2717k459K1500l687j4752R383P23j6438R103
1101d957J6809r967l601J0578j3378j0084J9520N414j1715O783J404j7639L753
1114g080J5857n846n004J0034o304j3664J0152O327r462O314P710j3986m407J0330
$$ plain form
1128 971 -2886 -4646 7092 5714 -6414 -3295 1838 -4123 -66 8925 1742 -3221 4508 1154 -5648
1143 -5648 2401 5915 207 3273 4317 -5031 -5261 3097 2492 -2 1999 -1604 -7301 -2352 1557
1158 1557 -1499 127 1596 -3983 -5239 -840 -914 -337 3780 1599 -2861 -1061 80 -54 3937 5327
1174 5327 1359 -559 42 224 2703 5245 1900 -1926 -725 81 164 1897 431 -3305 -1279 -30
1190 -30 -3324 -1521 476 -2057 -1941 -654 -3224 -3094 1296 1665 -1936 -1059 356 -1734 911 4772
1206 4772 649 -1530 2528 951 3 4590 2966 -1265 662 2573 -564 143 2297 -563 -1995
1221 -1995 2408 538 -3872 -659 827 -2740 -993 1096 -3092 -2598 1776 -831 -3529 351 1070
1236 1070 -1789 311 1698 -2262 -875 3479 1479 -587 2004 287 -2177 2071 4013 118 270
$$ packed form
1128I71l857j760J1738j378j2128L119N133n961M057Q991p183m963P729l354o802
1143e648Q049L514n708L066J044r348k30Q358o05k494K001l603n697M949L909
1158A557l056J626J469n579j256M399p4N77M117k181m460J800J141j34L991J390
1174E327l968j918O01J82K479K542l345l826J201Q06Q3J733j466l736K026J249
1190c0l294J803J997k533J16J287k570J30M390L69l601Q77J415k090K645L861
1206D772m123k179M058j577r48M587j624m231J927J911l137P07K154k860j432
1221a995M403j870m410L213J486l567J747K089m188M94M374k607k698L880P19
1236A070k859K100J387l960J387M354k000k066K591j717k464M248J942l895J52
$$ plain form
1251 270 1014 -2168 -1064 3484 1343 -1459 919 320 -2222 -783 852 -812 -313 1538 -1984 -3597
1267 -3597 412 1535 -503 87 -1301 -3044 65 2652 581 -1056 -629 -563 -714 1289 1692 -498
1283 -498 234 1321 -648 -65 1882 157 -404 893 74 -53 785 824 57 -507 100 -347 -642 980
1301 980 1072 -986 -1253 -1416 -637 1078 1236 -1127 -1902 -1189 208 874 328 -451 -1245 -315 1054 716 -29
1320 -29 610 491 204 508 141 664 1098 924 299 -139 -296 164 577 904 108 -1098 -1065 77 910 674
1340 674 -403 -1909 -1422 298 716 94 -878 -1464 -619 701 554 -258 22 -188 398 -195 -256 174 470
1359 470 883 124 -859 -315 676 658 880 14 -1206 -517 336 623 1042 -45 -1015 -424 146 1305 1057
1378 1057 -399 -536 -557 562 1382 493 -89 -93 -631 -120 211 -570 333 689 -453 -1396 -1371 -695 323 644
$$ packed form
1251B70P44l182J104M548k141k802K378n99k542J439J635j664M99J851l522j613
1267c597M009J123k038N90j388j743L109K587k071j637M27O6j51K003M03k190
1283d98P32J087j969N83J947j725n61J297q19j27Q38L9p67n64O07m47k95J622
1301I80R2k058k67j63P79J715J58k363p75P13J397O66n46p79p94R30J369l38p45
1320b9O39j19k87L04l67N23M34j74o25m38j57M60M13L27p96j206L3J142Q33k36
1340F74j077j506M87J720M18o22r72n86Q45J320j47q12K80k10N86n93o1M30K96
1359D70M13p59r83N44R91j8K22q66j220O89Q53K87M19j087r70N91N70J159k48
1378A057j456j37k1J119Q20q89n82mn38N11L31p81R03L56j142r43K5O76J018L21
$$ plain form
1398 644 -428 -1699 -1482 248 281 257 642 -777 -1100 1288 1480 40 650 905 -477 715 2233 259
1416 259 -517 1375 534 -347 674 391 -1809 -424 990 -1205 -1554 516 -837 -2443 -256 -1343
1432 -1343 -2731 911 2036 -1862 -1479 35 -1505 -481 3497 1358 -2038 204 1380 -1129 2121
1447 2121 4569 -639 -1762 2248 -182 -1150 3095 1695 -2006 209 755 -3191 -1148 3339 -258
1462 -258 -2433 736 -1752 -4266 2137 2649 -3344 -967 1414 -2850 -892 3638 -299 -3066 2314
1477 2314 1937 -3062 917 3129 -1878 -811 3874 -1268 -2727 3585 1306 -2604 1881 1763 -3912
1492 -3912 -95 3609 -1583 -1994 2948 -740 -3248 2627 1407 -4100 808 3723 -2372 -1312 2566
1507 2566 -1489 -2156 4128 1638 -4381 -30 1597 -2480 876 3876 -1848 -3035 1632 -1007 -2796
$$ packed form
1398F44j072j271K17J730L3k4L85j419l23K388J92j440O10K55j382J192J518j974
1416B59p76J892q41q81J021k83k200J385J414k195l49K070j353j606K187j087
1432a343j388L642J125l898L83J514j540J024L978k139l396K242J176k509L250
1447B121K448n208j123M010k430r68M245j400l701K215N46l946K043M487l597
1462b58k175L169k488k514O403N12n993K377K381m264J958M530l937k767N380
1477B314l77m999L979K212n007J067M685n142j459O312k279l910M485j18n675
1492c912L817L704n192m11M942l688k508N875j220n507M908K915o095J060L878
1507B566m055o67O284k490o019M351J627m077L356L000n724j187M667k639j789
$$ plain form
1522 -2796 2995 2494 -2734 -790 282 -3688 -575 5147 707 -1962 667 -1579 -3067 2775 4920
1537 4920 266 -576 237 -2858 -1394 4680 2917 -571 814 -1292 -3891 158 2719 1100 853 716
1553 716 -3226 -4205 -291 1695 933 1402 -591 -4065 -2453 480 552 1577 1566 -1186 -1903 -763 -440
1570 -440 1106 2814 2036 634 25 -1177 -1136 2139 3019 2103 1536 -819 -3027 -893 1991 1052 1306
1587 1306 1260 -2104 -3579 -856 -721 -720 2381 1396 -3389 -3193 -787 -1776 783 4071 -148 -3666 -784
1604 -784 -522 -1267 3221 3941 -1509 -1336 1502 -1728 -229 5302 2137 -1992 981 569 -3446 1055
1620 1055 4178 -1012 -1373 1908 -2648 -3818 2691 1869 -3455 154 748 -4266 -272 3768 -1952 -2645
1636 -2645 2342 -360 -3281 1886 1994 -3308 898 3859 -2644 -2131 4012 74 -2052 3386 951
$$ packed form
1522b796N791n01n228J944J072l970L113N722m440k669K629k246j488N842K145
1537D920m654q42Q13l095J464O074j763l488J385k106k599M049K561j619k47j37
1553G16l942r79L914J986p62M69j993l474J612K933P2J025j1k752p17J140L23
1570d40J546J708p78j402o09j202M1L275Q80r16n67k355k208K134K884r39K54
1587A306m6l364j475K723J35JL101r85m785J96K406r89K559L288m219l518K882
1604g84K62p45M488P20n450J73K838l230J499N531l165m129K973m12m015M501
1620A055L123n190l61L281m556j170O509q22n324L609N94n014L994M040n720o93
1636b645M987k702k921N167J08n302M206K961o503N13O143l938k126N438k435
$$ plain form
1651 951 -3787 1848 3610 -2425 -990 3565 -1397 -2116 3224 82 -3561 2000 2167 -3503 -106 2324
1667 2324 -2728 -1268 4005 -840 -3603 1612 426 -3271 1579 3468 -2988 -2009 2201 -1394 -1875
1682 -1875 3637 1199 -3183 706 1062 -2661 240 3902 -731 -1042 1713 -1657 -2304 3243 2977 -956
1698 -956 98 752 -2596 35 3934 26 -1731 1128 -495 -2707 901 1485 -1651 -341 1155 -2143
1714 -2143 -2010 1124 393 -1185 633 82 -2449 127 1880 -686 -93 1566 -515 -614 1913 1021 -629
1731 -629 1336 1543 -347 397 1033 -900 -642 1197 267 -579 -237 -573 -2063 -335 309 -491 -684 -484
1749 -484 -1044 -1173 53 -395 -644 543 555 -656 -353 758 474 1445 1162 -144 -184 589 1298 1313 1003
1768 1003 169 -334 329 453 109 228 9 -548 -639 -647 -725 -306 -249 -375 -981 -898 -477 -288 213 -104 -843 -414
$$ packed form
1651I51m738N635J762o035J435M555m962p19N340l142l643N561J67n670L397K430
1667B324n052J460N273m845k763N215j186l697M850J889o456R79M210l595m81
1682a875N512k438m382L889L56l723K901L662m633l11K755l370o47N547k66l933
1698i56J054O54l348K631L899l908j757K859j623k212L608N84l136J310J496l298
1714b143J33L134p31j578J818n51k531K576J753k566N93J659k081r9K527q92j650
1731f29J965K07j890P44O36j933K58J839r30q46L42l36j490J728O44q00j93K00
1749d84n60j29J226m48k49J187J2j211L03J111k84R71k83j306m0P73P09J5l10
1768A003q34n03O63J24l44J19k19n57r1qp8M19N7j26o06Q3M21J89N01l17p39M29
$$ plain form
1790 -414 100 478 572 687 -106 -35 201 538 962 1041 535 -215 -114 585 514 80 117 -585 -723 192 -160 -133
1812 -133 -75 -412 -861 -298 -376 71 81 -39 -199 -706 -34 668 248 563 -137 -704 40 575 652 158 -634
1833 -634 -219 -100 436 610 -67 -437 -334 -400 -496 356 -29 153 141 -399 -350 -49 688 668 70 32 203 352
1855 352 749 781 204 -87 -479 21 550 663 -190 -724 -483 -258 -258 -27 -193 -1102 -970 -160 -240 -76 157
1876 157 -369 -494 145 -26 -237 608 1080 100 132 301 42 600 1437 477 -489 217 322 236 609 256 -416
1897 -416 -555 131 -345 -518 261 -209 -1475 -202 -77 -908 -8 170 -696 -493 -26 -408 -877 439 667
1916 667 -669 -137 449 86 654 1358 -168 -843 790 796 200 892 302 -766 -74 1130 26 -768 765
1935 765 -87 -807 600 -52 -614 -195 236 -617 -413 678 -287 -467 333 -341 -929 334 540 -329 -178
$$ packed form
1790d14N14L78R4J15p93P1K36L37M24P9n06p50J01O99p1m34L7p02j38R15l52K7
1812a33N8l37m49N63p8M47J0j20j60n07O72P02m20L15p00n67P44N35P7m94p92
1833f34M15J19N36J74o77l70J03o6r6Q52l85J82j2n40M9L01P37k0n98l8J71J49
1855C52L97L2n77k91l92N00N29J13q53n34K41K25%K31j66r09J32Q10q0J64K33
1876A57n26j25O39j71k11Q45M72r80L2J69k59N58Q37r60r66P06J05q6L73l53o72
1897d16j39O86m76j73P79m70j266J273J25q31R00J78q66K03M67l82m69J316K28
1916F67j336N32N86l63N68P04j526o75J633On96O92n90j068O92J204j104p94J533
1935G65q52p20J407o52n62M19M31q53K04J091r65j80Q00o74n88J263K06q69J51
$$ plain form
1954 -178 -37 -954 -185 1249 183 -577 -212 -397 -399 962 1050 -598 -678 -58 -329 566 1552 467 -328 -64
1974 -64 -379 -437 827 1119 326 419 -342 -1162 110 960 271 333 71 -1429 -971 410 190 167 499 -737
1994 -737 -1584 -458 118 -459 208 733 -847 -1063 -102 -561 -420 1693 1194 -969 262 262 -847 1100
2012 1100 2572 230 -76 891 -274 -1440 1518 1763 -563 897 707 -2626 -1266 1716 -50 -387
2028 -387 1361 -1115 -3532 -111 1028 -997 724 1530 -2549 -2842 1127 82 -857 2514 1226 -2610
2044 -2610 -508 1473 -1238 1103 4215 -265 -2355 1370 66 -1472 2899 2854 -2430 -1159 1257
2059 1257 -1583 -713 3411 -188 -3112 962 -8 -2907 821 2455 -1954 -1245 1879 -1936 -2297 2740
2075 2740 1146 -2446 857 1348 -2742 -103 3113 -1032 -1276 2852 -154 -2452 1879 1447 -2095 915
$$ packed form
1954a78J41r17P69J434j066p60L65j85kJ361Q8j648q0O20k71Q95R86j085p95K64
1974f4l15n8J264K92p93R3p61q20J272Q50o89O2k62j500M58J381k20k3L32j236
1994g37q47J126N76n77O67N25j580k16R61m59J41K113m99k163J231%j109J947
2012A100J472k342l06R67j165j166K958K45k326J460j90l333J360K982j766l37
2028c87J748k476k417L421J139k025J721Q06m079k93L969j045r39L371j288l836
2044b610K102J981k711K341L112m480k090L725j304j538M371m5n284J271K416
2059A257k840Q70M124l599k924M074r70k899L728J634m409P09L124l815l61N037
2075B740j594l592L303M91m090K639L216m145k44M128l006k298M331m32l542L010
$$ plain form
2091 915 2341 -2215 -1493 2484 -409 -1735 2481 556 -3204 609 1652 -1777 39 2546 -1588
2106 -1588 -1899 1986 126 -1692 2074 1130 -2806 -157 1796 -1428 -56 3063 -411 -2328 349
2121 349 156 -1398 1731 1754 -2053 -1218 683 -857 -292 2543 345 -1971 107 239 -1538 1060 2398
2138 2398 -460 -932 435 -1317 -1077 2091 1470 -636 392 -304 -1704 342 1984 229 -351 139
2154 139 -979 -1219 464 1007 -473 296 277 -1537 -953 79 -184 510 614 -578 -921 -234 25 312
2172 312 563 556 -398 -314 -136 -375 154 1045 238 260 -161 -925 -408 246 535 442 482 -600 -1309 -321 684
2193 684 246 422 -68 -1287 -1041 64 -338 -62 799 -275 -1116 -218 -31 -467 607 1335 -372 -1131
2211 -1131 15 48 -19 1274 383 -984 -166 373 -251 78 907 -487 -909 372 84 -873 663 710 -814
$$ packed form
2091I15J426m556P22L977k893j326M216j925l760L813J043l429J816K507m134
2106a588l11L885j860j818L766r44l936K649J953l224J372L119l474j917K677
2121C49j93j554L129K3l807Q35J901j540N65K835k198k316K078J32j777K598J338
2138B398k858m72J367j752K40L168o21k106J028o96j400K046J642j755n80M90
2154A39j118k40J683N43j480P69j9j814N84J032k63O94J04j192l43O87K59K87
2172C12K51pr54Q4J78k39N29Q91q07K2m21p64N17O54K89r3M0j082p09R88J005
2193F84m38J76m90j219K46J105m02K76Q61j074q41Q98J87m36J074P28j707p59
2211a131J146L3o7J293q91j367Q18N39o24L29Q29j394m22J281k88r57J536M7j524
$$ plain form
2230 -814 -264 518 -640 -236 782 -90 -510 423 512 -655 12 696 -532 -263 985 8 -385 713
2248 713 -126 -567 575 612 -640 -181 595 -406 -507 745 133 -1052 -50 133 -617 649 493 -548
2266 -548 -174 185 -504 -333 563 320 -394 265 595 -325 336 820 159 -298 107 -262 9 569 535 -528
2286 -528 -245 40 -186 -154 477 62 -846 0 -218 -433 -49 211 -661 -291 -187 197 0 151 17 -210
2306 -210 -100 7 -196 545 486 8 -192 -140 62 -19 223 199 -425 -152 291 108 268 137 -291 -88 4 174
2328 174 118 2 -271 -476 -633 -122 14 -158 -97 -52 -287 -120 488 182 267 26 21 -131 327 550 210 82
2350 82 -206 -186 222 402 152 237 -3 -264 42 137 122 -19 126 -305 -143 -199 -20 242 -83 -201 -378 -184
2372 -184 63 144 195 -113 -299 114 217 376 272 121 -204 -282 126 295 -138 -61 -315 -50 -246 -75 103
$$ packed form
2230h14N50P82j158M04J018q72m20R33Q9j167O67O84j228K69J248r77l93J098
2248G13q39m41J142L7j252M59P76j001j01J252o12j185J002J83p50J266j56j041
2266e48L74L59o89J71Q96k43p14O59L30r20O61M84o61m57M05l69K71N60l4j063
2286e28K83K85k26L2O31m15r08Q46k18k15L84K60q72L70J04L84j97J51j34k27
2306b10J10J07k03P41n9m78k00N2K02q1K42k4o24K73M43j83J60j31m28K03R2J70
2328A74n6j16k73k05j57N11J36j72O1M5k35J67O08l06Q5k41nj52M58K23l40j28
2350H2k88K0M08J80k50Q5k40k61L06R5j5j41J45m31J62n6J79K62l25j18j77J94
2372a84K47Q1N1l08j86M13J03J59j04j51l25p8M08J69m33P7k54K65j96J71J78
$$ plain form
2393 103 -98 -30 -305 -157 225 -72 -24 -49 -106 -289 24 408 367 55 247 -59 -466 230 408 -38 48 23
2415 23 -366 -97 390 134 -316 -79 -459 -519 1 164 -313 45 251 -457 -485 145 -125 -467 184 -131 -856
2436 -856 -138 681 -65 -70 534 0 -284 752 214 -268 335 266 -284 -40 605 -418 -515 741 289 -776
2456 -776 444 255 -1337 -153 696 -524 -453 448 -728 -819 323 415 -679 361 714 -1209 -485 870
2474 870 2 52 1001 -151 -1084 718 965 -263 716 880 -1233 -886 1022 16 -375 1315 -117 -1370
2492 -1370 15 536 -713 180 1181 -609 -1121 626 60 -992 1164 689 -1390 -203 778 -678
2508 -678 -52 1231 -342 -951 814 649 -852 438 868 -701 -205 1081 -865 -665 1244 241 -940
2525 -940 345 402 -1254 -152 935 -565 -373 763 -388 -1201 574 686 -724 501 708 -1032 -240
$$ packed form
2393A03k01O8k75J48L82k97M8k5n7j83L13L84m1l12J92l06m07O96J78m46Q6k5
2415B3l89K69M87k56m50K37l80o0N20J63m77L58K06p08k8O30k70l42O51l15p25
2436h56P18Q19p46nO04n34k84J036n38m82O03o9n50K44O45j023r7J256m52j065
2456g76J220j89j592J184Q49j220P1R01j176r1J142R2j094J040L53j923P24J355
2474H70q68N0R49j152r33J802K47j228R79J64k113L47J908j006l91J690j432j253
2492a370J385N21j249Q93J001j790n12J747n66j052K156m75k079J187R81j456
2508f78O26J283j573o09J765j65j501J290M30j569M96J286j946K00J909j003j181
2525i40J285N7j656J102J087j500J92J136j151q13J775J12j410J225K07j740P92
$$ plain form
2542 -240 674 96 -154 1103 4 -1130 393 403 -150 470 748 -992 -815 419 118 17 416 -153
2560 -153 -1138 -514 93 -216 557 572 -390 -698 -247 -377 341 1010 604 -345 -176 -437 106 874 1091 194
2580 194 -370 -439 -468 26 820 297 -74 -46 -820 -805 380 438 194 583 -456 -1120 -429 471 -288 352 732
2601 732 -511 -798 459 -32 -136 1190 707 -799 -218 324 -360 223 1195 213 -734 59 -233 -1128 683
2620 683 1322 -439 -102 413 -1404 -473 1493 297 -624 656 -104 -1839 -10 1365 -234 227 1396
2637 1396 -1010 -1391 930 639 -478 950 506 -1649 -761 1035 -369 -224 1169 -252 -1743 252
2653 252 332 -866 821 1257 -999 -926 1047 -308 -602 1436 806 -1612 96 853 -921 213 1664
2670 1664 -678 -1026 642 -45 -947 679 902 -1229 -34 710 -1179 -453 1063 -203 -958 832 -95
$$ packed form
2542b40R14n78k50J257j099j134J523J0n53O20K78j740J77J234l01j01L99n69
2560a53r85O24O07l09P73J5r62l08M51j30P18O69m06r49J69k61N43P68K17q97
2580A94n64o9k9M94P94n23l71K8p74J5J185N8k44L89j039o64O91R00p59O40L80
2601G32j243k87J257m91j04J326m83j506N81N42o84N83R72r82r47P93k92q95J811
2620F83O39j761L37N15j817R31J966j196r21J280p60j735J829J375j599M61J169
2637A396k406l81K321k91j117J428m44k155Q88J796j404J45J393j421j491J995
2653B52Q0j198J687M36k256P3J973j355k94K038o30k418J708P57j774J134J451
2670A664k342l48J668o87r02J626K23k131J195P44j889P26J516j266p55J790r27
$$ [...]
8191A28
##END NTUPLES=NMR FID
##END=
