##TITLE=1H_LR-753-R1-C1OST
 DMSO-d6
 8 sc, 
 26.07.2022
##JCAMPDX= 6.0         $$ Bruker NMR JCAMP-DX V2.0
##DATA TYPE= NMR FID
##DATA CLASS= NTUPLES
##ORIGIN= UXNMR, Bruker Analytische Messtechnik GmbH
##OWNER= root
$$ XWIN-NMR		Version 3.5
$$ Tue Jul 26 16:09:21 2022 Russian Standard Time (UT+4h)  she@DPX200
##.OBSERVE FREQUENCY= 200.1313499994
##.OBSERVE NUCLEUS= ^1H
##.DELAY= (6, 6)
##.ACQUISITION MODE= SIMULTANEOUS
##.ACQUISITION SCHEME= undefined
##.AVERAGES= 8
##.DIGITISER RES= 18
##SPECTROMETER/DATA SYSTEM= spect
##.PULSE SEQUENCE= zg30
##.SOLVENT NAME= DMSO
##.SHIFT REFERENCE= (INTERNAL, DMSO, 0, 15.7039)
##AUDIT TRAIL= $$ (NUMBER, WHEN, WHO, WHERE, WHAT)
$$ ##TITLE= Audit trail, XWIN-NMR		Version 3.5
$$ ##JCAMPDX= 5.01
$$ ##ORIGIN= Bruker BioSpin GmbH
$$ ##OWNER= she
$$ F:/spectra/data/she/nmr/H-F/1/audita.txt
$$ ##AUDIT TRAIL=  $$ (NUMBER, WHEN, WHO, WHERE, WHAT)
(   1,<2022-07-26 16:07:35.68 +0400>,<she>,<DPX200>,
      <created by zg, POWCHK disabled, PULCHK disabled
       configuration hash MD5:
       00 E9 B6 7A A2 85 ED C7 34 08 36 98 17 FE 4E 26
       data hash MD5: 16K
       89 B9 56 73 66 C9 42 EB 75 FE 01 BE 7C E9 94 ED>)
$$ ##END=
$$ 
$$ hash MD5
$$ 8B 70 C7 02 50 7D 48 03 2C F4 C0 7B 81 E6 FE 63
##$RELAX= 
##$RELAX= 
##$RELAX= 
##$RELAX= 
##$RELAX= 
##$RELAX= 
$$ Bruker specific parameters
$$ --------------------------
##$DU= <F:/spectra>
##$EXPNO= 1
##$NAME= <H-F>
##$PROCNO= 1
##$TYPE= <nmr>
##$USER= <she>
##$AMP= (0..31)
100 100 100 100 100 100 100 100 100 100 100 100 100 100 100 100 100 100 
100 100 100 100 100 100 100 100 100 100 100 100 100 100 
##$AQSEQ= 0
##$AQ_mod= 1
##$AUNM= <au_zg>
##$AUTOPOS= <>
##$BF1= 200.13
##$BF2= 200.13
##$BF3= 200.13
##$BF4= 200.13
##$BF5= 200.13
##$BF6= 200.13
##$BF7= 200.13
##$BF8= 200.13
##$BYTORDA= 1
##$CFDGTYP= 0
##$CFRGTYP= 5
##$CHEMSTR= <none>
##$CNST= (0..31)
1 1 145 1 1 1 1 1 1 1 1 1 1 1 1 1 1 1 1 1 1 1 1 1 1 1 1 1 1 1 1 1 
##$CPDPRG= <>
##$CPDPRG1= <>
##$CPDPRG2= <>
##$CPDPRG3= <>
##$CPDPRG4= <mlev>
##$CPDPRG5= <mlev>
##$CPDPRG6= <mlev>
##$CPDPRG7= <mlev>
##$CPDPRG8= <mlev>
##$CPDPRGB= <>
##$CPDPRGT= <>
##$D= (0..31)
0 1.2 0 0 0 0 0 0 0 0.06 0 0.03 0 0 0 0 0.0002 0 0 0 0 0 0 0 0 0 0 0 0 
0 0 0 
##$DATE= 1658837255
##$DBL= (0..7)
120 120 120 120 120 120 120 120 
##$DBP= (0..7)
150 150 150 150 150 150 150 150 
##$DBP07= 0
##$DBPNAM0= <>
##$DBPNAM1= <>
##$DBPNAM2= <>
##$DBPNAM3= <>
##$DBPNAM4= <>
##$DBPNAM5= <>
##$DBPNAM6= <>
##$DBPNAM7= <>
##$DBPOAL= (0..7)
0.5 0.5 0.5 0.5 0.5 0.5 0.5 0.5 
##$DBPOFFS= (0..7)
0 0 0 0 0 0 0 0 
##$DE= 6
##$DECBNUC= <off>
##$DECIM= 32
##$DECNUC= <off>
##$DECSTAT= 4
##$DIGMOD= 1
##$DIGTYP= 9
##$DL= (0..7)
0 120 120 120 120 120 120 120 
##$DP= (0..7)
150 150 150 150 150 150 150 150 
##$DP07= 0
##$DPNAME0= <>
##$DPNAME1= <>
##$DPNAME2= <>
##$DPNAME3= <>
##$DPNAME4= <>
##$DPNAME5= <>
##$DPNAME6= <>
##$DPNAME7= <>
##$DPOAL= (0..7)
0.5 0.5 0.5 0.5 0.5 0.5 0.5 0.5 
##$DPOFFS= (0..7)
0 0 0 0 0 0 0 0 
##$DQDMODE= 0
##$DR= 18
##$DS= 0
$$ [...]
##$SUBNAM2= <"">
##$SUBNAM3= <"">
##$SUBNAM4= <"">
##$SUBNAM5= <"">
##$SUBNAM6= <"">
##$SUBNAM7= <"">
##$SUBNAM8= <"">
##$SUBNAM9= <"">
##$SW= 18.0517283424941
##$SWIBOX= (0..15)
0 0 2 0 0 0 0 0 0 0 0 0 0 0 0 0 
##$SW_h= 3612.71676300578
##$TD= 16384
##$TD0= 1
##$TE= 0
##$TE2= 300
##$TE3= 300
##$TEG= 300
##$TL= (0..7)
0 120 120 120 120 120 120 120 
##$TP= (0..7)
150 150 150 150 150 150 150 150 
##$TP07= 0
##$TPNAME0= <>
##$TPNAME1= <>
##$TPNAME2= <>
##$TPNAME3= <>
##$TPNAME4= <>
##$TPNAME5= <>
##$TPNAME6= <>
##$TPNAME7= <>
##$TPOAL= (0..7)
0.5 0.5 0.5 0.5 0.5 0.5 0.5 0.5 
##$TPOFFS= (0..7)
0 0 0 0 0 0 0 0 
##$TUNHIN= 0
##$TUNHOUT= 0
##$TUNXOUT= 0
##$USERA1= <user>
##$USERA2= <user>
##$USERA3= <user>
##$USERA4= <user>
##$USERA5= <user>
##$V9= 5
##$VALIST= <valist>
##$VCLIST= <CCCCCCCCCCCCCCC>
##$VD= 0
##$VDLIST= <DDDDDDDDDDDDDDD>
##$VPLIST= <PPPPPPPPPPPPPPP>
##$VTLIST= <TTTTTTTTTTTTTTT>
##$WBST= 1024
##$WBSW= 4
##$XGAIN= (0..3)
0 0 0 0 
##$XL= 0
##$YL= 0
##$YMAX_a= 199710
##$YMIN_a= -337625
##$ZGOPTNS= <>
##$ZL1= 120
##$ZL2= 120
##$ZL3= 120
##$ZL4= 120
##$ABSF1= 10
##$ABSF2= 0
##$ABSG= 5
##$ABSL= 3
##$ALPHA= 0
##$AQORDER= 0
##$ASSFAC= 0
##$ASSFACI= 0
##$ASSFACX= 0
##$ASSWID= 0
##$AUNMP= <proc_1d>
##$AZFE= 0.1
##$AZFW= 0.1
##$BCFW= 1
##$BC_mod= 2
##$BYTORDP= 1
##$COROFFS= 0
##$CY= 11.3945322036743
##$DATMOD= 1
##$DC= 2
##$DFILT= <>
##$DTYPP= 0
##$F1P= 2.36226072786647
##$F2P= -0.459571619588291
##$FCOR= 0.5
##$FTSIZE= 0
##$FT_mod= 4
##$GAMMA= 1
##$GB= 0.15
##$INTBC= 1
##$INTSCL= 1
##$ISEN= 128
##$LB= 0.24
##$LEV0= 0
##$LPBIN= 0
##$MAXI= 10000
##$MC2= 0
##$MEAN= 0
##$ME_mod= 0
##$MI= 1.114404
##$NCOEF= 0
##$NC_proc= 0
##$NLEV= 6
##$NOISF1= 3.799351
##$NOISF2= 2.8
##$NSP= 1
##$NTH_PI= 0
##$NZP= 0
##$OFFSET= 15.70392
##$PC= 1
##$PHC0= -18039.74
##$PHC1= 10.20068
##$PH_mod= 1
##$PKNL= yes
##$PPARMOD= 0
##$PSCAL= 0
##$PSIGN= 0
##$REVERSE= no
##$SF= 200.130013532006
##$SI= 16384
##$SIGF1= 3
##$SIGF2= 2
##$SINO= 400
##$SIOLD= 16384
##$SREGLST= <1H.CDCl3>
##$SSB= 0
##$STSI= 0
##$STSR= 0
##$SW_p= 3612.71676300578
##$SYMM= 0
##$S_DEV= 0
##$TDeff= 0
##$TDoff= 0
##$TI= <>
##$TILT= no
##$TM1= 0
##$TM2= 0
##$TOPLEV= 0
##$USERP1= <user>
##$USERP2= <user>
##$USERP3= <user>
##$USERP4= <user>
##$USERP5= <user>
##$WDW= 1
##$XDIM= 8192
##$YMAX_p= 0
##$YMIN_p= 0
$$ End of Bruker specific parameters
$$ ---------------------------------
##NTUPLES= NMR FID
##VAR_NAME=  TIME,          FID/REAL,        FID/IMAG
##SYMBOL=    X,             R,               I
##VAR_TYPE=  INDEPENDENT,   DEPENDENT,       DEPENDENT
##VAR_FORM=  AFFN,          ASDF,            ASDF
##VAR_DIM=   8192,          8192,            8192
##UNITS=     SECONDS,       ARBITRARY UNITS, ARBITRARY UNITS
##FACTOR=    0.0002768,     1,               1
##FIRST=     0,             0,               0
##LAST=      2.2672688,     0,               0
##MIN=       0,             -337625,         0
##MAX=       2.2672688,     199710,          0
$$ Real data points
##PAGE= N=1
##DATA TABLE= (X++(R..R)), XYDATA
0 0 0 0 0 0 0 0 0 0 0 0 0 8 -8 8 -8 16 -16 24 -24 32 -40 47 -55 64 -72 88 -98 116 -134 152 -175 199 -227
33 -227 256 -290 326 -366 411 -460 513 -571 634 -704 779 -863 954 -1053 1160 -1279 1408
50 1408 -1552 1710 -1883 2079 -2297 2541 -2822 3140 -3511 3950 -4473 5115 -5920 6969 -8394
65 -8394 10453 -13713 19679 -34272 152574 103867 -109330 25846 -14000 9642 138021 178450
77 178450 107115 132871 38567 -127037 -116278 13690 37054 52031 35399 -31154 -26105 -20310
89 -20310 -181186 -245350 -97354 -6178 -11906 45090 15245 -116467 -124654 -86180 -144873 -66368
101 -66368 148477 185580 73588 7154 -63038 -86459 18093 79527 54754 118940 178019
112 178019 67923 -39017 -24222 -6418 29791 105032 82715 23440 59963 43016 -84547
123 -84547 -132160 -83313 -37438 29531 67898 3231 -42742 -36871 -106021 -160287 -68606 28824
135 28824 55959 78561 27144 -91391 -100862 -32454 -27336 -8263 78189 102076 50455 8786
147 8786 -41173 -63500 9976 68878 49772 58483 81965 41199 -11358 -46410 -76444 -35001
159 -35001 56994 69734 30954 34682 13243 -63298 -90007 -61092 -20645 50322 89803 26488
171 26488 -41643 -49576 -60144 -64808 -16844 28567 42035 52298 17866 -57392 -68282 -23444
183 -23444 -5142 16002 52751 51300 31741 15384 -37291 -79849 -39389 21329 37953 47190
195 47190 49829 15718 -16481 -35147 -58364 -31639 46803 75325 41903 13635 -13412 -46340
207 -46340 -44826 -22325 -3882 35747 67572 29310 -28679 -41953 -39150 -29279 3796 28113 33100
220 33100 40174 19108 -36630 -64959 -47260 -22111 9198 40421 35526 15662 6363 -24745 -58984
233 -58984 -35734 16627 41591 45396 30990 -6420 -31807 -29276 -28644 -16931 28134 60827 43804
246 43804 7951 -21037 -34745 -23152 -4181 8602 29803 48045 29642 -12233 -41540 -48211
258 -48211 -30465 3315 24333 26131 27708 15183 -21983 -46463 -37461 -12534 16728 37069 26944
271 26944 -1857 -17183 -24202 -35169 -27365 7948 38400 42743 24363 -6059 -28338 -29140 -15975
284 -15975 428 18747 38204 41537 15339 -24137 -40938 -24592 -1080 11572 23746 32621
296 32621 20530 -5515 -27487 -35951 -24411 5509 29389 25805 8669 -3080 -18173 -36488
308 -36488 -34114 -8237 19732 32950 26536 4576 -20294 -29866 -21878 -9631 5225 26408 38389
321 38389 23916 -6154 -27232 -27068 -13206 4381 19403 26809 25187 11897 -11257 -30882 -25821
334 -25821 517 21436 23338 16302 5932 -10658 -27688 -32397 -20600 3179 24359 27020 11027
347 11027 -9146 -19937 -23081 -20565 -7449 13770 29504 24991 3939 -16605 -26064 -20599 -2994
360 -2994 13147 21494 25427 21471 2592 -19230 -22906 -7404 11135 21435 20732 11485 1240 -12260
374 -12260 -26816 -26026 -6184 15241 25204 19167 1064 -15134 -20598 -23174 -20636 -2557 18972
387 18972 20286 7277 -8054 -22567 -23774 -9716 2478 11358 23163 22997 5736 -9944 -16904
400 -16904 -15566 1477 20810 20694 15468 14945 808 -16896 -16007 -6211 5164 23000 27227 7996
414 7996 -5293 -8845 -21423 -25187 -6865 8060 14111 15722 -1251 -24541 -24017 -14998 -13436 133
428 133 17009 12494 965 -5102 -19337 -23507 -1924 10899 8742 18220 20499 2790 -5589 -4844
442 -4844 -11843 -2636 22396 26067 15792 15051 3898 -16268 -13915 -3172 1211 17816 26953 4296
456 4296 -14898 -15023 -20726 -19749 1201 8728 1992 6117 -2809 -26803 -23496 -5656 -7740 -2584 13217
471 13217 7189 -2653 1520 -8534 -20984 -5049 11488 10296 20733 26542 6011 -4924 -2303
484 -2303 -9831 -2936 24888 27462 11725 7547 -5423 -23136 -10019 7132 4048 10009 17899 -3754
498 -3754 -20212 -11874 -13316 -14850 1325 2584 -7620 1388 3094 -15752 -16893 -6995 -11561 -2703
512 -2703 19574 15062 3017 6267 -8284 -24505 -4229 17074 15339 21057 19886 -6369 -16090
525 -16090 -1333 330 5212 24308 18098 -2352 -781 -4593 -17368 -3296 8021 -5741 -2586
538 -2586 12636 232 -10449 -1504 -11239 -22112 -1090 10182 907 9027 9580 -17873 -23105 -7004
552 -7004 -5118 6961 26885 11485 -10056 -4694 -7892 -16656 6420 21972 5943 5400 10202 -11228
566 -11228 -13657 7461 2728 -5336 11282 11018 -2948 6431 6721 -15217 -10859 4119 -3883 2785
580 2785 21530 5695 -11823 -4270 -12199 -19217 8668 22461 3491 261 1224 -20398 -19833 4799
594 4799 3849 782 14920 3846 -16327 -5180 798 -10296 594 11323 -2689 -429 13802
607 13802 -789 -11342 1820 -2501 -9679 11948 19765 3276 5296 4139 -16454 -12835 10099
620 10099 9260 7463 16402 175 -18874 -7068 -1554 -7104 8504 16119 -3319 -6756 -515 -12666
634 -12666 -12727 3780 -867 -8131 5413 5173 -8201 -2572 119 -12908 -5175 10023 5169 5846 12870
649 12870 -1116 -13947 -3576 1341 632 15559 18516 389 -3415 -668 -9129 -3036 12853 8667
663 8667 2177 5979 -2580 -12772 -4256 -406 -6105 250 6094 -2700 -2600 2062 -8651 -12598 -2473
678 -2473 -1946 -1937 8626 6338 -6112 -6298 -5236 -9037 304 13473 9718 4795 4925 -4063 -9240 1023
694 1023 5299 4107 10092 9005 -1527 -2466 -237 -4825 -2185 6193 3757 781 5096 118 -8505
709 -8505 -6310 -5144 -6845 988 6584 512 -2352 -2706 -8999 -10159 -710 3154 3251 7091 2790 -6670
725 -6670 -5871 -2263 -2762 2773 9314 6480 3645 3353 -1992 -5039 1086 3674 2660 6501 6787 116
741 116 -2351 -2373 -6089 -3321 3820 4304 2664 2562 -2199 -8163 -7334 -4485 -3274 1974 5353 446 -3940
758 -3940 -4335 -6605 -5424 408 3625 4258 5435 2591 -3045 -4047 -1799 -407 2741 6402 5867 4188
774 4188 2652 -1563 -3952 -503 2869 4363 5455 4345 -209 -3768 -4937 -5422 -3232 2051 3528
789 3528 1933 -788 -3707 -6055 -5500 -3285 -1166 1753 3336 1186 -2533 -4403 -4919 -2644 1261 3884
805 3884 4831 5474 3559 -894 -2978 -1922 1341 4005 5418 4661 2386 119 -2056 -3476 -1538 1585
821 1585 4049 4444 1430 -1983 -3832 -4865 -4653 -3115 312 2229 1204 -1409 -4421 -5550 -4187 -1574
837 -1574 382 2708 3453 1891 -1209 -3435 -3548 -1092 2722 4396 4343 4177 2658 -257 -1775 -1027 1159
854 1159 4005 5267 3479 288 -1386 -2550 -3433 -2587 606 2494 2522 909 -2943 -4765 -4160 -3389 -2174
871 -2174 406 1405 676 -794 -3548 -5380 -2803 712 2189 2830 3730 2051 -714 -1380 -1928 -1109 3211
888 3211 4455 3153 2351 1552 -1237 -1927 -451 195 2099 4827 3120 -1109 -2022 -3109 -4476 -1821
904 -1821 632 735 1748 1624 -3281 -5398 -2699 -1558 -757 2361 2405 -730 -254 -1371 -4372 -2055 2108
921 2108 1661 2034 4178 1663 -1063 665 -679 -2985 2029 4679 1652 1605 1652 -3395 -3697 49 17
938 17 853 5269 3063 -2643 -2346 -2616 -4641 -10 3595 -116 -452 1768 -2757 -4329 582 79 -1667
955 -1667 2691 2704 -1806 368 1787 -4057 -3194 1581 233 807 5618 1877 -3548 -795 -800 -3855 2396
972 2396 6489 1133 -29 941 -5176 -4896 2922 2145 -107 4262 1691 -4353 -364 1705 -2893 -611
988 -611 3443 -1790 -2004 3681 -363 -4317 265 -1264 -4279 2993 5374 -455 -309 605 -6117 -4764
1004 -4764 3347 1952 1015 4652 -314 -6710 -1019 1806 -1095 3396 5892 -1596 -2352 2219 -1594
1019 -1594 -2221 4151 1036 -3073 2546 2780 -2226 1704 2200 -5023 -2438 3130 157 328 4776 -1783
1035 -1783 -7547 -1770 -827 -2501 4749 5766 -3237 -3294 -295 -4376 -1334 6508 1902 -2249 1723 -1110
1051 -1110 -4842 2223 4064 -2292 596 3825 -1938 240 5936 -372 -3784 1092 -828 -3035 5067
1066 5067 5175 -3156 -1901 -515 -5770 -1153 7017 1862 -1211 1826 -4347 -7860 1218 2887 -1446
1081 -1446 2056 2036 -5931 -2628 3937 -753 -1170 4195 -827 -4067 3872 3014 -2736 1305 1108 -5344
1097 -5344 212 6513 1570 615 4290 -3014 -6343 2403 3691 -272 4427 2410 -6596 -3724 1693
1112 1693 -1927 626 5795 -670 -5191 505 -31 -3815 2300 2153 -4983 -1028 3001 -2302 -601
1127 -601 3574 -2288 -4712 2103 2184 -643 4766 2676 -5313 -2008 1723 -1372 2009 6982 243 -2910
1143 -2910 1003 -961 -2509 4404 4371 -2062 201 1045 -3910 -1394 3046 -1667 -2917 1832 -997 -2669
1159 -2669 2063 815 -3982 -1206 522 -2911 472 3954 -1086 -3225 23 -2401 -2413 3874 3568 -99
1175 -99 1530 734 -3232 -375 3328 1096 909 3222 -631 -2457 1833 786 -1797 1408 1590 -1456
1191 -1456 663 1936 -1592 -1735 267 -2382 -2404 1772 761 -1498 285 -1220 -4214 -691 1745 -109
1207 -109 1083 1902 -1621 -2538 188 -346 -434 2766 1987 -933 1029 1080 -1076 682 2249 10 312
1224 312 1974 288 -995 820 -552 -2165 526 1452 -174 895 944 -2203 -2001 -296 -1301 -545
1240 -545 1490 41 -1642 -1159 -906 -1960 190 1593 35 236 1175 -759 -1243 443 -269 -152 1331
1257 1331 1299 -261 796 894 -742 -75 1301 708 754 2186 104 -1061 -250 -826 -1087 370 1008 435
1275 435 109 7 -1439 -1326 133 -135 -95 493 75 -1012 -915 -1258 -1324 -264 677 495 334 485 -146 -764
1295 -764 -71 -19 41 1412 1138 116 145 -221 -547 -205 728 980 1145 1286 267 -769 -505 -151 -414 -4
1315 -4 309 143 94 -402 -1094 -995 -193 577 198 201 171 -551 -715 -978 -1167 -403 726 526 513 417 -45 -316 -424
1338 -424 131 451 1151 991 412 -310 -516 -442 -42 351 722 805 880 137 -401 -705 -133 -145 344 288 199 -95
1360 -95 -455 -905 -1292 -192 383 387 912 42 -427 -529 -283 -840 -417 666 373 118 191 -546 -495 340 284
1381 284 607 1130 1095 308 195 -426 -487 -318 510 447 209 595 59 -667 48 -37 152 778 913 -591 -290
1402 -290 -283 -765 -825 -202 -25 -299 628 562 -764 -103 74 -820 -359 524 34 -261 469 -754 -1467 -324
1422 -324 683 -44 1289 1550 -382 138 162 -696 -62 1624 401 -516 644 224 -1123 456 769 -543
1440 -543 363 1336 -368 -227 939 -745 -1382 133 -264 -923 844 1019 -1390 -739 127 -1262 -443 1875
1458 1875 266 -758 537 -474 -1975 715 1585 -326 646 1144 -989 -308 1913 51 -516 1617
1474 1617 196 -1258 1451 1016 -1183 157 662 -1588 -39 2113 252 -450 923 -1273 -2163 832
1490 832 1057 -766 675 430 -2699 -1437 996 -400 -261 2104 -422 -2327 771 486 -1333 1073
1506 1073 1325 -1868 -205 1701 -427 51 2449 -551 -2116 1420 1126 -305 1966 1310 -2668 -994
1522 -994 1418 -672 641 2737 -289 -2043 231 -603 -1557 2114 1503 -2036 -1017 417 -2363 -663
1538 -663 2208 -1013 -1641 1094 -810 -1353 2271 1273 -1961 -70 507 -1707 985 3336 -226 -1395
1554 -1395 1113 -724 -1065 3132 2453 -598 954 189 -2972 200 2788 -164 -633 1050 -1715 -2175
1570 -2175 1711 834 -1342 767 47 -3100 -177 1680 -1189 -1002 749 -2395 -2126 2281 1184 -947
1586 -947 1692 51 -2862 616 2658 379 1234 2334 -1428 -1959 1679 947 103 2875 734 -2315
1602 -2315 367 1514 -807 529 1685 -1904 -2035 991 -542 -1107 1883 -583 -3554 -193 1053
1617 1053 -1406 1125 1917 -1879 -2072 789 -556 -495 3167 1259 -2318 284 877 -1255 1648 3103
1633 3103 -756 -715 1466 -1161 -819 2483 601 -1907 231 460 -1822 888 2245 -1569 -1467 622
1649 622 -1489 -1048 2009 173 -2118 43 -665 -2244 620 2542 -476 -189 1008 -1419 -1006 2161
1665 2161 718 -531 1126 162 -1897 853 1841 -786 100 1422 -1048 -601 1837 544 -968 684
1681 684 -414 -1831 607 1136 -758 -204 571 -1395 -1102 1326 312 -218 1487 -157 -1806 29
1697 29 817 -598 766 1043 -1080 -747 926 -389 -229 1062 -58 -855 359 656 -788 381 566
1714 566 -1098 -354 907 44 -49 1065 48 -1015 115 275 -498 747 1111 -898 -506 198 -601 29
1732 29 854 185 -438 373 111 -527 32 337 -772 -150 53 -740 -456 479 -326 -723 326 31 -201 661
1752 661 638 -582 -242 412 -485 147 798 301 -128 579 -126 -258 666 731 243 279 251 -397 -192 321 -538
1773 -538 -296 82 -272 -738 73 -79 -684 -275 -359 -362 115 -266 -308 -570 -112 -555 -580 258 487 184 423 432
1795 432 91 242 469 436 338 454 155 304 291 304 -78 165 429 -77 479 -37 -116 -125 -313 -808 -471 2
1817 2 -338 -616 -350 -349 -745 -212 -273 -333 -293 -32 -196 -169 -281 -300 -348 102 252 329 468 445 559 538 391 515
1841 515 504 624 289 -92 166 48 -64 53 243 107 -27 -15 -292 -460 -113 -553 -730 -218 -452 -500 -378
1862 -378 -275 -644 -586 0 -167 -31 310 -17 -54 -10 174 -219 347 420 416 322 378 210 122 544 332 139 704
1885 704 466 -363 239 -74 -400 -189 21 -212 -2 -187 -173 -510 112 -357 -463 -214 -253 -376 -196 -346 -637
1906 -637 -406 142 -107 143 490 137 -354 291 99 21 549 457 -8 330 295 -152 33 797 273 -56 671
1927 671 438 25 311 153 -511 -80 195 -686 52 454 -651 -860 233 -332 -318 394 185 -619 -216 -270
1947 -270 -857 -234 564 -560 -482 526 -307 -455 294 288 -177 287 371 -436 239 695 -308 -150 461 -194
1967 -194 -213 864 477 -154 280 -4 -835 72 831 -28 -7 641 -584 -925 233 124 -362 729 382
1986 382 -1237 -145 533 -544 -548 491 -875 -997 278 -86 -495 581 70 -1196 237 949 -354
2003 -354 417 1128 -560 -868 527 300 -172 1183 478 -1231 132 704 -547 566 1486 -400 -361 404
2021 404 -511 -653 844 228 -1344 28 466 -1023 361 1319 -936 -1030 100 -787 -688 1135 368 -1256
2039 -1256 141 16 -764 628 1860 -193 -427 560 -829 -554 1439 661 -674 638 158 -1227 388
2056 388 1336 -199 -463 651 -785 -752 1190 -15 -978 548 -407 -1707 158 1108 -385 -139 684
2073 684 -797 -950 843 396 -268 971 -369 -1614 404 1267 -108 522 765 -999 -677 954 60
2090 60 -193 1017 -248 -1444 214 381 -632 355 828 -1409 -750 906 -167 -66 1814 -178 -1392
2107 -1392 -44 42 -701 973 1176 -1253 -446 413 -341 132 1824 -11 -1018 249 -79 -834 829
2124 829 989 -1068 -490 519 -894 -8 1453 -143 -1106 539 -199 -1125 815 1009 -867 -257 368
2141 368 -1013 -60 1559 72 -674 631 -338 -687 855 928 -730 -101 476 -1357 -283 1154 -238
2158 -238 -332 865 -121 -950 849 686 -564 5 222 -1044 -278 953 -370 -468 767 -366 -1041 818
2176 818 906 -288 605 532 -993 -197 658 33 -502 825 -561 -938 519 519 -355 528 391 -973 -332
2195 -332 595 -325 -154 626 -658 -827 133 322 -382 398 326 -614 -336 257 -511 -177 766 -78 -745 286
2215 286 43 -395 656 702 -279 354 537 -186 96 693 -287 -410 180 263 -327 384 114 -722 -131 171
2235 171 -196 310 529 -10 -327 94 -384 -575 101 330 -236 -296 67 -128 -29 512 143 203 211 -125 -206 204
2257 204 331 -238 11 189 -165 121 490 21 -82 123 -66 -129 168 225 -81 -65 -253 -420 -452 258 -441
2278 -441 -17 262 -124 -43 -153 -8 -180 202 -128 -391 105 174 -129 64 46 108 301 275 100 -132 161 24
2300 24 -581 87 197 -76 47 69 -317 -57 379 79 -64 187 8 -249 -259 -31 -170 -51 -134 -243 -146 164
2322 164 -258 -162 59 -122 45 156 176 203 -48 57 -23 8 81 19 213 127 197 135 25 376 -82 231 -57
2345 -57 -295 -296 158 -223 -269 100 -8 -7 9 -9 -207 -180 -7 -234 -222 -15 -81 -63 -188 -17 -189 146 119 98 50
2370 50 144 -112 257 -33 -138 34 97 8 20 280 224 -56 226 188 -346 312 202 182 -44 -297 20 -428 -43
2393 -43 -220 -156 156 120 -105 189 57 -189 -26 99 -184 -196 -121 -182 -102 207 106 -73 -222 117 -310 7
2415 7 325 -104 160 305 -92 119 50 151 -71 306 -15 -157 58 363 122 -202 -105 -234 -12 130 145 -131
2437 -131 234 99 -261 8 111 -270 -47 113 -221 -82 197 -51 -207 142 -251 -316 20 294 -130 254
2457 254 295 -163 14 343 2 88 174 -89 -152 113 401 -198 145 343 -440 -10 527 -102 -72 265 -297 -708
2479 -708 -126 234 -255 78 262 -144 -216 349 -82 -169 547 -85 -652 6 298 -183 75 265 -342 -215 403
2500 403 -291 109 802 122 -322 -188 315 -537 336 543 -488 -322 58 -137 45 586 -141 -615 296 -91
2520 -91 -527 314 539 -634 -276 -19 -616 -266 595 19 -305 128 -212 -355 541 526 -371 -210 481 -421
2540 -421 -163 760 90 -253 161 -106 -481 371 660 -65 159 206 -870 -212 586 -69 -223 117 -383 -639
2560 -639 509 333 -490 104 -22 -661 -390 469 -228 -222 763 -177 -642 417 430 -215 351 316 -612 -511 484
2581 484 -137 -184 501 -486 -463 307 480 -41 269 -3 -939 -344 308 -336 22 532 -271 -708 -27 -28 -309
2602 -309 527 364 -520 -67 337 -415 -59 686 -195 -598 67 7 -279 502 256 -570 -85 439 -284 247
2622 247 939 -419 -385 172 -90 -86 584 170 -382 61 67 -616 135 650 -231 -258 371 -213 -511 568 159
2643 159 -366 241 -35 -544 192 767 -289 83 93 -440 -460 589 70 -53 201 -23 -536 209 803 -21
2663 -21 150 405 -229 -511 297 272 -132 125 -115 -563 -3 138 -81 80 322 -187 -393 198 101 -342 329
2684 329 -57 -610 -1 102 -366 42 432 -144 -357 248 14 5 441 199 -668 -90 201 -403 120 302 -228
2705 -228 -252 337 -13 34 346 102 -650 -30 287 -488 -28 382 -83 -143 29 101 -243 41 214 -147 127
2726 127 20 -144 111 331 -442 -197 -128 -95 136 296 49 -219 437 18 5 -114 196 -358 -338 -39 -306
2747 -306 -110 212 66 -59 134 -272 -95 152 156 -27 -144 -224 -18 -9 84 -118 -189 293 -23 -375 11 118
2769 118 -109 136 -133 -148 -147 320 -156 -49 475 -121 -67 141 353 115 215 60 -95 -1 13 46 -5 42 -23
2792 -23 -142 253 249 -217 27 7 -336 -171 -191 -130 -64 70 21 -336 97 -42 -137 66 27 -162 -68 -132 -197 17
2816 17 229 29 38 -374 16 -344 208 -64 83 357 -109 5 -50 108 -30 13 -50 -129 34 -259 -177 -193 101
2839 101 -96 -9 24 49 -62 112 74 83 -169 -159 78 -266 -30 -132 21 -132 165 69 -147 -167 -35 136 -86
2862 -86 -132 -21 134 80 -27 99 88 141 -34 132 -40 -87 256 -66 -303 -110 -361 -183 -35 -200 119 8
2884 8 127 -13 -212 -157 102 7 111 -111 -60 230 19 -348 196 62 47 298 132 132 -101 199 161 -126 -56
2907 -56 120 -100 -225 313 128 -73 27 -83 -71 137 -132 -183 119 295 121 -56 181 -25 -21 165 -136 -13
2929 -13 -6 -4 -134 12 21 -311 60 -28 -330 90 -6 -12 72 142 -13 -298 131 161 -200 -79 -147 -56 -145 113 48 -161
2955 -161 186 113 -138 155 48 23 208 27 65 -150 -19 62 90 155 13 -59 196 -156 -133 -81 35 -299 -152
2978 -152 195 -166 -349 -82 -52 -411 125 163 27 220 168 -353 -234 216 -166 63 460 -99 -166 161 100 -199
3000 -199 309 11 -170 48 49 -104 -48 375 -279 -289 -82 -86 -195 183 -30 -304 73 166 -260 23 351 -13
3022 -13 -105 39 -90 -179 358 221 -536 -181 282 -396 -156 270 -377 62 387 -134 -51 434 -15 -279 248
3043 248 10 -266 144 311 -217 -89 241 -253 -339 338 -63 -198 -27 226 -317 -194 142 40 -137 129
3063 129 -177 -376 4 128 -133 340 -66 -618 144 162 -53 214 216 -221 -340 248 73 -78 51 176 -411
3084 -411 57 21 -90 -9 97 -110 -483 284 290 -2 448 -3 -278 160 211 -282 168 308 -470 -57 -78 -74 -76
3107 -76 299 219 -576 -14 1 -307 -11 167 9 74 181 40 -223 418 -87 -310 325 -192 -134 -75 283 -163
3129 -163 29 -3 -20 156 464 -6 53 114 5 -194 140 226 -346 -109 31 -334 -223 463 -216 94 295 164
3151 164 -369 20 135 24 -98 312 -282 -438 323 360 134 391 -113 -242 222 47 23 233 22 -260 -136
3172 -136 87 -286 -118 248 -2 -83 -21 62 27 228 -47 -526 -271 72 -159 -181 297 37 -309 143 129 -130
3194 -130 304 255 -171 140 -102 -44 -207 155 2 -115 388 7 -178 253 -66 -69 -105 56 -40 171 247 -100
3216 -100 -319 12 -192 -281 -52 -83 -67 -44 208 -199 -63 265 -68 -109 -150 -213 -169 -81 27 -101 -18 -31 -142 42
3240 42 256 66 -53 -54 24 -270 88 -89 62 167 65 197 -104 26 -200 -159 -71 2 -140 -27 265 -72
3262 -72 -236 186 -20 67 132 -44 260 95 -194 -193 118 85 -120 1 9 60 -29 2 198 -38 237 -20 54 141
3286 141 -35 -87 82 -165 -295 -113 100 175 -94 -73 109 101 93 -126 -146 21 334 -399 -48 231 -60 55 73
3309 73 -63 100 -77 12 10 -155 -2 174 -23 -33 94 -49 -156 -144 63 -77 38 76 98 40 214 100 -126
3332 -126 -196 -150 -217 -73 321 17 222 58 14 429 -127 97 -39 143 32 -117 128 43 127 -69 -17 143
3354 143 313 87 -23 35 164 -234 -33 27 187 -78 18 26 -25 48 8 201 -44 -126 -171 2 48 -9 41 -73
3378 -73 -177 -444 -59 -63 38 -233 43 -293 7 -198 150 25 -213 -212 49 -29 -204 63 -39 -83 -56 140 16
3401 16 181 -212 78 117 150 -25 -6 39 91 151 -4 -86 -143 56 -163 -135 157 100 -121 77 -131 20 -20 -177
3425 -177 115 21 123 126 180 92 -25 28 27 -41 -116 -35 11 20 -1 158 -140 -83 102 108 -173 -32 64 -145 -181 250 -38
3452 -38 -311 -56 -200 -85 -99 202 -45 -58 10 -270 -122 142 55 128 -25 -140 -164 203 149 189 163 33 -108
3475 -108 -133 107 120 57 68 207 82 -90 342 16 33 33 -4 76 317 189 -240 171 38 -215 -62 119 -165
3498 -165 48 99 90 -62 59 -82 -128 22 122 -344 19 -97 -69 218 -56 45 -150 410 28 -24 144 113
3520 113 41 206 -17 -204 27 46 -132 -226 -339 -88 87 65 -55 -31 137 25 93 0 50 -85 -22 211 -290
3543 -290 94 313 286 -257 269 75 -156 5 40 63 204 30 140 14 -162 114 -107 112 392 -109 48
3564 48 288 -228 125 -136 -272 56 265 -30 -86 217 285 -207 -74 77 -66 39 25 -218 -36 9 -12 -208
3586 -208 214 21 -346 126 23 -434 254 65 0 -186 160 -123 -50 290 209 45 -139 196 144 -83 -135 204
3608 204 51 91 1 70 289 -189 -215 157 -148 -142 -8 195 -254 7 279 -401 39 -127 21 -86 -30 -263
3630 -263 -117 -47 108 134 -66 38 91 124 164 -30 -1 -82 43 -169 214 -238 -67 204 -78 -52 73 286 -132
3653 -132 166 -68 -78 -389 -201 32 -67 213 118 -149 184 -12 -158 -71 61 2 -142 -17 4 -143 421 -1
3675 -1 -215 108 -110 50 39 263 133 -382 -166 40 -22 -41 184 35 85 -221 -3 -99 286 246 195 6 31
3698 31 165 81 19 -291 17 -116 -147 -78 129 -130 -127 0 -179 -82 -52 39 -91 -23 -85 -92 -91 143 -4 -317 248
3723 248 -170 177 236 117 -61 -59 31 -13 -280 102 9 -187 217 167 8 83 -23 -77 -122 -17 22 52 85 -64
3747 -64 222 215 -116 -173 257 69 -98 267 164 26 -127 -69 196 -158 165 -148 -183 -164 31 187 56 -186
3769 -186 -88 -85 212 -410 -266 134 -39 53 -54 60 -370 272 -299 -30 89 52 -137 66 29 -135 -372 -94
3791 -94 -172 -86 73 -100 -217 -96 162 -114 -308 132 11 176 57 134 -116 -378 -35 114 -10 -26 277 24
3813 24 -38 232 -79 -117 141 20 67 -301 278 92 17 42 -40 268 107 89 -197 -4 125 103 -20 -127 32
3836 32 202 85 10 40 -58 223 -2 126 94 -86 -6 151 75 37 50 -119 39 36 -73 45 -197 201 -172 38
3860 38 -34 -200 60 30 -105 99 -68 -141 -50 69 -188 173 -228 -55 -37 -77 89 21 -29 -118 -63 -121 -153 12
3884 12 -66 113 65 142 -93 -36 -237 -84 -43 48 130 148 -126 -181 140 55 -197 83 214 179 -86 -31 275 32
3908 32 -148 51 -56 -115 -183 114 189 55 -31 -39 -21 -199 -104 29 -286 -223 -11 -157 -191 -76 181 -225 -149 78
3932 78 -78 12 66 165 -17 69 52 -18 -153 146 20 204 -133 -15 412 86 229 -183 38 -177 -43 136
3954 136 -216 17 172 -102 139 116 67 90 287 -22 12 -41 -20 -108 62 212 62 -29 -87 -32 -21 390 -59 -66
3978 -66 -29 17 -98 111 -21 -60 -81 116 -387 -21 -19 -169 48 -59 -31 -76 113 39 59 258 -82 -3 43 -21 53
4003 53 -35 220 105 397 35 -99 -107 -253 62 17 -253 4 -168 130 56 -199 44 14 140 -12 55 166 84
4026 84 129 7 -40 68 -22 48 52 108 11 63 6 -122 69 39 106 18 -71 149 79 -54 32 -103 49 6 -50 54
4052 54 -88 -138 -124 87 -35 -150 6 157 130 78 -12 91 293 -101 -78 -54 -158 39 -97 -26 68 18 -90 54
4076 54 17 19 220 110 106 138 28 -120 -40 58 -75 29 -204 76 191 203 -125 -9 -94 237 -57 -159 -216 -103
4100 -103 176 202 52 27 63 154 36 43 -63 -423 -164 94 124 69 2 -160 202 16 -65 -108 43 224 15 29
4124 29 142 -84 102 184 48 -14 80 -45 64 140 219 125 157 -55 -63 -112 -79 -150 -204 -81 44 -83 -170 148 -52
4149 -52 -53 21 138 -171 36 -164 -173 -21 -233 315 11 268 -205 -195 12 48 9 134 146 43 248 70 -143
4172 -143 156 150 262 168 88 -25 104 42 24 -8 -24 -123 -132 36 308 -141 -86 -229 -99 175 112 -166 -58 12 34
4197 34 -33 108 -39 -175 109 -190 -104 81 -182 -113 -279 161 -124 -87 256 -28 73 -17 -30 -133 112 265
4219 265 -11 42 177 156 160 108 -21 -57 8 -46 109 19 22 -12 -43 76 0 -130 207 84 -228 -3 -229 -29 92
4244 92 132 54 115 54 -146 -59 -25 17 13 107 -105 -96 16 14 -127 71 62 -242 -208 -96 -106 179 238 -154 -43 259 54
4271 54 -53 126 -80 -136 -61 197 10 202 52 101 -91 224 -126 -175 -60 -163 301 -161 -94 -251 -24 289
4293 289 63 -14 90 1 -55 -42 -20 -170 133 71 -166 -43 186 -103 -250 -61 91 83 176 -78 31 73 39 169
4317 169 -160 -6 -132 -7 -161 -92 -97 -121 -136 -94 -111 146 77 48 -111 109 -26 -85 100 -81 7 73 -114 -159
4341 -159 150 102 -92 114 -40 -165 -244 -231 -87 -89 1 300 -119 70 -132 44 120 217 -77 -110 25 -35 -94 32
4365 32 -214 -294 -73 132 65 133 120 -138 266 -56 119 -268 -97 -73 140 30 172 33 193 -59 91 -11
4387 -11 142 163 -116 -236 -33 167 -91 96 -57 -134 -6 100 -10 138 156 -85 -28 -198 239 153 24 -245
4409 -245 -20 -80 -15 113 121 95 150 -86 -134 -272 103 243 165 -143 159 -48 -97 -133 -97 -116 97 64 240 54
4433 54 112 -1 52 -90 -256 90 -114 -355 320 -134 -80 -102 94 -195 288 -129 61 -226 29 97 -27 69
4455 69 -219 128 315 242 32 -158 19 -63 14 157 -294 239 78 -128 32 -146 -311 38 34 -96 -31 -118 -69
4478 -69 -42 43 283 132 85 53 -88 29 1 19 131 -162 -46 -150 13 54 99 97 259 -297 -142 135 89 -88
4502 -88 35 110 31 -84 88 142 -25 30 206 -33 52 -117 -347 -163 70 87 -171 -133 71 -72 129 26 64
4525 64 201 -13 22 -50 186 9 -169 -31 131 -96 -180 23 -14 -236 43 14 -160 73 181 -76 -19 -57 103
4548 103 -58 5 -114 -6 166 -33 -115 -99 -150 -55 250 -45 -36 132 17 -133 -44 55 177 -37 -87 -17 -259 24
4572 24 69 -23 -93 81 181 63 -149 -10 278 -78 -83 -299 -46 34 -42 -89 163 -7 -184 192 -73 -72 -2 76
4596 76 -66 -63 -224 -38 -74 68 -59 184 115 139 -92 -223 226 163 212 -54 -167 -163 57 266 9 141 9
4619 9 73 -23 -62 -41 91 60 -158 -53 4 237 243 -136 -113 93 9 26 128 -84 60 67 67 -276 -77 345 172 -33
4645 -33 52 117 65 -99 -54 6 87 65 -59 -101 -42 8 -122 39 73 -137 255 10 -237 73 177 -352 46 0
4669 0 -111 106 -192 -410 -378 -18 -276 -115 100 46 -196 109 88 325 188 -6 77 80 237 -18 -26 39 -103 -307
4693 -307 12 68 29 175 34 201 31 -8 -245 36 114 109 -52 32 -83 43 226 -177 51 -110 161 249 -175
4716 -175 85 -6 28 -104 120 189 63 140 -145 -17 165 -210 -205 1 -60 -115 -10 -37 -137 -96 152 -53 251
4739 251 100 11 52 -312 82 -170 181 64 -185 -15 53 138 -15 -173 184 -39 3 78 24 -52 87 162 -147
4762 -147 8 -16 -222 -158 240 27 20 -161 14 120 -21 200 146 -40 -34 43 -31 2 -50 -57 -148 178 87 -101 207
4787 207 -50 -123 1 -106 -73 62 102 -135 68 122 -41 29 -129 -163 199 -24 -153 180 109 -45 -19 72 163
4810 163 2 176 189 -116 -59 33 120 31 -58 143 175 259 5 -174 123 -65 257 98 81 -248 95 -105 -82
4833 -82 -6 -7 -105 -62 67 18 203 32 136 128 -86 149 119 74 -82 15 -62 -90 -66 -144 -42 -65 32 -42 -128 -133 57
4860 57 241 -55 60 -2 110 187 70 6 68 -109 -12 -68 -37 33 268 -64 -24 99 -39 -7 -209 -113 -89 31
4884 31 -8 42 175 134 -8 35 -230 -28 -199 -10 104 191 -217 42 212 -132 149 -172 98 -225 13 244
4906 244 252 -91 -29 71 158 -136 27 -146 162 -96 -126 180 192 26 167 25 -200 181 78 -73 107 -131
4928 -131 83 293 205 105 54 -70 107 42 155 -21 -201 173 186 -27 -341 -96 17 -150 -105 201 62 -89
4950 -89 -19 -48 -22 139 72 -90 59 184 -10 -13 27 204 93 -22 120 -62 -46 -174 -176 -164 -11 64 90 -21 -117
4975 -117 -37 110 168 -43 -16 -171 144 46 -56 -200 160 383 -57 100 -21 123 -64 -191 -78 284 23
4996 23 172 -224 -13 73 59 147 74 -136 -150 -112 100 -201 -196 -18 124 -136 32 32 -187 -5 5 -52 63 -319
5020 -319 -4 83 118 148 95 20 -255 122 43 -34 -39 228 -212 -147 28 -43 3 166 113 50 -10 90 -74 -292 -34
5045 -34 232 121 -20 -61 125 65 -113 49 -37 137 -135 -172 0 -160 63 -13 -131 0 -155 -192 211 -70
5067 -70 -111 -51 -140 185 -185 -149 152 7 -109 3 30 204 92 -128 -62 0 -134 188 -106 235 -108 -17 108
5090 108 13 -29 13 182 -77 -98 85 69 -65 6 232 204 -97 8 46 383 -174 -157 -100 -27 97 -120 331 115
5114 115 -9 111 8 78 74 31 37 0 200 133 -114 118 -205 45 -61 -50 20 31 -26 -89 235 -161 31 -46 -40
5139 -40 79 -44 30 87 44 11 42 91 96 -100 -55 -104 29 -29 106 -183 -20 188 130 -33 19 -165 73 -105 -70
5164 -70 155 -141 -52 18 -181 137 89 -128 24 -19 33 46 130 59 -79 -37 -31 7 -112 -215 205 85 130 6 -65
5189 -65 -147 -30 -10 223 -113 61 74 123 -152 40 -14 -31 198 -14 67 -264 -83 26 -125 -208 -27 -48 -42 -112
5213 -112 33 64 21 -56 -155 -33 74 -55 85 -324 153 -30 35 -206 55 242 -42 -134 -8 -2 -87 25 256
5236 256 -20 3 126 -61 -35 59 -20 176 378 -154 -8 94 -49 -72 -48 -13 -159 38 -215 -182 -77 191 -87
5259 -87 -48 94 276 58 41 -304 -7 180 -102 -192 -80 -285 -34 -219 116 -190 10 -99 -29 149 9 -65
5281 -65 92 113 222 -143 37 -21 309 50 -49 118 182 9 -106 -40 -43 -10 -30 168 0 -180 122 -86 -64 -245
5305 -245 118 350 51 -49 -72 94 -129 149 69 -1 -82 72 105 -177 -20 90 -43 60 -144 -27 -233 154
5327 154 64 109 -10 -181 -98 -11 120 -49 12 24 106 -98 -37 -106 -53 -71 38 -53 -14 6 -98 136 -27 -136 -198
5352 -198 215 84 5 -90 -12 119 -128 -102 156 -149 -120 -241 51 -195 36 13 -68 -116 40 40 -80 71 -391
5375 -391 -278 -75 90 -55 81 64 184 -89 162 101 -24 112 193 75 -34 138 -82 68 172 132 164 -225
5397 -225 154 5 100 127 -134 59 46 268 140 -99 -23 100 -473 5 119 143 215 -114 -118 -116 -126 -117 72 -97
5421 -97 132 129 -50 -158 -222 -24 80 -52 -27 -3 193 -74 -14 -50 265 11 -17 176 -216 36 82 71 170 105
5445 105 -103 -122 -153 94 -98 2 -98 -8 -125 159 35 4 -37 57 -119 -190 -132 -82 -185 174 -141 -89 -158 -25
5469 -25 22 -49 29 103 38 183 -241 8 163 222 166 -66 8 -310 2 39 175 172 -177 -111 -110 -32 -41 -236 -125 43
5495 43 -89 -10 -202 -11 -85 -102 -5 -142 -162 87 113 100 -95 -113 73 -38 -8 -87 -153 146 -31 164 -57 -40
5519 -40 109 -17 -46 118 -87 -49 -45 104 28 14 -53 -65 -14 -139 150 36 -23 -192 48 -98 64 62 235 -4
5543 -4 249 105 54 264 -7 306 3 19 30 -131 148 -84 78 -76 28 441 115 -177 -150 -94 -20 14 254
5566 254 -211 126 152 25 64 134 127 216 142 141 14 -13 -58 -124 120 156 -224 -29 -88 -127 66 11 -89 -154 109 -5
5592 -5 -107 -80 44 15 132 -29 118 -36 -38 -68 146 128 82 -6 251 20 46 -214 -1 -277 30 -46 225 -147
5616 -147 -58 94 -160 148 9 -182 -97 154 -23 77 -148 184 -253 160 -137 -122 171 -153 43 232 -43
5637 -43 205 -2 87 -104 87 -128 145 68 -29 9 66 106 -126 -59 108 11 2 23 -65 204 -145 -132 -203 181 -132
5662 -132 209 -23 163 53 -99 141 41 9 -24 -4 174 -300 -108 91 51 297 -175 -53 25 -102 -44 130
5684 130 140 -40 93 5 92 -6 153 -19 143 23 -70 -122 -122 -50 2 -33 13 115 156 -201 -149 133 36 142 31
5709 31 -61 -50 1 214 31 -103 -43 75 -5 181 291 -110 49 -94 -119 230 182 -200 -234 -153 -61 -23 121 6
5733 6 162 35 55 33 5 -233 -59 228 -276 208 -222 -143 -58 -35 -51 242 96 -111 143 -95 160 29 236
5756 236 -44 330 -108 -90 90 -164 74 -96 192 16 147 9 223 145 233 121 159 17 -89 208 -191
5777 -191 -73 176 28 -23 277 -66 67 38 44 -185 83 252 191 184 147 7 -202 -2 -204 13 184 -328 -3
5800 -3 100 -142 -98 31 32 -123 -4 -67 216 293 15 -16 -149 23 205 177 -76 -15 341 -100 -41 -217 2 36
5824 36 218 -76 -43 -52 -62 -208 -25 54 188 194 -266 153 -147 37 99 67 -144 -204 -26 40 20 -76 -70 -24 -85 -17
5850 -17 -18 -42 -72 185 -321 -25 -143 23 -146 -79 139 -286 -126 235 74 210 131 21 -120 103 -110 -55 -79
5873 -79 176 -205 -4 -64 -182 -107 -213 16 -99 -50 55 -176 100 34 159 -222 -50 -163 201 84 34 -94
5895 -94 35 -13 -198 14 98 -65 109 -56 -74 108 58 -206 -191 215 148 77 64 326 -307 -21 90 -48 26
5918 26 -60 128 21 69 -56 118 16 -53 129 191 199 -63 144 79 -113 -66 37 -234 19 203 197 -107 50 -79
5942 -79 29 -90 -137 -220 30 91 -142 116 116 -39 -83 -14 177 -76 -150 -110 -118 -149 -57 32 -92 -21 45 379 26 -22
5968 -22 -229 -31 43 104 -23 -222 -2 21 207 42 328 71 7 -223 186 -188 -46 43 74 -134 -48 146 54
5991 54 -130 -74 17 -206 -144 -54 42 -54 11 -83 -43 -148 -85 -35 261 -210 -220 -15 -113 44 -201 32 -64 180 160
6016 160 -33 -52 135 132 19 11 -52 -174 15 -271 -141 25 -86 -236 17 -7 -83 -37 -64 412 83 -254 91
6039 91 -174 127 -50 -119 17 -37 62 33 268 159 95 171 247 -86 19 208 129 -16 20 -181 -182 -9 -89 89
6063 89 237 87 122 170 69 -118 156 -255 -24 31 105 139 194 -176 10 -240 34 -2 15 45 34 5 -163 101
6087 101 -53 24 60 -14 47 -103 26 -84 8 -240 21 -151 148 -4 -35 7 19 44 6 22 42 -107 -64 -100 -301
6112 -301 -286 -214 3 27 58 92 102 -9 59 -43 163 -96 -29 133 -13 -118 -40 -291 178 -209 70 79 75 -145
6136 -145 -53 30 -12 112 85 55 -147 110 12 -113 28 -210 100 -329 153 208 132 -48 -41 -109 -163 49 84 -5 -393
6161 -393 -208 69 122 368 -27 -67 34 -130 203 -124 -22 -288 -223 250 44 -8 39 -166 56 -104 73 132
6183 132 150 -235 146 127 364 78 -28 158 -50 494 165 181 36 -42 -366 13 -181 -81 -215 82 -82
6204 -82 116 -102 -82 206 9 139 -127 84 -105 137 -61 -37 85 -53 -119 -18 67 273 168 113 10 312
6226 312 -102 -161 139 -110 150 -90 11 -328 24 -84 -66 -117 37 166 17 4 35 151 6 120 130 -41
6248 -41 -78 13 -234 -436 -155 23 -161 265 99 -208 -20 -94 -35 62 52 204 -91 38 -88 -84 -139 129 165 -122
6272 -122 -95 -131 126 -158 -62 311 -50 142 70 -154 -18 -27 -59 164 137 -194 51 159 -27 18 123 -46 -99
6295 -99 110 10 -74 -78 -47 -1 28 104 51 -127 -109 -258 139 60 -96 -124 133 -1 -23 -158 138 -34 -107 -70 54
6320 54 259 -165 67 4 -52 40 -229 -8 250 -18 -292 -105 -174 -19 -169 -80 67 -16 215 33 215 -110
6342 -110 32 147 3 -72 -86 -99 -54 -37 -34 -30 160 9 164 110 -50 130 -8 75 -154 137 -113 -102 -135 195
6366 195 243 -39 135 -204 59 -36 -31 -192 -3 -301 -37 108 -35 -97 -112 -99 -32 -62 94 102 -68 179 -248 117
6390 117 39 80 -21 30 -78 115 -25 -225 67 25 -68 -15 176 -87 98 19 117 -153 110 48 44 12 59 209
6414 209 -34 -43 -97 -23 -226 158 125 -188 261 27 197 -66 172 -106 42 -51 -77 -124 68 72 -83 103 13 417
6438 417 -174 10 174 -128 158 -128 34 57 87 -50 -99 -119 84 165 -27 -135 1 19 174 -3 255 -114
6460 -114 -54 -97 53 84 216 169 314 49 -242 -38 -104 109 -78 -48 3 -107 203 -48 9 1 6 -194 -95 -107 -144
6485 -144 235 -61 -117 179 -291 45 -34 -23 341 -204 -267 -88 279 -110 80 136 -157 161 -43 142 -95 177
6507 177 -82 26 -88 -111 89 -104 123 7 -47 -171 -131 -17 219 15 -181 134 -96 -247 197 57 -165
6528 -165 -10 -175 27 184 17 88 130 160 46 -162 110 -94 36 -66 -169 -24 178 -221 -168 112 85 111
6550 111 -227 -281 242 -86 18 114 10 29 286 128 61 87 101 39 -152 -175 44 -76 36 135 -257 -165 262
6573 262 93 -37 -103 -74 -3 103 -57 -90 92 -149 153 102 93 19 -10 165 -213 72 298 -107 240 -95 58
6596 58 13 143 100 4 83 -170 -144 -34 -99 187 18 220 20 27 190 47 67 186 -101 121 -228 -105 -147 69
6620 69 136 70 -131 186 -90 -147 -21 -139 237 -18 -247 -170 -160 -193 194 63 64 262 -189 -83 -5 -94 81 -193
6644 -193 -134 47 -17 39 150 -131 -61 -18 112 -61 72 -83 22 146 -237 -167 200 -20 130 124 10 -45 247
6667 247 51 -92 289 -103 -67 -121 128 298 -26 93 62 -63 36 -101 56 50 -133 46 -76 -245 -115 -33
6689 -33 39 -61 224 23 175 24 -27 48 55 89 -53 131 60 57 -234 -216 -56 48 -63 -77 -192 163 -75 -88
6713 -88 -5 -131 -295 31 -26 179 -211 73 -113 -39 -156 -47 -209 38 -72 42 95 193 116 -124 92 -162
6735 -162 -129 44 -153 -121 57 67 149 -132 -99 -105 -30 132 11 184 159 125 186 -88 83 145 106 -205 186 118 39
6760 39 -104 -55 -30 -14 66 -16 69 -52 72 52 -217 147 -124 302 -18 -220 -40 -73 198 -90 -70 -84 -21 -1
6784 -1 -14 -83 -77 -152 -282 83 -54 -9 -31 29 -5 -57 -96 97 -102 -146 -205 240 -89 -206 28 54 -45 43 2 43 -376
6811 -376 18 30 -177 -167 -327 -51 -63 -91 0 -3 51 -47 -14 -122 -36 -73 -4 38 -61 -37 -143 164 -140 119 -116
6836 -116 -126 -136 -118 -40 -124 -100 187 -6 -57 -25 48 -105 -114 -374 228 296 -215 77 -276 76 -157 -48 7 172
6860 172 172 223 89 -9 13 44 -13 -258 -126 44 -298 -193 30 132 148 175 -79 44 -181 -338 27 -149 -183
6883 -183 -40 207 -90 146 52 -149 125 -345 -65 -34 23 269 -85 129 32 -83 -133 62 72 20 90 167 24
6906 24 37 10 -175 62 -101 -70 -62 72 -1 -170 61 353 133 148 -286 86 -120 143 212 -254 157 118 111 96
6930 96 -100 99 -103 54 -25 -70 -40 11 -81 183 118 132 27 -38 -98 -23 -130 185 -12 -222 -31 -14 -67 -21 -13
6955 -13 -30 58 -260 255 -47 -6 -252 179 -6 -72 37 -129 147 113 -117 -66 67 60 44 -145 -64 -65 38 -40 -128
6980 -128 -40 100 -30 131 135 195 -184 -40 -35 -139 302 76 -52 172 -111 22 11 201 56 -64 -13 203 123
7003 123 143 14 51 -236 -79 137 76 4 -201 -240 -64 140 154 17 82 -4 52 158 65 5 -124 2 -138 -368
7027 -368 15 63 -137 -93 60 127 128 36 -31 208 188 -101 -140 -121 -323 -229 -75 0 -153 -11 -41 -67 115 -138 -15
7052 -15 54 43 -263 -127 -62 15 -87 -127 -136 19 41 -258 -148 68 -37 -356 76 205 68 -7 141 -31 -152
7075 -152 -147 111 112 21 -91 33 100 48 -120 -57 -213 64 231 -120 -60 -9 -47 201 43 -333 105 -113 -74 -169
7099 -169 137 90 -15 -14 218 -5 15 28 -234 69 31 61 4 162 -177 -213 -136 31 -80 156 40 64 -134 -51
7123 -51 203 39 -156 -182 19 127 84 85 60 -44 -116 199 -110 55 -51 -12 -35 96 10 -103 38 86 -166 -109
7147 -109 -104 -214 -159 -80 181 157 297 -54 88 -95 172 101 -80 221 27 -43 -34 -10 79 104 -48 -114 20 252
7171 252 94 -5 209 -116 -140 -189 -61 108 82 134 67 -129 -8 -49 21 -100 15 -168 -228 -205 -111 101 -55 -17
7195 -17 38 -241 -36 -72 57 -31 157 -97 239 -101 -134 -128 -8 44 68 -255 -120 -130 -131 -181 -45 20 -118 -81 177
7220 177 -59 -22 104 158 123 209 211 -12 87 -287 145 182 -149 53 -269 -43 -124 79 20 -173 -160 4 125 -64
7244 -64 -99 -92 1 -146 29 -36 -24 89 -220 -210 -92 -24 99 66 53 34 50 -160 100 -288 -75 9 178 95 85
7269 85 -139 178 133 -9 -12 -106 -43 -117 145 -93 -300 24 220 -342 25 -182 -283 8 -79 -158 212 -90 -123
7292 -123 -7 -72 35 122 99 -87 8 56 342 89 -61 60 -31 -52 46 -21 -45 104 -73 223 43 -34 -30 64 -31
7317 -31 38 96 147 169 106 139 51 23 64 328 -254 -77 -165 145 165 -3 -23 -88 -18 20 -325 -72 -38 -173 -52 -41
7343 -41 105 -5 -13 -368 102 17 -106 155 181 32 66 10 242 -53 -144 88 -180 12 31 171 -175 189 171
7366 171 -37 -197 -271 -75 -225 43 64 -144 109 15 -101 -145 7 27 -12 151 -353 -245 -105 -112 -12 -25 -41
7389 -41 -60 32 155 -46 -1 -53 108 52 -134 -102 39 -43 -55 -7 -125 -180 197 -29 106 -107 111 47 -10 -104 208
7414 208 -20 41 34 233 44 -51 111 39 -147 173 -128 -125 31 -10 -155 43 120 15 165 -116 47 162 33
7437 33 -278 111 -34 123 -100 -104 191 119 72 -69 -22 -103 93 -69 -216 426 94 51 -11 112 -11 140 -75
7460 -75 -61 105 -49 -354 137 -144 -152 -43 -24 3 244 -13 -41 96 -87 216 -197 57 -36 -217 85 171 140
7483 140 -16 39 -108 130 129 346 9 -209 -78 -154 -91 153 -27 -79 -9 -252 -118 -75 -159 0 63 15 227 -158
7507 -158 98 -16 98 16 77 168 -157 68 -29 -133 -35 102 101 148 273 145 -158 34 27 -56 -156 -260 -3 -54
7531 -54 -2 -13 -66 -82 -91 83 55 139 -98 -178 -16 56 -127 180 111 -77 -31 197 60 60 244 -49 -187 -3 -48
7556 -48 -36 54 11 -70 76 -275 -139 99 -256 49 41 -269 136 188 -57 61 -68 -272 20 -116 -169 -227 131
7579 131 250 -48 -30 -169 17 156 79 183 137 -61 71 -277 190 161 248 -57 57 218 -98 33 39 -93
7601 -93 26 76 81 49 51 170 62 50 128 127 -124 99 39 -15 -37 0 30 41 -158 -314 27 17 -143 110 115 -61 -257
7628 -257 170 188 -74 94 117 14 160 -37 -111 -216 -13 69 -223 -126 136 -127 181 -134 -77 92 56 -49
7650 -49 -118 142 371 245 180 384 86 348 -78 31 93 -77 -66 46 70 -120 47 49 53 -114 203 -87 202
7673 202 -202 -10 -24 -100 47 99 56 -125 74 41 172 -53 92 -107 -196 -44 -209 -13 -2 -6 49 -42 173 -14
7697 -14 25 167 -43 35 152 -37 -155 -15 107 -126 -26 -75 43 -5 134 106 78 48 -54 -313 120 -2 -210
7720 -210 -26 85 -37 -259 -170 335 33 -63 -81 -129 -16 -104 95 64 -218 -63 175 -186 -180 -73 45 116 -13
7743 -13 -167 -260 52 85 24 -157 93 -46 -2 -128 -14 -109 -207 -244 155 160 -138 41 290 72 160 187 -140 81
7767 81 -37 -71 14 -349 -133 58 20 113 -39 243 -138 10 191 2 66 155 78 175 -117 -103 -63 -35 209 -115
7791 -115 -58 -106 -112 -100 145 179 -246 233 -252 -257 17 259 87 54 51 -104 -121 124 -88 -157 182 56 -147 79
7815 79 205 103 86 129 -1 -131 -68 10 198 -286 75 -211 339 106 37 -138 -87 -16 224 222 -65 -25 -75 120
7839 120 128 60 29 49 56 -98 59 -187 128 137 -111 60 -8 88 -327 -30 -289 269 -298 64 107 34 90 177 -23
7864 -23 -159 -30 63 153 -86 -156 -54 73 30 308 -143 34 -230 -101 61 -155 -151 -240 184 51 8 83 -182
7887 -182 112 -87 18 -16 124 2 17 4 -178 107 79 -57 31 -28 64 0 -82 67 247 -83 -231 -63 63
7910 63 -3 -105 86 -4 -119 47 -109 -39 -131 -5 226 102 15 -153 -60 -37 -50 -1 -138 165 191 -35 -72 -43
7934 -43 -48 -74 57 44 53 232 -39 -126 -3 129 -138 14 129 -260 85 46 -165 -128 43 192 75 -90 -35 -219
7958 -219 285 76 169 -28 -175 -121 274 104 69 -131 26 -201 -10 16 51 70 -15 -15 176 -213 48 113 -13
7981 -13 153 -155 -12 13 -120 -258 -104 55 149 -120 -177 136 -131 51 -77 -11 222 -276 20 -202 2 68
8003 68 -169 127 179 -22 -98 -11 46 -51 -42 -42 -252 -142 206 154 -205 36 -263 -244 235 83 122 52 113 -51 186
8028 186 165 218 -5 56 228 -256 -91 10 -114 0 53 -90 -18 -192 37 72 59 -288 14 -1 -22 97 196
8051 196 127 105 -64 -135 -65 -147 51 178 28 277 174 -2 -194 -185 -37 -41 41 -185 91 -29 -122 12 -19 79
8075 79 0 -124 122 242 -140 -91 137 -105 41 93 -33 264 34 -53 49 37 105 -183 -127 72 6 -4 140
8098 140 93 154 -97 136 60 -19 -174 -14 36 -94 -160 4 60 147 21 -125 -280 -174 -15 -130 128 203 -62
8121 -62 -218 75 -51 41 -147 128 -32 171 -142 -181 -209 -83 -128 -100 -58 30 -83 -83 -57 -236 290 286 -17 7 21
8146 21 -105 137 -82 -70 -35 -239 56 -15 -133 -10 -118 51 21 136 -37 -112 30 143 -80 30 197 -34
8168 -34 -75 107 216 167 -6 -80 -135 29 76 -9 118 91 74 51 -454 65 -182 -13 -11 30 -350 -63 156
8191A56
$$ Imaginary data points
##PAGE= N=2
##DATA TABLE= (X++(I..I)), XYDATA
0 0 0 0 0 0 0 0 0 0 0 0 0 0 8 -8 8 -8 8 -16 16 -19 24 -27 32 -40 48 -52 62 -72 80 -92 104 -120 136 -154
34 -154 174 -196 220 -244 274 -305 340 -377 417 -461 510 -564 622 -685 756 -831 916 -1010
52 -1010 1113 -1229 1358 -1507 1675 -1866 2096 -2365 2694 -3098 3615 -4302 5260 -6690 9060
67 9060 -13677 26022 -129590 -337625 -70452 26238 37068 145989 173820 49046 34403
78 34403 3948 -88311 -15913 174222 199710 152387 119910 49192 21669 38157 -62715 -98569
90 -98569 67435 152438 60269 22586 -18098 -142451 -146240 -55024 -72458 -40983 103429 68058
102 68058 -124741 -192792 -172845 -131639 -4779 73981 22982 23188 53436 -49964 -136385 -52610
114 -52610 40305 78370 130275 106629 28400 46978 54916 -41343 -58018 40985 97722 112000
126 112000 104894 19609 -47306 -25733 -41172 -65906 28893 109653 61041 -1921 -66917 -155629
138 -155629 -130212 -15323 12342 608 46189 39242 -46195 -88695 -87793 -68762 14330 76974
150 76974 40745 16878 32302 -7089 -54807 -48895 -26322 27545 103291 90775 15150 -823
162 -823 -166 -43501 -39261 25495 64328 83068 71282 -17253 -88963 -66492 -30945 -14571 32644
175 32644 68037 45782 13660 -27841 -84196 -72559 -67 27491 24182 35657 17670 -21113
187 -21113 -34822 -53255 -61737 -4024 59076 50705 22320 8937 -23609 -47579 -35854 -21516
199 -21516 13238 74487 72624 1972 -40886 -46055 -46348 -19372 24902 43981 53991 53751 1547
212 1547 -55875 -47111 -13229 5218 30196 43221 27524 12274 -9529 -48881 -53346 -9193 26464
225 26464 38590 40391 12869 -24143 -33357 -38078 -43377 -3800 48803 49977 18156 -12214 -43104
238 -43104 -52563 -27678 -4711 10264 41288 52982 14986 -29164 -42200 -31703 -4213 23012
250 23012 30219 32580 30346 1676 -35336 -41853 -18442 12460 38754 42056 20224 2915 -11128
263 -11128 -34537 -38688 -7525 25543 39866 35551 6590 -30073 -41736 -31519 -22639 -4868 28583
276 28583 43258 23165 -9088 -33561 -37941 -20011 3829 18124 23117 22874 10590 -18138 -42012
289 -42012 -34878 499 29502 33570 27368 19912 -1223 -25848 -31311 -17070 7726 34128 40851
302 40851 18159 -11633 -23218 -24859 -25326 -10289 18716 35734 28853 6810 -18258 -33933 -29133
315 -29133 -9501 7023 15135 21095 15382 -7892 -33399 -35998 -14266 11730 26755 28314 18534
328 18534 2965 -13278 -26669 -27302 -6487 23218 36198 23681 5099 -7017 -17275 -22649 -13625
341 -13625 7111 26702 32627 17718 -8030 -26411 -25772 -14574 -2860 9233 20039 18914 1051
354 1051 -21702 -31799 -23747 -5856 13285 22378 17249 7080 -4492 -20850 -29959 -17709 9193
367 9193 27354 27408 15577 -258 -10640 -14954 -15678 -4362 17636 30473 24392 7136 -11221 -19945
381 -19945 -14031 -4497 2637 15360 24781 11777 -12080 -25573 -27834 -17469 2990 15118 13609
394 13609 10515 1118 -18588 -28115 -20445 -7287 9544 22715 13813 -907 -4167 -10991 -20199 -9116
408 -9116 10174 19798 26964 22184 -736 -13480 -7299 -5338 -2057 17403 27272 17019 5429 -10641
422 -10641 -26322 -15931 4409 8285 11844 18787 5193 -15069 -20021 -23554 -21908 317 13020
435 13020 2285 -415 -88 -16655 -23013 -10866 -5768 3240 22600 19736 -1119 -5264 -6790 -15911
449 -15911 -5240 15494 19393 23116 24002 -112 -17881 -6980 2038 5806 22660 25883 7486
462 7486 -122 -6237 -24466 -17739 6403 5433 -421 8066 -378 -16942 -12923 -13450 -21772 -5908 11365
477 11365 3440 -335 2139 -15882 -24781 -9312 -2491 4595 27302 24426 -1623 -7834 -7027 -12430
491 -12430 4690 26977 20111 12524 15521 -1870 -17024 -1388 7140 2685 12904 13773 -2491
504 -2491 -1754 1392 -15679 -18201 -1985 -2079 -1642 12350 3303 -17860 -14934 -15387 -23150 -984 21904
519 21904 10021 855 -1563 -20064 -23721 1423 11738 9563 20682 14431 -8823 -6602 2189
532 2189 -4940 5751 20140 5486 -61 13408 3082 -11854 -816 238 -9367 7831 20173
545 20173 2280 -1751 447 -21159 -23493 1688 8057 7287 16385 -514 -25793 -16029 -4134 -8266
559 -8266 8831 23236 1337 -9560 -208 -11643 -15114 9343 9744 -5226 6179 10509 -5816
572 -5816 -1228 5786 -10516 -7200 13853 8256 3815 16160 945 -20835 -8026 -513 -5283 15743
586 15743 27241 283 -11780 -2670 -13156 -11791 14870 14724 -942 6098 -669 -20859 -8528
599 -8528 5668 -4663 -43 11401 -2147 -7773 5740 -3929 -17220 -1424 3465 -6562 7926
612 7926 15345 -5970 -9900 -2135 -12634 -7373 18529 17694 4329 7239 -2796 -18988 -3461 11966
626 11966 4707 10816 16803 -3699 -11342 1559 -2490 -5079 10882 8362 -5634 1948 4538 -11136
640 -11136 -8995 -562 -9984 -5815 10582 3795 -4745 430 -8992 -19284 -4078 7177 3378 9259
654 9259 9761 -9640 -13536 -1779 -1941 2154 17312 11890 -1157 2123 21 -7334 1985 9995 2646
669 2646 3777 9376 105 -4786 1310 -4619 -8642 3580 6875 538 4345 1411 -12695 -12747 -4671
684 -4671 -5305 418 10390 2915 -7277 -5505 -8162 -10317 2397 9000 4022 4923 3887 -6228 -6651
699 -6651 953 776 2219 10136 7527 964 3817 1561 -5629 -1331 4654 2404 5807 8885 -254
714 -254 -6325 -4322 -6877 -6285 3660 6835 2101 918 -2956 -11328 -8999 -920 -335 1732 5313 266
730 266 -5656 -4581 -5106 -4840 2241 6976 4153 4242 4676 -1877 -4158 -560 -457 2168 8787 7540 2004
747 2004 556 -1855 -5313 -1640 3801 4456 5050 5071 -1941 -7432 -5795 -4589 -2882 2248 3580 637
763 637 -1009 -3599 -7728 -6559 -1359 994 2540 3939 1253 -2626 -3252 -4218 -3458 1974 6259 5997
779 5997 4550 2438 -949 -2590 -572 1322 3727 6703 6167 1339 -2256 -3663 -3908 -1208 1635 3206
795 3206 3507 1952 -2295 -6122 -6275 -4450 -1510 1320 1806 62 -1509 -3575 -5695 -4783 -1058 2588
811 2588 4528 3931 1395 -1147 -2511 -2382 -1168 2096 5534 6488 4229 976 -1628 -1411 176 1674
827 1674 3069 4737 4176 511 -3335 -4764 -4587 -1724 843 1827 1609 339 -2428 -5114 -5782 -3878
843 -3878 -358 1902 1858 -29 -1662 -2942 -3842 -2899 289 3289 5041 4551 1886 -1092 -1306 -548 146
860 146 2350 4544 5061 3045 252 -2653 -2767 -202 1672 2612 2917 2117 -652 -3292 -4814 -4877 -1917
877 -1917 1559 1382 -150 -277 -2234 -4562 -3324 -1935 -215 3182 3616 326 -1543 -1747 -2411 -1927 1370
894 1370 3019 3585 4762 2395 -1736 -1556 54 -66 2182 4296 3004 1252 215 -3636 -4991 -432
910 -432 1986 1118 2361 1570 -2643 -2969 -2256 -3790 -1910 2549 1159 -1023 12 -1622 -3879 -1307
926 -1307 9 -1114 2441 5291 867 -961 -93 -3194 -2838 2836 3024 1614 3973 2022 -3875 -2858
942 -2858 536 -269 2580 5598 848 -2313 107 -2369 -4292 735 1857 -1038 1544 2220 -2712 -1825
958 -1825 1187 -3095 -3131 2875 1857 -652 2500 -308 -6229 -2444 1155 -918 3209 6454 -45 -3451
974 -3451 -638 -3044 -3214 4783 4435 -1032 1367 620 -4924 -1469 3448 -388 -63 4620 -61 -2277
990 -2277 2898 551 -4908 -318 1320 -1990 2522 5266 -1837 -3277 -4 -3595 -2728 5605 4239
1005 4239 -1155 800 -1988 -7844 -1750 4022 -86 1169 3848 -3028 -4699 1655 437 -1707 3828
1020 3828 2314 -3579 1050 3322 -2286 -744 2434 -3107 -1793 5668 2941 -356 2942 -1413 -6777
1035 -6777 -222 4064 156 3015 3863 -5042 -5941 230 -1255 -331 6364 1791 -4976 -1103 -566 -4466
1051 -4466 897 4176 -2847 -2157 2763 -1564 -2034 4179 -7 -4633 1834 2598 -1180 4229 4858 -4282
1067 -4282 -3810 1066 -1988 1156 8177 2563 -3959 -67 -1792 -4999 3349 6323 -1112 -1186 843 -5524
1083 -5524 -3526 4043 321 -3237 2717 -321 -4978 2296 3529 -4009 -1394 1420 -3864 -748 6265
1098 6265 972 -3475 844 -2386 -5150 4248 7022 281 1493 1819 -5608 -2971 5189 1983 462
1113 462 4672 -480 -6005 728 2695 -1982 1949 3398 -4017 -1759 3631 -1102 -3065 1632 -1927
1128 -1927 -5503 1866 3331 -1950 810 1389 -5973 -3245 3485 710 711 4460 -1494 -5968 195 1044
1144 1044 -1152 3883 4920 -2020 -1455 2468 -1153 -244 4732 864 -2484 2043 1329 -2250 1428 1798
1160 1798 -3512 -1262 2459 -630 -34 3409 -1710 -5472 -878 -1015 -2393 2653 2437 -3153 -2274 -638
1176 -638 -3224 -792 4050 1443 -942 1479 -587 -2949 1427 1994 -1140 1233 2356 -712 681
1191 681 3084 -334 -1038 1625 699 -438 2973 2143 -2091 -911 -698 -3114 -340 2878 219 -455
1207 -455 392 -2569 -3263 135 551 -791 725 368 -3080 -1356 374 -1442 -270 2027 316 -81
1223 -81 1542 430 -1326 673 704 -998 1069 2301 35 112 879 -1356 -1208 1607 1278 696 1738
1240 1738 343 -1903 -1283 -533 -1227 59 1358 -562 -1230 -183 -1356 -1530 374 221 -684 906 461
1257 461 -1285 -938 -2 -1348 -869 1110 698 477 1370 28 -1204 159 675 268 1048 1777 204 -330
1275 -330 -345 -855 -147 1382 978 410 1028 384 -823 -613 -622 -932 38 731 -84 -807 -582 -1045 -1376 -469
1295 -469 681 320 959 422 -621 -1213 -623 -669 -273 444 744 729 300 -150 -798 100 791 879 1079 1141 471
1316 471 31 -359 -795 -404 495 851 534 210 -7 -201 -686 -338 -137 217 814 13 -656 -789 -949 -1107
1336 -1107 -381 139 237 576 228 -378 -575 -479 48 53 569 554 286 69 -462 -580 -173 486 769 1051 663
1357 663 263 76 -262 -330 -327 336 523 113 153 -464 -839 -489 -58 -6 215 779 301 -513 -688 -662 -1013 -110
1379 -110 65 -2 303 438 -180 -227 -273 -244 315 961 695 -115 -8 -223 -918 -252 439 573 876 1075 -75
1400 -75 -347 250 -51 91 425 634 -224 -18 186 -826 -278 302 -375 -154 1013 392 -450 10 -661 -1430
1420 -1430 -52 593 -244 282 399 -893 -952 347 -72 81 1597 545 -654 -71 305 -1068 278
1437 278 1091 -126 183 1347 -148 -420 1376 251 -951 752 1182 -410 644 795 -1661 -1393 476
1454 476 -600 -67 1554 171 -1534 -154 -361 -1760 747 1534 -868 -792 516 -1518 -1064 1252 347
1471 347 -1202 1034 659 -1300 693 1217 -1198 -413 954 -774 -377 2182 552 -1591 855 -138
1487 -138 -1331 1837 2316 -540 -173 623 -2064 -1555 1688 306 -727 1072 -378 -2449 478 1247
1503 1247 -1193 118 1040 -1655 -1159 1431 -639 -1491 1117 -589 -2612 1173 1603 -469 715 1385
1519 1385 -2209 -1004 2540 578 216 2295 -83 -2567 679 1370 -188 1937 2010 -1918 -967 1372
1535 1372 -797 -388 1898 -718 -2507 385 137 -1702 1016 1012 -2654 -1157 909 -830 -22 2426
1551 2426 -1109 -3029 -30 -44 -967 2179 2366 -1778 -685 845 -1416 754 3894 525 -1501 1176
1567 1176 -347 -1519 2311 2010 -1289 162 949 -1641 295 2804 -443 -1881 299 -1198 -1853 2072
1583 2072 1010 -2036 -660 -484 -3052 -61 2778 -177 -821 923 -1644 -2466 1920 1746 -703 1106
1599 1106 502 -2856 191 2836 -31 564 2469 -749 -1550 2171 1489 -787 1322 279 -3101 -236
1615 -236 2261 -511 -169 1267 -2256 -2821 1105 530 -946 1406 113 -3728 -845 1010 -1115 518
1631 518 2309 -1160 -2001 1394 537 -590 2165 1176 -1959 102 1210 -887 607 2483 -1180 -1725
1647 -1725 1246 346 -449 2370 774 -2430 -531 194 -1687 242 2293 -1605 -1851 41 -1154 -1212
1663 -1212 1828 901 -1565 290 389 -1760 228 1787 -881 -1008 923 -699 -967 1800 1039 -1177
1679 -1177 676 438 -1254 825 2225 -712 -856 512 -952 -1228 1346 857 -775 421 -118 -1618
1695 -1618 167 1247 -374 9 742 -998 -992 829 159 -732 847 373 -1338 237 1164 -711 -144
1712 -144 868 -866 -615 1007 525 -371 271 -217 -1317 247 865 57 669 926 -783 -721 213 -17
1730 -17 -484 995 28 -790 349 119 -527 390 861 -408 -93 607 -113 -359 185 -486 -801 84 74 -530
1750 -530 281 309 -611 -415 160 -67 -285 624 -56 -585 -229 -342 -490 391 642 231 513 746 57 251
1770 251 673 324 -25 776 260 -153 -47 80 -449 -589 375 -256 15 455 -338 -498 -103 -530 -708 -176
1790 -176 11 -504 -420 -351 -504 -465 241 -42 130 457 -108 -115 134 213 -3 295 524 151 279 555 120 446
1812 446 207 301 307 273 197 -176 -191 12 -246 -344 -60 -186 -78 -247 -495 -538 -195 -191 -589 -220 -149 -424 -504 -234
1836 -234 -369 -563 5 227 66 414 194 -41 201 123 145 351 427 330 217 337 446 188 595 280 256 588
1858 588 254 -271 -344 104 -486 -409 -617 -403 -435 -193 -338 -547 -295 -345 -183 42 -73 -342 -457 -142 -462
1879 -462 -218 17 149 47 234 642 44 313 547 216 314 706 526 230 647 -132 -114 417 417 177 342
1900 342 432 -313 64 -58 -650 -346 70 -349 -421 -108 -459 -822 -292 23 -147 187 73 -429 -377 24 -197
1921 -197 -81 506 -21 -404 234 320 -87 387 520 131 361 1140 79 355 756 20 -397 110 309 -149
1941 -149 69 445 -452 -150 286 -360 -181 825 -153 -991 -140 -347 -657 147 297 -776 -126 226 -492
1960 -492 -99 517 -199 -343 20 65 -559 386 474 -635 -77 330 -569 189 1325 205 -158 573 -190 -427
1980 -427 897 772 -638 179 -21 -944 -255 892 -316 -227 877 -182 -939 488 437 -936 -48 254
1998 254 -1316 -218 1013 -352 -288 779 -683 -1206 357 563 -451 507 344 -1473 -440 990 -292
2015 -292 397 1301 -281 -1026 826 602 -120 1005 571 -1122 -27 1050 -538 -84 1089 -479 -1137
2032 -1137 751 112 -404 983 385 -1630 -586 404 -1216 164 1180 -524 -1270 193 -124 -462 1272
2049 1272 786 -949 -140 215 -940 232 1650 -259 -718 425 -185 -482 1526 589 -675 325 203
2066 203 -1247 366 1428 -517 -838 206 -780 -691 1342 755 -961 213 -184 -1416 223 1174 -264
2083 -264 -512 552 -1100 -1058 1075 586 -405 754 130 -1136 383 1229 -154 9 793 -1048 -754 876
2101 876 470 -381 732 -1 -1537 60 1096 -401 412 634 -1245 -1153 701 -34 -334 1211 -98
2118 -98 -1623 259 1042 -466 520 1177 -843 -787 890 -142 -196 1111 -126 -1572 300 307 -625 859
2136 859 961 -860 -713 537 -521 -275 1297 -85 -1194 148 156 -913 821 1220 -620 -415 399
2153 399 -581 -173 1398 37 -837 713 167 -924 625 1058 -420 -207 229 -657 -213 1142 -256
2170 -256 -765 169 -472 -1066 624 595 -599 -40 200 -617 -610 1163 129 -251 577 -32 -1100 502 773
2189 773 -554 334 616 -546 -256 832 31 -206 589 -82 -1057 343 756 -265 387 244 -1098 -521
2207 -521 666 102 -7 337 -362 -787 340 393 -434 136 398 -537 -319 479 -99 -2 720 -109 -328 598
2227 598 322 -412 470 473 -833 -350 399 -191 -121 659 -110 -205 456 190 -294 142 219 -460 -368 162 -490 -193
2249 -193 254 -161 -366 108 -23 -186 18 276 15 7 48 -155 80 316 57 -374 368 287 32 545 187
2270 187 73 147 93 -192 212 201 -284 -5 -20 -341 -254 80 72 -192 94 105 -322 47 -83 -412 -358 -67 58
2293 58 -149 -170 252 58 -127 -132 47 123 244 96 -89 153 -346 -124 231 211 114 104 254 200 16 150 318
2316 318 -3 207 -5 125 -156 -288 -276 -130 58 -376 43 40 -153 -157 -27 -19 -137 -79 69 -70 -217 81 -28
2339 -28 167 341 91 288 399 198 -114 61 85 -297 167 306 -12 14 157 52 181 52 -21 -90 114 -43
2361 -43 -41 86 187 -492 -68 -46 -229 13 -57 -238 37 93 -197 283 -9 73 27 112 -25 108 -65 -102 -129 188
2385 188 192 -45 467 252 69 -204 380 3 -98 55 -13 -318 124 308 -284 -269 127 168 -214 125 -57 -274
2407 -274 -327 -63 -245 -164 -250 -32 -135 114 1 -178 214 280 19 -103 255 -200 -27 129 -98 77 287
2428 287 -118 -100 243 124 -244 46 132 -154 -160 -88 -348 -146 365 -119 -12 12 -73 -246 -7 -3 -346 70 91
2451 91 -325 -312 77 16 -238 59 -42 -11 247 37 -217 137 219 -484 171 451 -108 18 459 -147 -236 319
2473 319 264 163 367 136 -564 245 423 15 57 134 -201 -528 181 32 -245 386 94 -465 83 455 -418
2494 -418 -49 193 -574 -269 478 -78 -194 333 -149 -403 88 524 -48 75 686 -265 -95 443 -193 107
2514 107 490 392 -363 422 246 -5 93 523 -359 -247 291 -347 -439 317 -1 -722 -134 162 -531 135 565
2535 565 -538 -437 80 -189 -722 690 -149 -913 138 99 -309 394 803 -304 -75 206 -74 -28 951
2554 951 56 -455 160 0 -488 438 412 -41 -192 122 -697 -540 701 225 -584 130 -291 -666 117 325
2574 325 -318 -135 179 -611 -285 392 28 -369 188 -202 -540 301 395 -146 201 249 -393 -258 545 264 47
2595 47 500 -176 -361 206 475 -502 253 153 -834 -382 308 32 -100 394 -86 -850 83 8 -516 226 130
2616 130 -890 -477 241 -244 -123 670 -49 -588 142 153 -225 486 378 -594 -354 228 -82 118 882 98
2636 98 -299 54 -41 -282 370 135 -527 -160 59 -601 -30 506 -144 -377 96 -149 -328 428 480 -234 -131
2657 -131 -166 -323 215 464 -291 -469 363 -222 -282 512 503 -334 132 131 -449 -53 348 -126 -166 245 -94 -234
2679 -234 381 275 -392 395 47 -628 66 458 -266 -290 258 -315 -405 336 94 -521 321 132 -457 -3 495
2700 495 -9 -218 351 -317 -367 436 377 -167 475 72 -527 -149 467 92 140 323 -160 -375 154 153 -287 226
2722 226 146 -495 -103 338 -89 -85 235 -224 -333 99 -288 -394 359 212 -210 -31 301 -91 16 558 151
2743 151 -119 36 -95 -358 269 42 -209 -32 186 -127 269 347 28 15 213 129 -283 164 -141 -221 140
2764 140 -169 -239 45 239 -16 -170 123 -175 -156 337 120 -93 75 33 -146 176 11 -160 -9 30 -152
2785 -152 99 156 -70 24 288 149 -240 -46 40 120 135 90 -194 11 -127 -20 201 -69 98 11 95 27 -122
2808 -122 99 -84 12 -83 -134 327 26 78 2 -156 -20 -103 23 -139 25 -92 275 -10 -155 -11 220 153
2830 153 -49 -1 -58 -4 -116 164 -54 136 191 -82 -73 2 -199 49 20 -74 -83 -23 60 -167 -21 -210 -44 -219
2854 -219 84 31 176 227 -18 129 127 19 7 34 -115 -74 -5 42 -87 -6 -67 114 154 -376 183 10 22 165
2878 165 -124 -79 112 -274 78 87 -87 285 170 -134 11 227 140 58 -30 126 308 -79 157 30 -5 3 -17
2901 -17 -71 55 57 -49 56 257 -190 -108 138 -6 -214 229 21 54 20 26 -117 122 382 83 -120 -75 88
2924 88 -68 84 151 -65 -108 260 84 -54 123 6 289 318 8 48 -154 -114 -111 -27 -251 42 47 206 -12 18
2948 18 -79 -254 -359 48 -230 -144 32 75 -160 -275 152 -352 -2 41 -19 76 123 279 -139 225 -52 -248 107
2971 107 422 -147 307 219 -51 93 306 266 -77 12 -22 -297 117 105 -207 -205 101 -229 -120 300 -10 -236
2993 -236 1 210 -525 280 -75 -304 181 8 -147 -231 35 -174 193 467 -296 -32 166 -124 -145 110 330
3014 330 -311 -301 339 3 128 352 -235 -36 199 237 -96 214 -89 -375 -245 -73 104 -29 367 -261 -422
3035 -422 -3 -231 -127 175 246 -362 -58 47 -174 53 301 -22 -243 169 -144 84 287 201 -180 183 -26
3056 -26 -311 -185 498 -184 -94 30 -18 -141 418 119 -258 -1 216 -281 -57 395 -106 -162 94 -289 -409
3077 -409 136 123 -139 116 177 -500 -259 336 -67 -12 214 -50 -370 391 150 -229 452 427 -153 -153 143 -399
3099 -399 127 536 95 -55 154 6 -120 361 98 -426 171 344 -247 62 -58 -286 -338 165 -99 250
3119 250 322 10 -292 -190 -57 -263 249 238 -114 -106 58 -141 58 400 331 -390 -93 395 -55 227 506 -240
3141 -240 87 310 -166 -196 258 414 -391 210 -150 -274 200 299 37 -238 63 -129 -47 255 26 -378 67
3162 67 123 -226 48 490 -60 147 -69 -180 -114 508 195 -79 134 -98 -464 350 221 -13 -49 233 221 -203
3184 -203 260 -110 -114 255 -110 -422 18 50 -95 114 286 -183 -306 149 47 -107 133 159 -272 68 19 -296
3206 -296 40 209 17 -166 416 168 -133 124 354 65 136 79 -52 -87 140 -147 -184 300 -73 -356 323
3227 323 -3 -203 -163 10 -356 -31 310 -420 -21 -17 -54 -143 357 -31 -87 276 48 -54 14 -256 21 160
3249 160 140 -8 -185 96 2 71 187 172 62 221 146 -49 97 106 205 -24 96 -352 -210 130 -66 -17 -105
3272 -105 161 33 72 -63 -89 32 284 116 162 226 39 76 -38 1 -39 -147 -49 -141 22 167 -183 -112 133
3295 133 80 75 -198 20 55 52 85 -228 -159 100 -94 -64 68 30 -83 111 88 -3 177 -102 196 185 -347 -86
3319 -86 -184 -101 95 -138 -35 -64 -117 8 -93 -216 246 133 66 77 1 113 -104 -74 130 -136 154 -149 35
3342 35 223 53 -127 90 -29 -143 35 194 -52 -43 120 -90 11 -316 -292 -17 12 187 -230 85 30 -43
3364 -43 1 -18 -114 -78 12 52 36 -5 137 -17 -346 5 -91 -88 -30 67 -121 -56 -147 -222 186 289 50 -200 60 42
3390 42 -64 21 96 35 -179 -100 -257 -137 138 -52 -172 -23 -82 129 2 -3 27 -28 25 -300 76 -120 -127 97
3414 97 300 -116 155 100 85 47 -182 -100 -106 -109 84 -385 -81 239 -363 36 111 -91 -188 203 199 -45 159 119 -175
3439 -175 -42 -178 -110 -13 141 -39 -237 234 139 -74 16 130 287 34 41 -165 -239 -76 83 11 113 58 25
3462 25 -275 -49 -197 -217 36 -67 -218 161 -58 -111 109 -54 -146 163 32 -146 166 27 73 -119 88 -48
3484 -48 46 279 -9 55 -68 -1 -206 141 115 -9 -248 279 85 11 -7 -20 -157 -16 15 18 45 -9 18 223 -18
3509 -18 -15 -8 72 83 11 107 -109 53 -22 4 -8 -58 136 -32 58 122 126 -60 -86 -165 -369 215 138 -76 -254 209 16
3536 16 61 55 -14 -98 6 36 11 103 -78 -148 -180 13 -81 41 207 -12 19 -123 -131 -11 337 85 -212 79 -48
3561 -48 -138 -32 101 -5 -115 160 22 -122 -34 97 -179 -26 399 -73 -141 259 -167 163 -31 -358 -71
3582 -71 403 28 64 156 -51 -65 -44 190 19 17 24 2 31 130 -259 -102 195 -104 -36 26 -157 -190 -106 199 -211
3607 -211 -174 160 -99 -41 86 -85 -193 94 25 -45 -117 311 -269 244 96 -128 -51 219 -23 -167 187 -51
3629 -51 48 -64 267 4 -189 -109 -239 35 -51 -55 -231 -54 191 137 32 175 -26 -170 -107 -272 -283 296 38
3652 38 -156 147 -102 115 -37 -46 56 -186 -124 -291 -129 -8 94 -134 203 -159 -78 165 240 -97 -131 33
3674 33 -163 -64 160 -47 -79 157 32 -167 -13 207 -131 160 148 -131 39 228 -115 131 186 -202 -60 22
3696 22 99 -56 294 -20 87 67 37 -221 161 164 -141 -334 26 186 -126 -71 160 188 -108 99 0 -310 -33
3719 -33 -69 -325 -53 129 -67 270 -46 100 27 157 -146 88 205 255 -165 54 -113 -158 228 77 -58 96
3741 96 88 157 52 191 51 -134 -6 142 40 168 51 169 55 -81 150 108 325 42 115 39 -177 -197 -54
3764 -54 120 177 -79 -89 24 241 52 -93 149 -76 93 -171 19 -181 44 -5 93 71 -153 -29 -2 148
3786 148 66 88 19 132 -150 55 44 84 30 27 -97 -135 248 118 -146 122 207 14 131 14 228 -53 -74 113
3810 113 -101 -204 62 -148 130 -126 181 -131 -59 -391 -223 50 -2 -8 158 94 -71 -90 346 211 -2 124
3832 124 -128 -89 -306 64 48 -196 -84 -212 -204 -67 -176 -63 -47 -10 -52 226 34 142 -164 -107 -117 -38 49 -70
3856 -70 32 8 140 11 -67 -169 283 -248 -66 -327 162 -73 173 5 -142 40 79 97 -159 165 135 220
3878 220 -164 76 137 -107 -88 66 234 73 150 -170 12 159 -145 -44 -258 92 -135 -60 47 -87 -250
3899 -250 -32 -74 24 153 28 188 -21 -23 -37 -213 -94 18 -93 -266 -12 -286 -6 124 -13 50 87 65 103
3922 103 90 -79 102 45 -176 17 10 155 -73 -157 -95 19 -80 63 -104 12 70 -84 158 41 -119 -192 147
3945 147 -84 -8 101 30 185 -145 54 184 113 -180 6 29 -71 35 -141 136 92 -70 -149 -184 -154 8 312
3968 312 -199 -97 0 -63 -190 -162 216 4 72 114 -50 -83 35 -45 -65 139 467 11 -50 -51 191 -278 79 -35
3992 -35 -133 -35 154 158 -29 -113 69 -111 174 -19 -13 116 78 314 149 38 -38 98 86 -126 -8 2 -5 33 218
4017 218 -146 -5 265 179 -29 208 338 139 -25 157 -30 255 50 193 -68 124 -100 122 -63 30 79
4038 79 121 -79 -52 61 -91 63 -160 26 2 -105 -90 70 49 120 20 -27 159 213 -141 115 -92 165 -217
4061 -217 141 173 -105 -11 140 310 -80 185 -207 -27 -44 11 169 -12 142 44 142 -49 147 13 190 -117
4083 -117 36 -52 67 13 32 -170 -361 109 -91 37 94 13 88 43 -236 -2 -47 -54 31 81 315 -92 -140 102
4107 102 -16 196 -38 -34 -105 -133 -19 107 -41 -76 31 -12 143 56 -145 -123 195 15 -80 -40 -118 -37 109 150
4131 150 -11 -76 -40 -236 41 47 59 66 239 -97 149 65 151 -76 163 -19 -149 -169 -98 253 103 152 -33 191
4155 191 -193 135 45 -129 95 -320 364 81 31 119 49 -142 1 -109 31 47 -261 -2 -186 -281 170 -54
4177 -54 -185 186 -164 44 -73 55 -233 -50 87 75 -149 -138 -118 -85 -202 40 -61 61 -15 -260 -77 -34
4199 -34 18 -209 176 -41 122 -7 -43 189 -75 -39 59 110 76 131 56 -257 -22 -105 83 253 68 200 -10
4222 -10 -44 11 230 -81 36 -231 55 139 -182 37 -138 -147 11 149 -8 123 96 -27 185 -91 -6 145 85
4245 85 -25 19 39 -25 214 -330 -203 -116 15 234 -90 -218 -62 111 -120 -73 -212 122 15 281 217 -83
4267 -83 70 -92 -281 -50 -11 54 -97 -94 -67 24 116 83 3 -75 77 44 -109 63 -126 158 84 30 -16 -124 22
4292 22 40 59 26 98 -99 -260 66 11 -65 178 255 -44 -285 -248 157 -153 -226 121 97 92 191 174 -2 -128 -102
4317 -102 252 -4 69 58 -85 19 44 23 108 143 -190 -102 234 -189 157 -220 -1 -221 -136 1 -95 -16 -210
4340 -210 197 39 12 -156 -65 -3 -130 -206 -150 63 8 -161 78 -130 9 332 136 -69 -80 97 -37 166
4362 166 -95 -144 -85 73 -71 -26 1 -85 -102 8 210 42 149 75 6 210 -109 -41 -65 -139 18 11 -50 23 65
4387 65 -123 36 72 85 58 78 161 -134 9 -140 -58 63 116 -9 47 -37 -24 -69 149 -36 57 438 107 180 -116
4412 -116 -51 -266 82 -19 203 -126 -47 210 3 -87 148 87 -11 -215 -22 7 -49 293 -229 -167 184 -266 135
4435 135 -31 -62 41 -74 -131 95 -84 143 -88 -105 208 -128 -181 -125 -22 -325 -28 30 63 148 68 -111 38
4458 38 -108 -253 -119 -90 28 -83 20 -13 46 -89 201 -125 -132 135 -101 -121 261 111 -18 -11 27 13 -43 -95
4482 -95 -97 -40 -161 6 -26 -44 56 -156 -10 -55 66 236 83 -221 104 105 -163 150 139 30 135 -38 126
4505 126 159 24 -11 203 187 79 -186 74 -127 -72 -20 47 -50 13 -97 -291 160 254 -225 248 144 34 -188
4528 -188 -94 94 125 75 149 78 84 23 -59 6 8 58 106 78 86 114 -17 151 -76 58 -105 -17 97 3 -71 7 -197
4555 -197 74 108 186 -60 160 72 -26 103 161 -40 -14 -60 52 179 92 141 -174 -37 26 -194 253 -111 48
4578 48 -44 32 -60 -61 340 -244 -135 -193 44 41 -258 141 -213 -15 -5 164 -87 101 61 -128 -185 40 -251 47
4602 47 -96 -77 -192 14 58 -254 189 166 52 -141 63 -141 91 -43 -4 -252 139 115 -16 -221 -174 -65
4624 -65 55 357 98 65 -146 7 -14 97 147 54 81 138 -17 -173 37 -69 -94 18 124 -163 133 -73 -4
4647 -4 47 55 9 101 107 117 88 -341 128 415 166 -155 -88 -11 -13 142 3 -81 -48 -90 60 121 -31 211 -273 276
4673 276 -224 163 -45 -181 157 123 -61 95 -263 -122 76 -183 10 -31 -9 -178 153 -41 226 -23 -18 -128
4695 -128 -51 134 -220 -40 73 67 -69 -91 -49 92 8 -48 -375 193 -150 -16 -6 79 3 17 -19 -35 170 -259
4719 -259 162 -19 198 -16 212 174 91 -153 70 350 15 -56 11 -11 16 -145 -116 262 -298 -49 -5 -113 -154
4742 -154 241 136 -64 18 -81 -254 83 -53 -172 -37 16 -105 -227 -167 97 162 104 -366 127 189 -110 -7
4764 -7 181 80 199 -128 49 45 86 24 73 155 -219 47 155 115 62 80 -23 346 109 258 -159 112 -191 255
4788 255 -240 -267 -30 -185 90 91 19 73 -5 -34 98 28 -167 128 -19 -38 160 16 14 -35 319 179 -38 -75
4812 -75 -191 243 196 -91 -34 -130 154 -35 51 20 4 -36 47 -28 7 -309 -65 80 -64 -127 105 -134 -133 -72 47
4837 47 150 -39 -193 -15 -87 -10 39 -85 -100 108 142 36 -101 188 168 68 -162 -162 -58 30 -27 -5 37 37 68
4862 68 -230 187 -137 181 124 -149 -139 -323 72 33 92 29 -101 -46 -31 39 119 -53 175 122 -78 -164 -202 155
4886 155 -17 -12 11 13 -42 -13 -234 -44 -68 -192 245 179 -336 -20 100 -158 187 141 316 -15 35 -130 -160 146
4910 146 -194 73 31 193 48 90 -47 -86 137 -33 10 232 -19 -22 -164 164 -44 183 111 -86 200 -85
4932 -85 -49 -133 63 -27 -40 228 183 90 -26 -107 150 -40 -73 -213 24 143 -246 -77 -164 -246 32 -24 -88 -132 142
4957 142 -23 59 30 -195 195 -80 47 -76 -31 51 5 1 237 160 49 126 135 32 84 24 122 81 -44 -57 -155 74
4983 74 117 34 -184 135 -237 151 -79 -189 117 109 -315 43 173 3 234 -155 -116 341 92 -267 -126 103
5005 103 36 213 75 -287 -21 3 90 -139 193 -106 -98 13 95 -255 -7 -155 -116 -123 -270 82 -11 41 -51 -170
5029 -170 -83 -2 -97 82 -151 370 -187 -75 -106 256 -74 258 -148 108 88 -23 162 -98 -133 -243 113 -2
5051 -2 -228 -69 58 25 -120 -178 122 -153 69 -60 149 14 72 -2 -52 -32 -106 102 183 61 -16 232 43 171
5075 171 -63 -28 -71 -155 -158 -95 229 36 -104 -88 -43 -100 -241 39 140 -53 -102 -116 -2 77 19 4 -128 -42 -49 -49
5101 -49 -100 154 23 -45 128 -200 -86 60 -3 -48 -16 86 11 31 -52 -76 -70 -126 -200 -73 -428 -258 -51 -175 -2
5126 -2 -119 16 -80 -12 -17 -139 314 -25 146 132 305 -59 89 -108 -190 233 -57 -28 -47 23 -193 65 -164 52
5150 52 -138 -144 -340 162 78 12 39 166 -91 -183 -17 -23 67 72 -40 180 190 241 -220 126 -257 153 -173 -126 -86
5175 -86 -264 -118 47 65 148 -67 233 110 218 -18 -138 200 119 13 154 46 -12 -238 298 327 -159 131
5197 131 111 -118 132 -287 68 -140 -136 -28 91 159 9 32 148 78 -30 -24 14 235 27 219 -2 -14 -33 107
5221 107 13 -82 -396 177 52 209 -32 -35 -107 -38 -46 -11 12 -87 -112 -37 193 140 -98 68 -85 317 50 -181 -129
5246 -129 268 200 146 143 87 25 -87 138 -83 184 66 119 57 -36 -237 -17 122 102 25 -47 -189 96 141 -166
5270 -166 105 -3 -57 -147 127 -51 -108 151 146 -123 -93 57 104 36 17 106 154 103 -106 69 -70 -87 -119 158 -45
5295 -45 86 35 126 -54 -144 -55 -24 -23 -15 -184 158 -32 -196 135 -128 133 -92 -77 156 -182 56 -240 75 -45
5319 -45 -145 150 -146 -380 -192 -212 -11 271 -41 -138 -104 3 4 24 -58 29 -95 180 273 12 -35 -23 282 -143
5343 -143 -75 123 36 185 -110 147 170 141 -162 238 14 -55 -126 -7 -71 -135 102 -122 -201 146 -15 -27 -23 -163
5367 -163 -307 -200 51 -199 37 -18 -23 4 116 -175 66 40 115 -53 209 211 -226 126 150 138 -221 82 71 -19
5391 -19 165 212 -3 -62 171 -155 -188 14 -153 46 77 -278 -27 177 117 32 -83 -34 158 196 -118 -62 11 -54
5415 -54 52 183 162 286 -5 -87 76 -42 28 -189 -111 48 96 -106 123 24 -66 188 -98 56 -161 43 144
5438 144 250 -79 -127 162 130 -60 -74 -171 -66 26 -258 7 -210 -173 -25 -63 -119 276 -193 55 28 -69 -27 375
5462 375 18 260 -123 195 -75 -25 -81 173 132 -93 -13 130 239 54 -101 136 -137 -96 21 -318 -213 73
5484 73 -191 -30 89 92 39 7 -181 -123 115 80 -112 -332 262 -78 -20 -5 69 -89 20 -97 -72 -206 67 -196
5508 -196 -82 27 -135 25 114 16 -302 6 18 70 -97 -27 -44 -136 -124 -22 245 91 240 -170 -48 -141 99
5531 99 94 10 113 88 116 169 139 133 219 -228 57 -136 145 -50 -98 -181 101 31 178 79 121 -1 161 406 -195
5556 -195 -88 34 277 -1 44 99 47 -7 -106 0 113 -78 143 -179 92 82 -34 -38 162 -45 -73 158 239
5579 239 -63 51 270 -123 -203 -47 -1 -49 64 -237 22 -17 155 47 139 -102 333 -23 -198 -33 -54 10
5601 10 -110 -2 -69 -95 49 -138 202 -105 315 105 34 19 136 -165 64 2 136 88 84 80 -124 97 -132 -301
5625 -301 -217 176 -143 52 34 -56 -160 187 -87 180 68 187 -22 -27 -11 -71 95 136 -72 107 139 -282 -69
5648 -69 160 3 24 82 53 -194 202 72 -170 -87 -130 73 123 142 86 -68 135 45 8 13 59 34 292 107 100 -98
5674 -98 -227 44 -62 -108 -191 50 -51 103 -178 -118 -28 47 175 -134 108 68 -37 -126 -181 -238 110 -21 230
5697 230 11 -31 -38 57 171 135 139 -68 -142 102 -114 -21 42 65 127 -105 -55 127 233 50 -21 66 7 -267 -333 6
5723 6 116 -50 95 -46 -12 -12 -108 67 90 90 22 -135 71 142 -72 33 -134 -216 -168 -239 29 14 -103 12 -153
5748 -153 -53 -46 23 -14 -146 -93 -65 9 330 26 -88 206 -196 179 122 106 41 -156 -62 41 233 -29 -173 158
5772 158 70 88 88 69 -225 56 -275 57 234 246 216 -201 309 79 -161 99 -41 -227 -323 63 175 -192 -36
5795 -36 -38 254 -9 55 -75 89 -73 -26 -11 -158 162 46 -116 -163 -243 -104 30 -87 55 231 -47 -117 -37
5818 -37 -13 30 -133 -40 45 -112 306 -31 -48 300 -93 -131 5 25 -109 -16 -112 48 -28 39 -291 18 74 -70
5842 -70 51 171 -58 -2 -9 -196 -6 -287 -83 -237 -60 95 -62 -174 -112 -91 143 273 -154 -42 356 -130
5864 -130 -182 144 304 63 80 -53 132 40 -151 143 137 -250 48 37 -24 153 -47 -92 103 -17 142 68 154
5887 154 -113 62 -190 -137 -144 118 -105 159 -107 69 -42 -73 -144 55 8 69 237 147 -194 42 -221 -100 -49
5910 -49 -6 149 -21 -109 146 240 137 188 -173 53 208 -44 -261 -14 -131 135 101 -108 177 -43 -95 127
5932 127 73 -55 -93 56 -175 -95 177 -154 83 241 -4 -2 -173 133 -65 -42 -76 4 -111 -277 -1 71 107
5955 107 24 -38 -63 335 117 -129 299 -76 -69 133 26 158 -115 -45 176 -109 60 -73 -228 -28 -27 -159 244
5978 244 -171 327 -99 -219 -18 -12 9 -45 54 43 53 7 76 -146 -2 84 -56 261 -66 -53 38 149 -123 109
6002 109 -77 161 31 -130 94 90 105 -84 129 -58 136 -131 -59 115 -109 -169 48 105 143 -204 46 -2 -22
6025 -22 -97 219 42 132 215 53 -81 -101 69 -21 231 210 -354 -12 116 130 -61 33 -170 174 -124 36 105
6048 105 -102 46 51 105 -233 -120 50 97 -56 -64 -115 6 24 -113 -190 136 -147 -204 132 164 105 120 68 215 22
6073 22 16 -218 -29 -364 10 146 -255 -5 42 112 -38 -141 -137 -37 -7 -91 -93 -24 -93 -7 31 46 -11 -167 -198 -139
6099 -139 193 -63 122 -144 149 -205 72 108 -211 90 -7 126 61 65 69 -69 -33 105 -43 -31 -173 -231 132
6122 132 -7 -23 -18 56 12 24 48 -69 -16 -127 70 55 58 121 -13 103 -62 77 186 -113 124 215 67 26 -151
6147 -151 22 101 -96 41 -141 -151 33 63 181 -37 21 30 -20 123 22 98 134 9 67 144 -401 -30 -98 77
6171 77 -16 14 30 8 -8 18 15 -47 -75 -88 -272 -57 -281 -119 -217 -18 -35 -283 212 -66 266 78 138 246 -23
6196 -23 195 -186 -116 -252 -309 -17 136 -103 32 8 74 69 228 -147 -94 123 -168 -96 -63 27 -63 -80 -97 -180 13
6221 13 194 -88 -18 -74 75 -199 23 156 160 101 39 41 6 25 -39 20 106 -23 -72 149 9 172 -87 54 4
6246 4 96 -242 -196 -10 -31 71 133 80 -143 -78 52 323 -136 261 83 286 10 -65 286 -9 103 -91 -37
6269 -37 -38 -180 18 -14 -26 92 233 243 -77 15 187 -265 164 161 -16 131 21 -113 -59 14 52 -91 182 216
6293 216 20 -130 -137 -91 -91 -124 -212 187 -76 -16 91 2 90 243 -76 91 -3 -94 173 -81 -50 94 205 -252
6317 -252 -106 -62 -135 -54 60 138 -48 147 -121 146 223 -34 12 29 -21 -98 -119 152 61 -61 344 -319 -55 -55
6341 -55 -293 -147 129 -67 83 -45 -110 60 160 158 -251 14 82 140 -38 113 -88 -102 -89 169 159 172 -232
6364 -232 6 -69 172 165 60 -53 -199 200 -20 466 -189 -113 85 -113 -57 133 122 -157 117 -154 95 129
6386 129 -247 66 305 -93 69 -100 76 214 253 52 -60 -59 -77 210 102 4 -10 186 156 184 -127 17 263
6409 263 94 120 -114 -86 -150 12 87 -108 -318 3 -130 -128 197 -15 -63 211 -2 -248 -135 -84 -71 -99 139
6432 139 12 1 186 43 164 -5 -188 -216 -15 -75 111 -18 -47 -1 -38 -39 14 -98 177 71 -101 2 -100
6455 -100 -20 179 -31 -187 118 11 219 262 12 45 112 -122 140 -86 64 151 -86 157 51 -55 37 -171
6477 -171 -28 179 197 214 -311 210 169 100 -41 -113 -102 -125 -4 80 17 242 224 96 -51 -125 25 -23 -49 -69 -130
6502 -130 17 66 76 -168 47 -229 -13 -20 -15 -35 -297 68 121 -61 2 7 117 105 -127 45 -164 171 2 95
6526 95 202 -522 71 -30 -23 -107 -85 66 -28 196 -255 -87 261 -35 197 -91 -134 -118 -4 -134 -114 285 64
6549 64 139 -66 60 -184 -11 27 36 71 -153 -43 -205 -116 35 -71 83 112 30 102 -99 -80 84 8 -10 172
6573 172 -88 -19 176 -54 155 14 72 48 68 228 203 -112 -12 246 40 -55 94 -106 -186 197 -205 312
6595 312 14 -189 -176 79 251 42 104 -228 -129 15 88 -59 -9 143 131 137 88 23 -67 -179 45 60 290 66
6619 66 135 41 -207 89 58 115 -121 -50 15 40 32 -115 -68 -166 -14 147 -178 159 -24 230 -115 13 124 27
6643 27 79 295 14 -17 -37 22 -81 -61 110 -272 87 -46 -49 -102 64 49 -95 81 -106 -46 124 44 -76 -77 -60
6668 -60 -80 -179 72 -81 -34 -71 28 -172 -130 105 -4 123 -162 170 73 41 -103 -36 101 -72 -14 25 -111 -77
6692 -77 144 -184 182 54 106 -78 -128 -57 88 -181 338 234 -60 -103 80 173 -236 34 -67 -46 178 -23
6714 -23 -90 -343 14 128 -26 1 190 -44 140 126 -94 -135 -53 -36 161 19 135 -55 192 54 -1 41 -7
6737 -7 388 231 40 51 69 18 -129 122 -35 -14 -225 78 52 -27 -46 25 155 -95 -157 116 196 -124 10 -107
6761 -107 86 179 -174 61 -2 -122 -86 -2 8 153 -195 -193 251 -199 -11 115 185 -130 85 -65 145 -55 352
6784 352 88 267 -59 -35 -25 124 -100 -226 5 83 -238 -175 74 -103 24 132 -21 -218 148 160 37 -104
6806 -104 -144 -4 -16 -43 376 102 42 176 27 -3 129 -146 -97 201 -233 -41 11 47 -117 47 81 86 -56 -11
6830 -11 -83 -19 -29 -225 -10 -154 89 -30 91 -84 134 15 -31 45 9 -113 -122 18 -304 -196 -36 -75 -215
6853 -215 89 48 36 -235 -41 1 -91 196 79 262 148 233 -178 90 -46 -3 72 7 170 -70 6 -208 -138
6876 -138 -137 4 -17 -55 -182 -162 -70 91 60 -187 81 37 -124 -36 40 -82 38 233 -29 62 -115 -96 -272 -68
6900 -68 -26 82 92 13 227 -185 -67 73 131 -35 -17 -169 -39 -16 -102 91 -102 -93 -203 -60 83 -25 -86 -127
6924 -127 27 37 113 4 -166 -4 37 31 16 -43 -77 268 203 263 -320 130 10 146 -141 -90 115 -3 -49 230
6948 230 -53 92 112 -18 192 165 -23 -83 28 -150 14 -338 107 34 -71 -171 28 0 91 119 -47 20 83
6971 83 73 -46 -174 48 -256 -55 -116 207 164 -192 -196 70 -166 261 96 -179 -57 212 -120 -146 41 -38 43
6994 43 143 -40 -131 24 -109 123 260 174 87 114 -182 75 -23 -3 -81 -128 -107 -66 153 108 -65 -124 -27 -224 140
7019 140 104 -219 117 -218 61 68 -126 212 -318 -81 -137 172 -40 140 -2 32 14 -106 128 253 56 279
7041 279 174 -35 -88 -85 153 180 -22 -96 -18 -8 -108 58 110 -12 0 6 -167 -55 239 149 -109 -178 195 -119
7065 -119 -6 15 -328 1 -136 -92 9 -181 -94 125 136 -117 -40 0 -124 104 54 72 77 121 -228 120 -177 61
7089 61 -50 34 122 56 -56 146 -149 190 -3 5 -93 91 230 102 64 146 -102 -29 -87 -182 337 177 113 -75
7113 -75 62 -157 -36 -31 164 81 -23 185 -79 -195 -56 119 35 38 -158 378 -17 -210 50 -93 78 -207
7135 -207 -80 164 12 -187 -178 -115 -133 -112 169 71 51 -39 -54 -14 -9 59 -20 35 -52 248 90 -5 -18 58 32 59 40
7162 40 -99 -99 -108 137 -45 -130 -12 -39 23 195 -51 110 -66 -111 -98 27 76 12 77 -237 12 -190 -144 0 19
7187 19 100 99 40 -49 302 16 41 10 131 -1 298 254 251 26 71 95 -114 192 186 94 147 59 -87 135 220 -62
7213 -62 169 -163 -23 -60 181 -16 -77 -64 -162 43 -181 23 -68 -22 71 -71 199 37 139 -11 144 251 108
7236 108 28 138 -145 -230 100 -186 -71 -134 -71 -8 -33 -34 151 -53 -228 2 -90 18 109 -324 214 -223 -203 111
7260 111 -49 -157 -163 -260 -151 161 7 -64 -19 4 49 -150 -202 109 -194 -135 72 -156 -181 -112 -158 93 7 -121
7284 -121 -114 108 -237 35 128 -15 -21 -155 68 -210 -300 -161 -68 -166 -18 -17 173 130 -150 -5 166 -19 220 -333
7308 -333 -228 -1 -217 145 -87 79 -79 -14 38 130 -57 239 -24 -114 -124 154 -63 -51 16 264 -94 -42 -163
7331 -163 190 17 8 -110 145 -122 -76 -37 63 -88 -149 -45 -183 198 -120 6 136 -152 -101 325 143 -65
7353 -65 6 -116 29 220 57 -220 20 -91 26 -156 -114 155 -216 13 -36 98 179 -30 131 -134 157 340
7375 340 -114 -96 -78 13 123 67 32 -186 -67 150 -30 -251 26 -67 -164 112 -118 -152 -85 -201 -27 56 -243
7398 -243 -55 -44 76 -106 -14 58 -125 -107 -215 -284 -9 -31 -220 -25 162 112 -113 84 180 6 25 58 32 38
7422 38 150 -73 -84 3 21 -18 -87 15 11 79 190 -70 -31 23 128 9 -166 120 -88 -13 -231 86 115 13
7446 13 66 130 -26 -99 104 -87 302 -190 -20 224 266 190 145 -223 -231 55 -209 115 -141 89 -117 6 218
7469 218 135 -57 55 379 163 96 -216 -143 59 -71 -130 79 44 76 -99 193 60 -38 19 -135 22 -57 124
7492 124 -37 -134 -24 -11 -218 -150 -52 127 -135 2 225 203 72 -23 -111 146 -136 -103 -113 248 114 128 12
7515 12 29 -115 135 192 -111 -180 12 -68 24 -235 -61 -176 -151 130 79 -238 26 -201 47 223 -70 -161 -143
7538 -143 -68 33 325 -18 51 -77 -1 20 320 -3 -3 -104 92 -111 -68 95 199 13 -137 210 -93 154
7560 154 100 76 181 77 107 -39 -293 63 -42 -110 19 129 -271 -56 -111 10 33 104 -59 207 44 286
7582 286 -204 -67 76 -104 -82 226 24 -20 -5 234 -28 -170 -63 -104 -38 -80 -72 -68 176 -55 200 -50 118
7605 118 95 -98 63 10 -91 56 -19 -25 -74 20 82 47 11 46 117 -74 -57 -102 -203 -186 -43 33 241 103 -215
7630 -215 -153 68 -7 -29 -130 175 254 -138 -369 -32 -115 199 -353 198 133 100 -22 -121 -23 94 11 -123 -204 -19
7654 -19 -251 -204 185 169 -7 32 36 38 -42 -4 95 60 -46 100 -56 17 -76 184 -246 -91 140 106 132 -157 -153 -24
7680 -24 -75 -220 134 229 25 -20 6 -154 -175 58 -68 126 86 19 -67 231 -189 94 237 31 -25 76 -9 148
7704 148 24 -211 189 23 83 229 8 -284 172 -122 116 80 -62 77 -247 90 -1 -177 -54 167 -70
7725 -70 77 126 -46 128 34 -114 61 -15 -80 -48 47 177 63 258 -176 55 -29 250 64 19 -63 145 91 270
7749 270 -41 -134 261 -51 115 205 142 -272 -185 43 -176 8 95 -50 -103 -25 -42 127 4 -216 -46 -62 -33
7772 -33 -21 -194 -135 12 -76 -125 219 48 77 -72 227 74 -176 -72 -154 165 108 67 69 -146 340 -7 -121 -116
7796 -116 54 161 1 234 205 30 167 -6 166 -11 88 -22 134 8 -123 -227 -125 -114 281 24 -53
7817 -53 -217 13 -23 -17 172 56 79 -107 -295 -26 -284 -102 150 -231 -53 83 43 129 -225 29 56 74 -126
7840 -126 -206 63 121 64 -117 42 -89 4 23 -121 55 -208 -107 -70 230 13 -95 -267 139 -4 -2 -55 -35
7863 -35 -5 176 -8 137 -23 -11 62 -172 -112 161 69 -27 106 35 -38 210 -38 203 -100 -119 85 145 64 32
7887 32 -14 77 -109 20 157 -77 234 72 69 14 -138 -157 -166 -250 -263 -25 102 -96 -184 -25 72 2 194 -203 59
7912 59 -117 -68 149 -6 21 287 -166 41 6 78 49 221 -162 129 -55 -118 -94 -93 203 28 125 78 65 31 60
7937 60 51 42 113 -144 -107 -59 -53 137 112 262 20 -111 62 88 -168 161 178 -101 67 -2 230 -312 -83 68 -270
7962 -270 -297 75 -91 77 -86 141 -199 317 12 -120 1 35 197 11 105 -55 -33 -235 9 339 -37
7983 -37 62 -51 86 -32 -33 13 34 -33 -30 61 3 167 101 -246 77 -87 -180 -78 -147 5 -165 107 228 -185 -113
8008 -113 251 130 199 -34 -42 23 -19 -124 -201 -84 -72 53 160 -107 46 -89 152 -181 288 254 -281 -63 -102
8031 -102 144 -145 39 -231 25 -29 -130 -8 41 -178 1 109 122 95 211 262 -131 -158 79 -142 49 1
8053 1 -83 75 -39 -52 63 149 182 51 -126 158 -13 -84 198 -5 107 1 110 91 -35 88 -205 190 -8
8076 -8 -183 -180 212 64 -50 16 -121 -18 -70 140 124 -117 -163 25 386 91 12 -83 -30 -33 -220 103 93 -46 -64
8101 -64 -151 -173 -60 -63 -326 13 3 85 331 -94 -82 -114 -14 -232 -178 26 -226 178 -51 -80 103 -27 53 -83
8125 -83 -10 -178 -106 -210 126 -11 -123 -82 -72 103 -383 -39 4 -238 -57 -14 -100 -229 -155 -19 137 -237 -85
8148 -85 -165 78 -41 -17 72 198 -82 416 129 -4 -8 -59 -146 -111 217 -68 180 -8 -49 -58 143 259 150 -30
8172 -30 85 -40 237 -225 -153 53 -58 -234 -147 66 -13 163 78 -99 64 104 -19 -74 25
8191B5
##END NTUPLES=NMR FID
##END=
