##TITLE=1H_LR-753-R1-C1
 CDCl3
 8 sc, 
 26.07.2022
##JCAMPDX= 6.0         $$ Bruker NMR JCAMP-DX V2.0
##DATA TYPE= NMR FID
##DATA CLASS= NTUPLES
##ORIGIN= UXNMR, Bruker Analytische Messtechnik GmbH
##OWNER= root
$$ XWIN-NMR		Version 3.5
$$ Tue Jul 26 15:51:12 2022 Russian Standard Time (UT+4h)  she@DPX200
##.OBSERVE FREQUENCY= 200.1313499994
##.OBSERVE NUCLEUS= ^1H
##.DELAY= (6, 6)
##.ACQUISITION MODE= SIMULTANEOUS
##.ACQUISITION SCHEME= undefined
##.AVERAGES= 8
##.DIGITISER RES= 18
##SPECTROMETER/DATA SYSTEM= spect
##.PULSE SEQUENCE= zg30
##.SOLVENT NAME= DMSO
##.SHIFT REFERENCE= (INTERNAL, DMSO, 0, 15.7039)
##AUDIT TRAIL= $$ (NUMBER, WHEN, WHO, WHERE, WHAT)
$$ ##TITLE= Audit trail, XWIN-NMR		Version 3.5
$$ ##JCAMPDX= 5.01
$$ ##ORIGIN= Bruker BioSpin GmbH
$$ ##OWNER= she
$$ F:/spectra/data/she/nmr/H-F/1/audita.txt
$$ ##AUDIT TRAIL=  $$ (NUMBER, WHEN, WHO, WHERE, WHAT)
(   1,<2022-07-26 15:49:50.46 +0400>,<she>,<DPX200>,
      <created by zg, POWCHK disabled, PULCHK disabled
       configuration hash MD5:
       00 E9 B6 7A A2 85 ED C7 34 08 36 98 17 FE 4E 26
       data hash MD5: 16K
       E3 B6 DE 47 8E BF F8 58 3D A3 A1 35 C9 2D 3E 96>)
$$ ##END=
$$ 
$$ hash MD5
$$ F9 A1 57 A7 C1 90 D3 50 B4 31 64 C2 D7 3E B5 E9
##$RELAX= 
##$RELAX= 
##$RELAX= 
##$RELAX= 
##$RELAX= 
##$RELAX= 
$$ Bruker specific parameters
$$ --------------------------
##$DU= <F:/spectra>
##$EXPNO= 1
##$NAME= <H-F>
##$PROCNO= 1
##$TYPE= <nmr>
##$USER= <she>
##$AMP= (0..31)
100 100 100 100 100 100 100 100 100 100 100 100 100 100 100 100 100 100 
100 100 100 100 100 100 100 100 100 100 100 100 100 100 
##$AQSEQ= 0
##$AQ_mod= 1
##$AUNM= <au_zg>
##$AUTOPOS= <>
##$BF1= 200.13
##$BF2= 200.13
##$BF3= 200.13
##$BF4= 200.13
##$BF5= 200.13
##$BF6= 200.13
##$BF7= 200.13
##$BF8= 200.13
##$BYTORDA= 1
##$CFDGTYP= 0
##$CFRGTYP= 5
##$CHEMSTR= <none>
##$CNST= (0..31)
1 1 145 1 1 1 1 1 1 1 1 1 1 1 1 1 1 1 1 1 1 1 1 1 1 1 1 1 1 1 1 1 
##$CPDPRG= <>
##$CPDPRG1= <>
##$CPDPRG2= <>
##$CPDPRG3= <>
##$CPDPRG4= <mlev>
##$CPDPRG5= <mlev>
##$CPDPRG6= <mlev>
##$CPDPRG7= <mlev>
##$CPDPRG8= <mlev>
##$CPDPRGB= <>
##$CPDPRGT= <>
##$D= (0..31)
0 1.2 0 0 0 0 0 0 0 0.06 0 0.03 0 0 0 0 0.0002 0 0 0 0 0 0 0 0 0 0 0 0 
0 0 0 
##$DATE= 1658836189
##$DBL= (0..7)
120 120 120 120 120 120 120 120 
##$DBP= (0..7)
150 150 150 150 150 150 150 150 
##$DBP07= 0
##$DBPNAM0= <>
##$DBPNAM1= <>
##$DBPNAM2= <>
##$DBPNAM3= <>
##$DBPNAM4= <>
##$DBPNAM5= <>
##$DBPNAM6= <>
##$DBPNAM7= <>
##$DBPOAL= (0..7)
0.5 0.5 0.5 0.5 0.5 0.5 0.5 0.5 
##$DBPOFFS= (0..7)
0 0 0 0 0 0 0 0 
##$DE= 6
##$DECBNUC= <off>
##$DECIM= 32
##$DECNUC= <off>
##$DECSTAT= 4
##$DIGMOD= 1
##$DIGTYP= 9
##$DL= (0..7)
0 120 120 120 120 120 120 120 
##$DP= (0..7)
150 150 150 150 150 150 150 150 
##$DP07= 0
##$DPNAME0= <>
##$DPNAME1= <>
##$DPNAME2= <>
##$DPNAME3= <>
##$DPNAME4= <>
##$DPNAME5= <>
##$DPNAME6= <>
##$DPNAME7= <>
##$DPOAL= (0..7)
0.5 0.5 0.5 0.5 0.5 0.5 0.5 0.5 
##$DPOFFS= (0..7)
0 0 0 0 0 0 0 0 
##$DQDMODE= 0
##$DR= 18
##$DS= 0
##$DSLIST= <SSSSSSSSSSSSSSS>
$$ [...]
##$SUBNAM2= <"">
##$SUBNAM3= <"">
##$SUBNAM4= <"">
##$SUBNAM5= <"">
##$SUBNAM6= <"">
##$SUBNAM7= <"">
##$SUBNAM8= <"">
##$SUBNAM9= <"">
##$SW= 18.0517283424941
##$SWIBOX= (0..15)
0 0 2 0 0 0 0 0 0 0 0 0 0 0 0 0 
##$SW_h= 3612.71676300578
##$TD= 16384
##$TD0= 1
##$TE= 0
##$TE2= 300
##$TE3= 300
##$TEG= 300
##$TL= (0..7)
0 120 120 120 120 120 120 120 
##$TP= (0..7)
150 150 150 150 150 150 150 150 
##$TP07= 0
##$TPNAME0= <>
##$TPNAME1= <>
##$TPNAME2= <>
##$TPNAME3= <>
##$TPNAME4= <>
##$TPNAME5= <>
##$TPNAME6= <>
##$TPNAME7= <>
##$TPOAL= (0..7)
0.5 0.5 0.5 0.5 0.5 0.5 0.5 0.5 
##$TPOFFS= (0..7)
0 0 0 0 0 0 0 0 
##$TUNHIN= 0
##$TUNHOUT= 0
##$TUNXOUT= 0
##$USERA1= <user>
##$USERA2= <user>
##$USERA3= <user>
##$USERA4= <user>
##$USERA5= <user>
##$V9= 5
##$VALIST= <valist>
##$VCLIST= <CCCCCCCCCCCCCCC>
##$VD= 0
##$VDLIST= <DDDDDDDDDDDDDDD>
##$VPLIST= <PPPPPPPPPPPPPPP>
##$VTLIST= <TTTTTTTTTTTTTTT>
##$WBST= 1024
##$WBSW= 4
##$XGAIN= (0..3)
0 0 0 0 
##$XL= 0
##$YL= 0
##$YMAX_a= 449569
##$YMIN_a= -598402
##$ZGOPTNS= <>
##$ZL1= 120
##$ZL2= 120
##$ZL3= 120
##$ZL4= 120
##$ABSF1= 10
##$ABSF2= 0
##$ABSG= 5
##$ABSL= 3
##$ALPHA= 0
##$AQORDER= 0
##$ASSFAC= 0
##$ASSFACI= 0
##$ASSFACX= 0
##$ASSWID= 0
##$AUNMP= <proc_1d>
##$AZFE= 0.1
##$AZFW= 0.1
##$BCFW= 1
##$BC_mod= 2
##$BYTORDP= 1
##$COROFFS= 0
##$CY= 11.3945322036743
##$DATMOD= 1
##$DC= 2
##$DFILT= <>
##$DTYPP= 0
##$F1P= 2.36226072786647
##$F2P= -0.459571619588291
##$FCOR= 0.5
##$FTSIZE= 0
##$FT_mod= 4
##$GAMMA= 1
##$GB= 0.15
##$INTBC= 1
##$INTSCL= 1
##$ISEN= 128
##$LB= 0.24
##$LEV0= 0
##$LPBIN= 0
##$MAXI= 10000
##$MC2= 0
##$MEAN= 0
##$ME_mod= 0
##$MI= 1.114404
##$NCOEF= 0
##$NC_proc= 0
##$NLEV= 6
##$NOISF1= 3.799351
##$NOISF2= 2.8
##$NSP= 1
##$NTH_PI= 0
##$NZP= 0
##$OFFSET= 15.70392
##$PC= 1
##$PHC0= -18040.57
##$PHC1= 13.60068
##$PH_mod= 1
##$PKNL= yes
##$PPARMOD= 0
##$PSCAL= 0
##$PSIGN= 0
##$REVERSE= no
##$SF= 200.130013532006
##$SI= 16384
##$SIGF1= 3
##$SIGF2= 2
##$SINO= 400
##$SIOLD= 16384
##$SREGLST= <1H.CDCl3>
##$SSB= 0
##$STSI= 0
##$STSR= 0
##$SW_p= 3612.71676300578
##$SYMM= 0
##$S_DEV= 0
##$TDeff= 0
##$TDoff= 0
##$TI= <>
##$TILT= no
##$TM1= 0
##$TM2= 0
##$TOPLEV= 0
##$USERP1= <user>
##$USERP2= <user>
##$USERP3= <user>
##$USERP4= <user>
##$USERP5= <user>
##$WDW= 1
##$XDIM= 8192
##$YMAX_p= 0
##$YMIN_p= 0
$$ End of Bruker specific parameters
$$ ---------------------------------
##NTUPLES= NMR FID
##VAR_NAME=  TIME,          FID/REAL,        FID/IMAG
##SYMBOL=    X,             R,               I
##VAR_TYPE=  INDEPENDENT,   DEPENDENT,       DEPENDENT
##VAR_FORM=  AFFN,          ASDF,            ASDF
##VAR_DIM=   8192,          8192,            8192
##UNITS=     SECONDS,       ARBITRARY UNITS, ARBITRARY UNITS
##FACTOR=    0.0002768,     1,               1
##FIRST=     0,             0,               0
##LAST=      2.2672688,     0,               0
##MIN=       0,             -598402,         0
##MAX=       2.2672688,     449569,          0
$$ Real data points
##PAGE= N=1
##DATA TABLE= (X++(R..R)), XYDATA
0@%%%%%%%%qJ6j6J6k4L8m6N6p2Q8j12J36j60J92k27K71l20L72m32N04n84O72p71
$$ 0 0 0 0 0 0 0 0 0 -8 8 -8 8 -16 22 -24 32 -40 48 -64 72 -88 104 -123 148 -172 200 -232 272 -312 360 -411
31d11Q79j000J136j287J449j626J824k046K284k544K832l144L484l858M265m709
$$ -411 468 -532 604 -683 766 -860 964 -1082 1202 -1342 1490 -1654 1830 -2028 2237 -2472
47b472N194n725O311o951P657q436R304j0275J1363j2595J4000j5623J7524j9781
$$ -2472 2722 -3003 3308 -3643 4014 -4422 4882 -5393 5970 -6625 7375 -8248 9276 -10505
61a0505K2515k5911L0258l6053M4213n6649P8162j25788M23995j27980m30405
$$ -10505 12010 -13901 16357 -19696 24517 -32132 46030 -79758 344237 216257 -214148
72b14148N56042K912j23533M0858o6811j73373J73237p6659k87020R2055K66317
$$ -214148 341894 344806 221273 262131 195320 21947 195184 118525 -168495 -76440 189877
83A89877j73375j38113m7208k55030L9543M57052p7925l57788J13000J11905j85137
$$ 189877 16502 -121611 -168819 -423849 -384306 72746 -5179 -362967 -249967 -138062 -323199
94c23199J17573J78231j43928P5494L17427j70913k68217K85247K60903j24438
$$ -323199 -205626 -27395 -171323 -95829 221598 50685 -217532 67715 328618 204180
104B04180k761l122k06408P1918K30427j35304j02226J80741p4890k47164N5757
$$ 204180 201419 198297 -8111 63807 294234 158930 56704 237445 162555 -84609 -28852
115b8852N7817j08170J00435J08010k06018j13203J06465j8532R207J36508j25233
$$ -28852 28965 -79205 21230 129240 -76778 -189981 -83516 -102048 -92841 43667 -81566
126h1566j91672J70271J01483j81648R0990K39330j18282j24329J20423j2462
$$ -81566 -273238 -102967 -1484 -183132 -92142 147188 28906 -95423 25000 12538
136A2538o8730J37643Q0010q5228k3032j5050o8092P2911Q8346j36498o7857J31986
$$ 12538 -56192 81451 161461 76233 53201 38151 -29941 42970 131316 -5182 -73039 58947
148E8947m7673j29219J08798P2708o9909M3897N337j43776K584J30608L27l5442
$$ 58947 11274 -117945 -9147 63561 -6348 37549 42886 -100890 -98306 32302 32629 -2813
160b813M4073l0938p0806O5332L9112p7962M1328P9805q2921l9150O0406j5802
$$ -2813 41260 10322 -60484 4848 43960 -34002 7326 87131 4210 -34940 25466 9664
172I664J9065P4889p9568j18412M8006N0810o1549j317O1601k9620l4575L0103
$$ 9664 28729 103618 24050 -94362 -46356 4454 -57095 -58412 3189 -26431 -61006 -30903
184c0903l1170j8923Q4346J3243n1039L8093J6185m2780N4581O1826o4183l0328
$$ -30903 -62073 -80996 3350 16593 -34446 3647 19832 -22948 31633 93459 29276 -1052
196a052N8858j8064n4344M3092M5843j5610N269j0965n7498Q523M2206l7273k1547
$$ -1052 57806 39742 -14602 28490 74333 58723 63992 53027 -4471 4052 46258 8985 -12562
209a2562L7014l6782n2354M0619N145n1546K3703J8797o1810q081N8029J0269
$$ -12562 24452 -12330 -64684 -24065 -18920 -70466 -46763 -27966 -89776 -97857 -39828 -29559
221b9559n617L3009M429k8238J9806K4019k3762J4946L6534j9236K931K3445l0557
$$ -29559 -35176 -2167 2262 -25976 -6170 17849 -5913 9033 45567 26331 29262 52707 22150
234B2150N415M7476l0338m2694L3016J9617l6401l710L4843j9609l8004J4950
$$ 22150 27565 75041 44703 2009 35025 54642 18241 14531 49374 29765 -8239 6711
246F711j4051m8052J4463K1635j8014p12m777j0203K3090J0101j9122K096J9583
$$ 6711 -7340 -55392 -40929 -19294 -37308 -38020 -42797 -53000 -29910 -19809 -38931 -36835 -17252
259a7252K430k304K0004J2337j2032J4191J4602l2697m485L5371l266j2204J7418
$$ -17252 -14822 -17126 2878 15215 3183 17374 31976 -721 -5206 30165 26899 14695 32113
272C2113J685p854J1271M499k4746j7725J2928O536j7507j0866J70J85m41j0055
$$ 32113 33798 25944 37215 41714 16968 -757 12171 18707 1200 -9666 -9496 -9311 -9752 -19807
286a9807j1901j461P80L637J1304p77p667K1317K2219k1816k1376K1420J8545
$$ -19807 -31708 -33169 -32389 -28752 -17448 -18225 -25892 -4575 17644 -4172 -25548 -4128 14417
299A4417j0920q512R116P622O88J1311M872k3197q543K4046Q946j6544j4051J0969
$$ 14417 3497 -5015 4101 11723 12411 23722 28594 5397 -3146 20900 29846 13302 -749 10220
313A0220J9834j3818k6498K441L114o901m900p342n82Q325Q831O378j4602j1161
$$ 10220 30054 16236 -10262 -7821 -4707 -11608 -16508 -23850 -24432 -16107 -7276 -898 -15500 -26661
327b6661K0972J0917j0106m907J092J4224J3306r455p791J216L751O063q007o213
$$ -26661 -5689 5228 -4878 -9785 -8693 5531 18837 9382 1591 2807 6558 12621 4614 -1599
341a599J1928O585Q41k264r056M642L462j2170n803k708k438Q068p11j0588m017
$$ -1599 10329 16914 17755 15491 6435 11077 14539 2369 -3434 -6142 -8580 -512 -1223 -11811 -15828
356a5828L589M514m903n083O019K076K431R759p69j706O070n469p963P384M894
$$ -15828 -12239 -7725 -12628 -17711 -11692 -9616 -7185 2574 1805 99 6169 700 -7263 121 5015
371E015m035J342N014j552J137M735m133l187N332k817p281N827N647o530m56
$$ 5015 980 2322 7336 5784 6921 11656 7523 4336 9668 6851 -430 5397 11044 4514 4058
386D058J358j2779m104J2174p804j2015J3941P273o369M326l064q076J2043Q220
$$ 4058 5416 -7363 -11467 707 -7097 -19112 -5171 2102 -4267 59 -3005 -11081 962 9182
400I182j1940o332J0528l0p957J2473L456j7548P652P631k3383L507K4637l962
$$ 9182 -2758 -9090 1438 1408 -6549 5924 9380 -8168 -516 7115 -16268 -12761 11876 7914
414G914m496L312j4019j475J9059r73j9329N699J2941j7423j944K3768j1684q172
$$ 7914 3418 6730 -7289 -8764 10295 9322 -10007 -4308 8633 -8790 -10734 13034 1350 -6822
428f822K7730j1366k9977K0459J8052j1420O894M439k0693J95J7461j7131j4273
$$ -6822 20908 9542 -20435 24 18076 6656 13550 17989 -2704 -2509 14952 -2179 -16452
441a6452K8296m56l2232J2086P908k7396K2755L1890m0235k4518L1646k888j5851
$$ -16452 11844 11388 -20844 -8758 -850 -28246 -5491 26399 -13836 -38354 -6708 -9596 -25447
454b5447K8963N734k8325J4940R517l4110J5530M6560j9711j7388K8232j7958
$$ -25447 3516 9250 -19075 -4135 5382 -28728 -13198 33362 13651 -3737 24495 6537
466F537k0827N2192J3622n2246J2476L0466m5337j2237M5056j2802j9791K7654
$$ 6537 -14290 37902 51524 -722 11754 42220 -3117 -15354 29702 16900 -2891 24763
478B4763k5334m6198L2716K3443l5069J1898K4215m9476j2478N2365j9414k7816
$$ 24763 -571 -46769 -14053 9390 -25679 -13781 10434 -39042 -51520 845 -18569 -46385
490d6385N9898J916o8318K0170M1188k2524J9965M1585l9469k6753M1388l693
$$ -46385 13513 15429 -52889 -32719 8469 -14055 5910 47495 8026 -18727 22661 18968
502A8968k1776N3242J2488o3426J1636K9296n3603J0951O9259m2030n5906L5878
$$ 18968 -2808 50434 62922 -504 11132 40428 -13175 -2224 67035 25005 -30901 4977
514D977o617m2313M1748L0827m9666n867K0946m7043j217O9065j7926l7258M6978
$$ 4977 -1640 -43953 -2205 28622 -21044 -26911 -5965 -53008 -54225 14840 -3086 -40344 6634
527F634j2552o2072N1077N3408m2923N285M1827m9364k8553O6293J4020l0952
$$ 6634 -5918 -67990 -16913 36495 -6428 -1143 40684 -8680 -37233 29060 43080 12128
539A2128L0200m805o0446K1721L7800l7034J3919M6419n8931n0695N0153O857
$$ 12128 42328 37523 -22923 -1202 36598 -436 13483 59902 971 -49724 429 7286
551G286l1645M3673R910p2387R07M5689k6666K30N0274k3529l9478K7036o012
$$ 7286 -24359 19314 29224 -43163 -42256 3433 -23233 -23003 27271 3742 -35736 -8700 -14712
564a4712k6112N8153L3321o1977q430L7997l3135l845O2996j4715m3182L0397
$$ -14712 -40824 17329 50650 -11327 -19757 18240 -14895 -18740 44256 29541 -13641 16756
576A6756l675m7442K9800M3826k8786j0485J4196m1442j2431O1154J371l9188
$$ 16756 13081 -34361 -4561 39265 10479 -6 14190 -27252 -39683 21471 22842 -16346
588a6346K9384M49n4429K1946M2137k5956M419L2356m0237l4022M2854J7625k2224
$$ -16346 13038 13487 -40942 -18996 23141 -2815 1604 33960 -6277 -40299 2555 20180 -2044
601b044K1719M935m9543O548L5904k5741K063M1847l0203l7976K7946Q46k3116
$$ -2044 19675 24610 -24933 -18385 17519 -8222 -6159 35688 5485 -32491 -4545 -3699 -26815
614b6815L5642J9130m6904p116K9711j9791m291M4840q554l2732K1290o69k8562
$$ -26815 8827 27957 -18947 -26063 3648 -16143 -20434 24406 15852 -16880 4410 3741 -24821
627b4821L2589K9565l2071k396J9410l2379r516M8318j464l2206J9213o35l9611
$$ -24821 7768 37333 5262 2866 22276 -10103 -19619 28699 27235 -4971 14242 13607 -26004
640b6004J6404L3165k3927o990K0753k6404k1879L1967M553j9383K3765J382m2283
$$ -26004 -9600 23565 -362 -7352 13401 -13003 -34882 -2915 1638 -17745 6020 7402 -34881
653c4881J1685L2839j9444O5L1322j8853k5449K5964P460j9695K1633J9169l1421
$$ -34881 -23196 9643 -9801 -9736 21586 2733 -22716 3248 10708 -8987 12646 31815 394
666C94p472K1096j4268K75L1370j6539k7248K1289j440k5942K0631K0282k5790
$$ 394 -7078 14018 -250 25 31395 14856 -12392 8897 7457 -18485 2146 22428 -3362
679c362q288J6000j7929j1177L2869K693k8527J0806O385k1402J4042J9511j8654
$$ -3362 -11650 4350 -13579 -24756 8113 10806 -17721 -6915 -530 -21932 -7890 11621 -7033
692g033J874J7797j9561j1925K7106N766j7830J0858P164k3716M161K3332j4256
$$ -7033 -5159 12638 -6923 -18848 8258 14024 -3806 7052 14216 -9500 -5339 17993 3737
705C737p406J9421q673j7223J2260K617r920J2543L638k1982P76J7333j0669o848
$$ 3737 -3669 15752 7079 -10144 2116 4733 -5187 7356 10994 -10988 -10212 7121 -3548 -10396
719a0396J8341l383j6714R641M442j2978R396J3682j3723p637J0456j898k603
$$ -10396 7945 4562 -12152 -2511 1931 -11047 -1651 12031 -1692 -9329 1127 -771 -3374
732c374J0235l974r511J0860J329j4595O962J2254q603n722P455l769n625J0519
$$ -3374 6861 2887 -6624 4236 5565 -9030 -2068 10186 1583 -4139 3316 -453 -6078 4441
746D441K362j2414L377Q524p722j421N052m366L341O010r094n136Q684L534o916
$$ 4441 6803 -5611 -2234 6290 -1432 -2853 2199 -2167 1174 7184 -1910 -7046 1638 5172 -1744
761a744k78N444m278k466O436l758m305P800K49o886J353J046R28K989k519l930
$$ -1744 -2022 3422 -856 -3322 3114 -644 -4949 2851 3100 -3786 -2433 -1387 -459 2530 11 -3919
777c919K784L753k184l711M368K354n380J772L148m169J700L396l952j392K941
$$ -3919 -1135 2618 434 -3277 1091 3445 -1935 -163 2985 -1184 516 3912 -40 -1432 1509
792A509P89j148k357k33K086O86j727k615J519L389l027k215K756R25j258J98
$$ 1509 2298 1150 -1207 -1440 646 1332 -395 -3010 -1491 1898 -1129 -3344 -588 337 -921 -723
808g23k46n53J226K075r48k808R32L015J482k574k838K380L487j670l345J070
$$ -723 -969 -1522 -296 1779 831 -1977 -1045 1970 3452 878 -1960 420 3907 2237 -1108 -38
824c8K572l31k912M75J037j567Q04N36k949j14J913J737j717m080J821N039j899
$$ -38 2534 2203 -709 -234 803 -764 40 576 -2373 -2487 -574 1163 -554 -4634 -2813 2226 327
841C27l349K86L146J315l458N90L263k066l82K776k302q96K479J019q68k376K21
$$ 327 -3022 -2736 410 1725 -1733 -1143 2120 54 -328 2448 146 -750 1729 2748 1880 -496 -275
858b75L673p09k311j657J477L269l258l180M072J04l534K352M50k712J36J665
$$ -275 3398 2689 378 -1279 198 3467 209 -2971 1101 1205 -2329 23 473 -2239 -2103 -438
874d38j04q46K5J070q67j15m30o44L839P37o006J879M863l746j187M954o94m020
$$ -438 -542 -1388 -1363 -293 -1160 -1275 -1705 -2349 1490 2227 -3779 -1900 2963 -783 -1970 2984 2290 -1730
892a730K248K414k906J051L054k423j406K422k740k94M871l139m103N112K55p425
$$ -1730 518 2932 26 1077 4131 1708 302 2724 -16 -310 4561 1422 -2681 2431 2686 -4739
908d739K909O267o011k885O267l292n625O457J074m299L525L36n326K190M921
$$ -4739 -1830 4437 -1574 -4459 1808 -1484 -7109 -652 422 -3877 -352 -16 -5342 -3152 1769
923A769m476J052P482n757o871J0143K427q967O922N270j0715j95P325l197j699
$$ 1769 -2707 -1655 5827 70 -6801 3342 5769 -3198 3724 8994 -1721 -1916 5409 2212 513
938E13O272l373o985M508J190p208O664N660j2788j48R399r866k890J4137k661
$$ 513 6785 3412 -3573 935 2125 -5083 1581 7241 -5547 -5695 3704 -6162 -9052 5085 2424
953B424j1088N566L338q291M486R639o608k632P930p282m959J4700j83r439R770
$$ 2424 -8664 -3098 240 -8051 -3565 6074 -534 -3166 4764 -2518 -7477 7223 7040 -2399 7371
968G371l52j5453O979J3575r669m125J1092q275j1788J1718M359r530P526K590
$$ 7371 7019 -8434 -1455 12120 2451 -1674 9418 1143 -10645 1073 5432 -4098 3428 6018
982F018j6809K196J1570p959J0J4493j0481j3827J3759L622j2097J1910J1237
$$ 6018 -10791 -8595 2975 -4984 -4974 9519 -962 -14789 -1030 2592 -9505 2405 13642
995A3642j8082l379J3143o878k249J7032l996j4530P712J528j2462J1321J3586
$$ 13642 -4440 -7819 5324 -1554 -3803 13229 9233 -5297 2415 3943 -8519 2802 16388
1008A6388j6598m199J1881j4236o896K3234j15j7489Q073J943j7294O755J8119
$$ 16388 -210 -4409 7472 -6764 -13660 9574 9459 -8030 43 1986 -15308 -8553 9566
1021I566r591n073J1349j1913j1769K1053N711j4559J1812L983k3770N514K0203
$$ 9566 -25 -5098 6251 -5662 -17431 3622 9333 -5226 6586 10569 -13201 -7687 12516
1034A2516r859l753J6582j0261j9545J4011R019j2115R517Q844k3645l160J7502
$$ 12516 2657 -1096 15486 5225 -14320 -309 8710 -3405 6112 14956 -8689 -11849 5653
1047E653j0053l248K1702q635k1627J1919O127j5458J2214J8553j9689j1215J6267
$$ 5653 -4400 -7648 14054 5419 -16208 -4289 1838 -13620 -1406 17147 -2542 -13757 2510
1060B510o234p835K2514K404j9856O557M829j6634J0351K0404j4406q862J4004
$$ 2510 -3724 -11559 10955 13359 -6497 60 4889 -11745 -1394 19010 4604 -4258 9746
1073I746j1962j3708K3798P718k1077N892Q519k1909O74K2754o847r878J3540
$$ 9746 -2216 -15924 7874 15592 -5485 407 8926 -12983 -12309 10445 3598 -6280 7260
1086G260p979j8213J6160J0979j4160P867J0053k2587l492K1725n838p637J8899
$$ 7260 -719 -18932 -2772 8207 -5953 1914 11967 -10620 -14112 7613 1775 -5862 13037
1099A3037l334k2913Q724J3058j2154N006J5737j7310j1061J4984m317q005J9608
$$ 13037 9703 -13210 -4486 8572 -3582 1424 17161 -149 -11210 3774 -543 -8548 11060
1112A1060j1k0816N201P605j4008N692J9329j1382j3734J2412k116j2410J6353
$$ 11060 11049 -9767 -4566 3039 -10969 -5277 14052 2670 -11064 1348 -768 -13178 3175
1125C175R215j6126K154O923j4229K295J8060n830p770R764o042j4045J3545J0958
$$ 3175 12390 -3736 -1582 5341 -8888 -6593 11467 5637 -2133 7631 1589 -12456 1089 12047
1139A2047j3806J820R904j5304o565J6092j581p127J0226k951j4923O432Q481
$$ 12047 -1759 61 9965 -5339 -11904 4188 2607 -4520 5706 2755 -12168 -5736 2745
1152B745p036M638Q591j3521n557J3431l233o415J4243J996j5754K737P844p128
$$ 2745 -4291 347 8938 -4583 -10140 3291 58 -6357 7886 9882 -5872 -3135 4709 -2419
1166b419L030J0991p766q443P381k168n612J0475J686j1007L307L124j1121K548
$$ -2419 611 11602 3836 -4607 2774 606 -5006 5469 7155 -3852 -545 2579 -8542 -5994
1180e994J2824n123q166O312j358p842P763N977p527J890M904q917M0R054k344
$$ -5994 6830 1707 -6459 -147 -1505 -9347 -1584 4393 -3134 -1244 3660 -5257 -5217 3837 1493
1195A493j365O332m916q008P716N669p461J853O554p991m503P971j412l935O689
$$ 1493 128 6460 1544 -6464 1252 6921 -540 1313 7867 -124 -4627 3344 1932 -2003 4686
1210D686j702p876K857K626m148L403L677o588k040O333k575m749P969K005q413
$$ 4686 2984 -4892 -2035 591 -3557 -154 3523 -3065 -5105 1228 -1347 -6096 1873 3878 -4535
1225d535K167M572m832O75N975k947k200L199j713k583M192J581m283J960K118
$$ -4535 -2368 2204 -2628 -1953 4022 1075 -1125 2074 361 -2222 1970 3551 -732 1228 3346
1240C346o305J437O729l792l913N021N7n853K116L844k950N4K112l486j128L932
$$ 3346 -2959 -1522 5207 1415 -2498 2523 2580 -3273 -1157 2687 -263 -209 1903 -1583 -2711 1221
1256A221r90j914K509j297k641L144J038l879J265M171k844l568L517J074k261
$$ 1221 231 -1683 826 -471 -3112 32 1070 -2809 -1544 2627 -217 -3785 -268 806 -1455
1271a455J748P85k115J279J464j782N04J578j284L5J140r46k056L087K028m629
$$ -1455 293 1078 -1037 242 1706 -76 428 2006 722 757 1897 951 -1105 1982 4010 -619
1287f19m57L425j613j609J050r9m06l73j85l05l90L49N00o70L49j216K14K922
$$ -619 -1076 2349 736 -873 177 78 -328 -701 -886 -1191 -1581 -1232 -732 -1402 -1053 -2269 -2055 867
1305H67j212k510K900R66j273j98J245P62j000J85J259m59n66O26j95K73m43j009
$$ 867 -345 -2855 45 1011 -262 -460 785 1547 547 732 1991 1532 966 1592 1397 1670 1227 218
1323B18J136j13k153L81J630j245j623O51J371j323j362J324P11q88n48N64P01
$$ 218 1354 1241 -912 -531 1099 -146 -1769 -1118 253 -1070 -2432 -1108 -397 -1285 -1833 -1269 -568
1340e68N0n00Q56M43m89j25J342L16j445l19K598m67j983J131N19n10n78QM93
$$ -568 -518 -1018 -162 281 -208 -333 1009 1325 -120 -439 2159 1692 -291 840 1359 849 271 279 772
1359G72J09r33n5K06o9m60j10J281q85j815K016P93k132J75J682l36r98j22J026
$$ 772 881 -52 -107 99 30 -430 -540 741 -144 -1959 57 850 -1282 -1107 575 239 -759 -881 145
1378A45k65l52L38o42P19K04j231R30J375k476K14K222j726j236K425J159j758
$$ 145 -120 -472 -134 -776 -57 147 -1084 -154 1221 -1255 -1041 1181 -545 -1781 644 1803 45
1395D5p18J722o34m54J582l68m05J184j560j113L093n43k547J949N16l497J89
$$ 45 -673 1049 415 -39 1543 1175 770 1954 394 -719 2374 1831 -716 1233 1749 -1748 -1559
1412a559K958j135k776K351M11l298J033J572j376J474K88l248J494K670j900
$$ -1559 1399 264 -2512 -161 250 -3048 -2015 -443 -1819 -345 -57 -3305 -1811 859 -1041
1427a041o36M091j398l696L422J934l711J867M620m169k397L894r03j816K985
$$ -1041 -1677 2414 1016 -2680 742 2676 -1035 832 5452 1283 -1114 2780 1877 61 3046
1442C046j96l422J872M42m859K382M730m805k350M599l750l841O949J263o141
$$ 3046 2850 -572 1300 1742 -3117 -735 3995 -810 -3160 1439 -2311 -6152 797 2060 -4081
1457d081K063K652m968N9O276j555k377M822k958n322O969K789n906M017L648
$$ -4081 -2018 634 -4334 -4275 2001 446 -1931 2891 -67 -5389 1580 4369 -1537 2480 6128
1472F128q553p40P888k552l618O775j029r123L452M605n171K287N539q353k739
$$ 6128 -2425 -3165 4723 2171 -1447 5328 4299 -4824 -1372 3233 -1938 349 5888 -2465 -5204
1487e204P176l976l224R722m68j0275L484M913p387K183J0726o520p574Q172j487
$$ -5204 1972 -2004 -5228 4494 4026 -6249 -2765 2148 -5239 -3056 7670 1150 -6424 1748 261
1502B61o577Q627M117q217J507L548q222J068J1565m423o932P819k830r966Q975
$$ 261 -6316 2311 6428 -1789 -282 3266 -4956 -3888 7677 3254 -3678 4141 1311 -8655 320
1517C20P272r350P12P031r591m328J1456L49o021O137q00j1406N405Q210p240
$$ 320 7592 -1758 -1046 5985 -3606 -7934 3522 3871 -2150 3987 3187 -8219 -2814 5396 -1844
1532a844K108Q100r990p080J0831n8o294Q513L092j3858M93R401o194J84J0698
$$ -1844 264 8364 -1626 -8706 2125 2067 -4227 4286 7378 -6480 -5987 3414 -2780 -2596 8102
1547H102o237r054P069m08o183J0004N055j1944m33P036p288r24J3408k044j0588
$$ 8102 1865 -7189 -120 -528 -6711 3293 8348 -3596 -4029 3007 -4281 -5205 8203 6159 -4429
1562d429N618J179r217P091R078q031j975M974p825k659J1052K97p223N264n89
$$ -4429 1189 2368 -6849 242 9320 1289 -686 4288 -3537 -6196 4856 5153 -2070 3194 2605
1577B605j1564M368J0451o468j582P322p998p144R356K842n202N712J209r891
$$ 2605 -8959 -4591 5860 -608 -2190 5132 -2866 -10010 -654 2188 -3014 2698 3907 -5984
1591e984Q85P329l803J681Q649p212q132P680J140n321Q117M220j0655j766N979
$$ -5984 -5099 2230 -1573 108 8757 1545 -6587 1093 2233 -3088 5029 9249 -1406 -3172 2807
1606B807m053j017R159k351p851L253r82n502P410N292q149n48L730p094r75J0079
$$ 2807 -1246 -2263 6896 4545 -3306 -53 -1035 -6537 873 6165 -1984 -2532 1198 -5896 -6871 3208
1622C208k88o144L946j36p903M596P786m419K47L357p253j970Q421m59l373N747
$$ 3208 2920 -3224 722 586 -7317 -2721 5065 646 893 4250 -3003 -4973 3448 2989 -384 5363
1638E363j171r420K985O411m754Q51O621o398p090O396O56l007N908L49p825R48
$$ 5363 4192 -5228 -2243 4168 -586 265 6886 488 -6602 -206 450 -2557 3351 3700 -4125 -3177
1654c177L708m301K231P410n111n552N272q94n383P622M445p770o42M305m927
$$ -3177 531 -3770 -1539 5871 760 -4792 480 -414 -5797 1825 6270 -1500 -2142 2163 -2764
1669b764j66P051j459m358L547j382n742N433M765n873J137L577o854k030Q691
$$ -2764 -2930 4121 2662 -1696 1851 469 -5273 160 4925 -948 189 3766 -3088 -5118 3573
1684C573p47n053M382O20p217K339N326l675J31M176m847l693N586k16k953M747
$$ 3573 2826 -2227 2155 2775 -4442 -2103 3223 -452 -321 3855 -992 -4685 901 685 -2268 2479
1700B479L66o985J702M909m167r90O304k097n803M013J477m057L739L194n282
$$ 2479 2845 -4140 -2438 2471 -1696 -2686 3618 1521 -4282 -269 1208 -2849 890 4084 -1198
1715a198j54L027k790J38M669j317m399L444P64n100K469M664m382j874L724k508
$$ -1198 -1352 1675 -1115 -977 3692 2375 -2024 1420 2184 -2916 -447 4217 -165 -2039 1685 -823
1731h23k277L455J305l150O97R60k616O90K807k053o19L647k420k953L940J155
$$ -823 -3100 355 1660 -1490 -793 167 -2449 -1759 1048 -1005 -1624 2023 -397 -3350 590 1745
1747A745l004J886K003k855n28K943n23j586J619N0k080R41K77j650J639R09l098
$$ 1745 -1259 627 2630 -225 -753 2190 1667 81 1700 1750 -330 611 888 -762 877 1786 -1312
1764a312k08K019j444j215K198M15k684K64K152j448n34K080m02o38P68m51J15
$$ -1312 -1520 499 -945 -2160 38 453 -2231 -1967 185 -1263 -1797 283 -119 -757 11 -440 -325
1781c25J249K36q86Q68L81j081K4J602j025j376J599nj671N03P19m04p02j40j1
$$ -325 924 1160 274 1142 1523 442 466 2068 1043 -333 1266 1261 -410 93 812 408 -294 -434 -445
1800d45Kj77j77p7P05m63p91J243K07j154O34J142q77m51O46P18m74l86O74k41
$$ -445 -443 -620 -797 -874 -169 -632 -1423 -180 27 -1127 -493 649 -228 -679 -33 685 211 -175 499 258
1820B58k97K03P9L86P4j129N72Q31j334n3R15j86m55j46P27O3j127Q07M82r43
$$ 258 -39 164 243 629 703 -426 146 977 -357 -410 505 319 -136 -282 445 508 -619 188 670 -273
1840b73L26q8K56M60r33j29J185n32r16M54N27m85j103J027L12j215J58Q78l79
$$ -273 53 -35 221 681 -252 -381 804 272 -644 -190 337 -148 -1251 -224 88 -1127 -969 -91 -470
1859d70k70J84J31L49j91L6J68N86m31j72P64N67j143L43R74j014k60Q56j88m43
$$ -470 -740 -556 -425 -76 -267 -231 -63 523 92 -80 684 1251 108 451 1425 411 151 1007 819 376
1879C76r3L33k37m14J73k05J13j04r08j87J461j017j189J893j24j801P94J372
$$ 376 283 616 379 -35 138 -67 46 -58 -966 -1153 308 -709 -1898 -5 -129 -1930 -1136 236
1897B36p64l40P13k78n57J008O34n25O28j78j290J459J026k228Q10J618j586j398
$$ 236 -528 -868 -155 -433 -990 18 652 127 755 577 -713 746 1772 -456 354 1972 386 -1012
1915a012J622L38j553Q50J264j966l90J847j304r5J335j301j006J699r13j344
$$ -1012 610 948 -605 245 1509 -457 -847 1000 -304 -399 936 -365 -1371 328 -585 -1929
1931a929K095J312k747k47K468j744j247L109r2k857J797O61k044J200J947j855
$$ -1929 166 1478 -1269 -1516 952 -792 -2039 1070 978 -1879 -82 579 -1465 -265 1682 -173
1947a73j39J640k095q17L514m56k688K461R67m267J100L538k067j124K834j621
$$ -173 -312 1328 -767 -1584 1930 1474 -1214 1247 2214 -2053 -953 2585 518 -606 2228 607
1963F07k899K463J235k214J471J006l818M34L195k623n87M338k338l926K976J603
$$ 607 -2292 171 1406 -808 663 1669 -2149 -1715 1480 -1143 -1730 2608 270 -3656 -680 923
1979I23l480J617L608l736j825L688j287j450M186l0m019K220O99l498L177L308
$$ 923 -2557 -940 2668 -1068 -2893 795 -492 -1942 2244 2214 -1805 415 1114 -2384 793 4101
1995D101l645j417L489k116l525N189J869m952J441J831n265R78M609j982j889
$$ 4101 456 -961 2528 412 -3113 2076 3945 -1007 434 2265 -3000 -2022 2587 605 -1284
2010a284K756k581l353M129J947l649J984K386n716r67O062j599j956M540j308
$$ -1284 1472 -1109 -4462 -333 1614 -2035 -51 2335 -3381 -4348 1714 115 -1841 2699 1391
2025A391n214K704L095k614J699K908m331j995M211j937j193N604j097n916K257
$$ 1391 -3823 -1119 1976 -638 1061 3969 -362 -2357 1854 -83 -1276 4328 3231 -2685 -428
2040d28K274m239J934M922l654l776L378j419k663N083J461m479J039J074m731
$$ -428 1846 -2393 -459 4463 809 -2967 411 -1008 -3671 1412 2873 -1606 -567 507 -4224
2055d224K482N154k942j915L313k582l890N374K703m221J375K064n295l17N357
$$ -4224 -1742 3412 470 -1445 1868 -714 -4604 770 3473 -748 627 2691 -2604 -2921 2436
2070B436j281j640L293k560m142L588K328l293K512K901o254j823N504j380k303
$$ 2436 1155 -485 2808 248 -3894 -306 2022 -1271 1241 4142 -2112 -3935 1569 189 -2114
2085b114N533r72n701K090K164k914K400L599m162k162K929j957j193N472Q0n628
$$ -2114 3419 2447 -3254 -1164 1000 -1914 486 4085 -77 -2239 690 -1267 -2460 3012 3092 -2536
2101b536K001J841m975K273N470l282k926L046k021k801M727K148l889J413J133
$$ -2536 -535 1306 -3669 -1396 4074 792 -2134 912 -1109 -3910 817 2965 -924 489 1622
2116A622m979J205N317k486j553M098k841m586M579K882l925J752K576n024j323
$$ 1622 -3357 -2152 3165 679 -874 3224 383 -4203 376 3258 -667 1085 3661 -1363 -2686
2131b686M264j127j525L743j323m919K561J730l046K523L136m832j962M321j319
$$ -2686 1578 451 -1074 2669 1346 -3573 -1012 718 -2328 195 3331 -1501 -3463 858 -461
2146d61k575N119J013n701J390K299l063J463M040k690k079K870j591k082L880
$$ -461 -3036 2083 3096 -2605 -1215 1084 -1979 -516 3524 834 -1245 1625 34 -2048 1832
2161A832J578m400J216J949m464M7N328k280k704L229j244l266K506K486k585
$$ 1832 3410 -990 226 2175 -2289 -2242 3086 806 -1898 1331 87 -3179 -673 1813 -772
2176g72N79J539l328o37M052q79j654L303j243l877K167K923l172O96L201k833
$$ -772 -193 1346 -1982 -2619 1433 554 -1100 2203 960 -2917 -750 2173 -999 -303 2898 65
2192F5k041K451N73j993K351N57l677P75K131k538J015K574k293j982K472l35
$$ 65 -1976 475 1048 -945 1406 1963 -1714 -939 1192 -1346 -331 2243 -50 -2032 440 105
2208A05k197K461J889l243k20K070j931j35K559o75j050R31k62j869K261J192
$$ 105 -2092 369 2258 -985 -1205 865 -1066 -1201 1358 683 -367 564 302 -1567 694 1886
2224A886k228K74J611k083j014L112p45j929J517M29k436P18J664j085l5J011
$$ 1886 -342 -68 1543 -540 -1554 1558 813 -1116 401 830 -1606 -888 776 -309 -344 667
2240F67j499m46J645j84r56J286K74k451J183J411j354j92K028p69j564Q74P44
$$ 667 -832 -1278 367 183 -773 513 787 -1664 -481 930 -424 -616 1412 643 -921 -47 697
2257F97j142N68Q69j042j10P58r11l3J569j089p96J277l43j208R81P72j240k82
$$ 697 -445 123 992 -50 -160 598 -313 -346 1223 134 -662 615 272 -936 45 817 -423 -705
2275g05J071n90o81J152k48l15K26J91p14P27Q7o38M07K05l98n43Q76O32j095
$$ -705 366 -224 -905 247 -1 -316 -90 101 -613 114 201 -437 -30 175 -223 -766 110 742 -353
2294c53K82R99j278M1R72k88l31M09m18J51L8l76p0O35j35q93K01J062p79n06
$$ -353 -71 928 -350 -309 663 375 44 453 35 186 224 -152 -222 413 278 -615 -414 648 -131 -637
2314f37R21K3j047M18M63k18k92r1L48l40L08q0K57K41m33l28R84m30p43Q67K00
$$ -637 284 307 -740 -322 141 -77 -369 -460 -112 -452 -144 -224 33 274 -159 -487 497 67 -676 191 391
2335C91l10p8L60J22o95M2O89n84j40K30K39K41m64k23L93P6o67Q6M39m6l84k28
$$ 391 81 3 363 485 -210 -168 521 -63 -203 27 266 507 43 -180 213 289 -378 -292 147 101 -283 -511
2357e11J015o53k67M40J7n83N02q3N0K1n5J99P8j76k33L94K56m10p17Q07M74j075
$$ -511 504 -149 -416 24 41 -542 -40 -123 -73 -52 -107 92 170 -6 -239 155 411 1 -716 91 565 -510
2379e10L62M47l08j05N79j70k32J07k3K35j75k74l05N61L14n59m1R37j134j34
$$ -510 -148 299 -9 -114 465 295 63 170 147 382 207 -67 -372 189 503 -56 -97 840 -294 -428
2399d28Q05J02o85J10L21l07m24M02k54K54L11r62M4J151q32k05J017M6j119M32
$$ -428 377 479 -206 -96 225 -82 -506 -104 -358 -104 207 -755 -711 440 -392 -597 420 466 -653 -221
2419b21P13q07j73J293m39q01Q39p1o09P22P5p86N92K27j027R9J430p38q91J153
$$ -221 492 -315 -488 805 366 -435 404 333 -276 446 521 -265 327 554 -473 -374 1056 318 -573 580
2439E80k58j465R75J279j412j00N26r45MR65k20n02O08j36j329J199J223j600
$$ 580 322 -1143 -168 1111 -301 -401 125 -820 -816 149 -71 -573 35 -101 -1430 -231 992 -608
2457f08K31J571j515o76J656%j222J094O01j564K44J060j005N26J055j392r32
$$ -608 -377 1194 -321 -997 659 659 -563 531 1132 -432 -188 872 -133 393 1448 56 -876
2474h76J650n69j592K283L00k221L98J102j503k36K413o91j796J083M29j727J580
$$ -876 774 205 -1387 896 1196 -1025 -627 475 -1028 -1264 1149 458 -1338 -255 174 -1553 27
2491B7J095j715L68R94j515l20K395m26j808J770K75k788J377J980j355r58K184
$$ 27 1122 -593 -225 769 -746 -1066 1329 903 -905 865 1140 -1648 -271 1709 354 -604 1580
2508A580j934j388K312j71j005J489k89k313J055J630j777j7K297j584k003K074
$$ 1580 -354 -1742 570 399 -606 883 594 -1719 -664 966 -811 -828 1469 -115 -2118 -44
2524d4Q63k348K080J390k415m90J865j179k99K099m66k418J800K0k070K113J655
$$ -44 819 -1529 551 1941 -474 -964 901 -278 -577 1522 1056 -1362 438 458 -1612 501 2156
2541B156k837k80J870j775j082L032J39k587J103O82k146R86K285j832j53J554
$$ 2156 -681 -961 909 -866 -1948 1084 1223 -1364 -261 421 -1725 -739 1546 -286 -439 1115
2557A115j721j154K814K26k025J692M85l010N86K698j197o79K038j289k451K046
$$ 1115 -606 -1760 1054 1280 -745 947 1432 -1578 -992 1706 509 -170 1868 579 -1872 174
2573A74L08j284J573M07k460k63J724j073K5K734j708k180J864O56k070J731J875
$$ 174 482 -802 771 1178 -1282 -1545 179 -894 -869 1865 157 -2023 -159 497 -1573 158 2033
2590B033k228j013J838j146l7K125l57j849Q64K39j942J622K015k346q42K174
$$ 2033 -195 -1208 630 -516 -553 1572 1215 -634 230 469 -1473 149 2164 -182 -1024 1150
2606A150k043r14K656L57k106Q76M94k131O45J908q76l27J433j709j311K619R1
$$ 1150 -893 -1807 849 1206 -900 -24 470 -1661 -1016 892 16 -311 1122 -587 -1898 721 812
2623H12j715J934K48k654K77K078p51o28K079q37k290J497O23j511J420R56k417
$$ 812 -903 1031 1279 -1375 -1098 980 229 -399 1680 843 -1447 50 673 -838 582 1538 -879
2640h79pJ422j225r6K482q75k321J375P14j865J307J608j586q92J450j161m00
$$ -879 -886 536 -689 -785 1697 822 -1499 -124 590 -1275 32 1640 54 -838 612 -549 -949
2657i49J868J27j704J042J90j955J056J818j379q68J718j300j605K471M37j847
$$ -949 919 1046 -658 384 574 -1381 -325 1493 114 -754 964 -336 -1941 530 967 -880
2673h80J122O35k030J00J595l98m64J067p96j230J268N55j367J408R14k426Q3
$$ -880 242 877 -1153 -1053 542 144 -320 747 -49 -1279 -11 544 -823 585 1499 -927 -844
2690h44J851r85o42J810k96j768P64P42j260O73J146j415o33J598r06q34J881
$$ -844 1007 22 -620 1190 894 -874 -110 632 -628 45 1191 -224 -857 741 -165 -999 882
2707H82p8j752J045P32j744L60J527r04p50J063n10j056J267N27q13L87K66j224
$$ 882 804 -948 97 829 -915 -555 972 68 -682 381 -129 -1185 82 609 -204 183 449 -775
2725g75N05J116j048j69J134o64j027J249M39j112M42O78j220k32J021J5n87P95
$$ -775 -270 846 -202 -371 763 99 -928 321 760 -352 90 768 -452 -684 337 352 -235 560
2743E60j93j040P85J90q60M69Q57j244k11Q95l51l90P83M3p35O2O85m95j38P37
$$ 560 367 -673 112 302 -558 -89 768 -476 -687 208 -143 -533 250 293 -442 -380 305 -190 -328 409
2763D09l16j00M50o86J4L84O0o52M43O18j087L13O05k37m88J75M87n71P7O67n68
$$ 409 93 -7 443 -243 -229 155 215 -437 6 624 -463 -150 455 218 -270 -95 392 -179 -102 565 -3
2784cj2O5m29K72J52k79N4M47k6p50M15M16m97j04Q44n10l81M71j40j09j0j23
$$ -3 -15 50 -379 -107 45 -234 -180 267 241 -509 -94 322 -175 -279 565 55 -326 145 5 -104 -114 -237
2806b37k06M94J5l15J39N34m33j90M64p7n58O63J32n72J63L9J08j78J32k21j96
$$ -237 -443 51 66 -249 -110 424 -9 -199 265 188 -370 293 425 -147 16 55 163 -15 117 -104 -300
2827c00K10L3J95r9l26q7M44J45n04M8K30K23n06K14M05m78k83N48o6k6l0m8R0
$$ -300 -90 -57 138 39 -287 -374 70 215 -289 -241 -11 212 -294 -80 325 -153 -436 112 46 20 -10 -58 32
2850C2p1j78K60O7j78p7M35k55K99m73R2J73m43L52J84k34J03j81k6R0j26j15
$$ 32 -39 -217 43 110 -68 -145 290 35 334 -139 -47 126 -317 35 219 -15 88 -93 -119 -29 -155 -270
2872b70J70Rk16KK84J52n37N72J69p69L18M17k40N5j17O4j4J14K8j65K33l42j44
$$ -270 -100 -91 -307 -305 -21 131 -406 166 335 -434 -116 301 61 116 -1 63 49 163 191 26 259 -83 -227
2895b27J32M09m00m64J054n48m86M05J03j45m8K92j11R1J01k69K72K73k45k94
$$ -227 -95 314 -86 -550 504 -44 -530 -125 -22 -167 -215 77 -34 57 158 -111 161 434 189 -105
2915a05M44k54m97N68oj79k32M04l2n18L75L20l32k54L06l61K85L75n27K15L44
$$ -105 339 85 -412 156 150 -29 -261 143 111 -407 -32 288 -44 -298 8 -353 -68 307 -220 -5 339
2936C39k45n96Q02K71j042M78N30r79J53N03Q4k19K18p2m20O15k55j56m1L30p66
$$ 339 94 -502 300 571 -471 7 537 -442 -289 214 298 79 297 225 -195 420 165 9 -32 298 -468
2957d68J39Q34m19m18P65r2j062P32M90p32J91M85m97j93K97q0l90P94l65o67
$$ -468 -329 505 86 -332 433 341 -721 11 501 -231 -40 445 -52 -245 52 -28 -418 376 11 -656
2977f56O87q8n24N97P58p00p56J074m62p12J071N17q16k37P62j126J94J120o72
$$ -656 31 -57 -581 16 774 74 -682 392 -70 -782 289 806 -10 -247 515 -611 -417 703 31
2996C1j31K96l28p06J028L99q69L47N69j186Q6J117m40o87R98k49p04K15M41k23
$$ 31 -100 196 -132 -838 190 589 -280 67 636 -550 -464 653 213 -474 524 275 -429 -214 227 4
3016DL36K81q73l64R31l47k68J140k63j299O14O31q87L74P83r43n46Q00k89j52
$$ 4 340 621 -252 -616 315 -32 -300 840 577 -722 -108 523 -364 10 793 -150 -696 104 -185 -337
3036c37P38J96p45NN22r82K74J340j023k34P88m93o94Q34O16p73J28L4n83k80
$$ -337 401 597 -148 -143 379 -603 -329 1011 -12 -246 542 49 -645 189 805 32 160 194 -389 -669
3056f69J454o24l31R65q44q61O77N69j011J113K13j411j67J340k59m25Q27P6j560
$$ -669 785 161 -170 795 -49 -910 -233 336 -675 438 651 -760 -927 413 154 -271 556 632 -928
3075i28N92N46n85P31O11j301r5Q19n39j75J261k58j229N44M06j179P85R45r02
$$ -928 -336 210 -375 356 967 -334 -429 390 -149 -324 937 679 -550 -6 400 -779 6 951 49
3094D9o49O44l40j78O91N78j043M09K52j411N62J323q02o31J323r49r35J240O89
$$ 49 -600 44 -296 -474 217 795 -248 161 413 -998 -436 887 85 -546 777 -172 -1107 133 822
3113H22r15L95M11j145l86J174j81l95J046p78j139J054O14j291J131O27j490
$$ 822 -93 302 713 -432 -818 356 175 -220 826 48 -1091 -37 577 -714 417 1044 -446
3130d46j16J027n38n41J390j17j251M49L96q59M57J228j143l45P30n86m69J156
$$ -446 -562 465 -73 -614 776 659 -592 -143 253 -606 -149 1079 -64 -409 321 -265 -734 422
3148D22K04j249O99M52j432K35J765q84p94Q66j96q76J036K94q35K83N57q98j24
$$ 422 626 -623 76 528 -904 -669 1096 212 -582 284 88 -788 248 542 -293 -10 547 -351 -475
3167d75J009j68o94R09k77j201P03J038j054J03R50j295j63Q45N0p32Q70K28j261
$$ -475 534 366 -328 581 304 -897 -194 844 -210 -107 843 -452 -615 230 280 -452 418 646 -615
3186f15O40K62o67l0J491j209p34J222l06n82O84K54o84K49J75n47k5J171n77
$$ -615 25 287 -380 -410 1081 -128 -862 360 54 -528 156 410 -274 -25 150 -397 -422 749 172
3205A72l30L45l51n84J057O23j128K41N67q52m21J012J34p60K40L07p53K41M37
$$ 172 -158 187 -164 -748 309 932 -196 45 612 -240 -661 351 485 -275 -35 272 -481 -240 197
3224A97l32L42J08n39M1K62k26j79M94K11q26J15P54o22rP20m20m14L14L14k13
$$ 197 -135 207 315 -224 -183 79 -147 -326 168 379 -447 -332 422 -200 -209 511 91 -323 -9 305 92
3245I2J77M5m23Q5P2L3j44L26k16m19M27P8m85K72K75m77r5K51j19P4K46J00l99
$$ 92 269 314 -109 -24 48 81 -63 263 47 -372 55 133 -352 -80 195 -282 -377 -126 -245 -171 75 175 -224
3268b24M31l1l86M09k79j37L87J3l26p8K33L09m81J42j4k8l6K53j88Q9M5k79L2
$$ -224 207 176 -210 199 -80 -217 170 183 -143 -221 12 321 -160 -18 -32 -60 -96 157 -31 58 103 -176 -144
3291a44L23o9k89M22k5l06j8K15j07l3K75m2l56N10m21p5K87l83L68K8m9l05L60
$$ -144 179 110 -179 243 218 -88 -106 109 2 -31 244 202 -154 356 -65 -140 147 -236 132 160 111 -194 166
3314A66NK5n21M32K48o50K44J3J9l75K78L29j3m06J00J25j89L62k36N0N8j54n9
$$ 166 171 196 -325 107 355 -295 -51 -38 -19 -394 -116 213 200 -206 -106 19 -170 192 -44 6 64 -90 -149
3337a49M59k14j87J79K23j98j97L01j81lP5m3j13J8Q2j30J37k11k18L90J74m14
$$ -149 310 96 -91 88 311 113 -84 217 36 33 108 65 -48 -30 52 -78 59 -152 -370 20 194 -220
3359b20L00K61l83k62M41N5k41j01M84p7l7j26N0m1O9k83N5K20j13m4Q2r4l82
$$ -220 80 341 -42 -304 137 192 -49 -150 334 257 220 94 144 103 172 -111 -56 164 51 7 89 -5 -387
3382c87Q1L56l68m4L92L3j22q6K44k5K2O7L3n8L11n20JM67k69k55L92J68k84J3
$$ -387 -306 50 -318 -362 30 63 -59 -145 99 74 96 163 196 138 449 -71 -70 397 128 -127 265 433 149 162
3406A62Q6o4k21J64j64k42J94q3K38lj60k24L76J08m35j1N47j77k25L16K17o63
$$ 162 248 184 -37 127 -37 -279 -85 -168 70 67 -93 -317 59 167 -268 -279 268 91 -134 182 399 -264
3428b64N2O38j68k42K18k76R0K54l84J94J31k56l45M16O5l09K26R6k40n03P52
$$ -264 -212 426 258 16 234 -42 48 302 -82 112 243 -13 -358 58 123 -186 40 136 -104 -607 145
3449A45O0m26oL02l44L5L19l01R8M57m54j41K39J17m17M74K14n82J53L80j49l07
$$ 145 205 -221 -227 75 -269 -234 85 -216 -118 339 -115 -256 -17 100 -317 157 371 -211 -58 322 173 -134
3471a34N39l28j60L48j56n70M71J81j74j88L59m88j54O60k33j35K01n7j97J25
$$ -134 405 77 -83 265 109 -461 10 191 17 -171 188 -300 -454 206 -27 -162 39 -18 -215 -90
3491i0O17o71P6N24p39m4N72j53j9K77m82j69K78K88m62k4P46o11l41N15L78p59
$$ -90 527 -144 -68 456 -283 -327 245 92 73 350 -132 -301 -23 265 -197 -221 525 -86 -427 88 466 -293
3513b93L53N37p10j31M16k87J13J79j23k53K13q7j87N84J48n25j28L62l44j52
$$ -293 60 597 -113 -244 172 -115 -2 177 54 -199 14 -73 -260 324 472 -53 -181 181 -163 -315
3533c15P42j68k75PJ45l01K16K82l72j42M53o65l6P30k98n23P43k31m21L14M64
$$ -315 427 259 -16 -9 136 -165 51 333 -39 -181 272 -393 -429 301 3 -520 223 -8 -429 -115 349
3554C49k77l20N52m25j01O29o4l15L93J6r87M34N25n40L2M47l06m85O80l98j16
$$ 349 72 -248 304 -121 -222 407 343 28 421 437 -550 -116 409 -131 -99 348 42 -443 237 -161 -277
3575b77N85L55j012J58L09o88M44O72m80n45O68l79l59M87M79m45J3L42p10o9
$$ -277 308 663 -349 -191 118 -570 -126 546 66 -479 189 -190 -549 -62 417 -28 -15 327 -383 -452
3595d52P92k4n83L59j41m63M28M99l99j14J63m95J94M46Ml80M43mq09K67O03q47
$$ -452 340 316 -267 92 -49 -512 -84 415 16 -98 65 -430 -236 210 214 -166 277 273 -536 -269 334 -513
3617e13K94N50m10m20N70Q2n58O49J57o45RO23q42K13R35k84q56N07K46o69L95
$$ -513 -219 331 -79 -499 71 153 -405 244 401 -244 -235 388 -454 -241 694 410 -446 61 307 -362 33
3638C3M79n38k20O51l82k90O47k14l24L87j27n71L82K85l16J13K55n36p47J219
$$ 33 512 -26 -246 405 23 -267 380 166 -158 229 102 -469 -87 198 -118 -5 250 -286 -1033 186
3658A86j3l61K97J74r12J77N64m1j3L08o43k64O81j58j44L57P7n33jO44m24k80
$$ 186 173 -188 109 283 -629 -452 112 71 58 366 -277 -541 140 -18 -162 195 272 -261 -262 382 -42 -322
3680c22P55l10n49L85K69m73Q2N56l55k15K72l74p5N94p9n22M22j14m37M81M51
$$ -322 433 123 -426 -41 228 -245 -163 393 38 -177 95 -279 -354 240 161 -361 61 -53 -490 -9 442
3701D42m36j15J31L7l28L83R6k87J56m0m80L29N84m08K3j03K6o61O27M29n65J92
$$ 442 6 -109 22 59 -269 114 210 -77 79 39 -441 -112 472 64 87 -16 10 -651 -24 405 -160 32
3723C2jm94L74J46k03Q4M57l59m10K81J68j54J2N90o05o3K34l05M5L78j21n4K77
$$ 32 31 -463 -89 57 -146 -62 395 36 -374 -93 75 -79 -67 523 -82 -145 89 -216 -171 207 86 32 309
3746C09k44k35O7Q8Q7j66J00j29j68N38n29O3J62r5k4j1L78k54J4J01q5l3P9n9
$$ 309 65 -170 -103 -15 72 -94 6 -123 -291 247 -282 -219 -57 -152 -176 -187 191 -63 -49 52 -33 -66 13 -46
3770d6k7K72j34k16q8L55l09K41R5N7m92J78K29q2r0K6J30m22M90k25j17J59R0
$$ -46 -73 199 65 -151 -239 116 -193 48 143 200 -292 -114 115 33 -57 -31 99 -323 167 -58 -175 -16 74
3793G4k66L14m1l23L49j02j59M7R0j21L22p7J61k12m1M8J9k32M70k95M8q7k44
$$ 74 -192 122 81 -242 107 5 -154 -107 -17 -138 184 107 268 56 15 63 82 -150 320 25 73 -14 -258
3816b58Q6K98L2M9R0l48k76L29M6p1j38l9K27j13j9J05O4J9p9p7L33j52j47j8
$$ -258 -172 126 158 207 297 -51 -327 2 48 -23 -161 -200 27 -86 -105 0 64 83 4 -73 260 108 -39 -57
3840e7MJ25j40K41o1l00K08k8L7K7j54K07p8k88K45q0K88k70k51L50k6p8J37p4
$$ -57 -53 72 -68 173 112 -188 20 -8 29 56 -98 109 31 -257 -12 -92 196 -74 -325 25 -1 -79 58 -16
3864a6M6J3k2J00j73Q9Q2K01j64lr1J8K14k15k25N7K31l20L8J33p2M5K39k71p7
$$ -16 30 43 21 121 -52 37 119 320 156 153 62 80 294 79 -146 -89 142 -178 -140 -7 -79 -34 205 -66 -143
3889a43R1k16J44N0r1K2L33k31Q1J05p3P9j35P7m6k43J40J36n8j34L26j64l54
$$ -143 -52 -268 -124 -74 -165 -143 190 -41 40 145 72 151 16 93 47 -196 -56 80 22 -112 214 50 -304
3912c04K83K09m11L17k84K85j4M4j18J68k7l09q7M31m8k54K13k5k47k47O16q9
$$ -304 -21 188 -223 94 -190 95 81 125 7 175 148 -161 -248 183 135 -119 94 69 -178 -425 191 102
3934A02j44j32K15k07K97j10j18J81O7j56K37r4j85q6L38k14j3QK05j41m3K82
$$ 102 -42 -174 41 -166 131 21 -97 84 151 -5 232 138 -47 -133 205 -9 -22 -14 191 50 7 289
3956B89l12p5n7K71m1m8j30N2j25J72m1N2J81l74K86p0k77J46M58j42l25Q1nk27
$$ 289 -23 -98 -155 116 75 27 -103 -51 -176 -4 -45 7 188 -186 100 30 -247 -101 357 215 -110 -29 -34 -261
3980b61K76O1j6j87L42l24l08N66o5m2Q5K56l45J52p8k03Q1J31J09m75K73j73
$$ -261 15 76 60 -127 215 -109 -417 149 84 42 127 383 38 190 112 -91 -10 121 230 -245 28 -145
4002a45J05K30j29n7l07J41K76k75M15N2n61K40L38n02O8M73l87J5J65l25K11
$$ -145 -40 190 61 4 -303 -162 114 -161 254 306 -255 -15 323 -179 -111 362 -25 -10 155 -170 41
4023D1M8j16J85Q8j63k48J40K61k59k61M18j8k60L42j72kP1j67jJ99M4j81j09
$$ 41 89 -27 158 246 83 -165 -25 236 -23 -284 134 116 -144 198 26 24 95 -72 -73 126 170 -11 -120
4046a20J48j51j35L53jk18K54j02k66J82M10k49k83M61k52k50M57j9j41j89J83
$$ -120 28 -123 -258 95 94 -124 130 28 -238 -56 354 105 -178 283 31 -219 238 219 78 -111 72
4067G2j62K2J46m15J03M74O2m20K73J0l57K32K25j83k08K17k87j41M87r9k56K13
$$ 72 -90 -68 78 -337 -234 240 302 -118 155 165 -192 40 265 82 -126 91 -196 -337 150 51 -205 8
4089Hrj94J31L05l52j54O36j38n89N07P5m66L02Q3n65K44L93k7j61K49j34l63
$$ 8 -1 -195 -64 241 -111 -265 371 233 -356 151 226 -240 62 145 -420 -176 217 190 29 278 144 -219
4111b19J48L3J10J80k2n67K64J23J4OK28m9k51L2O9l16J83K68k31j86L01k42j84
$$ -219 -71 -38 72 252 230 -337 -73 50 64 70 298 249 -2 30 99 -217 -34 234 3 -183 118 -124 -308
4134c08P54m43l18L49J3l50Q1O21m20Q0j43K05m56N64Q7o55K61L50n53L62J75
$$ -308 446 3 -315 34 47 -303 -222 399 -21 59 -84 121 -335 229 316 -339 -78 272 -281 81 256
4155B56k68o1K47j56m03K71J74l6J94J87k83j71N92o07K50n7j63k44L49K75n15
$$ 256 -12 -73 174 18 -385 -114 60 24 218 405 122 -49 543 -64 186 129 -34 -278 71 346 -169
4176a69J76M42n33J72K9j17k7L29N0m09J69K98n59M8J91k10K6J40ql10K16K50
$$ -169 7 449 -84 88 117 0 -27 302 352 -57 112 410 -149 -101 90 -120 -94 46 38 -272 -56 194
4198A94l35Q4J27k60K11K30k30j78J92j00k21L19J68k20J31K57n88J40K98l17
$$ 194 -141 -57 70 -190 21 251 21 -157 35 -65 -286 33 201 -19 112 369 -219 -79 219 -98
4218i8j45M64j52n41P71k49r9NK58l07K4k1J0l1j46L40j87J8M64m04O7L13l12
$$ -98 -243 221 69 -472 299 50 -49 -44 214 -93 -69 -90 -80 -111 -257 83 -104 -86 378 -26 41 354 42
4241D2j19K8O7k31L82k40R6r8l1K00n7P7o5m8L1J83l59j2M80k63k62K90n05L47
$$ 42 -77 -49 18 -213 169 -71 25 -73 -104 96 39 116 51 3 34 217 -142 -154 326 63 -199 91 -414 -67
4265f7M13l90J22m4rj29K94l37J73N3J09k50q0L57l70k45M49n9q7J41L4q8kJ96
$$ -67 346 -44 78 34 25 -104 190 -147 26 79 188 -62 -142 215 -155 -400 49 -10 -97 44 78 -10 -12 184
4289A84l94K03p8J25J8j77O5j0L3P0j12J4M8P4j96M26l06N9j51L45k83k33M66
$$ 184 -210 -7 -85 40 58 -119 -54 -64 -31 39 -73 -59 -11 63 -133 293 -13 46 -105 240 -43 -276 190
4312A90k58j72R4J02K3P2k07J30p6Q4J2Q8J4k56K64kl53J95K1k4O2n2K9k7J08
$$ 190 -68 -240 -146 -44 -21 51 -156 -26 -102 -18 -6 82 96 -160 104 102 -251 -56 -35 -59 3 -49 -20 -47 61
4337F1j26M9P5r5q4J26K26j57k05O2K97k12K4j36J85l73J70J11l3K0r3J38j18
$$ 61 -65 -16 59 -36 -120 6 232 75 -130 -68 229 17 41 -95 90 -283 -113 -2 -35 -15 -108 30 -88
4360h8R2K8k9O4q2oO2j10j8o3L02j59L1j3J48j83J36J10l32L35k09j18M45m01
$$ -88 4 32 3 67 -15 -21 41 -69 -87 -150 152 -7 24 11 159 -24 112 222 -110 225 16 -102 343 -58
4384e8K8Q1J37j69o9k3J63l1j90J63K63j94N0l00J39J88j86J07K6Q6l30K35N5
$$ -58 -30 51 188 19 -50 -73 90 59 -131 32 295 101 151 -149 -10 178 -8 99 125 211 -119 116 171
4407A71j73J64o6m0r8j09M1M8j3J35j04nJ00j09J1lJ10R1k18R9P0o3Q5n4j48J84
$$ 171 -2 162 96 56 -42 -151 -110 -62 -75 60 -44 -49 51 -58 -47 -50 60 151 -67 32 102 39 124 70 -78 106
4433A06k76J84rL2j09M2J11J34j75O8r2P9k9k39Q3q8J12m6R7l42L96k58K12J4
$$ 106 -170 14 5 37 -72 -30 81 215 40 108 16 95 66 -173 -90 -178 -66 -112 -15 -357 39 -219 -7 7
4457Gj29K91j16n5l08J16K01K35j11l92L34j8l26K96M2k81J81J08j5j96N03k65
$$ 7 -122 169 53 -2 -310 -194 7 242 131 -261 73 55 -271 25 67 -214 -33 75 60 -136 367 102
4479A02k02j7K1k19K89J43j00j54J11J64j55J02K13m23K99l23K57l49L78m8j06
$$ 102 -100 -117 -96 -315 -26 117 17 -137 -26 138 -17 85 298 -125 174 -149 108 -241 137 89 -17
4500a7K62n44J29K53K4o4n6K3P0j35L44j04j9j76r9k2k2M19m05J41K87m47K1K35
$$ -17 245 -299 -170 83 107 43 -13 10 80 -55 289 185 166 -10 -109 -131 -153 266 -139 2 289 -158 -137 98
4524I8o3k7p4K93k61J54M1m66J13J93J6r0J98j52j15P1J38j01j37Q1JQM61n39
$$ 98 35 8 -66 227 -34 120 161 -305 -192 1 17 -73 125 -27 -142 -71 67 -34 -171 -90 -89 -81 380 -159
4548a59k9K37j68j0P4K64k99P6K06k18o0o5J7Q6J62j13k18K36j2j8J74q0m12J29
$$ -159 -188 49 -119 -129 -55 209 -90 -14 192 -26 -86 -151 -134 -48 114 1 -217 19 7 -11 163 83 -329 -200
4572b00L09l29K53P3j18j32L55l1k67k29M57l34K10J10j94k11L49k4k39M71k51
$$ -200 109 -220 33 106 -12 -144 211 180 -87 -316 141 -193 17 127 -67 -278 71 47 -192 279 28
4593B8j36r2L59k41q3N59m45n3K58n4l35J01K41l83L89p2J19l7k64L03n28M81
$$ 28 -108 -200 159 -82 -165 394 -51 -104 154 100 -235 -134 107 -276 113 41 160 123 -141 162 -366 115
4615A15qj45j1K16n55j06N02j98J59L87l28m66O54l8l87J10L08l16P2k6J84m42
$$ 115 107 -38 -49 167 -388 -494 8 -190 -31 356 28 -438 216 178 -209 -99 209 -107 -35 -61 123 -319
4637c19M12J22l83J91J16l13k27O75m43O6K83n4m53J13L42l95L60p0l70K48L60
$$ -319 93 215 -168 23 139 -174 -401 274 -169 -103 180 126 -327 -214 128 -267 93 23 -347 -99 261
4658B61l52k17M95j96k93M02L0k65JJ42Q7l46K49q3M7JJ00k91J39J56k71K56J5
$$ 261 -91 -308 187 -9 -302 100 130 -135 -134 8 95 -251 -2 -85 -38 -37 63 -228 -89 67 -204 52 67
4681F7j09K03j40q0J51p7J32j02j53K48j02j77M87k42J30j49k19j88O03o0l16
$$ 67 -42 161 21 -59 92 15 147 45 -108 140 38 -139 348 106 236 87 -132 -320 283 223 -93
4702i3N9J73l08L30j06k08QK07q9l18M15%k52n1J93%J12j90R3j39%M4P0k76K93
$$ -93 -34 139 -169 161 55 -153 -145 62 -27 -345 70 70 -182 -233 -40 -40 72 -118 -25 -164 -164 -120 -50 -326 -33
4727c3N3j50L11k78K78k87J00p4K32n0k65N05k33Kmoj21k24L69N5l51Q2K56l08
$$ -33 20 -130 181 -97 181 -106 -6 -80 152 102 -163 342 109 111 107 101 -20 -244 125 180 -171 -89 167 -141
4751a41qK05k31J25J34l56L36qP4l24K85P9k46K26J92l00j47O77n58o9J77l17
$$ -141 -149 56 -175 -50 84 -272 64 56 130 -194 91 170 -76 150 342 42 -105 572 14 -55 122 -195
4773a95J53J30K68j87n2l72RL29j28j40O4J85p7m5J23q6L44k70p5J09l39O7K21
$$ -195 -42 88 356 169 117 -255 -246 83 -45 -185 -121 64 -13 -58 65 -21 323 53 -22 87 -252 -185 36
4796C6j70K69K6k86K03L2j2l1Jmj40K15m0k20J33j11k86J57K41j15J63J51l59
$$ 36 -134 135 161 -125 78 110 98 67 68 64 -76 139 99 -121 12 -99 -385 -228 13 -102 61 212 -147
4819a47K87l4O3l23K39Q6j79j81M13j86q2J75j8r4j56J13O4j28K77M0j38j67l1
$$ -147 140 106 169 -154 85 171 -8 -189 224 38 -44 131 113 19 -137 -24 40 -88 189 229 91 -76 -107
4842a07J94l5M6l13L03j63O0Q8j09Kl2r3J43p5N8K44l47P8N3J05l66L06m9k0l6
$$ -107 87 52 98 -215 88 -75 -15 73 -36 -34 -66 -159 -16 -91 -33 211 -136 -58 -5 100 -266 40 -9 -29 -65
4867f5K11k07K66l38O5M6mln7J27r8k9Q7oJ37O3q0l4Q7N5l20J01L4Ok01K95j83
$$ -65 146 -61 205 -133 -68 -22 -26 -29 -86 41 -57 -86 1 -5 132 195 115 81 168 223 -97 4 38 44 -157 138 -45
4894d5J74k20K87q7q0J15j15k20rK63n3m3J8N4O7P0j32k11K11M1r0J19O7j90j00
$$ -45 129 -91 196 109 29 144 29 -191 -200 63 10 -33 -15 39 106 176 44 -167 44 85 -5 114 181 -9 -109
4919a09L22r4l29J57r2K6J54j91J01l4O2M9J57l88J82J8o3J21j7J03j4k39k4J04
$$ -109 213 119 -210 -53 -145 -119 35 -156 -55 -89 -27 22 179 -209 -27 -9 -72 49 32 135 121 -118 -142 -38
4943c8P6R1l74J99K01M0j90m4Nj30J81j24K18k81J52L4j13k12L79Ok77J58o4r4
$$ -38 38 129 -245 -46 155 195 5 -39 -34 -164 17 -107 111 -170 -18 16 -97 -309 70 76 -201 -43 -107 -201
4967b01J70K13l06P7k61K25J49M12m79r3o8R7J46k47J76p7P3J6j12J79J30j77
$$ -201 -31 182 -124 -47 -308 -83 66 478 -1 -94 -162 -65 81 -166 10 -67 6 22 -90 89 219 42
4989D2l7k59O8J91Q9J8O4j07k65J82j0Q3N1L7jk30J82m7j60k5l26P52l87MJ46
$$ 42 5 -254 -186 5 94 112 176 69 -196 -14 -24 59 110 147 146 -84 98 51 -109 -134 -460 292 -95 -91 55
5014E5j18M5K17o3m74K94L7k28L32o7p8m8L0P6n9R6j23NK46k30p3o8rP5L9N07
$$ 55 -63 -18 199 136 -338 -44 -7 -235 97 30 -48 -96 -66 10 -49 47 -76 -71 175 -55 -128 -196 -205 -130 -91 416
5040D16n31%J72o8j5lK31n85L99J23m91M88O0p5k43K5J20PJ52q3qo7L07l20k7
$$ 416 -115 -115 57 -11 -26 -29 202 -383 16 139 -352 136 196 121 -122 -97 23 30 182 99 91 24 331 11 -16
5065a6J19oj71J90J20N0j89p8p0L4J17l51L07L94k82L4j98R1k15L92j40k34K47
$$ -16 103 97 -74 116 236 286 97 19 -51 -17 100 -251 56 450 168 202 4 95 -120 272 132 -102 145
5088A45J27k29l11O01j09k46K21n2j83k29N05Ln79M06j6m1j29K1N1j30M09l37
$$ 145 272 43 -268 333 224 -22 199 147 -36 -265 240 243 -336 70 54 13 -116 -95 -44 -174 235 -102
5110a02k00L61j3l25K94L0j1O5Kj10Q1Q3k42k18M80m64L07K3K11k35L1Rk59NN67
$$ -102 -302 59 46 -279 15 45 34 99 101 -9 72 155 -87 -305 175 -289 18 41 252 17 48 57 -202 -197 370
5135C70l2l15p2J17j15m4M02J4l14j1J06k13K68k65j05N17m18j31K42Rk0lM35
$$ 370 338 23 -49 68 -47 -91 311 325 11 0 106 -107 161 -104 -209 308 -110 -241 1 10 -10 -13 422
5158D22o29J21K21N6l59M11k46pl07L49J30k20L63k28l07K20P2l13N21j93l06
$$ 422 -207 -86 135 191 -168 243 -3 -10 -317 32 162 -58 305 77 -230 -10 62 -251 270 77 -229
5179b29K06J59j97j44L86l21k8K84l7k85Q5L46k96J77J52n81L57Q2KJ3j66L7k35
$$ -229 -23 136 -61 -205 181 -140 -168 116 79 -206 -121 225 -71 106 258 -323 34 116 118 131 -35 2 -233
5202b33K09K46j63l2M2k60nM35j31J7P9q9k15J47J07j61J05j26nj39K08P0M0j40
$$ -233 -24 222 59 27 69 -191 -196 239 108 125 204 115 -100 47 154 -7 98 -28 -33 -172 36 106 146 6
5226Fj73K20N6pk01K86k78K0j03L7q8R1K45K64n13K81k25j12K41J34j28m52L77
$$ 6 -167 53 109 102 -99 187 -91 -71 -174 -137 -225 -134 111 375 -138 143 -82 -194 47 181 53 -399 -22
5249b2j22L7K18J11R3k84L36m79J2P9J70q4k0JK6m8K86n28J51K05j1k87K25K10
$$ -22 -144 -107 111 222 315 31 367 -112 -100 -21 149 65 45 46 72 24 310 -218 -67 138 127 -160 65 275
5273B75n05K35L50l15J57k28J3j7m7Q1j45N00k89l56L42J2k8O1K62k12J7l7n5
$$ 275 -230 5 355 40 197 -31 -18 -35 -82 -1 -146 354 65 -291 51 63 35 96 358 146 163 126 71
5296G1k90K41L45m46J72m8lR1o5r2j4J17k27oL75j84Q0l28J57kM6P4l37L07K34
$$ 71 -219 22 367 -79 93 45 42 133 68 -24 -38 79 -148 -154 221 37 117 -211 -54 -56 -10 64 -273 34 268
5321B68m12J45q1P9k04M59n4l91RJ67J10j48K3J76k01j39J23J50J05k88p6J67
$$ 268 -144 1 -80 -1 -205 254 200 -191 -182 -15 95 -53 -30 146 -55 -194 -71 79 184 -104 -180 -13
5343a3K02nl46J46j21j11J77PO9qJ99n8k57J08m2Q0l3J16k40Q1k31M01j28m1J65
$$ -13 189 184 -162 -16 -137 -248 -71 -64 5 -3 196 138 -119 -11 -53 27 -6 110 -130 -49 -280 121 -7 -48 117
5368A17j81K22j13J5j15R1k02l5K25p9j91L99k48j9J01M5K11k69j51o6J43K96
$$ 117 -64 158 45 60 -55 36 -166 -201 24 -55 -246 153 -95 -114 -13 32 243 -26 -177 -243 -100 196
5390A96k81j9J66J72k41k01K09j30nK68l4jk79K61k00K17q5k39P0K25j41J98J76
$$ 196 -85 -104 62 234 -7 -208 1 -129 -134 134 100 99 -180 81 -119 98 13 -226 -156 69 -72 126 302
5413C02l94j68NJ04j40M13j63J00Qk3k02J15J14L0q0Q4K3k56J93l3p5J05l8j38
$$ 302 -92 -260 -255 -151 -291 122 -41 59 67 44 -158 -43 71 101 21 105 128 -128 65 32 -43 62 24 -114
5437a14J14J78j97K05l40J71Q3kq2j35K66o1j44L51j91j40n6j66M12n6j24o3J5
$$ -114 0 178 -19 186 -154 17 100 98 16 -119 147 86 -58 293 102 -38 -94 -260 152 96 -28 -91 -76
5460g6K22P8k01j92K46r5Q2j94K62k89K46j70L6K47m5o4k3J58k05l19K44M2k39
$$ -76 146 224 23 -169 77 -18 64 -130 132 -157 89 -81 -45 202 157 93 70 228 23 -296 -52 -10 -249
5483b49J41L99r9l87K58j07o8J73m1J58J17k62k7q8M3k73M36M4j0m56N49k83j87
$$ -249 -108 291 192 -195 63 -44 -112 61 20 178 295 33 6 -82 -39 -312 124 168 158 -298 251 -32 -219
5506b19L42k22K56j84K57j59k9n6p6j40K53k10L8P4J10O9l00Q0j10L86j22N0k5
$$ -219 123 -99 157 -27 230 71 42 -14 -90 -230 23 -187 -149 -75 35 104 -196 -116 -226 160 38 88 63
5529F3K01k50k23J63J97l33K84m08M48l54K67j90L01J2Pm97N14J33l79K20p4j49
$$ 63 264 14 -209 -46 151 -182 102 -306 142 -212 55 -135 166 178 185 -312 202 335 -44 176 102 -47
5551d7P7K01Q5l24L3R8k35m8J01K2l6M68j49l01M2k8J46K2p8L3j74J85k48n6L74
$$ -47 30 231 316 -8 25 123 -112 -160 -59 -37 -73 395 246 -55 -13 -41 105 127 49 82 -92 93 -155 -211 163
5576A63k75Q5J54j55K5R5j06o5l0J15Q0j22j00J22J13L5L1l27%L30q1R8k14k02
$$ 163 -112 -27 127 -28 -3 92 -14 -79 -109 6 86 -36 -136 -14 99 134 165 -162 -162 168 87 185 -29 -231
5600b31J08K12O2m8R8j24j59m2K53k47J87n3p5j2K31k37M0J07K5k00M2O7k78K28
$$ -231 -123 89 151 103 201 77 -82 -124 129 -118 69 16 -59 -71 160 -77 -37 70 95 -105 -63 4 -274 -46
5624d6m0P7m1j28K43l17L77p4J88j25j5m5j89K68j34k25J68L84k04j98O7J5pJ76
$$ -46 -86 -9 -50 -178 65 -252 125 51 239 114 99 54 -135 133 -1 -226 -58 326 122 -76 -9 6 -1 175
5648A75Lk27j2K39r8qL2n1q3j11n9R7J53R7j78M42k77k74q2J57J39l02K59l4j87
$$ 175 178 -49 -61 178 80 72 104 53 -30 -141 -200 -103 50 147 -31 411 134 -140 -222 -65 74 -228 31 -3 -190
5673a90L51k3j76J08j12k0K89l95L0O6L6r9J13R0j69n9NK07O9k59M07k47j15J53
$$ -190 161 138 -38 70 -42 -62 227 -168 -138 -72 -36 -135 -22 68 -101 -160 -155 52 121 -138 269 22 -93 60
5697F0J14l57K02p3j79M08k9j55j80J30M2RK0r2J4K1k7j46M72k32j46J10K1l96
$$ 60 174 -183 19 -54 -233 175 146 -9 -189 -59 -17 -8 12 -80 -66 -45 -72 -218 254 22 -124 -14 7 -389
5721c89K13M24l01L3J00j69l0o7K14P8N8r8J7j27J14n0m9j22K40p0k5n7J39Q9
$$ -389 -176 248 -53 -20 80 -89 -119 -186 28 106 164 66 83 -44 70 20 -29 -151 89 19 -6 -63 76 165
5745A65k39J83k17p3K25m5N1PM7k30K44N4m21K62K3k51P4R9j50L40Lj21jl04K01
$$ 165 -74 109 -108 -181 44 -1 50 57 104 -126 118 172 -249 13 36 -215 -141 -42 -192 148 151 30 29 -275 -74
5770g4J02M5k24J16J0K45q6m2K27m08L11j83j98K56K6p4lo8J13j44K76n6j04j95
$$ -74 28 73 -151 -35 -25 220 134 92 319 -89 222 39 -159 97 123 49 46 -22 91 -53 223 167 63 -132
5794a32J92Q2L6k44jJ97l16K75or2P9J3p8r9J16j65J29j98K36p8K1Lk0O6j29P8
$$ -132 60 142 178 -66 -67 130 -186 89 83 -9 70 83 5 -94 22 -143 -14 -212 24 -54 -33 -30 -50 16 -113 -35
5820c5o0J31l05L50j38L52k19K5j15p3Q0j48l0M39j99m5Q7J1j68j9J85l8l1o2
$$ -35 -95 36 -269 81 -57 295 76 101 -14 -87 -7 -155 -185 254 55 10 97 108 -60 -79 106 68 37 -25
5844b5m7J25P4p9o6J14j9k14O9K78k84k28M96k17K12k73J19l6k15K82r7R8J28
$$ -25 -72 53 127 48 -18 96 77 -137 -68 210 -74 -302 194 -23 189 -84 35 -1 -216 66 -31 67 195
5867A95k16k33M39j48o4L1M2q7l4K32j77K91m5k39L3j01J19J8k8k81J07J4J71
$$ 195 -21 -254 185 37 -27 4 46 -41 -75 157 -20 271 226 -13 20 -81 38 56 28 -253 -146 -132 39
5890C9r6K10o5j50PJ28m2k49J78Q2J11k77J03J11L9R3k74J30o5k18K16j46J87
$$ 39 -57 153 88 -62 -55 73 31 -218 -40 42 153 -124 -21 90 129 222 -52 78 13 -205 11 -135 52
5913E2j76Q5J33j28k0J34m9j9J65k56j69M53L9j21q9K17j54j55J27k3j3j78K85
$$ 52 -124 -39 94 -34 -54 80 31 12 177 -79 -248 205 244 123 34 251 97 -58 69 46 33 -145 140
5936A40J44l40j8r6R0J65K64k73j28L7J08k2j95L9J06l4k76K09J12P6j32L3P1
$$ 140 284 -56 -74 -170 -80 85 349 76 -52 -15 93 71 -124 -85 21 -13 -289 -80 32 108 -24 9 80
5959H0k50J58l7J59J65j81k13J31K0j36Q3J90k09J79R0k44j52L4J72m4r2J09m6
$$ 80 -170 -12 -49 110 275 94 -119 12 32 -104 -21 169 -40 139 229 -15 -167 -133 39 -5 -97 12 -34
5982c4J47l61M37k52m1J05j30J85k32J55k34L80j52K3L2o0j30L56j24M4k72J03
$$ -34 113 -248 189 -63 -104 1 -129 56 -176 -21 -255 125 -27 -4 28 -32 -162 194 70 114 -158 -55
6004e5J28j28J30r6o7J99M3n6J26m42K06K18l39J40j87M41k80j65L45M0j88l4
$$ -55 73 -55 75 -21 -88 111 154 98 224 -218 -12 206 -133 7 -180 261 -19 -184 161 201 13 -21
6026b1J00j97k77M46K08m07M57j77j19n0l4j82L73j29M1Oj32J76J57k54j14K64
$$ -21 79 -118 -395 51 259 -148 309 132 13 -37 -71 -253 120 -9 32 38 -94 82 239 -15 -129 135
6048A35j41j61kKK92k70l5Q3J14Pj25R1K2K5M22n23k59M19N9j15j50M14k38k04
$$ 135 -6 -167 -169 -167 125 -145 -180 -97 17 24 -101 -10 12 37 459 -64 -323 96 155 40 -110 304 66 -138
6072a38J40K00j83J79M2j56o4J51k23j2K8j67J82J20k97J86oj96O4J20O3k54K79
$$ -138 2 202 19 198 240 84 20 171 -52 -64 -36 -203 -21 99 -198 -12 -18 -214 -150 -30 33 -221 58
6095E8J26l90L41j82n7K03N4k09k9MJ92j80p6N22j52k37K8j0m8P4m0k15n2M06
$$ 58 184 -206 135 -47 -104 99 153 -56 -85 -81 111 -69 -145 377 225 -12 16 6 -42 32 -8 -223 -275 131
6119A31k16J39m5p8l23K71J08Q1j47J70k59J36L88l66m6J21r6K6J48k73J17Q1
$$ 131 -85 54 9 -69 -392 -121 -13 68 -79 91 -168 -32 356 -10 -56 65 -31 -5 143 -130 -13 68
6141F8p5L4J41Q1l38J84k89K01J39m8k77R7j8j21K31K09l77J51j64K64K0l31M15
$$ 68 -7 27 168 249 -89 95 -194 7 146 98 -179 -82 -100 -221 10 219 -158 -7 -171 93 113 -218 197
6164A97r7r2L22l67l03K60K18K6j40j11R1N3q4J33q8k63J17j73K65J47l95K93
$$ 197 100 8 330 -37 -340 -80 138 164 24 -87 4 57 -27 106 18 -245 -128 -301 -36 111 -284 9
6186IJ04l81K52J71p7k25L58j42o4j31l6J94j67J77o9K00L4m2l22K77k6j5k95
$$ 9 113 -268 -16 155 78 -147 211 69 5 -126 -162 32 -135 42 -27 173 207 165 -157 120 94 79 -216
6209b16L86k64j4L36m65L03O4k72j53L79j9O0n9r4j08P6J37rj53k21J75Q8J45
$$ -216 170 -94 -108 228 -237 66 130 -142 -295 84 65 125 66 -28 -136 -60 77 68 -85 -306 -131 -43 102
6232A02Q3l51j68K22nj26M84M1m15n7M2P2R0m8L13l79Q5J60l96J85J53Mj33M0
$$ 102 185 -166 -334 -112 -117 -243 241 282 -133 -190 -148 -76 14 -34 279 -100 -15 145 -251 -66 87 91 -42 -2
6256bj05o6J77o3p7M10k98q6K4J12k12j03N57k00k3o6or1L77l82J8j91K92q7K57
$$ -2 -107 -173 4 -59 -136 274 -24 -110 -86 26 -186 -289 268 68 45 -21 -27 -118 259 -123 -105 -296 -4 -91 166
6281A66r9j42j75L81J09l78L75j79oq4R9k90J00O8q5J86j66k0m6J11L4J41o2j52
$$ 166 67 -75 -250 131 240 -138 237 58 52 -32 67 -223 -123 -55 -140 46 -120 -140 -186 -75 -41 100 38 -114
6305a14K76l13N0J70j08J78l2k02r1J22J0n1J27Q1k41R3K26j04k4k65N5M12q0
$$ -114 162 -151 -101 69 -39 139 107 -95 -186 -64 -54 -105 22 103 -138 -45 181 77 53 -212 -157 255 175
6328A75j61k54J40K8L0P1j78qOL96k7j03q2J03p6j20J85m19L42J1j07J61k30J56
$$ 175 14 -240 -100 -72 -42 29 -149 -157 -151 245 218 115 33 136 60 -60 125 -294 48 59 -48 113 -117 39
6352C9r8K83j53k01k8J33k88L44J22p4O0p1j68J12M4oJ05o1j10K25k48J30o9Q2
$$ 39 -59 224 71 -130 -158 -25 -313 31 153 79 139 68 -100 12 56 50 155 94 -16 209 -39 91 22 104
6376A04j60N2q1J62O9l48K37m2p0O7K8or5J54k07nJ84J45l01J49l6r6O0J95o8
$$ 104 -56 -4 -85 77 146 -202 35 -7 -77 -10 18 12 -83 71 -136 -141 43 188 -113 36 0 -96 -36 159 91
6401I1k60K17L03k42k09J65k17J27J09n9L0m5J40j90K95k37n2J1K20l67J53J71
$$ 91 -169 48 351 109 -100 65 -152 -25 84 25 55 10 150 -40 255 18 -34 -23 197 -170 -17 154
6423A54r6j17j9K46j00j18k1M4J6r8j20J91l9OJ75j84K63m21K18j76k74M35j5
$$ 154 58 -59 -78 168 68 -50 -71 -27 -11 -109 -229 -38 -77 -71 104 -80 183 -238 -20 -196 -470 -35 -50
6446e0K66m72K33J86j73j56J94o2J37j33j15M6Q4M0j93L95m66M52j76j7p8J19
$$ -50 216 -256 -23 163 -10 -166 28 -34 103 -30 -145 -99 -15 25 -168 227 -239 213 37 20 -58 61
6468F1j44K29l86L32j29K69n45L41q8P1n3o2J43r8J83J68k77M5j36J74k22k15
$$ 61 -83 146 -240 92 -37 232 -313 28 -60 11 -42 -104 39 -59 124 292 15 60 -76 98 -124 -339
6490c39K52M0J23k95K68J15m10K36J94l88L86l62O6K57j39j05L72k04j7j43K39
$$ -339 -87 -47 76 -219 49 164 -246 -10 184 -204 182 -180 -114 143 4 -101 271 67 50 -93 146
6511A46k18PJ09k0m4l8K33j04k01J50o3p2JqJ24J03k78J50r4L8J74l04K78J84
$$ 146 -72 -65 44 24 -20 -58 175 71 -130 20 -43 -115 -114 -122 2 105 -173 -23 -117 -79 95 -209 69 253
6535B53l18K6J31k18J58L05k55lj06K9j83K70r2j6Q3k10J97K8q0k46P6Q5M6Q3
$$ 253 -65 -39 92 -126 32 337 82 79 -27 2 -181 89 -3 -19 64 -146 51 79 -1 -247 -171 -86 -40 43
6559D3p5K2k9J98j88j24L83k53K6J20k7k74J97j46O0l4J51r7q9J74l1j41L17k29
$$ 43 -32 -10 -39 159 -29 -153 230 -23 3 123 96 -178 19 -127 -67 -101 50 -47 -136 38 7 -134 183 -46
6583d6M6J2n3R8j69q6L16p4r3L7k85K12J21K4RN4j41j67j52M70k06K12j02k31
$$ -46 0 12 -41 57 -112 -198 118 44 -49 -12 -297 -85 36 60 69 123 -18 -185 -337 133 -73 139 37 -194
6607a94O2m0J86p5l9J02K08j44L0k3k66L03m9j18Q9J3k67L16J71n15N14l51OO
$$ -194 -132 -172 14 -61 -100 2 210 66 96 73 -193 110 61 -57 32 45 -222 94 265 -250 264 -87 -81 -75
6631g5K57k23j58L37k36j88L45R1p4Q0j69j01M8J54j33r4K79r7k53J61j7J70k35
$$ -75 182 -41 -199 138 -98 -286 59 150 76 156 -13 -114 -66 88 -45 -139 140 43 -210 -49 -66 104 -131
6654a31J83Q2l00J92l5J82N8j73l67L43j54J69j94K65m2k89J25J52r0L09m22k86
$$ -131 52 134 -166 26 -9 173 231 58 -309 34 -120 49 -145 120 78 -211 -86 66 -24 285 -137 -423
6676d23J68K51m7J12m1j5J21k42K99l23J42J97k3r8K93k76p3O6k06MK18k27P7
$$ -423 -255 -4 -51 61 20 5 126 -116 183 -140 2 199 176 78 371 95 22 88 -118 -114 104 -123 -46
6699d6n5R1O3K15j94M4r9R8J1k88K36j41o5M7R8j12J26j80j1J34M7K18k74J10
$$ -46 -101 -10 53 268 74 118 19 117 128 -160 76 -65 -130 -83 15 -97 29 -151 -162 -28 19 237 -37 73
6723G3k29J53j0m1J19j82L48n47J94K02M7j67M9L4j09J90j96l2J74oj59L02r4
$$ 73 -156 -3 -13 -54 65 -117 231 -316 -122 80 127 -40 9 43 -66 124 -72 -104 70 64 -95 207 113
6746A13l19J71J04k99o6J80N27n40K68Lj5n8L4p1k83O1N65k96j09j45J65R8k42
$$ 113 -206 -35 69 -230 -296 -116 411 -129 139 142 127 69 103 32 -251 -190 375 79 -30 -175 -10 88 -154
6769a54n9J29J74j28n1K41j68o7K9J39k93K86m3oj77K92k54K33j9o6j0Nj33oP1
$$ -154 -213 -84 90 -38 -89 152 -16 -83 -54 85 -208 78 35 29 -148 144 -110 123 104 38 28 33 -100 -106 -35
6794c5r6J79l35L43J51k05KJ17k97J73J51j43j13J03M1k02M31m8l5j88J57j71
$$ -35 -131 48 -287 56 207 2 4 121 -176 -3 148 5 -108 -5 36 -166 265 217 182 -6 151 -20
6816b0J12J3J32l02O1j24m07K58L72L3l2j50k1J9Oj32J19L7k8Q9j1K8P2r9K83
$$ -20 92 105 237 -65 -4 -128 -535 -277 95 128 96 -54 -75 -56 -50 -182 -63 -26 -54 35 24 52 124 25 308
6841C08k97j14J87k47m8j09M16k23k5o1L61j74%N8J32l8k74k6L64j42r6J11Jj98
$$ 308 11 -103 84 -163 -211 -320 96 -127 -152 -213 148 -26 -26 32 164 126 -148 -174 190 48 -48 63 64 -134
6865a34L10k51K76L7n03J83J23j31J67L0k77L61j29k88P8J59P8r2l2o8K06p7k07
$$ -134 176 -75 201 238 -265 -82 41 -90 77 107 -170 191 62 -226 -148 11 89 -3 -35 -103 103 26 -181
6888a81J40q2P1p7J44j65Q9L02k14o7J79k94K34k35m2L39k46J97j77P0k46L83
$$ -181 -41 -123 -52 -129 15 -150 -61 241 27 -40 139 -155 79 -156 -198 141 -105 92 -85 -15 -261 122
6910A22j41K99j14p5l2J28j23k78K8J90J58k22NlJ25j66K7J78r4J43l53Q9K36
$$ 122 -19 280 166 91 59 187 64 -214 -186 4 162 -60 -55 -58 67 -99 -72 106 12 155 -198 -109 127
6933A27N4o5n2k37q0L76l97L77o5j44J64k9K7l40J46J93J57m66M3J88k22L0J49
$$ 127 181 116 64 -173 -253 123 -274 103 38 -106 58 29 56 -284 -138 55 212 -254 -211 -23 -245 -215 -66
6956f6L8L32m12J36m6j02N4M6L36m00K7J43O2k65K32l02J84j16LJ4L37k37R3k88
$$ -66 -28 304 -108 28 -18 -120 -66 -20 316 -84 -57 86 148 -117 115 -187 -3 -119 -116 -102 235 -2 91 -197
6980a97j7L76j74J49j69J39l44j6K30q5j66J19L4o8K16j43O6K2k7N1RM5k32J00
$$ -197 -214 162 -12 137 -32 107 -237 -253 -23 -108 -274 -155 -121 -189 27 -116 -50 -28 -55 -4 5 50 -182 -82
7004h2Ok7R2J33l11J43J08NK24p5N7k24k29R9J51o4o2K9J49k3k9j19Q5k10J5L59
$$ -82 -76 -103 -11 122 -189 -46 62 67 291 216 273 49 -180 -81 70 6 -56 -27 122 99 70 -49 36 -174 -159 200
7030B00j37j31j23J80L4J6R7k30J26j77J10J63k33P5K76k94RJ18q2j02r5K76J4
$$ 200 63 -68 -191 -11 23 39 136 -94 32 -145 -35 128 -105 -30 246 -48 -39 79 -3 -105 -200 76 90
7053I0j84p9J35K03j30j91K88k7j43J75j63m5PK05l77Q5J58p7j2R8L7j38q5J25
$$ 90 -94 -173 -38 165 35 -156 132 105 -38 137 -26 -71 -64 141 -236 -151 7 -70 -82 16 53 -85 -170 -45
7077d5k06L53N0K6l79J87J3JO5j44j1J39k05J70m00K48J27J18J01m5k27RM7j2
$$ -45 -251 102 152 178 -201 -14 -1 0 65 -79 -90 49 -156 14 -386 -138 -11 107 208 163 -64 -55 -8 -20
7101b0p5K37j48p2J18J16j14Q6k22j30K09j84K15J41J9l95J66K40k94k26N88l74
$$ -20 -95 142 -6 -78 40 156 42 128 -94 -224 -15 -199 16 157 176 -219 -53 187 -107 -333 255 -119
7123a19J40R2k82L2J90o7M6m0j26N3j60K96k69J43m8K29j31P3j12Q2j5j92K66
$$ -119 21 113 -169 -137 53 -14 32 -8 -134 -81 -241 55 -214 -71 -119 110 -21 52 -60 22 7 -185 81
7146H1j9J2o5j2P1q7l95K40J41j19J29jP0j25o4J64KJ13k85J51Qlm3P6L6o3p2
$$ 81 62 74 9 -3 68 -19 -414 -174 -33 -152 -23 -24 46 -79 -143 21 23 136 -149 2 10 7 -36 40 76 13 -59
7173e9O8Qj94L10k18jq3M48j42j12l20J78K17m4j20j82M23M7k18j4J77k41K32
$$ -59 9 17 -177 133 -85 -86 -169 279 137 25 -295 -117 100 56 -64 -246 177 224 6 -8 169 -72 160
7196A60k24J97L0k89J47j98Q6J28Q8j36k32R9J25l21L56n9J41q1j15M9J10J97
$$ 160 -64 133 163 -126 21 -177 -91 37 125 -11 -243 -144 -19 -340 16 -43 98 17 -98 -49 61 258
7218B58m43M21j54M5Jm1L6k4q9n9K05l23r6J84J43j24K28Pj60M2l14L77J44k06
$$ 258 -185 236 82 127 128 87 123 99 10 -49 156 -167 -263 -79 64 -60 168 175 15 57 -257 120 264 58
7242E8k46J93o0p4J30P7k97Q2K77l64L8L09j43O7k35p8L78M1j22j06O5L1o2j7
$$ 58 -188 5 -55 -129 1 78 -219 -137 140 -224 -186 123 -20 47 -188 -266 112 153 31 -75 -10 21 -41 -58
7266e8j60J18K77j66J49l64K44j69o5K23k2n9J80j96j16K02m4K14k29J07j94O5
$$ -58 -218 -100 177 11 160 -204 40 -129 -194 29 7 -52 128 -68 -184 18 -26 188 -41 66 -128 -63
7288f3K53p6ol06Q0J48lj98Q6j23K55k31J91J08M3j16m4J11r3k64L97q8l3j00
$$ -63 190 114 108 -198 -118 30 27 -171 -85 -208 47 -184 7 115 158 42 -2 109 16 -248 149 61 28 -72
7312g2O0j45K02K18q1j15o7j04J49k37J8l1K66L5j86K24j47r0J58l9p9o1Q9J84
$$ -72 -12 -157 45 263 182 67 0 -104 45 -192 -174 -205 61 96 -90 134 -13 -103 55 16 -63 -124 -35 149
7336A49k0j01r4J30K86m34R0j43K79l33J16J38K19k37M5P9l1m34L43qJ35j14k57
$$ 149 129 28 -66 64 350 -84 6 -137 142 -191 -75 63 282 45 90 169 138 -296 47 39 174 60 -197
7359a97K69j77K57M1Q5n09K41J09j8l5M6k81J27p7N9J17K7N6k26j87L08k15J86
$$ -197 72 -105 152 193 278 -231 10 119 101 66 112 -169 -42 -119 -60 57 84 140 -86 -273 35 -180 6
7382FQ9j43J85J36m45j77N04K2K26k48l11%K80j47J59l10K42j17O3o1J50l87L40
$$ 6 95 -48 137 273 -172 -349 155 177 403 155 -156 -156 124 -23 136 -174 68 -49 14 -47 103 -284 56
7405E6j00j43J3n1N1J48N8n8L30l47O8j16R4j61J90k27O9L4j34L53j76j07L35
$$ 56 -44 -187 -174 -225 -174 -26 32 -26 304 -43 25 -91 3 -158 32 -195 -126 -92 -226 127 -49 -156 179
7428A79O7k44m4P8k75J82J07k32J71k9j3q5K33k73J44mJ72l28K31J05k49j79M97
$$ 179 246 2 -42 36 -239 -57 50 -182 -11 -40 -53 -138 95 -178 -34 -38 134 -194 37 142 -107 -286 211
7451B11j06k29K25k34r1P5J65OJ69Lk69N9J47k93L69j58j32L08l41J97K9r9Q8
$$ 211 105 -124 101 -133 -224 -149 16 22 191 194 -75 -16 131 -162 207 49 -83 225 -116 81 110 11 99
7474I9j29j21K35m3J57m02K77j59J54k18l7M2L10o3k45j46L58m02K87K12m2k61
$$ 99 -30 -151 84 41 198 -204 73 -86 68 -150 -187 -145 165 102 -143 -289 69 -333 -46 166 124 -137
7496a37J31J37j35l28L22j31M9rk4J02j43J57J92k75L27m23K76j06n2LO2J02j53
$$ -137 -6 131 -4 -332 -10 -141 -92 -101 -125 -23 -166 -9 183 -92 235 -188 88 -18 -70 -67 -5 97 -56
7519e6P4j34J34N3m6k17K16J41ol39Q4J51k7K24l92J44m5K00l5j5k1l92L91Q7
$$ -56 18 -116 18 71 25 -192 24 165 159 -180 -96 55 28 252 -140 4 -41 159 124 109 88 -304 87 174
7543A74j53k14J78L9j31J55j08j36L74j98Q9k52J54j3J29O9j70k05K52m1L3k94
$$ 174 21 -193 -15 24 -107 48 -60 -196 178 -20 69 -183 -29 -42 87 156 -14 -219 33 -8 25 -269
7565b69L30j11P5J47nR7k31k5o0j70J68J46j91Q6j7N6j68J18K39m08J49J02j77
$$ -269 61 -50 25 172 167 264 33 8 -52 -222 -54 92 -99 -13 -30 26 -142 -24 215 -193 -44 58 -119
7588a19K72j68N0M9j51l5K70l20L32j01k63L35o5k14J46k11p8L32j40J84k5j33
$$ -119 153 -15 35 84 -67 -102 168 -152 180 79 -184 151 86 -128 18 -193 -271 61 -79 105 80 -53
7610e3J03LP8l15K63j32p2J34J55l8k35K79k54L20l22k6K15k43J59J77J30k40
$$ -53 50 53 131 -184 79 -53 -125 9 164 126 -109 170 -84 236 -86 -112 103 -140 19 196 326 86
7632H6oj57L24m7j09j00O0q0L9J8k38K44K9N6k66L86j87k73L76l5j56RlJ89J16
$$ 86 80 -77 247 200 91 -9 51 -29 10 28 -210 34 63 119 -147 239 52 -221 155 120 -36 -27 -30 159 275
7657B75l80J13j60pK00O0l11J79J5N5l7K9J49k64L34k49oJ6J1P2k88L73k20J17
$$ 275 -105 8 -152 -159 41 101 -210 -31 -16 39 2 31 180 -84 250 1 -5 11 22 94 -194 179 -41 76
7681G6k14O6O6k0kJ08j45P0R6k93O3J33O4q1r7J34K3q6K09j28j38m2K13j64K29
$$ 76 -138 -72 -6 -26 -28 80 -65 5 101 -192 -129 4 68 -13 -110 24 47 -39 170 42 -96 -138 75 -89 140
7706A40k22J76o7o0m8m5N6L30m87J98O2m8j2N6Q1k03K50j10k33j44L30J35j71
$$ 140 -82 94 27 -33 -81 -126 -70 260 -227 -29 33 -15 -27 29 110 -93 157 47 -186 -330 0 135 -36
7729c6n1j75K07J00j3J52k11L41l01p8J59P0m11Q9L62j77l2J03k23J11J37j54
$$ -36 -87 -262 -55 45 32 184 -27 314 13 -65 94 164 -247 -158 204 27 -5 98 -125 -14 123 -31
7751c1j64K17j0m2J11o4K04j70j69K19j51J42k11J74MJ71j48J61j30j59kL6k16
$$ -31 -195 22 12 -30 81 17 221 51 -118 101 -50 92 -119 55 59 230 82 243 113 -46 -48 -12 -228
7774b28L38j44O1j14N6k7n1N4j7j77K13J7j67J84J1Q8k1l55L44j00r3J91k36J44
$$ -228 110 -34 27 -87 -31 -58 -109 -55 -72 -249 -36 -19 -186 -2 9 97 76 -279 65 -35 -128 63 -173 -29
7798b9n3n1K70l13K70j51J90j29j40K9J02KJ56K1j15j23N9K2k67J86j77L98j84
$$ -29 -82 -133 137 -176 94 -57 133 4 -136 -107 -5 -3 153 174 59 -64 -5 17 -250 -64 -241 157 -27
7821b7J46J37l97K26j66J98q2L9K6k12J24j45J95P8j45K02k24J28j52K17k41L65
$$ -27 119 256 -141 85 -81 117 35 74 100 -112 12 -133 62 140 -5 197 -27 101 -51 166 -75 290
7843B90l59K70k46n6k1M0%J66j75r0L64j98k3j10L05k60n8K77P6r4P3k68J26l45
$$ 290 -69 201 -45 -101 -122 -82 -82 84 -91 -181 183 -15 -38 -148 157 -103 -161 116 192 98 171 -97 29 -316
7867c16J87M1Q0r7N21j42l14QJ04K6j47O9M4J22j96k27J15L16l64Q3J88Q7P4k43
$$ -316 -129 -88 -8 -105 416 274 -40 -32 72 98 -49 20 64 186 -10 -237 -122 194 -170 -87 101 188 262 19
7891A9k3Q1Nj25m3L46l30K30j28j09q2J84j15J12N8r8L1j42L82k00k11K53k24
$$ 19 -4 77 82 -43 -86 260 -70 160 32 -77 -159 25 -90 22 80 -18 13 -129 253 53 -158 95 -129
7914a29K34j10j20j48K32J33j94J42j71J28j38J51J45l39K37j21J77j68K57k95
$$ -129 105 -5 -125 -273 -41 92 -102 40 -131 -3 -141 10 155 -184 53 -68 109 -59 198 -97
7934i7q5K31O0r0j90N5q2L21j31J77k42J40j38K1J4o8J25L39l19j95O5J2N5J65
$$ -97 -182 49 109 19 -171 -116 -198 123 -8 169 -73 67 -71 -50 -36 -104 21 360 41 -154 -89 -77 -22 143
7958A43k10j35L43j34J02k47K08J74k12N2K7o8J4q2K35J9j28k16q6J09P0L2j86
$$ 143 -67 -202 141 7 109 -138 70 244 32 84 111 43 57 -25 210 229 101 -115 -201 -92 -22 10 -176
7981a76J89j85K05K01l31M8J77J42l10n1J1J23K0j45j42L99J7l22J89k22K18k23
$$ -176 13 -172 33 234 -97 -49 128 270 -40 -91 -80 43 63 -82 -224 175 192 -130 59 -163 55 -168
8003a68J51K4J49k11J52J33k10J30k45J96j52N9J6p1q1L13k98O0J06r5J8R7n2
$$ -168 -17 7 156 -55 97 230 20 150 -95 101 -51 8 24 -47 -128 185 -113 -53 53 -42 -24 73 21
8026B1N9k85M4K45j19k91L69j77J5L74l08P7j02K19j98PJ09j69P4j38J85M5k7
$$ 21 80 -205 -161 84 -35 -326 43 -134 -119 255 -53 24 -78 141 -57 -50 59 -110 -36 -174 11 56 29
8049B9j20j5L68l64l2K32k49J73l21K83n0N7J78k62J30l59L24J05J24k20j7K5
$$ 29 -91 -106 262 -102 -134 98 -151 22 -299 -16 -66 -9 169 -93 37 -322 2 107 231 11 -6 19
8071A9q3K22Ll03K40k3j18O6j36J7J74L8j13N1l53L35j23j10m4M50j25k40J46
$$ 19 -64 158 161 -142 98 75 -43 23 -113 -96 78 116 3 54 -299 36 -87 -197 -241 209 84 -156 -10
8094a0K6O5Q0l07J07j02K54j16q0p9J82M4l01J80o1J83J52m04L76j2k26K47m72
$$ -10 16 81 161 -146 -39 -141 113 -3 -83 -162 20 64 -237 -57 -118 65 217 -187 189 177 -49 198 -274
8117b74L75k44J21m1Nj9L97k06j59K18m6j42J16j10K4l07J22K02o2O2r4pm3J47
$$ -274 101 -143 -22 -63 -58 -77 320 114 -45 173 127 -15 101 -9 15 -292 -170 32 -30 32 -62 -69 -112 35
8141C5o2m6j1J13j60J58l52K48O3q1J67J56l55J18j6J5q1o9K68k9k29J39K10k54
$$ 35 -27 -73 -84 29 -131 27 -325 -77 -14 -95 72 228 -127 -9 -25 -10 -91 -160 108 79 -150 -11 199 -55
8165e5L6r3r5R3p4L46Mk85L66n15J55J66q4l6J05P8l37K66J7j27N6J16j69k69
$$ -55 -19 -112 -207 -114 -188 158 162 -123 243 -272 -117 49 -35 -71 34 112 -225 41 58 -69 -13 103 -66 -335
8189c35K64L5
$$ -335 -71 -36
8191c6
$$ Imaginary data points
##PAGE= N=2
##DATA TABLE= (X++(I..I)), XYDATA
0@%%%%%%%%%qJ6j6J6k4L2m0M8n6O9q5J04j20J40j65J93k24K62l06L52m02M59n26
$$ 0 0 0 0 0 0 0 0 0 0 -8 8 -8 8 -16 16 -24 24 -32 37 -48 56 -64 76 -89 104 -120 142 -164 188 -214 245 -281
32b81N98o77P64q60R68j085J211j348J500j666J850k052K268k505K766l049L359
$$ -281 317 -360 404 -456 512 -573 638 -710 790 -876 974 -1078 1190 -1315 1451 -1598 1761
49A761l700M075m491M950n462O036o681P416q262R243j0400J1787j3487J5633
$$ 1761 -1939 2136 -2355 2595 -2867 3169 -3512 3904 -4358 4885 -5515 6272 -7215 8418
63H418j8426K2231k7743L6471n2393R0457l42751l14666P47777M0153k29929K08612
$$ 8418 -10008 12223 -15520 20951 -31442 59015 -283736 -598402 149375 189528 -40401 168211
75A68211P9562k86317J51178K30694j51624l3889K79687j1296j80457j21672j88042
$$ 168211 247773 -38544 112634 343328 191704 157815 437502 426206 245749 124077 -63965
86f3965R6212M17322k14505n60475J46748L03133k70774j01765K42716p0516j62133
$$ -63965 32247 449569 235064 -325411 -178663 124470 -146304 -248069 -5353 -75869 -238002
97b38002J02637r4881j80544K49468K26900j58970k2299N3105j94373P6417L68434
$$ -238002 -135365 -230246 -410790 -161322 65578 -93392 -115691 -62586 -256959 -180542 187892
108A87892p1450k33503J89991J36882j69284K0777J48168k2698K8665J5872k24208
$$ 187892 116442 -117061 72930 209812 40528 61305 209473 186775 215440 231312 7104
119G104o7579J98112j6189j07724J15665n2560k58922O5355J66174j46394l5800
$$ 7104 -60475 137637 121448 13724 129389 76829 -182093 -116738 49436 -96958 -132758
130a32758J81648p3655j31857J07977N259p6486J41387O4133j76688m7208J01349
$$ -132758 48890 -24765 -156622 -48645 -43386 -119872 21515 85648 -91040 -138248 -36899
141c6899M669L3498J06190n6976q9904Q1124p049r5441J08106P5820j13690J7279
$$ -36899 -32230 1268 107458 50482 -39422 41702 34653 -60788 47318 123138 9448 26727
153B6727N4555j37691l0206J56111j386j29290j0235K9614j9411N0038M6890n3212
$$ 26727 81282 -56409 -86615 69496 68110 -61180 -71415 -41801 -61212 -11174 35716 -17496
165a7496K9655P1475r7971n7841J06975J3377l2440O9639j8680j06483L0425P2496
$$ -17496 12159 83634 -14337 -72178 34797 48174 15734 85373 66693 -39790 -9365 63131
177F3131m2293k9276L6619k6824l5126M0024j2888l2762P6055J0637j15459j8840
$$ 63131 20838 -8438 28181 1357 -33769 6255 -6633 -39395 36660 47297 -68162 -87002
189h7002M2623k6144J9960N3841m5289l2194N7868j801m3464N2966N0783l6512
$$ -87002 -44379 -70523 -50563 3278 -42011 -74205 -16337 -18138 -61602 -8636 42147 5635
201E635J030L8896j6971P808N7414j6008m4419J8260j4095m0089L9764J9195n0138
$$ 5635 6665 45561 28590 36398 93812 77804 33385 51645 37550 -2539 37225 56420 6282
214F282K1746L4213p1915l7789N3950J948m5602N971J1149k9697k613J9834j7630
$$ 6282 28028 62241 -9674 -47463 6487 8435 -37167 -31196 -20047 -49744 -52357 -32523 -50153
227e0153j305K2354l2055j3934M4334l83M554O1679m288m6736K8697L6997k3085
$$ -50153 -51458 -29104 -61159 -75093 -30759 -31142 -26588 35091 30803 -15933 12764 49761 26676
240B6676p912L1437l492k5582K5442J0600m0013R124K4206l5993j7186J2409n937
$$ 26676 18764 50201 46709 21127 46569 57169 17156 26280 50486 14493 -2693 9716 3779
253C779Q346M235k3596n919P023j5518k0801J273L921j3140J1962K6297k4245
$$ 3779 12125 16360 -7236 -13155 -6132 -21650 -42451 -41178 -37257 -50397 -38435 -12138 -36383
266c6383j2850M0120P555k1018J2873J1911k900J6605J5688q068n095J4312J408
$$ -36383 -49233 -9113 -1558 -22576 -9703 2208 -692 15913 31601 23533 18438 32750 34158
279C4158k2231p029J2116M994m33k906n610J583L086m012o162j4799j6853J3294
$$ 34158 11927 4898 17014 22008 21575 18669 13059 14642 17728 13716 7554 -7245 -24098 -10804
293a0804K0537k2016k6280J8803J7596j9586j5896R454R855j594P873J4876n016
$$ -10804 9733 -12283 -38563 -19760 -2164 -21750 -37646 -28192 -18337 -19931 -12058 2818 -2198
306b198q81K3560M835k1939r988J4926K0709q968k3238R235J8266l926o259j0764
$$ -2198 -3079 20481 25316 3377 -6611 8315 29024 20056 -3182 6053 24319 20393 14134 3370
320C370p061O078N633J731r893j0569J4723O708k1258r728J516L006L925j0054
$$ 3370 -3691 2387 8020 9751 -142 -10711 4012 10720 -10538 -20266 -18750 -15744 -11819 -21873
334b1873l917J4330J0062L663p187q716J2407J0527j598j173l793O454J2538o121
$$ -21873 -25790 -11460 -1398 2265 -4922 -13638 -1231 9296 7698 6525 2732 9186 21724 15603
348A5603o506m17n342K242J336o965K371Q129J516o140o447L362m70q211q38k503
$$ 15603 9097 8680 3338 5580 6916 -49 2322 10451 11967 5827 -620 2742 2272 -5939 -6777 -9280
364i280m239P691J047q594K756L641o263L48P288l38J63P720L019Q30O413k700
$$ -9280 -13519 -5828 -4781 -13375 -10619 -6978 -13241 -12893 -5605 -5943 -5780 1940 4959 5789 12202 9502
380I502j1607J298P374k715k21M811o629l739J3953j567j4649P831N995j3314
$$ 9502 -2105 -807 6567 3852 3631 8442 1813 -1926 12027 10460 -4189 3642 9637 -3677
394c677J270N929m032P093M719j6755r942J1118L074r675N828Q240j2055N702
$$ -3677 -2407 3522 -510 6583 11302 -5453 -15395 -4277 -1203 -10878 -5050 3190 -8865 -3163
408c163J6519j8046n804K3376m591j3843N855n214k658J7367P73j9882J051J2638
$$ -3163 13356 -4690 -10494 12882 8291 -5552 303 -4911 -7569 9798 10571 -9311 -8260 4378
422D378j5307r955K5148M47j4454K1273l042l2895J8002K7204j6231n959O614
$$ 4378 -10929 -20884 4264 4711 -9743 11530 8488 -24407 -6405 20799 4568 -1391 5223
435E223j4483J353K5489m329j6615K0568M857l3542Q192K4862k0168O575L0146
$$ 5223 -9260 -7907 17582 13253 -3362 17206 22063 -11479 -3287 21575 1407 7982 38128
448C8128l5388l1303L5280O827l0186J2871Q931l1121M538J9632k7099J982M3238
$$ 38128 2740 -28563 6717 13544 -16642 -3771 5160 -25961 -21423 -1791 -28890 -26908 16330
461A6330j8298l4730K4946L45k3188M3547K5374n0665O69M3371l0335j8476N4434
$$ 16330 -1968 -36698 -11752 -11407 -34595 8952 34326 -16339 -15670 27701 -2634 -21110 33324
474C3324L757l2791K2003l396l7530L3915L8559l8761j3185K3691l7069k1879
$$ 33324 37081 4290 26293 22897 -14633 19282 57841 19080 5895 29586 -7483 -29362
486b9362N3085m758m8025L4450R453p2642P719N6336k4693j1303L4067l0262l3391
$$ -29362 23723 18965 -29060 5390 14843 -57799 -50080 6256 -18437 -29740 4327 -25935 -59326
499e9326M5799J5570k9681L3289K2413n8191K208N4660k7906l013P1701k5453
$$ -59326 -13527 2043 -27638 5651 28064 -30127 -27919 26741 -1165 -4178 67523 42070
511D2070o7073L9374K4210l8873K9292L8813n2441k6302L1201k4875j4068N9287
$$ 42070 -25003 14371 38581 -292 29000 67813 15372 -10930 20271 -4604 -18672 40615
523D0615j3489o5997K5832Q994n7711L6200O2146n2607k8821M1829k8402l2671
$$ 40615 27126 -38871 -13039 -4045 -61756 -25556 36590 -16017 -44838 -3009 -31411 -64082
535f4082O6962K6566m8956J0957J7629m4645J8484N7434k8235j0654M5742l7444
$$ -64082 2880 29446 -19510 -8553 9076 -35569 -17085 40349 12114 1460 47202 9758
547I758n0685N9592L2262m2144J8406J8371o7549r631O0054j5425k3584M0002
$$ 9758 -40927 18665 50927 8783 27189 45560 -21989 -31620 28434 13009 -10575 29427
559B9427j7550n4189K3142J7733k5877L5159L1257o6850k5136N3865q278j6282
$$ 29427 11877 -42312 -19170 -1437 -27314 7845 39102 -27748 -52884 981 -7297 -23579
571b3579N4627o586n9621K3153K3060l7169K3292N0150l2707l0521K1617j5657
$$ -23579 31048 24462 -35159 -12006 11054 -26115 -2823 47327 14620 -15901 5716 -9941
583i941j3075N4475O836n5582J2641J9622m5086J1959N1502k6121k0289K8911
$$ -9941 -23016 31459 38295 -17287 -4646 14976 -30110 -18151 33351 7230 -13059 15852
595A5852k5718l5142M5754K9792l1103L916J3452l9900K01M7939j3687j5932L5820
$$ 15852 -9866 -45008 746 30538 -565 3351 16803 -23097 -22896 25043 11356 -4576 31244
608C1244j9469m5731L1004K2353k4833J8569J8273m8637j7168M0212m577j6755
$$ 31244 11775 -33956 -2952 19401 -5432 13137 31410 -17227 -34395 5817 1240 -15515
620a5515L3658n772m4783J5062J8336k5204J9244L1350l4700j6319K9140j3367
$$ -15515 18143 12371 -32412 -17350 986 -24218 -4974 26376 -8324 -24643 4497 -8870
632h870j2452M4531O047m1430J2076J7442l0221J0831M0092k0660k0971K1665
$$ -8870 -21322 23209 29256 -12174 -98 17344 -12877 -2046 38046 17386 -3585 18080
644A8080j3204k4830L0639J4188k7713Q118P266l8948L349M0047j5650j7596K4400
$$ 18080 4876 -19954 10685 24873 -2840 5278 12544 -26404 -23055 16992 1342 -16254 8146
657H146j3767l1415K5227J9646k1195P991J9510k8957j2582L1322j64r026K5977
$$ 8146 -5621 -37036 -11809 7837 -13358 -5367 14143 -14814 -27396 3926 3762 -5264 20713
670B0713q769l0670K2163J5174k3580J2143K3732k5456j5190K1289n996j5070
$$ 20713 11944 -18726 3437 18611 -4969 7174 30906 5450 -9740 11549 5553 -9517
682i517K5681O490l3870K265J6571j9295L645K2030j7522j0200J8051j3100j5895
$$ -9517 16164 22654 -11216 -8951 7620 -11675 -8030 14000 -3522 -13722 4329 -8771 -24666
695b4666K5907J1273k2453J822J2414j7955J14K7731p977j6083J7643j495j8896
$$ -24666 1241 12514 -9939 -8117 4297 -13658 -13544 14187 6210 -9873 7770 6275 -12621
708a2621J3599J1753j1563M919O081j8928j335K1211o221j3502J4050P90j8518
$$ -12621 978 12731 1168 6087 12168 -6760 -8095 13116 6895 -6607 7443 8233 -10285
721a0285P241J0495j2841J977J4095j1890j1438J2574K379p468P506J64j0317
$$ -10285 -3044 7451 -5390 -3413 10682 -1208 -12646 -72 2307 -5161 2345 2509 -7808
734g808P645N164j3591L422J5406p589r391P161K44n851Q253M931j2346m12J0156
$$ -7808 -163 5001 -8590 -5168 10238 2649 -6742 419 663 -5188 3065 7996 -4350 -4762 5394
749E394n912l895P665k258j634N186o519n148J0198M340q524k648O303j185l611
$$ 5394 -518 -4413 3252 994 -640 4546 -1973 -7121 3077 7417 -1107 -3755 2548 1363 -2248
764b248N660r68o833O703K798q258J074L350j153J329j575l531K753L025k468
$$ -2248 3412 2444 -4389 2314 5112 -3146 -2072 1278 125 1454 -121 -3652 -899 2126 -342
779c42l823L606L749n106q20M306l203L2N066k986k497K641J245j118j086N42
$$ -342 -4165 -559 3190 -1916 -2736 1570 -1633 -1601 3465 479 -2018 623 1868 750 -336 206
795B06K291p26j993q63J604L293l060l430K506J799j882k38l96j081Q88J598p41
$$ 206 2497 1771 -222 -1085 519 3812 752 -2678 -172 1627 -255 -493 -889 -1970 -1082 516 -225
812b25k544N34K462L37j884j631K575L521k553l335K008L970p03k987J45K336
$$ -225 -2769 -2235 227 564 -1320 -2951 -376 3145 592 -2743 -735 3235 2532 -455 -310 2026
828B026r13M24J455l144p32K329J000j744l030J175M341k562m024J393K653J24
$$ 2026 1113 1537 2992 -152 -884 1445 2445 701 -2329 -1154 3187 625 -3399 -2006 647 771
844G71l506j350M223n29j776K339j394k113L392J307r43k227K98L514L30k558
$$ 771 -2735 -4085 138 -391 -2167 172 -1222 -3335 57 1364 421 -1806 -1508 2006 2336 -222
860b22jJ462J848k166l461M453J874m246J074J738k635K36K314o98k045n51J778
$$ -222 -223 1239 3087 921 -2540 1913 3787 -459 615 2353 -282 -46 2268 1570 -475 -1026 752
877G52n51r67L41j105J801Q14m914Q24N447l688l032M803N14m355J357K967k634
$$ 752 201 -766 -425 -1530 271 1085 -3829 -3005 2442 -1246 -4278 525 1039 -3316 -1959 1008 -1626
894a626l85L860j675k244K616j005l01M686j153m654L792K601o154J737P468m593
$$ -1626 -2011 1849 174 -2070 546 -459 -760 3926 2773 -1881 1911 4512 -1642 95 7563 2970
910B970n806N837l03o052N323K479o448P70K001m397P59N053l812l184N917k948
$$ 2970 -2836 3001 2698 -3354 1969 4448 -2000 -1230 771 -3626 -2867 2186 -1626 -4810 1107 -1841
926a841p632Q424N340j0108L057P572r003k472J0090j262l675N875p39o926L915
$$ -1841 -9473 -1049 4291 -5817 -2760 4812 -4191 -6663 3427 2165 -1510 4365 3626 -3300 615
941F15N086n366L158O906j1043m078J1368m925o567J2671o52j4837L422P028p147
$$ 615 5701 335 3493 10399 -644 -4722 6646 1721 -4846 7825 7173 -7664 -4242 2786 -4361
956d361P05R243o802p280P297j750o545J2334K624j3036N129N939j2587M665J6318
$$ -4361 -3656 5587 -1215 -8495 -1198 -2948 -9493 2841 5465 -7571 -2442 3497 -9090 -4425 11893
971A1893q447q543J1019k203j1237J0467Q770j1192J830O393j4045p29J4893n431
$$ 11893 3446 -5097 5922 3719 -7518 2949 11719 527 2357 8750 -5295 -6024 8869 3438
985C438o510J1029o853j5806J2299R257j3211M601J1683j7356q541J7248p24o904
$$ 3438 -3072 7957 1104 -14702 -2403 6854 -6357 -1756 9927 -7429 -15970 1278 554 -6350
999f350J3405j674j7007O548R569r118O038J4167j5090r876J5444m259r554K0420
$$ -6350 7055 5381 -11626 -5078 4491 -4627 1411 15578 488 -9388 6056 1797 -7757 12663
1013A2663L059k2364L537R702j4041K833J8714r111j3363R931m137j3022J7656
$$ 12663 15722 -6642 -3105 6597 -7444 -4611 14103 4992 -8371 1560 -2577 -15599 2057
1026B057J0254j9234K642R177j9050J395K4294o405j2173J3439m328j8668J3764
$$ 2057 12311 -6923 -4281 4896 -14154 -12759 11535 5130 -7043 6396 2068 -16600 -2836
1039b836J7159j2811K44J0767j8558o669K3033k619j0876J6109m444k4215J0675
$$ -2836 14323 1512 1756 12523 -6035 -12704 10329 7710 -3166 12943 8499 -15716 -5041
1052e041J4755j3696L067J6446j8075j6878J9009L245j2347J5444N040k3178K353
$$ -5041 9714 -3982 -915 15531 -2544 -19422 -413 2832 -9515 5929 10969 -12209 -9856
1065i856J3125j1672L998K0309j2842j5301J4538j146j3837K0362J2297k3798
$$ -9856 3269 -8403 -4405 15904 3062 -12239 2299 1153 -12684 7678 19975 -3823
1077c823j734J4373j4743l486K5030l647j8382R414l76j7459J3708J5639j5940
$$ -3823 -5557 8816 -5927 -9413 15617 11970 -6412 3002 2626 -14833 -1125 14514 -1426
1090a426k700J1637j7339o914K4445m99j5267J2356J142k2115P820J9638j0022
$$ -1426 -4126 7511 -9828 -16742 7703 7204 -8063 4293 5435 -16680 -8860 10778 756
1103G56l815J4502j2060j4543J8284M209j1568J3003L656k1814K208J4831r896
$$ 756 -3059 11443 -617 -15160 3124 7333 -4235 8768 12424 -9390 -7182 7649 -2247
1116b247m80J7189r553j8754J1763N850j2936J0412J1846j8332m449J1896q916
$$ -2247 -2727 14462 4909 -13845 -2082 3768 -9168 1244 13090 -5242 -9691 2205 -6711
1129f711j080J7985m123j3592P979N08j1948J1684J4348j4767n321J2379r173
$$ -6711 -7791 10194 6071 -7521 458 966 -10982 702 15050 283 -5038 7341 -1832
1142a832p939J7461K609j2594N561J294j4008N190J2506p247k873P861j0296q411
$$ -1832 -9771 7690 10299 -2295 3266 4560 -9448 -4258 8248 1001 -1872 5989 -4307 -12718
1156a2718J4319J847j0564R348M168j5943K65J2544l962j650J0183n912j0413
$$ -12718 1601 3448 -7116 2232 6400 -9543 -9278 3266 -696 -2346 7837 1925 -8488
1169h488Q319M011o187P475M313j1398J32P002p693M73J2668m568j2052N301L015
$$ -8488 -169 3842 -2345 5130 9443 -1955 -1823 5179 -2514 -2041 10627 6059 -5993 -692 2323
1184B323p578N130P509r376k955O173n917k642J0338j403n979M844j753p504P368
$$ 2323 -5255 -125 7384 -1992 -4947 1226 -4691 -7333 3005 1602 -4377 467 -1286 -8790 -1422
1199a422P591p123k149P683m450n973R012K112o317M663R15p992K763N198l805
$$ -1422 6169 -954 -3103 4580 130 -5843 3169 5281 -1036 3627 4542 -3450 -687 4511 706
1214G06O43L683n442l987O258K13o259N583L391r378k93O773l644j456N882k702
$$ 706 1349 5032 -410 -4397 1861 2074 -4185 1398 4789 -4589 -4882 1891 -1753 -3209 2673 -29
1230b9m146L335O09k734L194K798m999L45L748m208m17P235k649n789M948J747
$$ -29 -4175 -840 -231 -2965 229 3027 -1972 -1627 2121 -2087 -2504 4731 2082 -3707 1241 2988
1246B988n553J643M543k631j466K374j841j980L940R4k869J937n4l069K056K066
$$ 2988 -2565 -922 3621 990 -476 1898 57 -1923 2017 2111 -758 1179 1125 -1944 112 2178
1262B178l614m7M452k435m653L201K822l408M12J523k718N80J877j479p0J467
$$ 2178 -1436 -1483 2969 534 -4119 -918 1904 -1504 -1092 431 -2287 -1707 170 -1309 -1379 88
1278H8q08l52J167k2j687K178K128l460q38M530p04k541J864N87j259M49l02k44
$$ 88 -720 -1072 95 73 -1614 564 2692 -768 -1606 2924 2220 -321 1543 2130 871 1320 1018 774
1296G74J67j43o6o49o0r18m38J817o73k939K049J551k607l05J480L00o33k11J006
$$ 774 941 798 732 83 23 -895 -1333 484 -189 -3128 -1079 472 -2135 -2440 -960 -660 -1293 -1504 -498
1315d98Q6m60Q47M66J96N5l49J049O09j461M19J594p59j560P01J560j799j286
$$ -498 -412 -872 -25 441 637 692 343 1392 2001 540 959 2553 1794 234 935 2495 696 -590
1333e90J294O49j472m76o0M72m56n92K2O96q57m00J095M53j248k36K330k16k054
$$ -590 704 1353 -119 -595 -655 -183 -639 -1231 -1209 -513 -1370 -1770 -675 -222 -1470 -1706 624 408 -1646
1352a646J136J442m53o32K30R87j33m71L0K47j19j45j85N79Q4j746J310J297k338
$$ -1646 -510 932 479 -153 77 1064 931 460 490 737 618 473 288 867 951 -795 515 1812 -526
1371e26k76K103m10j871M99R05L97r05o6j04j69O48o18J15J445k125o26K428j020
$$ -526 -802 1301 891 -980 -481 424 821 -84 -150 -254 -423 225 -393 -278 1167 -958 -1584 844 -176
1390a76j917J998J030k122q76J770K52r58R98J67j128J236l28j518K652Q31k593
$$ -176 -2093 -95 935 -1187 -2063 -293 -41 -999 -1 166 -962 274 -54 -1572 1080 1911 -682
1407f82J593J592k521k66L558o87l212J705J394l439N04K419j680l03N94k817
$$ -682 911 2503 -18 -284 3274 2587 -625 1080 2474 -965 -461 1958 278 -25 569 -2248
1423b248J1L046j975j612K965o06m471K522L525l656J95M805l443l431M810J158
$$ -2248 -2237 809 -1166 -2778 187 -419 -4890 -2368 1157 -2499 -2304 2501 -942 -4373 437 1595
1439A595k255K768L45l144J098K406k771R02N346m196m154N058j173m442N638
$$ 1595 -660 2108 2453 -691 407 2813 42 944 6290 2094 -2060 2998 1825 -2617 3021
1454C021J881p132J09M159m238j580N859p13n051K961k83n661N616M726o577O00
$$ 3021 4902 -2230 -2121 2038 -2200 -3780 2079 1366 -3685 -724 -1007 -6668 -1052 3674 -2903 -2303
1470b303N181o555j905R181m95n704M792J558q312K356Q486m750j226N572o026
$$ -2303 2878 -3677 -5582 3599 3104 -2600 2192 3750 -4562 -2206 6280 1530 304 5876 -150
1485a50m557Q114n69n305O795R94j0918J401Q033n265j518R274m873r987P566
$$ -150 -4707 3407 2838 -2467 4328 5322 -5596 -4195 3838 -1427 -2945 6329 1456 -8531 -965
1500i65L316p338N437O066r568j544O331n003m57J0761k769j0221O060K307q988
$$ -965 2351 -4987 450 6516 -3052 -4596 1735 -3268 -3725 7036 4267 -5954 106 2413 -6575
1515f575O283R875r572m298Q197n783n719J2097K443r531K461K629r339L491J1036
$$ -6575 -292 9583 11 -4287 3910 -1873 -7592 4505 6948 -2583 -122 2507 -6832 -3341 7695
1530G695o760l519Q155p166p702J1492M204q754M357M440j2334j070J2354k753
$$ 7695 935 -2584 5571 -1595 -9297 2195 6399 -2355 2002 6442 -5892 -6962 5392 2639
1544B639n192Q672l796j0778P242M489o890N557N854j2061l461R573k957l615
$$ 2639 -2553 6119 2323 -8455 -1213 3276 -3614 1943 7797 -4264 -7725 1848 -1109 -4724
1558d724J0849q75j3304M245O297p569L873J0196q130o183O687k666l568J0819
$$ -4724 6125 5250 -8054 -3809 2488 -5081 -1208 8988 858 -5325 1362 -1304 -4872 5947
1572E947J904r692J752L590q912K867J2037n938o583O540l807q165R724N546q127
$$ 5947 7851 -1841 -89 3501 -5411 -2544 9493 3555 -3028 3512 -295 -8460 1264 6810 -1317
1587a317Q45K452q292j13R010j910k916O123m664r431P727N925o029L850M980
$$ -1317 -472 1980 -6312 -6425 2585 675 -2241 3882 -782 -10213 -2486 3439 -2590 1260 6240
1602F240r842k918Q526n37k452P583q54r717K746L456l844M741N837q887m058
$$ 6240 -3602 -6520 2006 1469 -983 6600 5746 -3971 -1225 2231 -1613 3128 8965 78 -3980
1617c980O004l771k260R106L03r586J663K879o276K650Q992m729m521L658l923
$$ -3980 2024 -1747 -4007 5099 5402 -4184 -2521 358 -5918 -3268 5724 995 -3526 132 -3791
1632c791k668Q782J511n665K986O32p578K620Q870l387l049O006m320p336P118
$$ -3791 -6459 2323 3834 -1831 1155 1787 -5791 -3171 5699 2312 -737 5269 949 -6387 731
1647G31M030m562K865J291q034J44N859k789m73O198l995p411M944K822n625M838
$$ 731 4761 199 3064 4355 -3679 -3535 2324 -465 -938 5260 1265 -6146 -1202 1620 -4005 833
1663H33N220q788k693O740k434j953O939o28o594K399J763m567M031N427o233
$$ 833 6053 -2735 -5428 1312 -1122 -3075 3864 3236 -3358 -959 804 -3763 268 5695 -538
1678e38j815M806m294l133Q671Q10p253K529K663n735N63P197k757l372M220k387
$$ -538 -2353 2453 -1841 -4974 3697 4507 -2746 -217 2446 -3289 -2726 4471 1714 -1658 2562 175
1694A75m949N883K203m607K533J694o406M93O268k831k585M897j175o351L284
$$ 175 -4774 1109 3312 -1295 1238 2932 -3474 -2981 3287 456 -2129 2768 1593 -4758 -1474
1709a474L743m279J367L635m647j974M491j365j402M256m42m856K524L032m228
$$ -1474 2269 -2010 -643 2992 -1655 -3629 862 -503 -1905 2351 1909 -2947 -423 2609 -1619
1724a619R01N611l896l502M346n32l167L676J687m074J34J681k204k10K927j733
$$ -1619 -718 4893 997 -2505 1841 1309 -1858 1818 3505 -569 -435 1246 -958 -1168 1759 26
1740B6k090K708j107l537L553K260l843P49K174k645r43L319M53k068J092J400
$$ 26 -2064 644 -463 -4000 -447 1813 -2030 -1281 893 -1752 -2695 624 1077 -991 101 1501
1756A501k307J103J525j371L13J805k182j053K779q00j669J623Q91l277N4K407
$$ 1501 -806 297 1822 451 764 2569 387 -666 2113 1313 -356 1267 2158 -1119 -1065 1342
1772A342j485j491J662k99j391N46J2j71J036k15r16N27Q16q06P6J448l30j238
$$ 1342 -143 -1634 28 -271 -1662 -1116 -1104 -1275 -239 -454 -1370 -843 -27 -833 -757 691 361 -877
1790h77J452R16j727M02J295k92o17J37K66j50l69K83o59M16k55o42O23L76j638
$$ -877 575 1491 -236 166 1461 1169 552 689 955 805 436 719 60 476 221 -421 202 578 -1060
1809a060K24J447r05p96P24M04m31m20O05L03n31K98J78k7J55n07K78R14j065
$$ -1060 -836 611 -294 -1090 -366 38 -393 -813 -208 95 -436 -138 40 13 168 -339 -61 853 -212
1828b12m62J195K6r28p6P69K81j016K52P86n92q8K88J02%m32p2R76k67r97Q79
$$ -212 -674 521 547 -381 -457 312 593 -423 -171 615 23 -65 223 325 325 -107 -179 797 530 -467 412
1849D12N28m29n04K06M98r53j95Q71l15n40K24o8r4k2m56K63J45l47k96O45N52
$$ 412 940 511 7 213 711 -242 -437 434 119 -421 -197 -265 -359 -381 -837 -574 -429 -776 -1072 -427 125
1870A25j185J38J561m63q66J071M26r52K91O77J9k55K63p1J80o7r59J98J371l19
$$ 125 -1060 -922 639 176 -690 381 807 -145 146 823 842 587 850 779 959 892 -67 131 1502 1183
1890A183j951J092L33j322J56J010p45j064N17K35r28P17N53o44J44M25j448J193
$$ 1183 -768 324 657 -665 -509 501 -244 -1308 -791 -556 -1484 -767 -214 -858 -714 -289 -1737 -544
1908e44J479j584L1J754j104j127J752O53j498M75J292j656o71J896j64p22J066
$$ -544 935 -649 -618 1136 32 -1095 657 1310 -188 287 1579 -77 -748 1148 984 262 1328
1925A328p97j096J398j61j582J646Q84k465j016K975n05k247K506P33l406R45
$$ 1328 531 -565 833 672 -910 736 1620 -845 -1861 1114 609 -1638 868 1601 -1805 -860
1941h60J573j930K55K178j568j009J534j005j133L024O68l731J675J777l221J78
$$ -860 713 -1217 -962 1216 -352 -1361 173 -832 -1965 1059 1727 -2004 -329 1448 -1773 -1595
1957a595M215j658k466K449k67k810K321K335k346l8J946k930p82L751q37k235
$$ -1595 2620 962 -1504 945 678 -2132 189 2524 178 140 2086 -844 -1626 2125 1288 -947
1973i47L227q41m639K713K789k966m3L369l148l430M007M73k841L496N50m927
$$ -947 2280 1439 -3200 -487 2302 -664 -707 2662 -486 -3916 91 564 -2277 1219 1769 -3158
1989c158J241K396k734J247M259l543k800L663O6l247L946L250n561l79L604k874
$$ -3158 -1917 479 -2255 -1008 3251 -292 -3092 571 637 -2610 1336 4586 -975 -1354 2250 -624
2005f24m23M973j298l499K291q14k938L401K631m366k9K825m519j717O553n03
$$ -624 -1047 3926 2628 -871 1420 606 -2332 1069 3700 -666 -695 2130 -2389 -4106 2447 1944
2021A944m680L207K75n230K374M130k347o79K675k999k992N029L47k239L629L61
$$ 1944 -2736 471 746 -4484 -2110 2020 -327 -1006 1669 -1330 -4322 707 1054 -1185 2444 2805
2037B805o409J940M511l048n6M672l151m760L618J552l152L439K103n775k1K796
$$ 2805 -3604 -1664 2847 -201 -257 4415 1264 -3496 122 1674 -1478 1961 4064 -1711 -1732 1064
2053A064l353J161N233l080l967L239k58l799M079L852n093j010L435l566j239
$$ 1064 -2289 -1128 4105 1025 -2942 297 39 -3760 319 4171 -922 -1932 1503 -2063 -3302
2068c302N970j60l739K079p31m096L485L519k970J51K680n004k316O464Ql865
$$ -3302 2668 2508 -1231 848 117 -3979 -494 3025 55 206 2886 -2118 -4434 2030 2038 -1827
2084a827L783J84o277J758M523k642P42L280l875l080L819L07k289M333P50o448
$$ -1827 1956 2140 -4137 -2379 2144 -498 244 3524 -351 -3431 388 695 -1594 2739 3489 -2959
2100b959J141L841l489M18N293k631m754L101m9k864M148K224m761m03K307l096
$$ -2959 -1818 2023 -1466 -1048 4245 1614 -3140 -39 -88 -2952 1196 3420 -1341 -1744 563 -2533
2116b533r1N680j338m082L393r01m601M140M382m319q97L357l534k233N807M24
$$ -2533 -2624 3056 1718 -2364 1029 128 -4473 -333 4049 -270 -1167 2190 -1344 -3577 2230 2654
2132B654l460K797k83m889K439L402k874K03L581m186l425M790O17l410L282J593
$$ 2654 -806 1991 1708 -3181 -742 2660 -214 -11 3570 -616 -4041 749 1366 -2044 1238 2831
2148B831n909M0M239k197k82L953k308l343K822L00k430L446J987m658kL549l116
$$ 2831 -3078 -3038 1201 -996 -1278 2675 367 -2976 -154 146 -2284 1162 3149 -1509 -1511 2038 -1078
2165a078j039N787j502m085K232Q64l168K034L125k961j252K209k353j408M132
$$ -1078 -2117 3670 2168 -1917 315 1179 -1989 45 3170 209 -1043 1166 -1187 -2595 1537
2180A537J50l290K139M32m178J893L727k742r43L112j604l008L036J742k463J094
$$ 1537 1687 -1603 536 968 -3210 -1317 2410 -332 -1275 1837 233 -2775 261 2003 -460 634
2196F34J231l198j2L023j677k86K593j733k825K609P38k317J445J936l180j152
$$ 634 1865 -1333 -1345 1678 1 -285 2308 575 -2250 359 1097 -1220 225 2161 -1019 -2171
2212b171K737q25j345K652k59k201J390K28j599J553J497k129n89K371j788j080
$$ -2171 566 -259 -1604 1048 789 -1412 -22 206 -1393 160 1657 -472 -1061 1310 -478 -1558
2228a558K812L81k408N39J640k395M71J870p50q08P61n73q99J231N70j787J021
$$ -1558 1254 1635 -773 -234 1406 -989 -518 1352 602 -206 555 -18 -917 314 884 -903 118
2245A18Q48k648O76K258j443p66J646l32j819J098J030j084l7J124p12p63J347
$$ 118 966 -1682 -1006 1252 -191 -957 689 357 -1462 -364 666 -418 -455 669 -43 -806 541
2262E41n22k99J265o77j271J490J32j148N64J225j252r33J484J21j006M30P67
$$ 541 19 -280 985 308 -963 527 659 -489 75 1300 48 -885 599 720 -286 144 911
2279I11j199J97J61n73L44N58o24m0N74o10n84J038M35j202J68R50j054k40R24
$$ 911 -288 -91 70 -503 -159 399 -225 -265 309 -301 -885 153 588 -614 -446 504 -550 -790 134
2298A34k0m75L05K4J14J76l50N6R7M45q15N12P58n98o46J012l03o35K61j8L19
$$ 134 114 -361 -56 -32 82 258 -92 -36 61 506 -309 203 961 363 -283 729 426 -209 52 34 353
2319C53o07L73R6m53K50n2J64P0j86o69P53j36p08M56N39k04n33L59M13n65n4
$$ 353 -254 119 215 -238 12 -40 124 194 8 -661 92 -44 -752 -296 243 39 -494 -135 278 -287 -341
2340c41P11k17k27K27j60J86J12k67J46L06n86j57O01N2o91J30N18k12p60Q69
$$ -341 370 153 -74 153 -7 179 291 24 170 476 -110 -267 334 386 -305 -175 343 131 -629 240
$$ [...]
8191A
##END NTUPLES=NMR FID
##END=
