##TITLE=1H_LR-751-KB-R3
 DMSO-d6+CDCl3
 8 sc, 
 27.07.2022
##JCAMPDX= 6.0         $$ Bruker NMR JCAMP-DX V2.0
##DATA TYPE= NMR FID
##DATA CLASS= NTUPLES
##ORIGIN= UXNMR, Bruker Analytische Messtechnik GmbH
##OWNER= root
$$ XWIN-NMR		Version 3.5
$$ Wed Jul 27 10:27:02 2022 Russian Standard Time (UT+4h)  she@DPX200
##.OBSERVE FREQUENCY= 200.1313499994
##.OBSERVE NUCLEUS= ^1H
##.DELAY= (6, 6)
##.ACQUISITION MODE= SIMULTANEOUS
##.ACQUISITION SCHEME= undefined
##.AVERAGES= 8
##.DIGITISER RES= 18
##SPECTROMETER/DATA SYSTEM= spect
##.PULSE SEQUENCE= zg30
##.SOLVENT NAME= CDCl3
##.SHIFT REFERENCE= (INTERNAL, CDCl3, 0, 15.7039)
##AUDIT TRAIL= $$ (NUMBER, WHEN, WHO, WHERE, WHAT)
$$ ##TITLE= Audit trail, XWIN-NMR		Version 3.5
$$ ##JCAMPDX= 5.01
$$ ##ORIGIN= Bruker BioSpin GmbH
$$ ##OWNER= she
$$ F:/spectra/data/she/nmr/H-F/1/audita.txt
$$ ##AUDIT TRAIL=  $$ (NUMBER, WHEN, WHO, WHERE, WHAT)
(   1,<2022-07-27 10:25:44.09 +0400>,<she>,<DPX200>,
      <created by zg, POWCHK disabled, PULCHK disabled
       configuration hash MD5:
       00 E9 B6 7A A2 85 ED C7 34 08 36 98 17 FE 4E 26
       data hash MD5: 16K
       17 EB 7D DB 5E BD 4E CC 3E A1 A1 D1 37 62 61 CC>)
$$ ##END=
$$ 
$$ hash MD5
$$ 74 9C CC 59 B8 B9 DC 07 AC 87 0A 9A 69 35 C5 D6
##$RELAX= 
##$RELAX= 
##$RELAX= 
##$RELAX= 
##$RELAX= 
##$RELAX= 
$$ Bruker specific parameters
$$ --------------------------
##$DU= <F:/spectra>
##$EXPNO= 1
##$NAME= <H-F>
##$PROCNO= 1
##$TYPE= <nmr>
##$USER= <she>
##$AMP= (0..31)
100 100 100 100 100 100 100 100 100 100 100 100 100 100 100 100 100 100 
100 100 100 100 100 100 100 100 100 100 100 100 100 100 
##$AQSEQ= 0
##$AQ_mod= 1
##$AUNM= <au_zg>
##$AUTOPOS= <>
##$BF1= 200.13
##$BF2= 200.13
##$BF3= 200.13
##$BF4= 200.13
##$BF5= 200.13
##$BF6= 200.13
##$BF7= 200.13
##$BF8= 200.13
##$BYTORDA= 1
##$CFDGTYP= 0
##$CFRGTYP= 5
##$CHEMSTR= <none>
##$CNST= (0..31)
1 1 145 1 1 1 1 1 1 1 1 1 1 1 1 1 1 1 1 1 1 1 1 1 1 1 1 1 1 1 1 1 
##$CPDPRG= <>
##$CPDPRG1= <>
##$CPDPRG2= <>
##$CPDPRG3= <>
##$CPDPRG4= <mlev>
##$CPDPRG5= <mlev>
##$CPDPRG6= <mlev>
##$CPDPRG7= <mlev>
##$CPDPRG8= <mlev>
##$CPDPRGB= <>
##$CPDPRGT= <>
##$D= (0..31)
0 1.2 0 0 0 0 0 0 0 0.06 0 0.03 0 0 0 0 0.0002 0 0 0 0 0 0 0 0 0 0 0 0 
0 0 0 
##$DATE= 1658903143
##$DBL= (0..7)
120 120 120 120 120 120 120 120 
##$DBP= (0..7)
150 150 150 150 150 150 150 150 
##$DBP07= 0
##$DBPNAM0= <>
##$DBPNAM1= <>
##$DBPNAM2= <>
##$DBPNAM3= <>
##$DBPNAM4= <>
##$DBPNAM5= <>
##$DBPNAM6= <>
##$DBPNAM7= <>
##$DBPOAL= (0..7)
0.5 0.5 0.5 0.5 0.5 0.5 0.5 0.5 
##$DBPOFFS= (0..7)
0 0 0 0 0 0 0 0 
##$DE= 6
##$DECBNUC= <off>
##$DECIM= 32
##$DECNUC= <off>
##$DECSTAT= 4
##$DIGMOD= 1
##$DIGTYP= 9
##$DL= (0..7)
0 120 120 120 120 120 120 120 
##$DP= (0..7)
150 150 150 150 150 150 150 150 
##$DP07= 0
##$DPNAME0= <>
##$DPNAME1= <>
##$DPNAME2= <>
##$DPNAME3= <>
##$DPNAME4= <>
##$DPNAME5= <>
##$DPNAME6= <>
##$DPNAME7= <>
##$DPOAL= (0..7)
0.5 0.5 0.5 0.5 0.5 0.5 0.5 0.5 
##$DPOFFS= (0..7)
0 0 0 0 0 0 0 0 
##$DQDMODE= 0
##$DR= 18
##$DS= 0
$$ [...]
##$SUBNAM2= <"">
##$SUBNAM3= <"">
##$SUBNAM4= <"">
##$SUBNAM5= <"">
##$SUBNAM6= <"">
##$SUBNAM7= <"">
##$SUBNAM8= <"">
##$SUBNAM9= <"">
##$SW= 18.0517283424941
##$SWIBOX= (0..15)
0 0 2 0 0 0 0 0 0 0 0 0 0 0 0 0 
##$SW_h= 3612.71676300578
##$TD= 16384
##$TD0= 1
##$TE= 0
##$TE2= 300
##$TE3= 300
##$TEG= 300
##$TL= (0..7)
0 120 120 120 120 120 120 120 
##$TP= (0..7)
150 150 150 150 150 150 150 150 
##$TP07= 0
##$TPNAME0= <>
##$TPNAME1= <>
##$TPNAME2= <>
##$TPNAME3= <>
##$TPNAME4= <>
##$TPNAME5= <>
##$TPNAME6= <>
##$TPNAME7= <>
##$TPOAL= (0..7)
0.5 0.5 0.5 0.5 0.5 0.5 0.5 0.5 
##$TPOFFS= (0..7)
0 0 0 0 0 0 0 0 
##$TUNHIN= 0
##$TUNHOUT= 0
##$TUNXOUT= 0
##$USERA1= <user>
##$USERA2= <user>
##$USERA3= <user>
##$USERA4= <user>
##$USERA5= <user>
##$V9= 5
##$VALIST= <valist>
##$VCLIST= <CCCCCCCCCCCCCCC>
##$VD= 0
##$VDLIST= <DDDDDDDDDDDDDDD>
##$VPLIST= <PPPPPPPPPPPPPPP>
##$VTLIST= <TTTTTTTTTTTTTTT>
##$WBST= 1024
##$WBSW= 4
##$XGAIN= (0..3)
0 0 0 0 
##$XL= 0
##$YL= 0
##$YMAX_a= 313734
##$YMIN_a= -300040
##$ZGOPTNS= <>
##$ZL1= 120
##$ZL2= 120
##$ZL3= 120
##$ZL4= 120
##$ABSF1= 10
##$ABSF2= 0
##$ABSG= 5
##$ABSL= 3
##$ALPHA= 0
##$AQORDER= 0
##$ASSFAC= 0
##$ASSFACI= 0
##$ASSFACX= 0
##$ASSWID= 0
##$AUNMP= <proc_1d>
##$AZFE= 0.1
##$AZFW= 0.1
##$BCFW= 1
##$BC_mod= 2
##$BYTORDP= 1
##$COROFFS= 0
##$CY= 11.3945322036743
##$DATMOD= 1
##$DC= 2
##$DFILT= <>
##$DTYPP= 0
##$F1P= 2.36226072786647
##$F2P= -0.459571619588291
##$FCOR= 0.5
##$FTSIZE= 0
##$FT_mod= 4
##$GAMMA= 1
##$GB= 0.15
##$INTBC= 1
##$INTSCL= 1
##$ISEN= 128
##$LB= 0.24
##$LEV0= 0
##$LPBIN= 0
##$MAXI= 10000
##$MC2= 0
##$MEAN= 0
##$ME_mod= 0
##$MI= 1.114404
##$NCOEF= 0
##$NC_proc= 0
##$NLEV= 6
##$NOISF1= 3.799351
##$NOISF2= 2.8
##$NSP= 1
##$NTH_PI= 0
##$NZP= 0
##$OFFSET= 15.70392
##$PC= 1
##$PHC0= -18037.38
##$PHC1= 11.40068
##$PH_mod= 1
##$PKNL= yes
##$PPARMOD= 0
##$PSCAL= 0
##$PSIGN= 0
##$REVERSE= no
##$SF= 200.130013532006
##$SI= 16384
##$SIGF1= 3
##$SIGF2= 2
##$SINO= 400
##$SIOLD= 16384
##$SREGLST= <1H.CDCl3>
##$SSB= 0
##$STSI= 0
##$STSR= 0
##$SW_p= 3612.71676300578
##$SYMM= 0
##$S_DEV= 0
##$TDeff= 0
##$TDoff= 0
##$TI= <>
##$TILT= no
##$TM1= 0
##$TM2= 0
##$TOPLEV= 0
##$USERP1= <user>
##$USERP2= <user>
##$USERP3= <user>
##$USERP4= <user>
##$USERP5= <user>
##$WDW= 1
##$XDIM= 8192
##$YMAX_p= 0
##$YMIN_p= 0
$$ End of Bruker specific parameters
$$ ---------------------------------
##NTUPLES= NMR FID
##VAR_NAME=  TIME,          FID/REAL,        FID/IMAG
##SYMBOL=    X,             R,               I
##VAR_TYPE=  INDEPENDENT,   DEPENDENT,       DEPENDENT
##VAR_FORM=  AFFN,          ASDF,            ASDF
##VAR_DIM=   8192,          8192,            8192
##UNITS=     SECONDS,       ARBITRARY UNITS, ARBITRARY UNITS
##FACTOR=    0.0002768,     1,               1
##FIRST=     0,             0,               0
##LAST=      2.2672688,     0,               0
##MIN=       0,             -300040,         0
##MAX=       2.2672688,     313734,          0
$$ Real data points
##PAGE= N=1
##DATA TABLE= (X++(R..R)), XYDATA
0@%%%%%%%%%%qJ6j6J6k4L2m0M9n7P2q8J04j25J50j77K08k41K79l23L71m23M83
32B58n52O27p07P96q95J004j123J254j401J558j729J916k120K343k586K854l147
49a650L467l818M206m636N112n644O244o922P698q593R642j0894J2410j4297J6724
64I049j9972K4573l1658M4101p2392K58520M2681k98462J21622R099K3588Q5381
76A96130M4813j38766n8000k0618m9405o4276J8275N9659P9703q0098k13131p3187
88b98901J40662O4344n507N8787j2786j47990n129J33018L7848O762J16138M2524
100A29770j10842q5922L9312J24814J48387J8431j40077j06064O539L7896Q6879
111A49123P9642r6485j66082M197N7737o1920l2664P0584J492p4696m2724m4648
$$ y = [0, 0, 0, 0, 0, 0, 0, 0, 0, 0, 0, -8, 8, -8, 8, -16, 16, -24, 25, -32, 40, -48, 56, -69, 81, -96, 112, -129, 150, -173, 198, -225, 258, -294, 333, -374, 422, -473, 531, -592, 662, -739, 819, -910, 1006, -1114, 1229, -1357, 1497, -1650, 1817, -2001, 2205, -2431, 2681, -2963, 3281, -3641, 4057, -4536, 5106, -5788, 6622, -7675, 9049, -10923, 13650, -18008, 26093, -46299, 212221, 254902, -43560, 78062, 87161, 110749, 196130, 240943, 102177, 44177, 23559, -25846, -90122, -71847, -12188, 67515, -12583, -225714, -298901, -158239, -93895, -99402, -40615, -53401, -201391, -206520, -73502, -35654, -28892, 87246, 129770, 18928, -66994, -27682, 97132, 245519, 263950, 123873, 17809, 24348, 62244, 149123, 228765, 132280, -33802, -29605, 28132, -33788, -66452, 4132, 5624, -69072, -111796, -156444]
123a56444k9997P2369R2063L234m8681o6031l6471Q1683J12631n23j5353N3701
135F2181j7232q6184K7882J06875M0185J3331M641q8439r8562M1666J16392M2384
147A65120n5704j02469o0526L0670L5037k3349r406P379m3200l1812K2785k3545
159h9020m9937O1657J00785l1235r7857j4455N0038N2571M9163J8962k8478l3397
171a1203k708L3558N1048J4897j4669J6631M939p4689m6953P6278P5802l3438
183H9493n9861l4145m3169q176O6673M0611n5748o9858m208L0079O32k4348P874
196f4151M6144J1157m3264k2370J8226J3471L2653O6447M208q1065l2269O5567
208A4754N2877o371l876P742j9419l1760J467K6797J2598q133n997j3041m6430
$$ y = [-156444, -186441, -114072, -22009, -18775, -67456, -133487, -169958, -88275, 24356, 23833, 8480, 62181, 44949, -41235, -13353, 93522, 133707, 147038, 151679, 63240, -35322, 6344, 122736, 165120, 109416, 6947, -53579, -22909, 12128, -11221, -20627, -13248, -56448, -88260, -65475, -89020, -138957, -77300, 23485, -7750, -105607, -120062, -70024, -17453, 31710, 50672, 22194, -11203, -13911, 19647, 70695, 85592, 70923, 87554, 92493, 17804, -29149, 47129, 122931, 89493, 29632, -4513, -47682, -55858, 10815, 51426, -4322, -74180, -78388, -48309, -47677, -72025, -64151, -18007, -6850, -50114, -72484, -54258, -40787, -8134, 58313, 62521, -18544, -50813, 14754, 67631, 61260, 57384, 65126, 45707, 13947, 15414, 42211, 54809, 46676, 40679, 27638, -18792]
221a8792l9882L3964O2527j2782o4458k1991J1993o442M523L5977R094l4595j2664
234e3528K2868L854j3226K3556N1386Q549m3783k6574K6194L3318J1450J4260
246E8324P679l4846l9846J8476M2381l711k2986O460k651m3987k6678L0016L1332
259A9963j2616k6122r925j3931j8641J4672M1457O992l5448j5893J9961N959j0384
272c3956K1961M1012l059l3540l883J9322O059R679L1507P668m1413l1129K2579
285A2807L0999n422j2969M661q194l4271j2097K4979J1443j8613p655O248k0832
298b8916l0976J3988M1896M881k7143r425O863n327K461L2952K4642j8436k3731
311a6271J1608J9403l187L188K6007Q610k7484j8359J4812J0068p532O504J4536
$$ y = [-18792, -58674, -24710, 37817, 25035, -39423, -61414, -49421, -55863, -51340, -15363, -6269, -40864, -53528, -30660, -26806, -40032, -16476, 34910, 43459, -324, -26898, -704, 32614, 44064, 58324, 66003, 31157, -8689, 9787, 52168, 48457, 25471, 31931, 29280, -14707, -41385, -11369, 19963, 7347, -18775, -28700, -42631, -61272, -46600, -5143, 1849, -33599, -49492, -29531, -23572, -33956, -11995, 29017, 25958, -7582, -11465, 7857, 13916, 23595, 55102, 62770, 21357, -9772, 12807, 43806, 38384, 25415, 30076, 21882, -12389, -24486, 493, 11936, -6677, -14332, -8084, -28916, -59892, -45904, -4008, 873, -26270, -35695, -28832, -34159, -31698, 1254, 25896, 7460, -16271, -4663, 14740, 11553, 14741, 40748, 49358, 21874, 3515, 18327, 28395, 20863, 27367, 41903]
324D1903j9624m0511m712K8073Q631j6815p032j930j9804j4625J9587K2983j1540
337a5416j7390R621R057j6821n525L1556K4672j2316j4332O531K998k524J9940
350B0051K7903q863l1823l554K3235M624j4626J722J3365j0745k5888m144Q796
363E3m473k080J3360o000l8243j6494L0966K5511j3058j8474J656K535j635J0360
377a6016J6792L68r845P499J7072n976j7335J4298L4532J161k7809p419J1060
390A8382n87J801J4512m726k7858j0151J4339K319j5739n104J1420J047k2861
403b3206j9166J2270K0299j524o155J428j2867j1210K6857L1822j4354k3886J3794
416e898K0814l031n242P050P121M012J339k689n722p524O29J8573O293k9679k1312
$$ y = [41903, 22279, -18232, -22944, 5129, 13760, -3055, -10087, -12017, -31821, -46446, -26859, -3876, -15416, -32806, -23185, -14128, -30949, -36474, -4918, 19754, 7438, -6894, -363, 2635, 111, 20051, 47954, 39091, 7268, 3714, 26949, 31573, 16947, 18669, 32034, 21289, -4599, -8743, 53, -4420, -6500, 6860, 860, -37383, -53877, -22911, 2600, -10458, -28932, -27276, -24741, -26376, -16016, 776, 1144, -8701, -1202, 15870, 9894, -7441, 6857, 41389, 42550, 14741, 7322, 18382, 17795, 19596, 34108, 29382, 1524, -8627, 5712, 8031, -7708, -12812, -1392, -345, -23206, -42372, -30102, -9803, -11327, -17482, -16054, -28921, -40131, -13274, 18548, 4194, -19692, -5898, 14916, 11885, 6643, 13693, 20814, 24826, 26165, 23476, 17754, 10230, 10859, 29432, 35725, 6046, -15266]
431a5266J8262R484k1488m827J4755r397j9371L557L352o570R495J4919q799k0726
445c2620n836K0486L3114L788l0868j0883K5887J5480n30P845o553k1793J6151
458A3668L5322j4847l7803M139K4384M141r026j6952j6552M735J2468j798o362
471d483j0600j7451P884K3784j4787k6720K1794K4746k0471j4348J6740O222K881
484d809J8427k212k3906M325K8901J2506o924j7790j1986K2678K6612j8514k6154
497A154N849M285m149J4677l808m0562o297L6764L482k9008p938L532r91J0050
511a2960M790j2634r37Q552k588M714J1113p768P37K4709m106k6307J6920L0723
525C4958j3160j6972J1097R23l556J5592k884k9380n325K0074R667m709k0031
$$ y = [-15266, 2996, 12480, -9008, -13835, 920, -8477, -27848, -24291, -20939, -27509, -18014, -3095, -11894, -32620, -38456, -17970, 15144, 18932, -11936, -22819, 3068, 18548, 18018, 25863, 19310, -2483, 13668, 48990, 34143, -3660, 479, 24863, 29004, 19978, 3026, -13526, -8791, 3677, 1879, -4483, -15083, -32534, -24650, -866, -15653, -42373, -20579, 4167, -16304, -30652, -13912, -7690, -4809, 13618, 11406, -12500, -8175, 20726, 33232, 26308, 8518, -3468, 19210, 45822, 27308, 1154, 7003, 11288, 7139, 21816, 18008, -22554, -28851, 7913, 11395, -17613, -25551, -22019, -23010, -12960, -8170, -20804, -21741, -13189, -15777, -11063, 50, -7718, -6981, 17728, 13622, -12685, 4235, 34958, 21798, 4826, 15923, 16846, 13290, 28882, 25998, -3382, -8707, 11367, 21034, 16325, -3706]
538c706k7657P897L3328l056k5649k507j201o676K0655J5814k6928j2776K7829
551d633R794j5050K724R568J115Q213K086j3290L425J8397p77o827Q12r127k754
566C676K1641n95l2409m540K5527P29j5621p036j1394k623K4277R971k3733j9602
580c1732K659J2886K0374M625k4520j2108K2066J1496p687N137N559q720O859
593F894J4778j2584j4141J6742J5386q339j0366m790r63Q495L757j3284o002O206
607A789k680n030J505r183p129J8682J0738k4695j6318J6124J5606J509N58r585
621h109j3081R972K2544M950j0438q404N12J1476R437q376o621R459L575r684
635G212j717K036p506J865J3231o755k0301p30J2061n47p059l82K69p60o30k656
$$ y = [-3706, -31363, -23466, 9862, 6806, -18843, -21350, -22551, -29227, -8572, 7242, -19686, -32462, -4633, 5161, -9889, -7165, 2403, 3518, 11731, 13817, 527, 3952, 22349, 21572, 14745, 15557, 6430, 3676, 25317, 24722, -7687, -12227, 13300, 14029, -1592, -8628, -20022, -22645, 1632, 11603, -12130, -31732, -29073, -16187, 4187, 8812, -15708, -27816, -5750, 5746, -1941, 3196, 8755, 35, 6894, 21672, 9088, -5053, 11689, 27075, 18736, 8370, 3580, 2617, 11112, 14869, 1585, -4417, 1789, -891, -5921, -4416, -13599, -20728, -2046, 8692, -16003, -32321, -16197, -591, 918, 1476, -8109, -21190, -11218, 11326, 16276, 5838, -2566, -2054, 9422, 18859, 10483, 3862, 13321, 16896, 7212, 5495, 7531, 25, 1890, 15121, 8366, -11935, -12665, -604, -1151, -8210, -8592, -8323, -9083, -9713, -12369]
651a2369j114N286M742K446L38q538o391J5039J8122o520j4430L159P313j75M383
666A1291M448q214n489Q038L816r202o490M500O626j466j0392q265L741O571j687
681b174k659j717o857j923J0481L808r640j813J1248J638q265k10N968N223M896
696H004K97p243l785N852R548L938n085j1034n96J0859L390q526m024K017k036
711A576n85K172n911p656M884P347m642r080j782L351N425K140l812l730K425
726g878K254K391M207l58l342M224O819m251m305P082N701k709k193P43k610p51
742E024L947J057m405n318j094K264Q01m942l844K881j34n535n88L657k596k658
758a1483O024K108o505j228P617L371j747J320K724K89m56K593M390R45l720j85
$$ y = [-12369, -13483, -8197, -3455, -1009, -671, -9209, -15600, -561, 17561, 11041, -3389, -230, 7083, 6908, 11291, 15739, 7525, 2036, 10074, 13890, 4688, -1802, 2698, 9324, 7858, -2534, -10799, -7058, -487, -2174, -4833, -6550, -13407, -15330, -4849, -1041, -10681, -12494, -1246, 392, -7873, -8083, -2115, 3108, 8004, 8301, 1058, -2727, 3125, 12673, 16611, 11526, 492, -104, 10755, 14145, 5619, 1595, 3612, 1576, 991, 3163, -2748, -10404, -5520, 1827, -2815, -11895, -13677, -10326, -4901, -2761, -6573, -10303, -7878, -5624, -3233, 974, 616, -2726, 1498, 8317, 4066, -239, 6843, 12544, 9835, 7642, 8385, 5775, 5024, 8971, 10028, 5623, 305, -789, 1475, 2276, -2666, -6510, -3629, -3763, -9298, -9886, -6229, -8825, -11483, -5459, -3351, -9856, -11084, -3467, -96, -1843, -523, 2201, 2490, 2034, 4627, 9017, 9962, 6242, 6057]
774F057M650l29m917J069L664l838n232K069P24o130k728L686J67o249k630K252
790g715K97k457P83K779j002k641K084N323L56k449L218N999j121k526L620M500
806I048j278j000L278L72m382n06L811j6m682k987J813r07n067m96K329k424n485
823h579j77K985j224l562J884K667k098j050M753L233l135q39O341M836k376k579
839A080K836L272J06J516K042l522m830L336O461l252q693r51M485j032n006j080
855c232j61k837l66K526j255o323J19P294L514o191m534N762O702r10j964K140
871B84K28R27O206L465p176m973P816Q249l655q787k791M353L585j270l451m662
887a652m568J451Q025p38j1852m846Q709M381n557k270K594R9j7M669J238l754
$$ y = [6057, 10707, 10378, 5461, 6530, 10194, 6356, 1124, 3193, 3917, -2213, -4941, -1255, -1088, -7337, -9967, -7715, -7418, -9875, -9092, -6313, -7315, -9956, -7872, -2549, -2193, -4642, -1424, 4575, 3454, 928, 4548, 9048, 7770, 6770, 10048, 10420, 6038, 5532, 9343, 9327, 4645, 1658, 3471, 2564, -2503, -2999, -670, -3094, -8579, -8756, -5771, -6995, -10557, -8673, -6006, -8104, -9154, -4401, -1168, -4303, -5142, 1199, 6035, 3659, 1080, 3916, 7188, 7294, 8810, 10852, 7330, 2500, 5836, 12297, 9045, 352, -599, 3886, 2854, -2152, -3232, -3393, -6230, -6596, -4070, -5325, -11648, -11529, -4235, -721, -6912, -11446, -5684, 1018, 108, -1856, 284, 512, 1439, 7645, 11110, 3934, -1039, 6777, 15026, 11371, 2584, -207, 4146, 7731, 6461, 3010, -1652, -6220, -4769, 3256, 2518, -9334, -14180, -5471, -1090, -6647, -8917, -6323, -6224, -6241, -1572, -334, -4088]
903d088p2N717M579k100m265L712O085j999o002L159O609l371m974J615j044m717
919a156M556N223q352j0104K692P564M12n382n271N64L647J042m50J360k279k588
935h522P036O874p565n524J0432O688o741k033N658M08k315K447N08l033q2J308
951E544J92l281n813J303R379j610j5441l094J0629K684l913P87m094r025O086
966i667J4233j353j1879j317P769N649N25m962j087N391K901q18K164k097o970
981a518M909J1360n851j2737M656P428n847m402L647p87l822m8m87k985P28L090
997b666J895k362p979l173J2950J0367r788r580N236M203Q47O822J757j0935k806
1012e212J2352N195q087n072L489M977Q11m643n002J378J447o72L425j021j1079
$$ y = [-4088, -4160, 1557, 6136, 4036, -229, 3483, 9568, 7569, 1567, 4726, 11335, 7964, 2990, 4605, 3561, -1156, 3400, 8623, 271, -9833, -7141, 423, 835, -4547, -9818, -9254, -5607, -4565, -5015, -3655, -5934, -8522, -1486, 5388, -2177, -7701, 2731, 9419, 2678, 645, 6303, 6711, 4396, 6843, 7351, 4318, 4236, 5544, 5736, 2455, -3358, -2055, 7324, 5714, -9727, -12821, -2192, 492, -3421, -2634, -6728, -15753, -9667, 4566, 3213, -8666, -9983, -2214, 3435, 3960, -1002, -2089, 3302, 6203, 5385, 7549, 5452, -1518, 3391, 14751, 8900, -3837, 819, 8247, 2400, -2002, 1645, 858, -2964, -3012, -3499, -6484, -5756, -2666, -771, -3133, -11112, -14285, -1335, 9032, -756, -10336, -5100, -897, -50, 6772, 8529, -2406, -5212, 7140, 12335, 4248, -824, 2665, 7642, 8453, 3810, -1192, 186, 1633, 961, 4386, 3365, -7714]
1027g714k204J1132J672j0870N33Q609l955p218L587N311k51P03J121l978k309
1042e831L693P690L939o583r021M393J2000j596q163K404K432n065J884O075n849
1057B402q464O374P838o203q489O93M335K438j459k776l99o61k842K710O913l115
1073g05n720N530L757r203j000J4252L651j2058l370N343J843J884M010k489p947
1088b222j412O269O591k437j0193j574R909J697j0062r63N253l370r56P938k992
1103A476j3298K067J3480L78q262j005K426J08Q17P66J930J465l056j628M871
1118B535J29n566N836R393r449j1581Q728J0213o279l804L787l958m208N890M087
1133E753m990n236N94M928K477o993n918P004O223o760k262N838m340n584J0388
$$ y = [-7714, -9918, 1214, 2886, -7984, -7451, 1158, -2797, -10015, -6428, -1117, -1368, -665, 456, -3522, -5831, -2138, 5552, 9491, 2908, -6113, -1720, 10280, 8684, 521, 2925, 5357, 292, 2176, 8251, 2402, -6062, 312, 8150, 1947, -6542, -5849, -1514, 924, -535, -3311, -3710, -4371, -7213, -4503, 2410, -705, -6425, -895, 2862, -6341, -7341, 6911, 10562, -1496, -4866, 477, 2320, 4204, 8214, 5725, -2222, -3634, 2635, 9226, 6789, -3404, -4978, 4931, 6628, -3434, -4397, 856, -2514, -3470, 4468, 1476, -11822, -9755, 3725, 4103, -4159, -5164, -2738, -2630, -1813, -1047, 883, 2348, -708, -2336, 2535, 2664, -2902, 2934, 12327, 2878, -8703, 25, 10238, 3959, 155, 3942, -16, -4224, 1666, 5753, 763, -4473, -3879, 1049, 3526, -3467, -9385, -2381, 3842, -2918, -5180, 658, -3682, -9266, 1122]
1148A122O848j0250n697Q547K659l856J739K992j202k071j475J930M364q22m886
1163e8L255J973q189O0J1118k301j2502K558Q664m792m676M195L67m690J447L312
1179b59j043k780j641L479N552k863p300M018P334n111k278Q620j58r550K571
1194a409Q674l546m690N426K345n779k979K949L643k30n331k442M201j42m937
1209d247L407L986q115m172R904L070r977j681Q469m2m719K162L071k281j152
1224b317L258L437j870n154J968P733p18q072J815O686m289m486O120J750q426
1239b565j117P815j114p470K15N362k06m498j094L519j66l548J113N589j891o983
1255g039L742P943l393n983M925N344m627k578N471J355n541j1N667M63n863k071
$$ y = [1122, 7970, -2280, -7977, 570, 3229, -627, 1112, 4104, 2902, 831, -644, 1286, 5650, 4828, -58, 3197, 5170, -3019, -2959, 8159, 5858, -6644, -4086, 4578, -214, -4890, -695, -328, -5018, -3571, -259, -1302, -4082, -5723, -2244, 3308, 445, -6855, -2837, 4497, -614, -2892, 5728, 5570, -3980, -1409, 7265, 3719, -971, 4455, 6800, 1021, -1958, 991, 4634, 4404, -927, -3369, 832, 690, -4247, -840, 3146, -4969, -9141, 763, 3833, -6144, -7825, 644, 602, -4117, -1955, 1116, -1165, -2317, 941, 4378, 2508, -2646, -678, 7055, 6337, -1735, 80, 6766, 2477, -2009, 4111, 5861, -2565, -3682, 4133, 3019, -4451, -4236, 1126, 920, -3578, -4672, -1153, -1319, -4867, -3754, 1835, -56, -7039, -3297, 4646, 1253, -4730, 195, 5539, 912, -1666, 3805, 5160, -381, -392, 5275, 5738, -125, -2196]
1271b196N153K048n427k198M060k49m984J336N520m247o813M333O947m044n181
1286e942L399L632k533k020M261K077m278j597O137K223o013j854O379J901n744
1301B8q34N101n98n258J251M508k752n386K813M820m123m977L160M729l729m206
1317e453L513L259m040k257N101K065m906o10N769J296n572j00O621n04n848J303
1333c63N629j415n331J392M397k240m249L140K738m929l884N595L548o425m392
1348f789N408L693m606j957L980Q1m144K437N416j854o658K160P260m47o003J026
1364i97M907q68l484K597K540m020l128N083K477o105k876N742K128o130k619
1379d753M774J978m141j315K701m33l020K414M452l334n889L437Q182j978p019
$$ y = [-2196, 2957, 5005, -422, -2620, 1440, 1191, -3793, -2457, 3063, -1184, -7997, -3664, 3283, -761, -5942, -2543, 1089, -1444, -3464, 797, 2874, -1404, -3001, 3136, 5359, -654, -2508, 3871, 5772, 28, -806, 4295, 3697, -1561, -310, 4198, 1446, -3940, -1127, 3693, -430, -5407, -2247, 2482, -1247, -5453, -1940, 1319, -2721, -4978, 123, 2188, -2718, -3328, 2441, 3737, -1835, -1935, 4686, 4182, -1666, -363, 5266, 3851, -1480, -88, 4309, 2069, -2180, 960, 3698, -1231, -5115, 480, 4028, -2397, -6789, -1381, 2312, -2294, -4251, -271, -190, -4334, -1897, 3519, 1665, -4993, -2833, 4427, 3980, -2023, -997, 3910, 3042, -442, 2155, 4695, 675, -2453, 2630, 5107, -998, -3874, 1868, 3996, -2134, -4753, 21, 1999, -2142, -3457, -756, -1189, -4209, -1795, 2657, -677, -6566, -3129, 5053, 3075, -3944]
1394c944J771M989j012j812K922L09m736P4O072J150o597k745N390K984m733k730
1410b648L601M17m194P09M367k145n457L478M897m373m755N047M842m055m501
1425d770K922M250j109j447R02J43k870M81O658L32p792k197P885K383o098j840
1441b167L912j131k561L230K320n624l102M842M245l632m389J668L655j567k966
1456c267L495K770m581l110N367K477m441P2N068l058n806L756P380k711n935
1471b524K13L109R41j016L39J76k680j743M502L656n638n539N451N973m806m336
1487c922L990P97l448K369M098l667m466K746L762r55k855P63K782m43m760J78
1503c031O401M02n553K28L055l875k84P799K52r890j464Q100J887l646j110J47
$$ y = [-3944, -2173, 2816, 1804, -8, 2914, 3223, -1513, -1439, 4633, 5783, -814, -3559, 1831, 4815, 82, -2648, 953, 1370, -2824, -2115, 2252, 107, -5350, -1872, 3025, -1348, -6103, -1056, 3786, -269, -4770, -1848, 2402, 1293, -154, 748, 891, -1979, -1498, 5160, 5492, -2300, -4497, 3388, 5771, -327, -2167, 1745, 614, -1947, 1283, 3603, -2021, -5123, -281, 3964, 332, -4057, -2389, 1266, -301, -3267, 228, 2998, -1583, -4693, 674, 3151, -1290, -1218, 3850, 792, -5014, -1258, 6122, 3411, -2524, -2311, 798, 1739, 723, 1062, 1238, -1442, -3185, 1317, 4973, -665, -6204, -753, 5220, 414, -3922, 68, 865, -2583, -214, 3884, 217, -4249, -1503, 2259, 1304, -1551, -788, 1994, 1551, -3209, -3031, 3370, 3772, -1781, -1553, 1502, -2373, -2657, 5142, 5394, -4496, -5960, 2140, 4027, 381, -729, -582]
1519e82m31J038J303K21j904k976J310O858p37r311M75Q169r14m544L627P92o803
1536d409N51P368j95m807J08J740j013q28P24K504K313m132m868M508M446m014
1552dn28M662m885n426P700N539p805l683N487J073k539j9K19j521J666N48r4
1569C90P10k964l467N991N340o956l390O517j092o015N685N476o109l534M268
1584H50k24k193L641J390k591k018j884J341N959j57p736J010N163m104j715O843
1600C575j771p666M065O605n454m007M091J753j292J136j399j897K753k14o47
1615c69L949q35o730K748O494m939m069P523P25p869R0N839k290j529L687j796
1631F29m079R06K085J591J051m028l217N200L178n870O19N043l825l235O607J673
$$ y = [-582, -1013, 25, 1328, 1549, -355, -3331, -2021, 4837, 4100, -5211, -4736, 3433, 2519, -2025, 1602, 2394, -4409, -3858, 3510, 3315, -1492, -1384, 356, -657, -1485, -761, 1743, 4056, -76, -4944, -436, 4010, -4, -532, 4130, -755, -6181, 1519, 7058, -747, -4430, 1057, 2130, -409, -428, -209, -1730, -64, 484, 390, 1100, -1864, -5331, 660, 6000, -956, -4346, 2171, 1079, -4936, 749, 6225, 116, -3418, 850, 626, -1567, 2074, 3464, 873, -1145, -3029, -1688, 4271, 4114, -3622, -2612, 2551, -1553, -3268, 3575, 1804, -5862, -1797, 4808, -646, -4653, -562, 1191, -101, 1035, -364, -2261, 492, 278, -369, 3580, 2745, -3985, -1237, 5257, 318, -3751, 3772, 4497, -3372, -3282, 2557, 267, -1262, 2425, 629, -3450, -2544, -459, 1132, 2183, -1845, -5062, 138, 3316, -2554, -1935, 3108, -717, -3952, 2655, 4328]
1647D328p865J172O831j273m284J263p1n80K275M7j355N97k682j754N043J846
1663C538o330l7N605l814m022N367K869n413m61M051j663k522K768J595r46l87
1679A98j091M96K897j488k338L330J434n014j6N163j596m675L121K814m431j400
1695b596L744m46k368N44J159k09n62j790P53L372j444k896K476J760l727M34
1711a796N418j302n071K224L394k289j119K580J8j932l55J028L09n67j544Q88
1727a16K108k179k976K820J942l071j001L082n07l307J706L182j844k327J473
1742a015K046m65q90l3J399m15j340R30K593j785k656K460K147k765k141K859
1758I29P56k464o6J970p87k393N75K097l31k302J70K408k05k178M37K582r31k066
$$ y = [4328, -3537, -2365, 4466, 3193, -1091, 172, 101, -479, 1796, 1843, 488, 1085, -1597, -3351, 1692, 3538, -2792, -2829, 2776, -1038, -5060, 307, 3176, -2237, -2698, 1353, -310, -2832, -64, 1531, 585, 198, -893, -397, 2500, 1012, -1326, 2004, 3438, -1576, -1592, 3571, 1975, -2700, 421, 3235, -1196, -2596, 1148, 702, -1666, -1122, 37, -172, -734, -2524, -1771, 1601, 157, -2739, -263, 1497, -2230, -1796, 3622, 2320, -2751, -527, 2867, 578, -541, 2039, 2057, 125, -230, 798, 1107, 540, -1004, -116, 1992, -187, -3163, -343, 1599, -1472, -2473, 609, 102, -3205, -1499, 1683, -161, -2488, -1015, 1031, 566, -324, -357, 1042, 627, -713, 217, 2810, 1025, -1631, 829, 2976, 211, -1930, 929, 1685, -779, -845, 1125, 338, -2055, -1480, 617, 286, -2016, -1846, 562, 357, -1821, -1384, 1198, 267, -1799]
1776a799J663K077k353j070K451J455k413j207K378O93k023l20J486R4j694j11
1792f93K079q80k495N53K847p93k623R16J808p95j550J033J464j631p43K096J005
1809A598k248p28K675P62k106j072K059Q60j788kJ407q96j539J268J703j854k160
1826b061Q45K584q76k547Q84J286p34o89J540K14j911j85K437N68j975n84K086
1843H82O56j848L84J596l53j907Q89J362q15j449J027J034j619j083Q76J621j293
1860d0k007J140J096j051n63J026j2j309M96J963j49k105N31K196L7j285J57J460
1878A581p08r32Q62Q00p78p54P01O58j515o32J501O67j990k046K058J478j219
1895b68j204M37j19r14J766J156j836k087J445K792J1j516r06Q84J193N99L05
$$ y = [-1799, -136, 1941, -412, -1482, 969, 2424, 11, -1196, 1182, 1875, -148, -468, 1018, 1112, -582, -693, 1386, 506, -1989, -1436, 1411, 618, -2005, -1089, 719, -76, -1626, -593, 871, -760, -1503, 593, 1598, -650, -1378, 1297, 2059, -47, -1119, 940, 1800, 12, 10, 1417, 521, -1018, 250, 1953, 99, -2061, -1216, 1368, 492, -2055, -1171, 115, -619, -1308, 232, 446, -1465, -1650, 787, 1355, -620, -1204, 882, 1538, -310, 74, 1670, 1317, -590, 299, 1661, 846, -603, 424, 1458, -161, -1244, -368, 1253, -40, -2047, -907, 189, -862, -1425, -399, -411, -1720, -1224, 739, 590, -1515, -984, 1212, 1249, -36, 121, 1581, 873, -59, 803, 1603, 825, 71, 772, 1430, -85, -717, 784, 1451, -539, -2585, -527, 951, -268, -1472, -1035, -1154, -2068, -302, 854, -982, -3069, -1624, 1168, 1179, -337, -1243, -359, 834, 1433, 1738]
1912A738l92j768k79K679J137k174j941J940P55j570L24M84j047j021P57K58o78
1929g98m27J21Q70q22j203P51J861K69k406J87J937k26m94J538n06k004J361K808
1947B817p55k050J62R16L37M29o12j181rJ17L27J214j023k650Q7L023r68j677
1965a496Q53N10k534N24K226k17j013N86l2p33J440O98j25j64o41o92J954J481
1983B625k088q81J880m08j188J664K02l067N28K557n81k411O63K26j092J559J77
2000C65j581R1K35j139J313J897j976q86J982m48k281K974K410k815j096J587
2016F32o25k30K693o19k533K95Q27P2J056j26k742Q86K480j814k082J995o0k184
2034b079K918J118m283n92L208M38j655J273p95j739J857J346j036O19M68k076
$$ y = [1738, 1346, -422, -701, 1978, 3115, 941, -1000, 940, 1695, 125, 449, 933, -114, -1135, -378, -120, -798, -1225, -1104, -234, -1056, -2259, -1508, 353, 622, -1784, -1597, 340, 114, -380, 1158, 652, -1352, 9, 2817, 2062, 12, 174, 1090, 1427, 1856, 1244, 63, 54, 171, 498, 1712, 689, -1961, -1874, 1149, 181, -1496, -643, -133, -2667, -2143, 83, -134, -1147, -561, -593, -1326, 114, 812, 687, 523, -118, -810, 1144, 2625, 537, -344, 1536, 1128, -60, 1604, 1806, -1261, -733, 1824, 1243, -1168, -505, -279, -1371, 188, 365, -1216, -1125, -890, -2029, -716, 1181, -795, -1681, 301, -147, -2428, 546, 2956, 141, -955, 632, 7, -223, 2470, 1851, -682, -387, 440, 512, 1568, 1442, -1300, -414, 2066, 252, -1830, 165, 105, -2079, 839, 1957, -2326, -2918, 290, 728, -927, 346, -449, -2188, -331, 1015, -21, 598, 1066, -1010]
2050a010L65K255j356j173L638o25l796J047K662k058l6K645k358k522K599P64
2066A041j544N92M78j914Q05J332k244m0K778j331j750K424k21k931K123K744
2082B342k653r87K253j065j385K472P71j953N26K74j963J679J763j948k62J466
2098A330j936j705L470P38l306J004J874k455j058K960o44j605J427K29j886M96
2114a067J368o27R56N95k986J54K809k54j650K009K05l071J015L021k135j491
2130a149K751j66k088O88O31j125Q55O71j231k72K50j487Q47K499j595k255J558
2147f18P89k225R71K661j583j549J661Q4j236J159J383r78j69j94m74R07J048
2164A637j256m86J200p99j014J721P93k741L4K041r16j858J179O27q85J03L92
$$ y = [-1010, -645, 1610, 254, -919, 2719, 2094, -1702, -655, 2007, -51, -87, 2558, 200, -2322, 277, 1041, -503, 89, 567, -1347, -542, 790, -1454, -1494, 1284, -47, -1797, 627, 406, -2525, -402, 2342, -311, -1298, 955, -110, -1495, 977, 1748, -205, 321, 595, -1368, 311, 2074, 126, -136, 1330, -606, -2311, 1159, 1897, -1409, -405, 1469, -986, -2044, 916, 272, -1333, 94, 323, -1563, -1067, 301, -326, 630, 1225, -1761, -1607, 1202, 948, -702, 1307, 1512, -1559, -544, 2477, 342, -1149, 1602, 1436, -652, 36, 667, -458, 397, 1068, -163, -435, -185, -1672, -825, 1674, 79, -2176, -618, 171, -2054, -1083, 1578, -5, -1554, 107, 191, -1045, 114, 1497, 519, 350, 156, -318, 589, 1637, 381, -105, 1095, 296, -718, 1003, 1796, -945, -911, 1130, 214, -1644, -465, 162, -723, -620, -228]
2181b28q98o8L62L2J231R4j446k34J599j47o21J592M86k228j62J883J97j070P04
2200A078K40r28m91L90O30k95p65o17O66Lq47K1O18l91j398J238J147j385o75
2219a761J280O39q07rJ165k46p81O13J385j13j077k46R94M57o35q1R83j157j412
2238h09J386J224j473j281L78Q50j004m17O93J17j466K57J184P4j033PJ176K73
2256A36p25J88J108l11q33P42J311n71j240J032J097q92p50R87K44j027q68J138
2274G66K73j588j44N46P3j462L15Q41q9r59k41J090j15p31O12J309r88q22J427
2293A13J225n98j260J260O84p02j81J126l62j260J51J406L18k177l28J328o7j499
2311h23%J004o15j388R90O35p00r61R16J178j233p77J237Q25q16o0J023K09p62
$$ y = [-228, -1126, -1194, -832, -800, 431, 525, -921, -1155, 444, 297, -324, 1268, 1754, -474, -636, 1247, 1444, 374, 1078, 1318, 390, -101, 289, 919, 624, -141, -758, -92, -89, -936, -915, -297, -688, -2086, -848, 299, -1086, -1761, -481, 158, -649, -658, 507, 261, -520, 93, 1478, 1365, 288, 42, 1036, 1493, 858, 777, 1760, 603, -809, 577, 1801, 328, -953, -575, 275, -729, -1146, -453, -336, -1802, -1545, -361, -287, -1320, -1313, -137, 136, -589, -401, 707, 396, -437, 305, 1616, 1045, -195, 837, 1934, 1042, 292, 1279, 1523, 496, -372, 766, 1039, -549, -693, -147, -74, -1536, -1221, -380, -469, -1428, -1669, -579, -694, -1425, -813, 496, -492, -1314, 113, 1338, 740, -520, 740, 1424, 722, 541, 1667, 1305, 45, 196, 1602, 1920, -257, -585, 743, 676, -823, -823, 181, -434, -1822, -832, -197, -897, -1858, -942, 236, -997, -1774, -537, 288, -528, -588, 435, 644, -118]
2330a18n8J736k04j580K58J572K70j705r9J077k82j346J128J92j136j050J209
2347a36P88j207j224J168N41q95l37J001L17j435K45J699J70j526L87J475k59
2364G72j341P76J367o58j172M97J195o73q57L46Q92j225r44J533O24j748n72R57
2382b31P63j201n64J334k84j057k3J665r1j214P7J317k29j133N12J381r05j096
2400i79J317J200p22j399R11P38j038k16J284l69j341o0J612m01j176o16J124
2417a31O15j020n4P78j51j497J361J665j758j463J144J561r83o54J081M9p75j29
2435c61P68K30p24l04Q17L84j484l72K219K34k251K18J710n50j468J089N71j569
2453h43j85J471M76j221o97J124J036p74j358M97R76q67l62J747J74k756J60K637
$$ y = [-118, -176, 1560, 1356, -224, 34, 1606, 1876, 171, 72, 1149, 867, -479, 649, 841, -295, -1345, -136, 652, -555, -1779, -611, -70, -965, -1302, -301, 16, -1419, -1174, 525, 695, -831, -444, 1031, 772, -569, 207, 1574, 916, -256, 241, 1436, 763, -94, 252, 1144, -81, -1025, 508, 1132, -616, -1188, -231, 532, -669, -1233, 101, -183, -1240, -1263, 402, 311, -903, -826, 491, 262, -871, -359, 1022, 117, -979, 338, 1538, 816, -583, 328, 1066, 28, -188, 1096, 727, -614, -674, 938, 537, -639, -1255, -131, 484, -536, -590, 188, 37, -1460, -99, 1566, -192, -1655, -511, 1050, 67, -587, 494, 543, -232, -361, 407, 637, -87, -391, 426, 810, -674, -1046, 1173, 1407, -844, -626, 1084, 534, -934, 155, 726, -843, -1028, 443, 919, -302, -999, 125, 1161, 387, -971, -474, 502, -365, -727, 1020, 1194, -1562, -1402, 1235]
2471A235n44j488P67J069j369n33J106N55n79p96K11Q39Q1j146J76J661j078j443
2489a276J501J049j839p98K521k94j885M07J240j047k79Q22K27n62o66K02J078
2506D01M38j600q5J673o01j685J962J320j953j155K263J6j986P25J623n93j111
2523c48L58K18K6k68m05P10L40j670j43K177m90k428J515J852k030j315J981O34
2541G14j595O16J022r71r64R38R76L68o28j375Q88J164q37o88J975j27k629Q06
2559c47K138j673j407J812P89j875o79J263k29m68L12K98l3n46p82P30J452p98
2577d3j068J444K85j933P89K545p27k003P61J352j393q5J531o0j202q58N63R13
2595H11k87j093K06R70j042j302J573R60k312j08K193m18j840O03J623l19r59
$$ y = [1235, 691, -797, -30, 1039, -330, -863, 243, 798, 219, -577, -366, 473, 554, -592, -416, 1245, 167, -1276, 225, 1274, -565, -1363, 1158, 864, -1021, -614, 626, -421, -700, 122, 349, -213, -879, -677, 401, 839, -761, -846, 827, 226, -1459, 503, 1823, -130, -1285, 978, 994, -992, -267, 1356, 763, -348, 10, 228, 254, -14, -419, 291, 631, -1039, -1182, 995, 505, -1923, -408, 1444, -586, -1901, 80, 714, -881, -265, 757, -214, -1178, -240, 736, 1104, 476, -899, -11, 1153, 316, -372, 1603, 1476, -1153, -347, 1791, 118, -1289, 523, 1312, -563, -1242, 21, -208, -676, -364, -66, -99, -645, -1427, -697, 755, -43, -1111, 333, 618, -1315, -526, 2019, 1292, -711, 50, 1402, 9, -76, 1455, 1395, 193, -665, -102, 811, 524, -569, -363, 607, -435, -1737, -164, 796, -1516, -1624, 569, 151, -1689, -1086, 537, 218, -741]
2612g41J055K46q62l38J088J039k25j232j37J356n66q69J440N13j898j111J907
2629F65N69j906K51J008p37j425O64R80l52q44J57N52r4l97kJ437k26j273J032
2648E9J262j280j174J763J278j213r62J555k71j323O90J314l45j611l73P03L48
2665D20j79l40L00p02j138N76J765p62j993Q67J501j000n90J267L50j168K95J558
2683A027m33p93J66J052L18n60n13R03j21q21j83J355m93j903J46J967q58j548
2701a292J159O38j746m41J714M1j213K43N27J16o09P2J028O37j062o71J561L04
2719A006j460M80J745r57j168Q88J079j348q36R29Q87j063n38M12K27q33k10P89
2737B9J57r46j017J328J030j170o92J407j83j015Q66R83p69q86R08J025n35o21
$$ y = [-741, 314, 560, -302, -640, 448, 1487, 1262, 30, -107, 1249, 683, -186, 1254, 1767, -131, -1242, 665, 1234, -672, -421, 587, -150, -1575, -911, 69, -283, -1127, -970, -418, -512, -909, -911, 526, 300, -973, 59, 1321, 41, -1133, 630, 1908, 695, -267, 1288, 1017, -306, 384, 1698, 1353, -258, -631, 72, 420, 241, -99, 201, -501, -1639, -1063, 702, -60, -2053, -1186, 315, -685, -1275, -8, 342, -826, -531, 1027, 594, -199, -33, 1019, 1337, 777, 264, 1167, 1046, 225, 42, 1397, 904, -999, -853, 1114, 256, -1292, -133, 505, -1241, -1682, 32, 73, -1140, -897, -370, -254, -863, -791, 237, 874, -188, -859, 702, 1006, -454, 26, 1771, 814, -354, 534, 1613, 265, -571, 358, 1245, 182, -356, 56, 283, -550, -760, 29, 186, -760, -1777, -449, 581, -589, -1281, 126, -57, -1072, -206, 777, 8, -878, 30, 1055, 520, -101]
2755a01L41O42j70j180P71N92p35o33P57R59j330o89J084K47j750Q8J613m80r41
2774i15L47P30q9o20J27Q02l07p89Q2J650p38r75R24Q97r60p01J324M98j375k08
2794b96J095j2j000J12M53j97n34M3J017m09j069p3J199l97p04M42P84p15o06
2813h67R50N00r36j84Q67N21q61l26Q10L03p79k36P51K63j021n6J073k55j040
2832e23L58R73o13r69N61O22n04o91O78N38n59p01J321m2q43k82J052K14o40o11
2852f61J071j57q33L61J023o26p54M17Q03j19j078L67Q12m45p45N51L56m73o36
2871g66O82M67q37l04R67K51p57p7Q79j82p02J12J036n79p61K71Q83n79n68M34
2891a30O01l24q10P85P26j036l96O17M43o44n72J126J07q93j54J011j29n85K00
$$ y = [-101, 240, 882, 712, -468, 303, 895, 160, -473, 284, 1243, -87, -776, 308, 555, -1195, -1107, 506, 26, -915, -568, 162, 73, -547, -420, 382, 75, -714, -632, 1018, 280, -695, 229, 1126, 166, -535, 789, 1287, -88, -296, 799, 787, -213, -101, 352, 155, -379, -336, 681, 272, -797, -870, 329, -68, -772, -330, 454, -261, -867, 83, 583, -353, -537, 330, 851, -10, -336, 474, 777, -2, -238, 513, 776, -245, -301, 772, 517, -523, -165, 808, 195, -774, -213, 409, -95, -786, -108, 430, -129, -830, 491, 449, -394, -676, 376, 590, -50, -661, 410, 253, -580, -219, 804, 178, -576, -159, 644, 525, -553, -186, 626, 181, -564, -13, 343, -130, -766, -84, 383, -454, -758, 209, 460, -297, -374, 505, 323, -379, -267, 769, 190, -571, -300, 583, 4, -564, -130, 471, 147, -663, 122, 848, -188, -584, 33, 476, -168, -740, 386, 493, -400, -554, 457, 328, -257, -57]
2910e7N01m43n02J99O28J2j030K29J044l38p56M31Q08j002l29P49N69r13n19P65
2930D6L71m48k71O43l4q30M14O10J24r88M8P45l0n90k08J058n08q65J103J51l32
2951B09n89M48K81n50l25O02J61l46l47O33L06p68m9N47N8p54K74J194r20q29
2971g64N26R53l68n03N41m6l96k0J91J61k34l23K32L37j93o86O47L05o79l16R70
2992C35l24n17J28Q02l06q95M42L72j08L1K25J30k15l40K30O81m26l20L66K53
3012E44q46k11J292l08j139K61O60k48l67L72L13p57j65L64J91Lm68K38L84K6
3032A39p26M88P19o99m41J115P5j015J57O85J06m58K36J38m39k10K96L36j19k10
3052A73o02N12j8m36K44M97m62q72R04P70j442K43O68l62ON3M89j80l22K77R9
$$ y = [-57, 444, 1, -501, -302, 326, 338, -692, -463, 581, 243, -513, -82, 726, -276, -605, 144, 713, -200, -719, 46, 417, -31, -302, 341, 307, -523, -109, 501, 625, -363, -315, 430, 400, -190, -398, 660, 152, -713, 390, 541, 209, -380, 68, 349, -201, -526, 76, 237, -109, -456, 177, 483, -285, -334, 213, 271, -483, -209, 985, 65, -764, -238, 715, 347, -156, 385, 339, -57, -77, 114, 275, 41, -282, -50, 287, 94, -592, 55, 360, -319, -635, 335, 11, -506, -378, 424, 118, -777, -335, 37, -71, -40, 185, 315, 100, -240, -10, 671, 245, -75, 291, 544, -302, -513, 779, 471, -668, -407, 253, 5, -362, 10, 323, -434, -599, -235, -44, -41, -509, -271, 113, 139, -587, -99, 620, -79, -520, 595, 670, -345, -188, 497, 603, 145, 381, 519, 80, -130, 166, 502, 383, 173, -429, 83, 65, -371, -127, 370, -92, -964, -60, 710, -732, -489, 179, -183, -177, -124, 365, 185, -137, 140, 239]
3073B39k65o8J75K43N50n29n65M96N5p24L49R06q26o70O59P2q13M51N11m78p1
3094c03r8r0M05J0j89q8M29n14l58J249K24j062J41J045m77m44N34K07q82M06
3114A45M66o97J88j63o6L13k23j1l73M76p8n42P07L33j183K1J131k79q20O63K62
3135B70o81K00O83m56r8N02m10o6N31n05k18P45k77m55J65M39m93k74P44k29q19
3156g02O33K01o77J41O04n53N0K84k97J47K92j83l3N41l22p83O93O81o08m52P82
3177D39Pp55L30J57j94P3J00k13PJ4l7r4M64l82n06O91j34m39J24O57m93o70R71
3200A17K21n97K43L32m88j8N43j82J38j45j8j81K53Qo03O21J18n47Q2P5j42k04
3222c74M37J01n91J21M82k53k93N54k84J86K16n21L50K36j98l26N86k9n98J4Q77
$$ y = [239, -26, -94, 81, 324, 874, 345, -220, 276, 331, -393, -44, 862, 36, -634, 25, 97, -716, -265, 246, -232, -303, -401, -491, -86, -76, -265, -353, 76, -438, -796, 453, 677, -385, -244, 801, 324, -120, 414, 621, -261, 145, 611, -86, 102, -61, -127, 186, -37, -48, -421, 55, -23, -565, 142, 475, -708, -687, 444, 165, -655, 8, 270, -411, -211, 472, 16, -82, 420, 10, -56, 475, -30, -248, 497, 220, -235, -70, 369, -124, -398, 346, 117, -702, -69, 132, -545, -404, 200, -353, -303, -19, -316, -169, 123, -60, -93, 448, 126, -657, 36, 717, 109, -343, 439, 446, -309, 21, 178, -16, 57, 157, -56, -49, -35, -72, -166, 298, -84, -590, 101, -33, -472, -348, 309, -184, -854, 117, 338, -259, -16, 316, -172, -190, 353, 171, 309, 164, 146, -35, 218, 226, -377, 244, 362, -185, -103, -28, -170, -374, 63, 164, -427, -306, 176, -77, -370, 184, -100, 86, 302, -219, 131, 367, 169, -157, 429, 400, -198, -184, 693]
3243F93k86m67K02K20n71K94K98l99k35k7K72o3K95m11j34k0J51o8K06K81m55
3264b24K15K43l7k91L73p3l70J17J12L29m89P1Q7q9L08o3l39L32k09j83K00J67
3286A87n13J35J55k32J06M56k90l34pK00kK3J67r7L7O6j15J74L5r5l9j8m5j53
3310a99L93J02l01k05J06J82k67L14j1l5J87m45j17K81K2l0p7K96k45m51M08N7
3332c5J20j05J30JL2j25K09q6j11j87N32k10j90J45m7j06k1p0J65J76m73K13o3
3355a06J75m11L54J26l06J43J01q1R5j07P4Q6q9k7J22j73K1m22N92M4m2k91L5
3378h7K0j23K45k42j49K81J77j49j08K58J41l53l77N41J39J64n29O4M11k11j56
3399d3J26R0k88n6M58O5l97k2L10j21k53K01J66k82q6J1K56l72K99j53L49j84
$$ y = [693, 407, -60, 142, 362, -209, 85, 383, -16, -251, -278, -6, -69, 226, -185, -319, -339, -188, -256, -50, 231, -224, -9, 234, 197, -94, 279, 206, -164, -47, 65, 394, -95, -24, 63, -26, 282, 219, -120, 212, 3, -180, 20, 187, -326, -191, -36, -268, -162, 294, 4, -330, -337, -137, -139, -116, 51, -46, -9, 57, -58, 116, 151, 56, 17, -1, -46, -199, 194, 296, -5, -210, -104, 78, -189, 125, 114, 79, 266, -179, -296, -15, 7, -23, -100, 196, -49, -500, -92, -35, 85, -20, 110, 111, 143, 18, 227, 141, 30, -157, 375, 165, -25, 120, 73, -33, -54, -124, 41, 217, -256, -43, -106, 69, -342, 12, 138, -168, -25, 76, -5, 90, -17, 57, 143, 54, 27, 149, -24, -3, -425, 167, 211, 169, -122, -87, -67, -190, 55, -187, -336, -55, 122, -27, -135, 123, 264, -89, -466, 75, 214, 378, -151, -87, 324, 113, -43, 83, 173, -115, -171, 287, 352, -45, -67, 243, 122, -131, 70, 236, -46, -132, -121, 135, -237, 62, -91, 258, 74]
3421G4Q2n2Q5j1j78J94K43l80j14L27j84j28O7j02k0N1J99J18p3m96J15O4Qj29
3445b40N0L05L8l77J30J52k22P6K02j0m09L02K85j28nJ38l75K28r5o0r8K77q7
3468G7j28K73k63j23j81O69m68q9K13K8l80L6N92k86j08q2k6n1M73n5j73J98l22
3491a76J61K76P8l87J7J66r7p5J69n5k38J56K86m26M9l3J01%K2j35K0N2K1j12
3515a60J69K50m96L2L12j63n4K38J67k69j46K10J04k56N38l52o6%j63J2J81j42
3537e4p7J33M31o90j9L88j52m30J31N29o71K14M94k23k26K07k5j58J57K43o5J48
3559B85j35k67L69P2l41k52N91j7o56M61M85o58N8K11j30m92P11k96m33L72O8
3580Fm09K53P3k08M28Q5p6l83M25j49k67N1P13m62j91L72p3k31K48J08j70p9M9
$$ y = [74, 156, 104, 189, 178, 0, 194, 437, 57, -57, 270, 86, -42, 25, -77, -97, -46, 153, 271, 198, -298, -183, -119, -111, -240, -190, 115, 153, -224, -94, 58, -164, -88, 114, 104, -305, -3, 282, 154, 149, 287, -88, 140, 45, -15, -113, 164, 77, -51, 222, -41, -164, -345, 324, -144, -233, -20, 8, -372, -336, 256, -30, -138, -220, -246, -297, 176, 121, -52, 146, -176, -15, 261, 339, -48, -31, 135, 38, -37, 132, 77, -161, -5, 281, -145, -96, -129, -28, -28, -6, -141, -121, -69, -48, -160, 9, 259, -237, -205, 107, -56, -110, 128, 295, 26, -120, 90, 194, -62, 476, 124, 58, 58, -105, -93, 88, -54, -131, 2, 433, -257, -276, 112, -40, -470, -339, 190, -481, -267, 227, 4, -222, -15, -40, -198, -41, 202, 137, 285, 150, -117, 252, 324, -17, -269, 322, 305, -351, 110, 595, -63, -5, 206, 76, -416, 295, -1, -434, -62, 6, -403, -150, -77, -285, 143, 228, 152, -231, 194, 45, -222, -171, 542, 80, -111, 261, 188, -43, 205, 313, 143, 64, 113]
3603A13k74L72P0n82K14J72j16k79J91J58l94K35N45o81o4L20O2J16mL3m27K08
3625a2n8J11K02K20o65K3N55k76k63K92J42m56o9M55q6n23O26k73j72M09m14J22
3647a10JM8k22K61K31o09qN65J49o17M11K06p04L29P94n19m11J65J80j64R8M0
3669A14k12M24k93j27k5M29o63m9N97p6n00J66P67p85j23M00j62p3J89q4K35j54
3691eK12j51J80j5m58L83L46o77JJ88J60n58L14M54k89l24J65J19n6R7J7j42M6
3714Gj14J83R7j09m22J83L28l29k9M40n4o29N06N27m22k82N0J09Jm9m8j04K66
3737A06l63L50K69l32q2j11L67j48k28L86j90j00j95M31mj79l6K06l40J64J10
3758H1j6M8k60j4K84L8k28r6R4k02R8P7K29k91k05M47L23o01J82j64L02j51k23
$$ y = [113, -161, 211, 281, -301, -87, 85, -31, -310, -119, 39, -355, -120, 425, -256, -320, 0, 62, 178, 174, 207, -220, -12, -70, 41, 243, 463, -202, -179, 376, 100, -163, 129, 271, -185, -254, 201, 115, -408, 218, -55, -227, 182, -232, -110, -109, -61, -283, -22, 209, -400, -408, 157, 306, -311, 100, 306, -398, -69, 725, 206, -205, -40, 140, -24, 74, 114, -98, 326, 33, -94, -119, 310, -353, -402, 195, 119, -381, -215, 552, -233, -356, 44, -118, -191, -2, -86, 149, -5, 207, 56, 236, 221, -237, 146, 492, -185, -184, 4, 164, -394, -80, 374, 85, -239, -74, 45, -11, 86, 103, -39, 7, -107, 76, 173, 64, -358, -175, 153, -176, -205, 235, 181, -448, 58, 585, 163, -119, -69, 40, 41, -8, -56, -160, 106, -257, 93, 362, 30, -52, -163, 204, 56, -172, 214, 24, -76, -271, 160, 156, -23, -59, 147, -193, -29, 81, 65, 113, -147, -161, 123, 161, -67, -163, -69, -271, -173, -96, 133, -158, -363, 84, 407, -194, -12, -176, 126, -25, -248]
3781b48M43ll90J53L75k31j62P3R8j5k15J99J10j38j74Q9j54J71J9PQ2k89K16
3804A6J16J46n57n2L55k6j24J45J51j90O8Rj8l3l3k1L17k75q1J12pJ11k17J37
3828D9K00l80LJ40n5q4k3K50m0j67NN3J01j03rL13k87j30L07L22k70m85M93n2
3852A51O1j56O9J28k64k32J69K27j15j64J07J23k63j03K97j10j16K00jM8l60J29
3874a75L48j11l88L66J30j24J3l9M27m76N2J1J77p9K55k11j20l20K46j1J13J7
3896A01k97L04k04k15L05k5j91j8J06L61l74J90Q7J20k40L4N6J83l55P5j18L63
3918B48q2J8j27J37j64k53L95qm33L18J76K6m13N1L99m10n1K83m4P2j02j67L65
3941B34j86j02N9J57j37q6M44l7k27l77L58J3k39J3K50k21j34K67J76l56Lm2N12
$$ y = [-248, 195, 192, -198, -45, 330, 99, -63, 10, 108, 93, -122, 77, 187, 49, -125, -36, -190, -19, 0, 7, 89, -200, 16, 132, 278, -279, -331, 24, -2, -126, 19, 170, -20, 48, 57, 39, 6, -27, -48, 269, -6, -87, 25, 18, 129, -88, 49, 249, -131, -128, 12, -43, -127, -150, 100, 60, -107, -102, -49, 52, -51, -60, 253, -34, -164, 143, 465, 195, -290, 203, 151, 212, 56, 125, 253, -11, -243, -74, 153, 38, -126, -19, 104, -159, -262, 35, -75, -191, 9, 8, 56, -304, -175, 173, 62, -326, 40, 170, 46, 59, 20, 447, -29, 23, 34, 211, 132, 387, 176, 56, -264, -18, -29, 84, 101, -196, 108, -96, -311, -6, -31, -222, -240, -134, 227, -147, 43, 130, 250, 10, 44, 100, 283, -72, 3, -115, 248, 166, 184, 57, 194, 30, -223, 172, 164, -269, 49, 225, 251, -162, -111, 288, -122, -173, 110, 66, 138, 36, -131, 234, 48, -54, 5, 162, 25, -61, 383, 346, 119, -258, 100, 113, -126, -113, 137, -84, -218, 49, 225, -131, -128, -170, 342]
3964C42k61j65j43K76j04j06K73J60o17o3M99K6j70p4L51j33l75K55K69m54L83
3985A69j70Kq5L9j7K04j59k33L53M57o54p3Q2J09K1k23L72j87k15K75o0j21Qk1
4009a27M33k12PJ73k27r8l4J54K35k34p4J94p4k68J31L19j05m33K86O8nl93K75
4032iM9m0l2l44M15J39l38j46O24l03l36L89K67n23Q0J26J54j67j41L7M1J45n8
4055B9L2N0j96J56k58K96k17j96R8M10k80o5K03m5k48M16l3k96P9J07m2J14nk40
4079a31K41j27j07J0j6J80n40N12J73l47k59N33q0k28L03mj32J95k14J53j75k19
4101b79K22L7j13j0k0K34J6k92K43J07k18m0J60P1k88K24j20q6R6K29j37j01r
4124g4R2nj89M2j01L05N2k16O0K04k84J44J98j80j42K0L31j58j40K31j38j02j02
$$ y = [342, 81, -84, -227, 49, -55, -161, 112, 272, -345, -408, 91, 117, -53, -127, 224, 91, -284, -29, 240, -214, 169, -1, 1, -84, -45, -62, 142, -17, -250, 103, 560, -94, -167, -85, 24, 45, -178, 194, 7, -208, 67, 7, -114, -106, -127, 306, 94, 101, 274, 47, -51, -85, 69, 304, 70, -4, 190, 116, -152, -21, 298, 193, -240, 46, 114, 109, -284, -9, 40, 0, -32, -376, 39, 178, -160, -306, 318, 15, -321, 68, 335, -188, -108, 18, 172, 5, -136, -99, -58, 87, 29, 61, 111, -85, 71, -187, 109, -108, -304, -206, 204, -76, -141, 62, 17, -231, 185, 152, -144, -65, 42, 0, 114, 109, -131, 110, -17, -124, -114, -130, 50, -490, 22, 195, -152, -411, 122, 42, -186, 117, 113, -19, 176, -38, 115, -60, -279, -57, -20, -133, -143, -163, 71, 87, -205, 38, 145, -73, -113, 47, 118, -170, 54, -66, -152, -56, 173, 36, -65, -74, 18, 13, -176, -134, -235, 70, 122, -94, -34, 170, -114, 30, 228, 48, -94, -74, 257, 99, -41, 190, 52, -50, -152]
4147a52j37K00M68n65O7K59j74k3j93O10k17m41M85k55r1J62N6O9j40j4r3K61
4169A42m64Q7J90K73l26K44J81m20j84L28K12k69j6j19K27l22m8L54K8j49J70
4190A19j13L6q8k29L81R6j53j78K25J82m68J42K01j80m4k78L58P6Q4k40j0j89
4212b70L01j9J70j38j43N9n8o5K7P9K45m96K98j19J53K0j73L96J0l22K58Rl35
4235a13M7J14L4k31K07k3Q3q9j32P3q9j02J45L0K00j21m28M51J92m33M28k51j
4258ir1J02K26l19J46nR6j88O7l3lK30m73M46m6j49l1mj00M9K8J94K1j83K6qJ44
4285A33l40n7J71L39l58J63L6r3P2J3R7Ok74l6M4J73m9j19Q5J59j18J26M5k10
4309HJ07r0M3j67J49n7q4j59L37j97k27K24j81L07j22J0J24Kj08K49q5J10l67
$$ y = [-152, -289, -89, 379, -186, -119, 140, -34, -57, -250, 360, 143, -298, 187, -68, -159, 3, 59, 128, -12, -26, -119, 142, -322, -235, -45, 228, -98, 146, 327, -93, -277, 51, 263, -6, -22, -141, 86, -236, -284, 70, 98, -51, 119, 6, 42, -46, -275, 106, 202, 49, -129, 96, 278, -190, -48, 153, -27, -71, -349, 9, 85, 169, -71, -81, -270, 31, 12, 182, 44, -99, -40, -98, -163, -136, -57, 188, -308, -10, -129, 24, 44, -129, 267, 277, -45, 213, 222, -113, -66, 48, 82, -149, 58, 35, 118, 29, -103, -30, -119, -221, -76, -46, 154, 33, -395, 56, 248, -185, 243, -8, -9, -100, 2, 228, -91, 55, 50, 146, -42, 25, -8, -11, 219, -254, 192, 146, -3, -34, -38, -138, -89, -61, 133, 154, -29, -3, -11, 133, -207, -264, -93, 246, -112, 51, 87, -6, 66, 79, 176, 182, -92, -128, -84, 89, 40, -79, 6, 165, 47, 173, 218, 8, 115, 25, 68, -99, 50, -7, -91, -250, 87, -110, -337, -113, -294, 13, -109, -99, 25, 27, -81, 168, 83, 193, -174]
4332a74K67n1P0p0j12J84j59j22J88j61K26k41K6K46j23J87l35K9r4L54j47K44
4354B32j10k61K37j88K07j35O2O3l9K5L55l93Q4l93J56j15P7rJ82J75k41l19O97
4377C49j63k27J89p8pk40m7K02Qk4R7o7Q3j81q0k9oJ78MJ90j36K00j31j52K42
4402A74m33K40J26j68k09M12k45O8k8j2q9r8L38L15m83J64k0K6m5r7O2J47k65
4425a20nJ67P1l09L29r0J06L2N4r7k14%J58j4j35L2J58J12k04J6p1PN9r6P2J62
4451A80k10k39M02J77k46k01K50k6k47Q5K12k70K54n44M20N5J24k82L23j23l81
4472b87L67q9P1m04M14k6k8k09J38n8N8J34Q8j79p6J62j29K69M9j29p9J98j17
4495A38j47J32J28l79j4L59m68K85Q1j67o3J86p8j90L30J4m05K71p2Q9p0r8J94
$$ y = [-174, 93, 42, 112, 42, -70, 114, -45, -167, 21, -140, 86, -155, -129, 117, -6, 181, -154, -125, -219, 135, -12, 232, 122, -139, 98, -90, 117, -18, 44, 107, 68, 93, 448, 55, 139, -254, -98, -213, -136, -145, 37, 212, -29, -348, 349, 186, -41, 148, 70, 63, -177, -224, -22, -14, -38, 59, -8, 75, -106, -186, -215, -221, -43, -39, 151, 15, 215, 84, -68, 174, -259, -19, 107, -61, -270, 142, -103, -35, -63, -75, -164, -262, 76, 391, -92, 72, 52, 78, 33, -64, -2, 145, -120, -125, 42, 113, -196, 133, 43, 149, 181, 235, 138, -76, -76, 82, 68, -67, -35, 123, 235, 31, 47, -24, -17, 42, -54, 18, 180, -30, -269, 133, 310, 64, -137, 113, 87, -160, -75, 137, -133, 121, -423, -3, 52, 176, -106, 217, 94, -287, 80, -9, 62, -342, 72, 46, 18, -191, -53, -111, -53, 81, 169, -10, -86, 76, -53, 216, 265, 136, 57, 255, 138, -9, 123, 251, -128, -142, 217, -251, 34, 115, -52, -115, 71, -7, -197, 133, 147, -258, 13, -59, 30, -40, -138, 56]
4518E6q6pJ08l09L3J07K8K26o4M4k91K37p9qQK9j38J16J7k90J16R7l7K99J14j08
4544B18j30%nk58J58J53k10K85l41M15l06j2J89k23J5j40K69k14K34j29k09K75
4566C4K0j5j0j0j42R5K8k99J02K50J58l67j8J96JK00m74M13n0k2k23K44j58M5
4590bj15M6K84k08K3k21L35K4J2j53j02N5L39k62J68k99J63l11J92j7Q1o1K03
4613A74k18j23K99p9R8o5j05L0J7k23R0L7K52P0k35M3l06J44K53J19m18L17j34
4636C7j50k11K36j4q0K91k8k66J38O4j01J63j44K69j96J50r5o7KJ33N3m4n5q8
4660cq1l7R4M6J32k64L91l91O0P8j47J57K00k19O3J16p9M3k9j77n0M57o2o63M26
4685F1j4J87l37J63j28M6j17j05K61q6J60k21J47m3K7k84K82J7O6q2j43K29J79
$$ y = [56, -30, -37, 71, -238, -205, -98, -70, 156, 92, 136, -155, 82, 3, -5, 3, 32, -106, 10, 27, -263, -147, -50, -87, 212, 326, 218, 88, 88, 83, -175, -17, 136, -74, 211, -130, 285, -21, -33, 156, -67, -52, -192, 77, -137, 97, -32, -241, 34, 54, 39, 29, 19, -123, -28, 0, -299, -197, 53, 211, -156, -174, 22, 23, 223, -251, 162, 112, 90, -133, 111, -47, -2, -117, -71, 213, 5, 28, -193, 142, 166, 178, 25, -77, -22, 317, 55, 223, -76, 87, -224, -32, -49, 32, -29, 174, -44, -167, 132, 53, 151, 86, -19, 11, 28, -195, -105, -68, 184, 254, 19, 62, -244, -100, 153, 272, -146, 171, 37, -113, -324, -88, -102, -182, 109, 81, -185, -47, 17, -84, 79, -65, 204, 8, 158, 63, -4, -2, 131, 184, 140, 85, -3, -84, -121, -27, 19, 151, -113, 278, -113, -53, 25, -122, 35, 235, 16, 79, 195, 116, 159, 130, -47, -97, 360, 298, -365, 61, 47, 234, -103, 60, -68, -22, -139, -244, 17, -69, 91, -130, 17, -26, 1, -283, -1, 16, 82, 0, -143, 86, 265]
4708B65l30M59l27J71k67p8J41j86K08j31J89k04L63k14o9k75L22k87J09K36j93
4729i8k5J77j3k52M3M7J08J08K4k11R1j33K04o6K68q6l32K37j39m5O4J34j51j20
4753a66J66J1O2jk01l1J33J69o5l8j23j09KJ57K3J04j81j08K87j01P5m0k73K34
4777a4O8j00K51k81L21m17L53j71j65J90j96L46m61M58j31k00K54K77m19K2l9
4798e4J01j5O4k0k0j1l47L48j71o1O8J98r6N0n3N0n1%J68j66R2j67l5J08O3l9
4824Dj21j35K03K6m5k13J52K03N4o2K78k76o8q3L67k26j67J62K03l09J05j03m
4847e5K55k70K04j06j4r2J83j23Q2J12n9K7r7j68k1K24l0j39k27M0K62J1L35k98
4871C6R8k01L11k86j99L71m0m8J02j02L0Jj20J77L1q0pk93L34j43m26Q83k16j80
$$ y = [265, -65, 394, 67, 238, -29, -107, 34, -152, 56, -75, 114, -90, 273, 59, -10, -285, 37, -250, -141, 95, -98, -123, 54, 41, -211, -168, -121, -13, 95, 119, -92, -1, -134, 70, 4, 272, 186, -146, 91, -48, -93, -29, 105, -46, -166, 0, 11, 73, 72, -129, -160, -27, 142, 77, 39, -84, -193, -191, -34, -11, 93, -88, -196, 91, -10, 65, 25, -248, -14, 54, -46, 205, -76, 245, -172, 181, 10, -155, 35, -161, 185, -276, 182, 51, -149, 105, 382, -37, -15, -54, 47, 32, 96, 76, 56, 45, -302, 46, -125, -186, -118, 80, -16, 34, -19, 31, -20, -20, 148, -18, 74, -93, -128, -20, 43, 4, -117, -252, -49, -23, -68, -281, -129, 74, 128, 66, 344, 68, 0, -83, 284, 58, -109, 53, 256, -53, 52, -51, -55, 200, -70, 134, 28, 14, -78, 105, -18, 64, 176, 117, 144, 47, -121, -142, 82, 52, -87, -314, -274, -12, -1, 334, 36, 134, -67, 244, -42, -241, 130, 90, 42, 144, 42, 72, 73, -47, 130, 161, 81, 74, -219, 115, -28, -454, 429, 213, 33]
4895C3M1k92K00Qj66L3K13J9j49J22PJ1j7J23j5q3J20o9o2J4%k25N9J85o1l7j0
4922Bn6L27k89k3O9rr3j50M11j09K28m10K31j71m7K1j12J34J38J42k46Pj38K14
4946G1q2j5l6r8R5M04k50k61O8p7L5L10K2k46l62N37J67m38m2K05O7J34j39J9
4970H8O5l25j19K48N4l3K31j47P7j71j9j61J92k74L87J22l45J28N2m1n7O1j70
4993a57K73r8J77j23J1j91m3J35P6k22R7J82k41J31J37k22J57k53L72J2j80l02
5015b72K96K11l20q3J10Q7j10o4K39j7k41N1L45l26Q0J57j96Q4J77J31q1L2q8
5038B02j55l1j18K13j97L17q6j26r4q7K44nJ71p9l05K11R5j27k13K40L1L1q5j28
5062h1M34p9k89l0K3m2n0L09K27l35N8R6j46K31l25J95j82n8L7j18J67k8K10j15
$$ y = [33, 74, -218, -18, -10, -176, -143, 70, 89, -60, 62, 69, 80, 63, 186, 171, 88, 208, 139, 77, 91, 91, -134, -75, 110, 49, 12, 2, -54, 273, -16, -39, 30, 21, -72, -222, 189, 80, 308, -102, 129, -42, -89, -68, -180, -46, 92, 234, -12, -5, -143, 71, -11, -26, -62, -160, -65, 339, 89, -172, -104, -181, -146, 164, 186, -60, -422, 115, 282, -156, -198, 7, 74, 208, 69, 88, 153, -172, -291, -43, 11, -22, 209, 62, 139, -32, -51, -212, -20, -294, 93, 215, -130, -2, 50, 9, -48, 13, -157, 116, 18, 195, 72, 83, -108, -151, -16, 60, -162, -65, 117, -124, 7, 144, -78, 79, -174, 198, 210, 30, -272, 24, 235, -85, -168, -58, 29, -81, -145, 94, 77, -164, -113, 232, -94, -14, 143, -53, 31, 208, 339, 258, 290, 202, 47, 16, -102, 111, -86, 231, 145, 19, -75, -162, 82, 77, 248, 169, -136, 75, 170, 43, -170, 70, 101, 132, 47, -81, 353, 274, -15, -45, -22, -64, -114, 195, 422, 87, 145, 241, 95, 326, 1, 196, 14, -44, -7, -125, 42, 14, 224, 109]
5086A09q9N3j50J80j76jp1J39kJ2J65Jj16k42L57k21J3R3P3Q1m68J54K96ll65
5111a78k6J25L46k97k86Q1J68j89K90J27l96K44P6O5k48qK33J13j11j98J64OO8
5134A69L3k68M17m09k9K02L8k21j19M11j74q1J85J28o49R8M84k23J20k85L52j29
5156E0r0o0K05j65K10j96n1J55K3o8j61N46m64K00j16M5l72L82JJ72k20J59L2
5179B17k35m47K36K38j5Qj0R6r6Ml4k50n4J47L60m7k42l00K58J94J26k6L52n32
5203e2l6J19J20n7j48J6K48nm11J62K03j23k07L65j87k18n3J5K31p1k9J7K90j04
5227H5M5N7j23k12K86Q8k93j02K33J20k97R2J84k25J36m1l00J63K41j91P9n1j41
5250a67OK39l0m59M20K88l67qo8L00l47L03k8n4k4N4K4M7j98q5K22L21l48j52
$$ y = [109, 20, 73, -77, 103, -73, -74, -145, -6, -8, 4, 169, 170, 54, -188, 169, -52, -39, 54, 127, 208, -260, -106, 190, 187, -178, -204, -79, 267, -30, -316, -235, -67, -256, 34, 161, -235, 9, 85, 150, -98, -106, 127, 240, 129, -69, 95, 101, 169, 202, -66, 351, -58, -87, 115, 153, -68, -187, 224, 50, -31, 154, 282, -367, -269, 215, -8, 112, -173, 179, 50, -40, -100, 105, -60, 150, -46, -97, 58, 81, 13, -148, 398, -66, 134, 18, 63, -309, 73, 74, 246, 26, 185, 217, -18, -465, -229, 9, -6, 2, -8, 88, -8, -4, -38, -288, -342, -195, 165, 118, -124, -424, -166, 28, 154, 128, 480, -52, -88, 31, 151, 94, -54, -38, 210, 205, -206, -44, 159, 36, -171, 194, 7, -211, -264, -249, -18, -89, -118, -101, 189, 85, 130, 187, 64, -148, 138, 226, -67, -169, 64, 184, -113, -21, 163, -62, 74, 33, -267, -104, 137, -54, 25, -26, -167, -161, 78, 48, -411, 9, 297, -70, -78, -146, 154, -193, 110, 82, 28, 4, 58, 82, 129, -69, -154, 68, 389, 41, -111]
5274a11K32J19k17RR9Lj07L7J84m1j59k5m6K6Q0j80K02J5k13K42J23m71J70r9
5298a28J77N3l00L97k34j46K21J71j66j87M49k05J2j76K01j43K99l65j45J51K65
5319B01l87P0K40k16J41l3K22l41m6K75j41N7K5Q8k8j07rk9R4m60J22J34R7M6
5343A5J0L16m53j26K04L35o11J03K92J3l0p1p6J10L3m1P8O7j26l32K58J5P2j84
5367a29K00m2k39L38o8p3k08jK48R6k56J98q9r6J79k8J61k31j95k3M11j1k87L36
5391A91m2k85J1N09m55J33j92J93j83K4J26P1q2J06j80L58k49m05L54J08j68L04
5413B47m19R0J03q9J69J6ml25K10r6L04k30j1ok07J84K73j39k84M43l28J16k8
5436a1J87r4j99pJ21m5J08J22k0l44R2l3j31J92OLM3J38Q8l12J73k0l9P2K1l04
$$ y = [-111, 121, 240, 23, 32, 131, 134, 27, 64, 248, 207, 48, 23, -23, 3, 83, -97, 105, 120, -93, 149, 272, -199, -29, -128, 49, 102, -198, 199, -35, -181, 40, 211, 45, -142, 307, 102, 114, -62, 139, -4, 295, -70, -215, -64, 201, -186, -116, 124, -92, 49, 16, 238, -103, -149, 126, -15, 42, 67, 155, 127, 20, 11, -18, 76, -384, -262, -128, -31, 15, 25, 341, -112, -238, -34, 301, -310, -207, 85, 98, 68, -3, -79, 31, 64, 23, 101, 168, 42, -290, -32, -17, 55, -129, 71, 29, -210, 128, 60, -13, -221, -222, 26, 122, -134, 64, -25, -121, 58, 30, 191, -40, -235, -258, 153, 142, -145, 191, 149, -136, -125, 384, -71, 62, -130, 63, -120, -96, 30, 101, 19, 125, -55, 303, 54, -351, 3, 111, -57, 247, -172, -82, 21, -68, 101, 117, 113, -212, -2, -98, 206, -24, -35, -41, -248, -64, 209, 70, -214, 229, -99, 17, -11, 176, 82, -117, -124, -3, -48, 60, 182, 162, -182, -90, -123, -254, -62, -56, -53, -10, 128, 216, -96, 77, 57, 18, 90, 111, -193]
5462a93J01j6J84j37m9K58l8j78J57K7k56K19k39J97J7k26j51K38K41j88m0K36
5484A64l46J14M0m9r7K60j69J68j61K57j97J02K6j03k3j42K23k61M95l79M1q5
5506a22j3O2j94K92Lk9m8K32l54K03l13K75N7j41n7K73o8nj54J27R0l57L69p4
5530E4q7oPk4m1j77K73o6K2R7j95L45j69r5l2J73J53m34K90m1k37j45M81R4j33
5555A07j56K82J8o3pp0j35p3p2J66O7j18q0M3j38K32lJ45l98L5L38j05l53M71
5579A33k86L9J83J7j8q8K42l42J55K98j39j16j75o4J38K59k73O7l19L63K04j92
5601H6k24J30j17r4L06p5k29J25L46k94L41l45j08J83J34j14p8K59n0k98K40j49
5623b5Pj24L80k70M8q8n6N6J31m32K80l4K13j75p1J09k23P1L7J41j05J91k7k10
$$ y = [-193, -92, -108, 76, -61, -110, 148, 110, -68, 89, 116, -140, 79, -160, 37, 54, -172, -323, -85, 156, -32, -72, 164, -182, -68, -28, -77, -174, 86, -83, 85, -76, 181, -16, 86, 112, 9, -14, -156, 67, -194, 301, -78, -37, -122, -135, -73, -267, 25, 28, -1, -49, 183, -171, 32, -281, -6, 51, -90, -147, 126, 58, 53, -101, 26, 116, -241, 128, 54, -33, -39, -32, -56, -97, -274, -1, -67, -45, 52, -143, 202, 33, -62, -94, 79, 232, -202, 88, 47, -190, -335, 146, 240, 107, -49, 233, 251, 188, 181, 111, -24, -97, -169, -3, 64, -54, -134, -91, -229, 3, 0, 145, -253, -218, 120, 15, -338, 133, -153, -114, 69, 86, 68, -20, 222, -120, 35, 333, 194, 78, -97, -161, -23, 236, -37, 30, -289, 74, 278, 86, -138, -8, -125, -219, 87, 12, -217, -92, 254, -40, 301, -44, -152, 31, 165, 51, -27, 232, 182, -116, 124, -25, -18, -142, 238, -32, 16, -72, -128, -72, 59, -373, -93, -127, 86, -89, -160, -51, -274, -203, -166, -25, -130, 61, 34, -176]
5647a76L41K4k7j94q7P3J37K25m17k7O46n35K8m7L02k19l61M32k27K10j40Q2J0
5670E3m88L95n3Q2j9L9k3J93j73J03n9k89M0K38K60k91l4l7P7j49K86k77J21n5
5694f0n1PK68k20l19M18R5m4o9K33j80j22N0Kk57K35k99N35j11k21K17l90K51
5717c2O8l52n6M75J9k10J12k07PL28j79k45J87K13r9m6l50M52j71K3R8k4l9j77
5741b05J84J3r0l1J90j46K47k83N9J01k2j94L0K27j29J35k81K16K39k30j07k9
5763a06K21k03O0Q9r6J67r6k10K09J62q2j66J4J90j08Rq2O0J88k14j06K1K16k54
5787a17K04M6l77J07J88r1J20j98oM89l75j95M5J76j24K40n8r9pk00K97J76k53
5810a2J28j54K61m11N43j44p8q0k0k14J53k55K87q6J42Q1j65J57K01o37K62nl12
$$ y = [-176, 165, 189, 162, -32, -119, -46, 91, 316, -101, -128, 518, -17, 11, -36, 266, 47, -314, 118, -109, 101, -39, 43, 53, -435, -40, -93, -11, -30, 9, -14, 179, 6, 109, 50, -239, -199, 39, 299, 8, -26, -63, 14, -135, 151, -126, -5, -60, -111, -104, 164, -56, -375, 43, 138, 94, 25, 258, 78, -44, 6, 8, -249, -14, -313, 222, 111, -110, 107, -283, -32, 36, -316, -372, 103, 122, -88, 24, -183, -176, 152, -27, -272, -85, 128, 29, -17, -367, 85, -86, -63, 35, 11, -28, -205, -21, -8, -98, -129, 61, -85, 162, -121, -62, 39, 17, -177, -147, 80, -49, 86, -195, 21, 260, 30, -77, -106, 115, -88, -28, 61, -35, 132, 36, -174, 35, 197, 115, -51, -37, 153, 45, 54, -28, 32, 220, 6, -100, -79, 137, -117, 87, 133, -244, -137, 51, -40, 80, -118, -124, 365, -10, -205, -160, 16, -108, 132, 74, -25, -32, -232, 65, 241, -12, 116, -38, 223, -188, 355, 211, 133, 53, 33, -181, -28, -283, 4, -82, 60, 141, -24, 133, 334, -303, -41, -46, -358]
5833c58J62JJ98L5KJ32j20j38J76k12J81j36m7K68k92J10P3j62J93k14L53M9j54
5856A00j57K81k95p8K32k20J1J49j71J97o9J04j28M2K30m75j12K24L98j24l34
5877a95J80N5L3J38r7l8j99P1Q6J39j71MM9k17J42K27k96j36J53J54j37J53j32
5900c4K44k31J76M6k50K13l48J33O8j10P3p7N42l33j81J74K9j37O5k87o7L58j00
5923c4l29K96J96l86L07lo7l79L72J35j62J35qK3k38K41Lk73J61K11Lk58P9n5
5947c0MJ9j82N26m91L6L19k16K62j32j80J71m6p1J05k2j28Q8k5P0j26L38k92r8
5971a01J61j29m7M1p2L6J40p9j12J73k08K14k10J69R2j17J49Lk02K58k01O3N4
5994G5J71k14j8k54N20j20j29q6L1j29K18o2J0K55k80M2j6j2k12L7L22J7j60J14
$$ y = [-358, -196, -195, 3, 38, 40, 172, 52, -86, 90, -122, 59, -77, -124, 144, -148, -38, 35, -127, 66, -148, 205, 254, 100, -57, 224, -71, -149, 83, -137, -126, 23, -148, 49, -20, 84, -44, -2, 228, -247, -359, -135, 263, 139, -195, -15, 40, 73, 211, 114, 76, -123, -52, 34, 173, 2, 6, 55, -162, -20, 207, -89, -225, -72, 82, -55, 98, -34, 210, -21, 155, 201, -49, 164, -184, -51, 17, -93, -20, -97, 445, 112, -69, 105, 134, -3, 62, -225, -292, 66, -34, -363, -67, 129, -257, 50, 47, -20, -399, -27, 108, -54, 81, 73, 96, -142, 99, 102, -171, -10, 201, 204, -54, 25, -30, -26, -7, -189, 337, -154, -118, 201, -15, 247, 115, -65, 106, 60, -11, 94, 72, -56, 32, 7, 77, -49, 289, -3, -101, 60, -69, -116, -75, -147, -111, 29, -50, -162, 11, -197, 17, -193, -24, 68, -49, 100, 103, -99, 159, -42, 21, 75, 246, 32, 14, -240, 280, 160, 31, -55, -24, -153, 65, 3, 13, 268, -12, 30, 14, 2, -210, -173, 149, 166, 6, 120]
6018A20kj15N2k19J72o9J14p2RR2p0k15J88O6k29J34J03j06jJ84k03J43K0J59
6042B55l35K68L8k94N0P1qq5L18m34M2j10J17o5L56m00J89m2K09j26j73J6P8L11
6066B46q1j58p6K07J55l87k3L50n6k85L00k86l8J61pq5j4O1K69k45p0K45l62m
6090a83K61M0j12J4l94L13J48j38L4n0r6L37pOk42J1j11K67j90J95P2m13L58O9
6114A89k08j60K64l08K04N9J07j32m9J10n9k07J54O4q2L18k51j37J83k7j13q7
6136a68R8M3k52M27K0P4n9L4m01M74l34j18j57L19J31n7n3k05M96j08k47q9R4
6159c8K6J07J25j94M2o3m3J30j66J45J59j72j79O79o47O8o5R7N5r7J98k23j36
6182a92J10J28l3j15jK12j9m9j77J37K41l62J8L42Q7k90j0L6j43L5K58o7j26J15
$$ y = [120, 118, 3, 55, -164, 8, -61, 53, -19, -10, 82, 12, -203, -15, 51, -178, -44, 59, -47, -48, 136, -67, 76, 96, 255, -80, 188, 226, -68, -18, 53, 45, -40, 278, -156, -114, -224, -107, -172, 184, -216, -27, -69, 140, 14, -159, -143, -65, 246, 165, 7, -69, 138, 293, -94, -117, 233, 177, -108, 192, -94, -132, 29, 22, -63, -77, -16, 253, 8, -62, 183, -179, -183, 78, 118, 6, 20, -374, -61, 87, -51, -17, -67, -163, 174, 167, 173, -69, -58, -169, 98, -92, 103, 175, -238, 120, 189, -19, -179, 85, -223, -19, 40, 147, 15, -34, 76, 17, -190, -36, 28, -54, 264, 13, -124, 59, 32, -81, -168, -70, -27, -279, 148, 168, 242, 183, 217, -184, 290, -44, -162, -319, 0, 131, 74, 21, -184, 312, 204, -43, -132, -38, -12, 95, 220, 26, 68, 5, -38, 92, -74, 71, 230, 58, -121, 558, -89, -21, -86, 11, 66, -31, 167, -56, -192, -82, 46, 13, -102, -103, 109, 90, 41, -136, 1, 242, -120, -102, 240, 327, 37, 27, 63, -80, -45, 213, 146, 20, 135]
6206A35m30M09l00K73j90K21j64kN4Oo4j02J84J03j96j20KK93k82R4J99j53N5
6229B5l06L50j23P0j06K61jl42K89m1j97Q2j45qL78j78j87L58k55P8p6O7q4j23
6253b14K24P4k90J91K52k54J05r7k9r2N8J95Q7l98K08J10L0k16n9J79j15M7k05
6276b09L73l95J55n5J59L9J00l01J02M9l4n6K85m08K32q9J93j69m0Q1j17qJ30
6299A7J41k0r0j18K15j64j65NK00k9q1JJ36k08O1J48J26m41L99Qn1k22J78Jj54
6324a07k2M2Q5J69k21q0R2KL41n90L70K1j56J64K19j47j50J49j87n5OK07j28j96
6348a72J52O5k14L48l05L1K54m56L42K10o6l49J57J34J25k29k08N3J20J26K29
6369C47o24M56k29L90m25P5o6n7J31m2Q8Q3n1j78k18N01j4l39K01J12j12q2j48
$$ y = [135, -295, 114, -186, 87, -103, 118, -46, -48, 6, 12, -52, -154, 30, 133, -63, -183, -181, 112, -170, -76, 123, -30, 25, -281, 69, -54, 16, -90, 171, 170, -172, 117, 76, -121, -39, -184, -192, 186, 8, -179, 179, -76, 2, -74, -7, -91, -214, 10, 84, -206, -15, 237, -17, 88, -9, -38, -130, -72, 123, 210, -188, 20, 130, 160, -56, -115, 64, -51, -4, -209, 164, -231, -76, -131, 28, 67, 167, -134, -32, 17, -17, -73, 212, -196, 36, -53, 140, -29, -69, 12, -105, -113, 17, 158, 138, 48, -70, 145, -19, -184, -179, 21, -8, -89, -88, 48, -160, -99, 49, 175, -266, 133, 141, 90, -132, 46, 47, -107, -129, -87, -2, 167, -54, -134, -42, -40, 301, -289, 81, 102, -54, 110, 329, 182, 32, 181, -6, -61, -55, 152, 24, -172, -20, 45, -169, 179, -126, -95, 159, -297, 45, 255, 189, -160, -3, 131, 256, 27, -181, -128, -8, 118, 347, -277, 179, -50, 340, -85, -10, -76, -133, -2, -44, 44, 127, 76, -102, -320, 181, 167, -172, 29, 141, 29, -53, -201]
6392b01M42m82j6J57j38K61k1r3k3J00M6k0J59n3m6j7n7k60J97J55j98p9o2K62
6416A3L7j83KL72l22K8J30q2J9J44rj21L3J9j61pJ64j66LJ03m0k14J51K10r5j96
6442a68N1J80j1l22J98M6o4m7J00l2R0p4J1J38q5j05K16j35j12J08o8n2rJ77R5
6467A26p6k24K30J9j84r1J03R8J04j66R4k6o3pJ18j18Q8L5Q7K9m05K49LJ62k31
6492d6J16K65k99j53J63O3l04L31j65O6K21k36mj12K52m14Q4J46k9M8P1k43K93
6515A14o9j93K2k4K87j4P4j51l67L13k5K91j88R3o3m4o2J46j34j04K8K8r0k3K58
6540A03k46J49KJ77k69j47K81Q9j6Q8j59j25R3R9j65J58j37j74K72n4r8K10l0
6563A01l48L48k94K42j82L7M1J03p9p7r3J94p6Pj15K11o5j95M46j85k60Q2K17
$$ y = [-201, 241, -241, -257, -100, -238, 23, 2, -91, -114, -14, 32, 12, 171, 118, 72, 55, -2, -262, -65, 90, -108, -187, -249, 13, 50, -133, -131, 241, -81, -53, 77, -5, 14, 158, 149, 28, 61, 80, -81, -88, 76, -90, -87, 16, -24, -238, -87, 123, 28, -168, -117, 63, 52, -270, -72, -26, -90, -137, -37, -69, 21, -53, -42, 96, 11, -94, 122, -13, -125, -17, -85, -137, -146, 31, 126, 50, -174, 56, 75, -109, -200, -97, 1, 105, -61, 33, 7, -56, -63, 55, -63, 25, 60, 147, 176, -229, 20, 23, 185, -46, 70, 335, 36, -117, 46, 109, -195, 136, -29, 37, 258, 22, 18, -94, 158, -256, -172, -26, -55, -7, 64, -179, 114, 45, -148, -126, -150, 137, 123, 197, 46, -321, -8, -33, 258, 70, 163, 100, 56, -6, 140, 6, -98, -70, -42, -132, -155, 103, -143, 6, 8, 185, -84, -231, 50, 139, 123, 211, 52, -73, 20, 119, -46, 112, -25, -199, 73, 19, -79, 131, 101, -247, 101, -193, 49, -133, -96, -55, 48, -31, -108, -201, -7, -83, -76, -191, 20, -45, -240, 206, 21, -239, -157, 60]
6586F0k82Q5K99k91K5N0j42L20R3k08j37R4M2k7R8Pj27p2NL08m68O9L46k21J31
6611E7l0j9L4j90L72k60K97k32j52K5R6J9j95L40J6k35N4J34l08N8J76l13J98
6634e8o4L97n27L74j43P1j37l1N0J85k34q8K21N9J09n08K90N6n1j21J87O4J32
6657B33j47j28j02R0j00K85k72K18j93M4n0N5r5J52j6k79L11O0qk58L41J35l70
6680i4Q2KK61k16r5K88j35P3k59J70R0l53K10J70j13lj68K34n9k51R1J24k09K44
6704H4j22j56K73l1k10K85K25k38j32n4K45n5j82J86o00L44K35J23m80K89J8k68
6726b21L45l2O0k62J26j41O6J26J09l17J65l8j59J23K26k30P5q3J41k81J58M7
6748Ck03K18J6J27k02J31j63j92K50k8N6n5L2j46j13K59Q9k54M9M15m30J73L7
$$ y = [60, -222, -137, 162, -129, -104, -54, -196, 124, 217, 9, -128, -34, 8, -19, 79, 86, -41, -113, -108, 200, -268, -199, 147, -74, 57, 27, 8, 42, -148, 224, -36, 261, 29, -123, -98, -2, 17, -178, 162, 178, -57, -3, 131, -177, -119, 57, -256, -58, -122, 275, -252, 122, -21, 50, -87, -118, -68, 117, -117, -205, 16, 75, 184, -324, -34, 22, -29, -150, 37, 101, 233, 86, -42, -144, -54, -154, 131, -141, 77, -116, -72, -122, -67, -162, -10, -26, -305, 6, 66, 58, -200, 141, 276, -94, -12, -10, 251, 35, -60, 228, 93, 166, -93, 77, 167, -186, 24, 194, 81, 78, -90, 144, 85, -166, -75, 49, -160, 84, -38, -194, 79, 48, -162, 123, 348, 110, -22, -76, 169, 114, -68, 118, -482, -138, 97, 220, -260, 29, 47, -221, 124, 92, 152, -110, 16, -125, -59, 67, 176, -141, 24, -14, -173, -50, 176, -54, 21, -62, 79, -202, -44, 3, -200, 18, 34, 161, -41, 90, -73, -265, -15, -43, 13, -42, -10, -156, -269, -10, 79, -175, -126, 289, -141, 32, 69]
6771F9j93J75l22K25J2L0J52l05L33k88K34M1L5n0j06K03l02p9P1l5J31J33q1
6794H3j43J74j24Op5R3m4pM70o06J22K47j56j49R7j11J0K45q5K95k69j74J63m2
6818B0j8j93R9m6K48j62q2K75j73QJ97p7j60k79M82J5j70k66N01l04K16p7r7O7
6842B4Q2q2J22J02l67K73J68j87k8lj63J56J3k91m4J1L10O9o2k88l9M10r9l74
6866b87J56pN11m38J96J35q8j56%K07j79j00K5R9Q3q7m2k7J87j07j33p8k4J61
6890Gk17M18m05j22M20k06J82J09j58M4j48P4%j55R0K81n3m28L05j88N13l26q9
6913e2o7K7J77k00J03P5k59J75k2P7k74O7j01L80j04k3j40M2K37k42P4L59l66
6936e7J19L1k74K22m1J26k48J86k07J35r6K92j0J60n59K59N4Lj7m06J52J51j20
$$ y = [69, -124, 51, -271, -46, -34, -4, 148, -157, 176, -112, 122, 163, 198, 148, 42, 245, -57, -136, -65, -100, 31, 164, 83, -60, 114, -10, -4, -79, 14, -30, -37, 433, -173, -51, 196, 40, -109, -12, -123, -113, 132, 47, 342, 73, -101, 62, 20, 2, -191, -92, -138, 110, -52, -134, 141, -32, -24, 173, 96, -64, -343, 139, 154, -16, -282, 219, -85, 131, 54, -43, 24, 106, 24, 146, 248, -119, 154, 322, 135, 107, 104, -59, 97, 110, -181, -225, -214, 96, 165, 103, -185, -224, 186, 87, -287, -131, -138, 373, -65, 131, 266, 178, 22, 22, 229, 50, -50, -25, 74, 157, 70, 28, 1, 188, 81, -52, -130, -154, 7, -210, 208, -197, -319, 101, -105, 77, 186, 28, 72, -76, -2, -2, -157, -67, 214, 161, -267, 38, -150, 363, 37, -52, -119, -92, 85, -115, -12, 63, -196, -21, -43, 34, -240, -173, -274, 106, 2, -21, -161, -119, 118, -124, -50, 309, -57, 62, 93, -181, 41, 0, 126, -122, 64, -143, -8, -104, 188, 178, 338, -221, 38, 92, 95, 78, -328, -176, -25, -145]
6959a45J32m1k54K76j52J29L09j42j39J5j41J62K6p3M13k88k67M69o9k37k11J46
6981h2K15k37kj9q8K21J38p6o5k08K15j20p2J51N3j29K26n0j0o0L3k83L67Q1l41
7006a42K74k6k93J81P8m4j91R2p3J04J36k17k3M47l07k27J90l2J4KK9p6k21K91
7030c4J47m01J42K20J43k5j61J51l03K07p3n9J58k0L4J49K07j59m49J01nn5K27
7053A42j73J5J71k07P4k62J45J60l05J49J26j00K5L2J5l13M19l0q4q0P8j06K50
7076A41p4r5K86k41j7j22LL6J65k88L25k18J21k15L76j52o9J74k92L3j38J88j96
7099b69L20k11J53R9k4j28R0j02K83k42N9j53J14K17j61j84Q3K2J84NJ55l77o0
7122a27M8L07j50l8J59m59J37K31j62O4J6J3R8j44Kj63L10j89J31m5j48J30j01
$$ y = [-145, -13, -54, -308, -32, -184, -55, 254, 112, -27, -12, -153, 9, 35, -38, 375, 87, -180, 289, 220, -17, -228, -82, 133, -104, -106, -125, -213, 8, 146, 70, 5, -203, 12, -108, -180, -29, 24, -105, 121, 71, 61, 1, 34, -249, 118, 199, -142, 132, 106, -187, -6, 72, 28, -163, -71, -144, -40, 96, -121, -144, 303, -4, -231, -41, -73, -59, -57, -28, -104, -325, -34, 113, -288, -146, 74, 217, 192, 31, 182, -121, 86, 13, -46, 112, 92, 126, 275, 482, 323, -126, -25, -30, -85, 142, -31, -16, 155, -52, 22, -240, -95, 65, -240, -91, 35, -65, -40, -8, 7, -306, 113, 83, -1, -81, -3, -109, 141, 67, -28, 258, 17, 0, -122, -119, -83, 82, -206, 119, -99, 22, -193, 183, 31, -38, 136, -156, -123, -261, -73, -269, 51, -160, -7, 92, 68, -60, 30, -72, 211, -31, 28, -125, -11, 206, 45, -139, -56, -34, 150, 155, 310, -67, -127, -79, 228, 78, 40, 199, -260, -123, 108, -54, 10, 26, 39, 137, -7, -5, -168, 142, -47, 84, 39, -109, 21, -80]
7145h0K41j07l13L94j48J8q7J81n8l17K21K51r7J07l83j10L32K59l88p7L20j01
7167E8%l1O6J2j22L0P8M4j08p1kJ53l6P3j42j24J91k52L19j45j5q2K08k67K49
7192H4k5k3j08K82j76j33K09k41M06k88J34j20n6K89m23p4K78K3p7M5k4N5m4J48
7216A41j25k12K28n2J45j98j37J25N0K51k73r0N86m88J03jl47J32M2K62j02p5
7238c5K44k08r3K6n4J09j2j36Q2j2m5N9n4L37l11MM16j27n8j83J10j19j69J22
7262a07J95j01J20K4k9k07j23n7M61p3M1j46p2K2J96n0j90K97m00K26q4J20r7
7285c4O1l84O9L51j92J79k08J46j3Q0k27l3L46l73K53J07O8k51L42k64N3l82J90
7308a16J67J19j07n3k9p8K38l94J69J5j04K48j5o9j27%K59q7J07l4j34K77k74
$$ y = [-80, 161, 54, -259, 135, -13, 5, -82, 99, 41, -276, -55, 196, 99, 206, -177, -287, 45, 304, -84, -161, 159, 58, 58, 27, 93, 105, -17, 13, 91, 135, 27, -44, -46, 107, 71, 144, 2, -122, 69, -183, 136, -9, -24, -106, 102, -165, 84, 59, 36, -72, 210, 34, -99, 110, -131, 275, -13, 121, 1, -55, 234, -189, -263, 15, 38, -39, 6, -18, 37, -7, 141, 16, -196, 32, -20, 125, -73, -210, -85, -35, 216, -57, -147, 439, -49, 54, 53, -294, -162, -120, 142, 40, -35, 209, 1, -92, -66, -120, -11, -23, -159, -77, -89, -134, -75, -129, 208, -103, -99, 317, 190, 132, -51, 59, -60, -229, -107, 88, -13, 107, 131, 102, -105, -228, -285, 176, 103, 144, -2, -74, -52, 144, 94, -96, 201, -199, 27, -57, 63, -34, 27, -357, -288, 63, -129, 50, -158, -12, -25, 55, -172, -205, 141, -232, 21, 128, 196, -55, 287, 23, 76, -306, -116, 51, 170, 63, 10, -19, -97, 141, -253, -84, -69, -173, 75, 60, -9, -136, -136, 123, 36, 143, 109, -25, 252, -22]
7331b2Oj22Q8J23p7J29m0R7J35j56j82l1Q2J53l52L85k92N6p9J56j26P1j13J20
7355IL89k69l79L39k55L81l71J39lJ18l00P7L76k36K3K46k49J29j85P2L4j54J46
7378G7N9j73j23L9J48K31k27j33K08l66LJ40J46J27n8j26M9pK9J3M1l09M55k92
7402d9L0p3p2m1J07J72l85N89n24O4J21K85l94J41J02j64k8k7NJ05k48J73J59
7425D8K55J6k77J05k55L49j82R0j00j12J24k09K67k79N38n01R8J62j29J3Np2n6
7448a02J50j21o3K35j76p9J40j38L75j17J29k7k73j9J38n0M8n1J63j59L9j95Q3
7471g0N7PJ15k86K15r4m8J95n3j52j5J36J19k83L56l59J06o9J63J59k73J29M7
7494A02J53r1O1m6k51l7J68j53K43j81j6K73l29J32m0N7l2j34J45k18l8M28m06
$$ y = [-22, -16, -138, -50, 73, -4, 125, 85, 182, 317, 161, -21, -52, 30, 183, -169, 216, -76, -20, -99, 57, -69, 2, -111, 9, 398, 129, -250, 89, -166, 215, -156, -17, -20, 98, -202, -125, 251, 15, 38, 284, 35, 164, -21, 51, 85, -69, 77, 136, -37, -160, -121, 27, 258, 31, -102, 106, -260, -257, -117, 29, 156, 98, -28, 21, 14, 43, 56, 97, -212, 243, -49, -19, -92, -164, -205, -98, 74, -311, 278, -246, -182, -61, 224, -170, -29, 73, -91, -119, -146, -141, -36, -284, -111, 48, 303, 319, 42, 147, -108, 241, 59, 149, 49, -63, 61, -148, 119, -160, 378, -123, -25, 137, 8, 21, 26, -46, -102, 48, -73, -136, 99, -77, -156, -16, -154, 221, 104, 233, 206, -67, -86, 52, 2, 50, -1, 162, 3, 42, -153, -70, -13, -6, 109, -177, 38, -56, -104, 91, 38, -114, -129, 7, 126, -157, 199, -160, -54, -123, 40, 199, -74, 55, 102, 255, 164, 225, 179, -72, -109, 59, -94, 149, -32, -48, 225, -104, 28, -12, 45, 13, -121, 24, -194, -232, 196, -210]
7517b10K25j21R1p6k00L71j82Q3J33j01J05l24K18k29J83j1J70j61j07qp1L09
7539H7j9j89J5K89q5j38j34J27O6K7j86j27N67k47j59O4N0o3J86k32K3K16r6L6
7563G8j11lK1j20K67P3n04J44K09P8j54j7K15j86J08l7l66K36J49k30J48l0j66
7586a98J37k35M90k75J14q9j19K69K6L3l41L15k05J06k02K08j10j9o5j34J21N1
7608a22J99j24O8N8k45j41J25O4L5J37k17N0K04r7J91o8k32o8N6J50p3m0L08j33
7632H5p9r6K69n09L73j20J2j49K19r3J1N8j43K67k61Q8K50lj33J07j25K68j32
7655A64k74J98O2k10K22J50n17K12n0L3j28P5Mj28K55k5j59K31p3k54J59K93j95
7678D5o0J14k7k35R5j34K35k15K76L6p6l6o6K44J65k70j34J8Qk44K58N5j55R5
$$ y = [-210, 15, -106, -15, -91, -291, 80, -102, -19, 114, 13, 118, -206, 12, -217, -34, -45, 125, -36, -143, -151, -222, 87, 68, -121, -106, 183, 98, -40, -174, -47, 19, 46, -140, -267, 300, 53, -106, -42, 8, -55, 131, -101, -78, 138, 42, 78, -33, -36, -15, -135, 132, 205, -299, -155, 54, 132, -22, -39, 176, -10, 98, 61, -305, -69, 80, -150, -2, -32, -198, -61, -296, 194, -81, 33, -56, -175, 94, 120, 153, -188, 127, -78, 28, -174, 34, -76, -95, -160, -294, -173, -122, 77, -47, 21, 79, -166, -307, -182, -118, -83, 54, -163, -113, 91, -6, 185, 117, -115, -183, -127, 23, -50, -90, 218, 85, 6, -90, 179, -330, 43, -77, -65, -214, 5, -88, -77, -19, -162, 105, -156, -68, 182, 179, 46, 153, 28, 296, 164, -110, 88, 150, -60, 162, 312, -205, 7, -43, -10, -138, -63, -59, -187, 68, 43, -116, 115, 42, -212, -53, 240, 45, -15, 99, 72, -163, -68, -202, 33, -182, 94, 130, 54, 18, -48, 196, 361, 91, -43, -25, -17, -261, -3, 52, -103, -8]
7702hp8K47l55R4J57r0l4l0J19j07J22J5J74k32m9K1L09j56k51j27L62q8KL0l70
7727c23M89l16J06j43K58j18J09p7J31k28J82K10m23o7M64j69P4l01Q4K6L8nm1
7750d0j6J26j86K67q0P3k12P2q5l9o8L33j43K6m7N3n3r4J14n6J05k3J26k07j99
7775b53L36n3k11K32j28J78j36j31R2M20j87l20K39j54p9J88k17K44J52j59j24
7796g1J11j90K97k20J86k88J93J14j15q9J44R5Qk07J91j29q8J66r1K02k66J01
7818E4NO0r3j06J79n2om7K00j31k28J33l0loM2n2K1j03K21j23j31K07l3N7K12
7844B47j99k47L15k10p8L42l86l7K07K54q9J07m1k11K8Nr6R0mj22P6J65j5k92
7868a91R2J68q9P8k20J45m6p1J99j69L21l28K25o9Kr9J33J73k53J53l05J99l33
$$ y = [-8, -86, 161, -194, -100, 57, -33, -67, -97, 22, -85, 37, 52, 226, -6, -55, -34, 275, 119, -132, -259, 103, 15, 17, 47, -323, 166, -150, -44, -187, 71, -47, 62, -15, 116, -112, 70, 280, -143, -210, 254, 85, 159, -142, -58, -32, 6, 1, -40, -56, 70, -116, 151, 71, 144, -68, 4, -81, -120, -188, 145, 2, 28, -19, 34, -19, -113, 1, -55, 50, 27, 153, -54, -253, 83, 30, -181, 51, -77, 101, -35, -166, -74, 346, 159, -161, 78, -76, -155, 33, -184, 60, 212, 53, -71, 40, -150, 147, -73, 113, -175, 18, 132, 17, -72, 72, 167, 175, -32, 159, 30, -58, 108, 17, 219, -47, 54, 59, 119, 26, -80, 99, 47, 41, -6, 194, 63, -165, -32, -62, -65, -71, -29, -81, -60, -163, 58, -65, -196, 11, -22, 35, 247, 48, -199, 116, -94, -172, 170, -216, -253, -46, 208, 119, 226, 185, -26, 2, 7, -89, 1, -3, -125, -49, 116, 101, -191, -99, 69, -20, 58, -162, -17, -63, -134, 65, -104, 217, -111, 114, 45, 47, -52, 81, 254, 1, 154, -151, 48, -285]
7891b85M83j43k36N9J79q6q1j69l8L98k26K78j22O8j49k8k0K73J63j51q3%r6J46
7915A34K5k53K04J20l02J31j9mm1k67K1R9M02k87J01J70pk39J52k03O7n7k8RK38
7940A66j15l55L73k00j92N08l82J35R1Q4k32J13P8l52K62J96k39N3J70l92K65
7961C5N0oj6r4j2j15K14K7k05P3k0O9j15K83l35K46j91J85k61K48K10l36M4k12
7985b34L21j78mJ23j97K79P0k29O2k14O5P9K57p2j70Q5j17j4n2N3K94l89K55J49
8009B22k04j60j4K11J17k26J56K98l82k4J5J47j22l5Q2q2k0R7j13Q5o1J33j02
8032A8N5n4p9J16o3Nj12J68L8q5Q8J0q0N1l9P5j83l4O3M5J75J7n20N27j52j87
8058a37K18Pj96rJ97J1r2L14k78k23J77j40O3J36r8K6%oJ19K5mk01J43L4K68m92
$$ y = [-285, 198, 55, -181, -122, 57, -29, -110, -279, -317, 81, -145, 133, 11, 79, -70, -98, -118, 155, 318, 167, 84, 84, -12, 134, 159, -94, 110, 230, -72, 59, 40, 36, -5, -272, -251, -152, 250, -37, 64, 234, 227, -12, 140, -63, 4, -53, -81, -72, 166, 51, -304, 69, -131, -323, 185, -197, -62, 29, 113, -119, -6, 72, -280, -18, 178, -61, -8, 162, -230, 35, 85, 79, 63, -31, -43, -158, 56, 83, -122, -49, -69, 0, -115, 168, -167, 79, -112, 73, -188, 60, 270, -66, -22, -234, 87, -91, -95, 28, -169, 110, 180, -49, 13, -201, -136, -57, 200, 128, -42, 43, -74, -88, -140, -87, 207, -182, 73, 222, 18, -142, -156, 55, 172, -54, 102, 400, 18, -6, 9, 156, 34, -1, 81, -1, -21, 76, -37, 48, -13, 120, 18, 73, 19, -60, 56, -7, -2, -114, 54, 92, 7, 95, 105, 25, 76, 37, 112, -71, -105, -42, 3, 178, 195, -325, 202, 50, -137, 81, 88, -108, -117, 80, 91, -1, 313, 35, -188, -11, -151, -88, 48, -50, -24, -24, -30, 89, 114, 110, -91, 52, 86, 354, -138]
8084a38J02L76l52o7q9J83N7O6k3k67k1L72l51L64j02k39O6M4J46j09Nj05P8j60
8108a64P9J24j68J03J60l66L98l66K01K54l96K84j10k63O7O0J6K47j83j99L94
8129A72j01l45L79p4j89R0O4j39L85j15l06Q7j6K03K4J74j84j08l9O8l68L03K52
8152B17p9k17MP0KJ96l81k9P2J60M4J19j36K1q5J33Q6M4k53J27j30j62J53P6J65
8177B17k98j49N16k39pr9MJ73r3k08k0J78NK6
$$ y = [-138, -36, 340, -12, -79, -168, 15, 72, 138, 115, -152, -173, 199, -152, 212, 110, -129, -63, -19, 127, 18, 23, -82, -4, -164, -85, 39, -129, -26, 134, -232, 166, -200, 1, 255, -141, 143, 33, -230, -163, -103, -87, 160, -23, -222, 172, 71, -274, 105, 31, -158, -68, -4, -143, 242, 127, -179, -92, -108, 95, 119, 293, 109, 1, -38, 30, -338, -35, 217, 138, -79, -75, -5, -3, 193, -188, -217, -145, 15, 59, 178, 42, 63, -22, 111, 197, 241, -12, 115, -15, -177, -24, 52, 217, -81, -230, 286, 47, 40, -59, -55, 118, 25, -183, -203, -25, -20, 6]
8191F
$$ Imaginary data points
##PAGE= N=2
##DATA TABLE= (X++(I..I)), XYDATA
0@%%%%%%%%%%%%Qj6J6j6K1k9L2m0M8n6P2q8J02j17J35j54J78k06K36k68L04l44
34a82L88m37M92n50O15o86P64q51R43j045J156j277J411j556J713j888K079k291
52a202K527k789L080l409L784m213M709n292N995o855P933r331J1235j3982J8309
67A0499k6167M4889j70249j39944L86508J31189j39367j18408j3187r524J60506
78A16745J96989j565j72882j22152m821J15038P7938n1157m7542J8456j11795
89A3252j55577M9117J25796k5116l5929p870j37664j26049J16093J61161j1839
100c4625p3098k7101r768L0490M0867R399N7983R4611o879o0299o686j0856J7403
113B1441J60997J16370j35742j69698J5196O7419L3476N1516j3386j14819p3063
$$ y = [0, 0, 0, 0, 0, 0, 0, 0, 0, 0, 0, 0, 0, 8, -8, 8, -8, 13, -16, 16, -24, 24, -32, 40, -48, 54, -63, 72, -82, 96, -110, 126, -142, 162, -182, 206, -231, 261, -289, 326, -360, 404, -447, 496, -549, 607, -670, 741, -815, 898, -990, 1089, -1202, 1325, -1464, 1616, -1793, 1991, -2222, 2487, -2805, 3190, -3665, 4268, -5063, 6172, -7810, 10499, -15668, 29221, -141028, -280972, 105536, 236725, 97358, -21050, -34237, -43761, 116745, 313734, 312169, 139287, 17135, 12314, 127352, 205290, 154133, 106591, 125047, 13252, -142325, -93208, 32588, 7472, -28457, -36327, -173991, -300040, -183947, -22786, -34625, -107723, -134824, -144592, -114102, -73235, -63836, -5853, 88758, 81879, 21580, 14894, 4038, 21441, 182438, 298808, 163066, -6632, 8564, 75983, 109459, 160975, 147589, 32770, -40293]
124d0293j422l738J7168K9660j8489k9716l8316r1725j9746J31354Q1438p1076
136e4901n0257J4556j7743J6770R6904L8946l7119J1510L6371k5208l2933K8155
148B5051P7337P4160j8951j18907o8372M9442O3748L8409J8170q1861j39329q023
160h9126J00379J8902n1169n745j55n1718l9464J3158L4491L7947J9928j8916
172c1488l8803l2095J0080Q5205Q1800l1309o9011K0673M2124j8080M923N9998
184H4017J5690l4108r949j1410m3462J294P3696M5620n6398j03179m0223M9059
196b9353N2868l816k4359k4141m7047k5567M6903M0487k6727j1271L7686o763
208b1100n7668l78O9362M7949l709j9411j6046j4199R631M7281M6326j1581m8747
$$ y = [-40293, -41715, -45453, -28285, 1375, -17114, -46830, -85146, -176871, -196617, -65263, 16175, -54901, -105158, -90602, -108345, -91575, 5329, 44275, 7156, 18666, 55037, 29829, -3104, 25051, 102388, 176548, 157597, 38690, -29682, 19760, 83508, 121917, 140087, 58226, -81103, -89126, 11253, 30155, -21014, -26759, -26914, -78632, -118096, -104938, -70447, -32500, -12572, -31488, -70291, -102386, -92306, -7101, 74699, 43390, -25621, -4948, 37176, 19096, 24019, 84017, 99707, 65599, 55650, 44240, 778, 2072, 75768, 121388, 64990, -38189, -78412, -29353, 23515, 19699, -4660, -28801, -75848, -101415, -54512, -14025, -40752, -52023, -14337, -21100, -78768, -79146, -9784, 38165, 34456, 15045, -1001, -15200, -5569, 41712, 88038, 76457, 27710]
221B7710r833K3502r839k2249L1554L8622l3769o1091j4641P946J561K3517K7875
234C0865l1030p0808j9336M4998L4163q434j0752P267q539k5706R201M4403K0075
247A6367r542O860P422k8259j5206M8229N0366j5529l7260k566N739j2617L806
260A7810L0928P673l4546k9819N78j747j1403J4680K8709j7653n6324j7637L2641
273c6110J8026o250P586O898k6211k1162K5950L4141j049o100J9040N076k8310
286h475j0108L7922L5697q457j8820q56q090j6662J5614L6322l585m1435j7572
299h505J2046m838j5155J3337J8676j9642l4017k820J3053l301j2K3276P638l1983
313c2247k2797K3357L0671K531o01J1960n488k2736P341L7520J3119j7940m060
$$ y = [27710, 17877, 41379, 31540, 9291, 40845, 79467, 45698, -15393, -30034, -22088, -20527, 2990, 30865, -165, -70973, -90309, -45311, -11148, -19582, -30334, -23067, -31606, -57312, -48111, -3708, 16367, 6825, 13685, 21107, -7152, -22358, 25871, 76237, 60708, 23448, 20882, 26621, 14004, 17810, 48738, 56411, 21865, -7954, -7376, -9123, -20526, -5846, 22863, 5210, -51114, -68751, -36110, -18084, -24334, -16748, -9850, -36061, -57223, -31273, 2868, 1819, -4281, 14759, 19835, -8475, -18583, 19339, 55036, 46579, 27759, 26903, 18813, 2151, 17765, 54087, 50502, 9067, -8505, 3541, -1297, -16452, -3115, 15561, -4081, -38098, -40918, -27865, -31166, -31178, -7902, -264, -32247, -55044, -31687, -1016, 1515, 914, 12874, 7386, -15350, -8009, 29511, 42630, 24690, 20630]
326B0630J2129r052k0294J0339K6639j966k2715p826k713j8178o247K6437J5618
339B2801l0107l3252N740J4934n471o20J6231r69k2676l521K0707N985o333J5026
353a525K3303j0735k8550M786L4880J5919r359m574j52j3102m061K2404J2695
366D1929k2386j7479J3930L369k7053j3415J9222J3303j3256j6937q011p488j384
379c5656J9282K0460j3714l1988M80L0329J0399j2195O308J7464o458j1392J2262
392E581J1947l758P430J7248o986k6518m048K3700J5148j4122j9547q3M897j1799
406i10q377R378j207j5425L764P982k4908j9788K6232L0051j2391k4542l688Q812
420b5017J2278J4425O770m701r584j428J6959J5757r360o119K2237N707k9668
$$ y = [20630, 32759, 23707, 3413, 13752, 40391, 38425, 15710, 7884, 5171, -13007, -19254, 7183, 22801, -7306, -40558, -34818, -19884, -25355, -25975, -9744, -10713, -33389, -36910, -16203, -10218, -16551, -1525, 21778, 11043, -17507, -12721, 22159, 38078, 28719, 24145, 23993, 10891, 6830, 29234, 41929, 19543, 2064, 15994, 19363, -7690, -21105, -1883, 11420, -1836, -18773, -26784, -34272, -35656, -16374, 4086, -9628, -41616, -41136, -10807, -408, -12603, -6295, 11169, 4711, -6681, 5581, 17528, 13770, 21200, 38448, 31462, 4944, 896, 24596, 39744, 25622, 6075, 5992, 10889, -910, -9287, 91, -1116, -16541, -12777, -4795, -29703, -49491, -23259, 6792, -5599, -30141, -33829, -25017, -12739, 1686, 8456, 3755, -5829, -7257, 9702, 25459, 16099, 9980, 32217, 37924, 8256]
433H256q802K5731O754j4558p67l283j8263k080J3970m071j7106m810Q556P480
447b993j2722k8194J378L6399J3283k2178j2095j979l933K7278L9896j5228m3667
460b4755N771L5294J0756m220l010o421L535Q465n314n868K611k741L549Q864
474B6516k3275l2169J9922L1712k0603k7013Q395M73j0743J0684M680j7149L546
487b5024K2218k096j8123o925R733L0954K3271k4731l2260J4484K5262O329J2578
500C5670q49l5152p922L7888Q670k8797l773J1514o684o350k428j2127m44J2630
514A846n681j1647j078r672l041K3106K856k6332O790K5982j4964j7559K2705
527f689J7603m407N466l196k2466O533L5885J3424j3767k0991j8085J2167L5055
$$ y = [8256, -546, 25185, 31939, 17381, 16614, 13331, -4932, -7012, 6958, 2887, -14219, -19029, -10473, -2993, -15715, -43909, -42531, -6132, 7151, -15027, -27122, -29101, -33034, -5756, 34140, 18912, -24755, -18984, 16310, 27066, 22846, 19836, 13415, 16950, 25415, 20101, 14233, 16844, 14103, 17652, 26516, 3241, -28928, -9006, 22706, 2103, -24910, -16515, -16042, -26785, -16101, -11421, -28570, -25024, -2806, -4902, -23025, -29950, -20217, 10737, 34008, 9277, -22983, -8499, 16763, 23092, 35670, 34821, -331, -8253, 29635, 38305, 9508, 5735, 17249, 10565, 4215, 1787, -10340, -10784, 1846, -3835, -15482, -16560, -26232, -29273, -6167, -3311, -29643, -22853, 3129, -11835, -29394, -6689, 10914, 6507, 11973, 8777, -13689, -7156, 28729, 42153, 28386, 7395, -10690, 1477, 36532]
540C6532o83l0169m937L862j0663O986J1310k2563j4288K4510M852k8933o440
553c0624J5095M279L713J468j4604j810J7910L072n181Q171J568k521J4011J368
567A5915k3555N125L5616K847k5884r891m18M558K2351P468k9890k2645P398J3087
581B082Q656k375k3644j2115J9279P334j7479j257J1028l305J301J0324j2233
594a2404j4055K0552K1895p602j1030J074K761P933O702o383j089J0083j324j0528
608F585l77j463k158J5523O366k8204k0225J7330J6544n926p902q213j1065O656
622a6529J7565j916j4049m060O679R799L633r519n045J4110J0252p554l278N355
636E443k955K792J4618j918j7086O50J3993k583r387J674L455k110m258n698l726
$$ y = [36532, 35849, 5680, 743, 4605, -6058, 928, 12238, -10325, -24613, -103, 4749, -24184, -30624, -15529, -11250, -7537, -6069, -20673, -22483, -4573, -1501, -6682, 1489, 3057, 536, 14547, 15915, -7640, -2515, 33101, 35948, 10064, 173, -245, 4313, 26664, 34132, 4242, -18403, -11005, 2082, 10738, 8363, -15281, -27396, -8117, -783, -18262, -19519, -8491, -11796, -10495, -171, -12404, -26459, -5907, 15988, 8386, -2644, -1570, 1191, 9124, 15826, 9443, 8354, 18437, 17113, 6585, 6208, 4745, 2587, 18110, 24476, -3728, -23953, -6623, 9921, 3995, -3907, -12120, -23185, -16529, 1036, -880, -14929, -18989, -12310, -2511, 1122, -8397, -13442, 668, 10920, 3366, 88, 5443, 2488, 5280, 19898, 17980, 894, 1544, 15537, 12954, 3567, 5241, 8696, 6586, 2328, -3370, -7096]
651g096L654L811j427m055q457o549J0719J3824q496j4614N696J0661k080j024
665e433M802k666j003J0530M852r680m654Q902R732k91p931n653M884O382k897
680I876m695J44k932l307N087J81j1555k442J1128Kj2277l973N789L226J545q98
696e101o084k125O636O937Q88m303m501M455J2145K328j0324k312P753L892J25
711A0409J215m780o705O126Q069m541r388p89K744J097j667n326l592K451J248
726c429k772q49j866l292M144N962m760o434N760P089k293j075L822N35k6M180
742D696K682k045r06L175L429K71m913k846M533K473m853k228K029l866n088L506
758D9J702p137l541M060L72n415q41L153N48j818O40K843l3j379K057O370J366
$$ y = [-7096, -3442, 369, -1058, -5113, -13570, -20119, -9400, 4424, -4072, -18686, -12990, -2329, -4409, -5433, -631, -3297, -4300, 6230, 11082, 1402, -3252, 5650, 15382, 15091, 7160, 1507, 6391, 12773, 9876, 5181, 5325, 2393, -914, 4173, 4354, -7201, -9643, 1485, 1487, -10790, -14763, -8974, -5748, -4203, -5101, -11185, -13310, -6674, 263, 1151, -3152, -7653, -3198, 8947, 11275, 951, -1361, 6392, 10284, 10409, 11624, 6844, 139, 6265, 14334, 9793, 405, -384, 2360, 3457, 1790, -3536, -7128, -4677, -3429, -6201, -7050, -8916, -12208, -8064, -2102, -6862, -13296, -7536, -447, -2740, -3815, 7, 542, 516, 4696, 7378, 5333, 4427, 7602, 11031, 11302, 6389, 3543, 8076, 10549, 5696, 3468, 5497, 1631, -3457, 49, 1751, -5386, -8927, -4867, -4495, -9910, -10751, -7598, -7050, -8868, -8228, -5385, -5418, -6797, -4740, 1630, 2996]
775B996m067J511O015M7k185M534L385n263k105N182J147m987k083K492q17m784
791A018j929J208j319l671j196J980k540n381K232M512j785m142K237L610j292
806f458j87N061K624k255O70M920J813k181P70M964J002l687o44L098q44l715
822D951L93K651k813n847l32J469k952k827J705R2n818k855M861L955m101l759
838a1227L006L453N4R54L270p50j823M731O818j955o071K986P930N09n432j138
854E315J839j003j34J807k360o516j467N047Q52q114n285M876M524n119m980J633
870i085J969J76L474J276o180l112R733R206l665p926J070P873M722j337k830
885E364j337P2L025N479j949j0819k852R719L682r350n811K466k9j665J516n06
$$ y = [2996, -1071, 440, 6455, 6502, 4317, 8851, 12236, 6973, 4868, 10050, 11197, 6210, 4127, 6619, 5802, 1018, -911, 297, -1022, -4693, -5889, -3909, -6449, -11830, -9598, -5086, -6871, -11013, -8776, -5166, -6458, -6645, -1584, 1040, -1215, -545, 4375, 6188, 4007, 4777, 9741, 10743, 7056, 6412, 9510, 8666, 4951, 5344, 7995, 5182, -665, -997, 472, -2480, -5307, -3602, -3510, -9328, -12183, -7322, -3367, -7468, -11227, -8221, -4768, -4714, -3760, -490, -1240, -3063, 1668, 8486, 6531, 460, 3446, 11376, 11885, 6453, 5315, 7154, 6151, 6017, 7824, 5464, -1052, -2519, 2528, 3380, -4734, -10019, -5143, -619, -5738, -10718, -9085, -7116, -6940, -3466, -2190, -8370, -11482, -1749, 7457, 3792, -4134, -3064, 4809, 9531, 8194, 5364, 4027, 4099, 7124, 12603, 10654, -165, -3017, 6702, 10384, 1034, -4777, -2311, -2340, -4005, -2489, -2995]
901b995n342j922M481L000l210l425L323N467j597n013M132Q704k081m763L589
916B348K578k180M293N575o449p790N539Q093j835p836l833J651L547p76l884
931i59k011j915k797M384M381q471o993Q874P037p871l841P424J862l019K387
946a528K728j118J530L187N57j990j880K836Q427j638j3025j486J2844K384q571
961C257j893j784o148M471J0742n606j4728o12R593L710m281n919j136N750L637
976i47k447M71k11l266M766J0522m490j0718O157J0809m552n321N114K167l927
991D127n2J186k498P0K184p26l732o424r32R669N935j2929j1339P269P434j770
1007b528P55L77r289j237J3156M968r684m478O669O188L00m008k610L779M009
$$ y = [-2995, -8337, -10259, -5778, -2778, -5988, -9413, -6090, -623, -2220, -7233, -3101, 5603, 3522, -1241, 2348, 4926, 2746, 7039, 12614, 6165, -1625, 3914, 12007, 10172, 2336, -1497, 154, 3701, 2925, -959, -2970, -4885, -7682, -3298, 1083, -7388, -14381, -5507, 1530, -6341, -10182, -2758, -896, -3915, -1528, 1200, 82, 1612, 4799, 5356, 3366, 1486, 4322, 12749, 11111, -1914, -3400, 9444, 11828, 3257, 1364, -420, -6568, -2097, 8645, 3039, -11689, -12301, -2708, 1002, -3279, -9198, -10334, -4584, -947, -3394, -2923, -3134, -6400, -1634, 8888, 4398, -6320, -163, 10646, 6094, 773, 5887, 8054, 4127, 4075, 5261, 2763, 2833, 5017, 4291, 559, -5865, -6797, 2872, 8807, -4122, -15461, -8192, -758, -2528, -1773, -1396, -10685, -11922, 1234, 6202, -3482, -7960, -1291, 4897, 5197, 1189, -1421, 2358, 6367]
1022F367n68J165n23p112j356J1270J783j2482j186Q647l593q658L364N682l124
1037c24l049n10k835j406M492N213o06p101o223O271J2309k050r736J939N923
1052B307k808J106O531l725o971O875Q207p041q066L793O415M83l554l444p28
1067f20N69j468J233M105l689p301L728M515p358k259J1859K124j3787l275R316
1082b308L577m78J525k632n885J420Q366M784m199q170O3J0902K346j0227j586
1097b502Q106j442l596N375j712j1755K580J4207j858j2025j389M712L74p73M70
1112a228l17O3k657j620M132J676m405K825P462p853r857J0159J2006p117o740
1127c471M851r9l267N962M192n958m498K959M558O67n553n172O531O273p427n270
$$ y = [6367, 5799, 6964, 6441, -671, -2027, 9243, 11026, -1456, -2642, 6005, 2412, -6246, -2882, 2800, -324, -3373, -3883, -6718, -8124, -3632, 1581, 975, -6126, -12349, -6078, 6231, 4181, -5555, -3616, 2307, -501, 605, 7136, 3411, -3560, 3315, 11522, 4481, -3585, 208, 6623, 7106, 3552, 108, -620, -51, -1519, -286, 3819, 130, -7171, -3443, 1072, -6286, -8545, 3314, 5438, -8349, -11624, -2308, 1269, 791, 2316, -316, -6201, -4781, 3585, 8369, 4170, -4000, -3937, 6965, 9311, -916, -2502, 5604, 4162, 566, 5941, 4229, -7526, -4946, 9261, 7403, -4622, -6011, -1299, -925, -1698, -1228, -1545, -1482, -4139, -5759, -1627, 49, -4356, -1531, 5931, -1922, -11779, -1620, 10386, 3269, -3471, 1380, 1281, -1986, 3976, 8168, 2210, -2288, 671, 5229, 5896, 343, -4829, 1702, 7975, 548, -4722]
1143d722N156j069n561P388N821j1658o907J0057M209o055n9L250j751j922J15
1158c708K499M124r79m403K145L991n232j93J0598j037j2624K644J0762l716o844
1173a973M668J882n350N10L276j655l680m89K390L173l537p329L243P607m796
1188b060m582O995R10q855J764J0151k688o209M807L804n435j760N167M049j162
1203D896m560j236M401J659m626J833L915o144m794Q836L035j1035k673Q802K18
1218B527p230J038L417k815j817L073K009k644m117K633P026r30p424J595Q185
1233D526k349n281N895L635o792j535Q351J93q166P91O251k73n609q29L136K89
1249B233l831p2L901k026o794K362P193l415p329M462N847m796l713N719J981
$$ y = [-4722, 434, -635, -6196, 1192, 7013, -4645, -11552, -1495, 2714, -3341, -3400, -150, -1901, -3823, -3708, -1209, 2915, 1936, -2467, -322, 3669, -1563, -1756, 8842, 7805, -4819, -2175, 8587, 4871, -1973, 2695, 4577, -773, -263, 3013, 1358, -2322, -2811, -421, 2752, -785, -8114, -4871, 2736, -2060, -6642, 353, 1263, -7592, -5828, 4323, 1635, -4574, 233, 4037, -1398, -3158, 2009, 6058, 4896, 336, -900, 3501, 5160, 534, 2367, 6282, 138, -4656, 4180, 7215, -3820, -6493, 2309, 2527, -4703, -3665, -248, -3063, -4880, -1807, 202, -2442, -6559, -3926, 3100, 2170, -5254, -3659, 4526, 2177, -3104, 2791, 6426, -366, -1901, 6450, 6643, -1523, -732, 5519, 5246, -363, -1192, 1944, 2233, -1598, -1670, 2231, 205, -6589, -4227, 2966, -449, -7778, -3316, 2531, -2265, -5978, -259, 1722]
1264A722m745J73N750L15m838q49N828K587n116j899M328J459m607N15N070l527
1280B166o608M060O473m583o636K934M239l094l219L215J745m490j433N316J689
1295A774n442j758O583K166n454r09O030M30m759R25N139j614m583L043M531l728
1311B374n068L632M482l908m915L200L149l999l122M129J592n126j533N509R87
1326A383n803k04O133j62n592J075O146r36n077J804N357j403m027K870L095l513
1342A146l117N348L337o461m152N366L698n039l570L660O50l949N85M736k207
1357C1o474K027P100j238o423M45O111p23l954K517L266k601k657N061K628n145
1373b9k368N740K662o030k345N422K066m878j994L092K40l291Q88L584l444n600
$$ y = [1722, -3023, -2850, 2900, 3215, -1623, -2472, 3356, 5943, 827, -1072, 3256, 4715, 108, 623, 5693, 2166, -4442, -382, 6091, 1508, -5128, -2194, 2045, -1049, -4268, -1053, 692, -3798, -5231, 85, 1774, -3668, -5426, 1157, 3323, -2131, -3040, 2990, 3420, -1339, -414, 4725, 3111, -1472, 1571, 6102, 2374, -2694, 938, 5420, 1512, -3403, -203, 2946, -1053, -4175, -46, 1546, -3580, -5113, 396, 1383, -4420, -4624, 1509, 1347, -4245, -3170, 2976, 2040, -3037, -1233, 4124, 2721, -1306, 1564, 4659, 1146, -1971, 3377, 6714, 253, -3899, 1467, 5165, 126, -3444, 216, 866, -3083, -2498, 2238, 31, -6443, -4416, 2684, 1446, -4977, -4532, 1579, 856, -3098, -581, 2685, 84, -2573, 2488, 5116, -29, -2397, 3343, 6005, -25, -2370, 3052, 5118, 240, -1754, 1338, 1578, -1713, -825, 2759, -685, -6285]
1389f285L414P266l294p624J780O138r19l443K221J418l657K58O226M76o152j518
1405c695O261L033m477l237M239J588l842j30M140j492n453K875M378l677n173
1420d662M202M542m772m932L752M256k008k879N05J236j879M45N039n6p206j084
1436e501Q468K759o856k248N363M78l056K241K043m515k642N431L307m378m509
1451c615K378L778j571k980K211K387m256l180N367K865m874j534M798j551n417
1466e194L827O595k731p119J122N039J039k301l33O20j532n41L674K530n323m621
1482e249N879N720n280n671M424K639l671P02L717l077m730L334M694j783l505
1497a857L18K928n60l734P92N590M8o443P3M103j724j407O086J03r405r67R229
$$ y = [-6285, -2871, 4395, 1101, -6523, -4743, 1395, 476, -2967, -746, 672, -2985, -2727, 3499, 3975, -2177, -3695, 2566, 5599, 1122, -2115, 2124, 3712, -130, -260, 3880, 2388, -3065, -190, 4188, 511, -4662, -460, 4082, -690, -5622, -1870, 2386, 378, -2501, -1996, -760, -2639, -2194, 2845, 2789, -4417, -5501, 2967, 5726, -1130, -3378, 1985, 2463, -593, 1648, 3691, -824, -3466, 1965, 5272, 894, -3615, -1237, 2541, 970, -2010, 201, 2588, -1668, -4848, 519, 3384, -1490, -3024, 1774, 223, -5194, -1367, 5228, 2497, -4622, -3500, 1539, 2578, 277, -56, 564, -968, -1509, 2165, 4695, -628, -5249, 630, 6350, 1070, -4601, -177, 2462, -1209, -507, 3210, 133, -4597, -1263, 3431, 1648, -1857, -1539, 1389, 829, -2905, -2113, 3477, 3525, -2918, -2845, 1258, -466, -1873, 4213, 4316, -5089, -6056, 3173]
1514C173K174n896j939J794L99O72Q43k97j644j479J631M998j455q085O80Q999
1530D568m10o300J589K455n276L98P397p45o430J59L203r32p12J128J437N11l504
1547a464l662M632N182m302k857M417k237m861O045O096p482m821O300K381l601
1562b34l95J218q92Q98R71j077j95j614k411M719M825o575n121O898J221o216
1578c980L454N895o054m825N183K116l001K112J763l172j832N72K315L774n09
1593C811p471N04O495j906l973N701K10p975K868P176m839n692M716L046l199
1608e28l02m80j352K123J317j270J585j3n355J570P533l630n077O200K265q117
1624c531j50P480r08l662K852m89m334J476L411L00q92l072k615M629L129n726
$$ y = [3173, 5347, -549, -2488, -694, -295, 377, 1220, 923, -721, -2200, -569, 4429, 2974, -5111, -4431, 4568, 4158, -2142, -553, 1902, -3374, -2976, 4421, 3676, -2754, -2595, 608, -324, -1036, 92, 1529, 2040, -1464, -5126, -494, 4688, 386, -2471, 1946, -291, -5152, 893, 6989, -493, -5314, 986, 3367, -234, -629, 589, -303, 595, 1566, 489, 294, -1320, -3731, 988, 5813, -762, -5883, 1015, 2236, -3980, -526, 5369, -685, -5510, -327, 1789, -1212, 900, 2663, -509, -2341, -1769, 546, 4320, 3811, -3660, -3156, 3339, 1433, -2540, 3161, 3371, -4604, -1736, 5440, 601, -5091, -375, 2671, -528, -830, -1310, -2662, -539, 778, -492, 1093, 1080, -4275, -2705, 4828, 1198, -3879, 2321, 4586, -3531, -3681, 3799, 2891, -771, 2081, 1592, -2742, -1266, 2145, 2445, 1553, -1519, -4134, 495, 3624, -2102]
1640b102j318N389k034m534N419K404p604K06P761j012n789J516K114n28J266
1655A154P53j433p7o39j014M021J936o003j165N877j963n257M651L905o029k276
1671c559M524o48l045J930J975j931j036L5L41K401p14k918K831K259m575o00
1687b730N890n14n530L318L442l986j891M350L81l280M22J598n85j049q54P63
1703b55J936j286k978J472K083l104m89M564j036n177J672M510j706k098K395
1718E03O80k119J19J696N38p27q17P99J759j482k704K405K651k928k009K825J38
1735A327l278O61L249j768l142J607K149r07j446K77R18r8j089R97J665j145k123
1752b146J924K764k364j971K930J568k339m67K203n98k285Q10J988m88k395pJ880
$$ y = [-2102, -3420, 1969, -65, -4599, 820, 3224, -4380, -4174, 3587, 2575, -3214, -1698, 416, -112, 1154, 1907, 474, 397, -242, -1256, 2765, 4701, -1302, -2467, 3410, 1447, -3810, 841, 4746, -1283, -3559, 965, 317, -2728, -798, 1177, -754, -1790, -1755, -1414, 987, 273, -2645, 186, 2445, -2130, -2730, 3160, 2646, -2884, 434, 3876, -110, -2001, 2349, 2730, -550, -128, 1470, 885, -164, -1018, -255, 1681, 395, -2583, -1111, 972, -2132, -2621, 1943, 907, -4270, -2598, 1912, 206, -1892, 503, 1183, -936, -817, 879, 1417, 690, -127, 672, 2431, 949, -1755, 650, 3301, 373, -1636, 1189, 1327, -1951, -1290, 1959, 191, -2951, -1344, 805, -102, -1548, -1271, -353, -451, -1540, -543, 1122, -23, -2146, -222, 2542, 178, -1793, 1137, 2705, 366, -101, 2102, 1504, -781, 29, 2017, 1529, -866, -873, 1007]
1769A007l58j922j78K399q56k331J084J726j336j437K056J480k208j373K435J681
1785A869j972o79J727L73j463n0J833m05k295P18K916j004k962O48K330n33k433
1802a382R13J113j246j192K006M92k090o77K311J108k577o79K268Q20j610m70
1818h92J749jj362J186J372j371k087J203K468r06k432N44J541n30j187Q26K95
1835D16j718l59K311J91k222r20K287O79j941k8J709r1j348P10J633m75j325R24
1853D33J289j101j096J295J555j457j777J045J357r57j115N53L54j354O0J432
1869E16m95k031J9K080k10j270j55J533o6j368R57J439n93j306J388N92p48k5
1887B57J272O00j666j211J975J553j790j358L77M54n98N94P39k095j856J703K127
$$ y = [1007, 649, -1273, -1451, 948, 92, -2239, -1155, 571, -765, -2202, -146, 1334, -874, -2247, 188, 1869, -103, -782, 945, 1318, -145, -195, 1638, 1233, -1062, -344, 2572, 1568, -1394, -746, 1584, 1051, -1382, -469, 644, -602, -1794, 212, 704, -1386, -2063, 248, 1356, -1221, -1900, 368, 1188, -422, -892, 857, 856, -506, 680, 2052, 681, -1406, -203, 2265, 1359, -1073, -529, 1012, 482, -705, 121, 416, -1302, -1661, 650, 841, -1381, -2301, -14, 665, -1276, -1304, 405, 314, -1034, -324, 1309, 834, -491, 433, 1722, 621, -475, 820, 2375, 918, -859, 186, 1543, 586, -529, 24, 378, -976, -916, 516, 21, -2010, -1991, 89, -121, -1391, -1546, -13, -79, -1447, -490, 949, 356, -950, 438, 1030, 282, 257, 1529, 2129, 463, -748, 1227, 2780, 990, -368, 9, 463, -135, 459, 1198, -897, -2753, -1050, 1077]
1904A077q88j907q39J453R60k27j69k97p46L12K149J028k237j441K257J392q38
1921A039o32R09j61r50R38N84q29o06K14L03o41r72N46J357n90k505l1J804J33
1940i0j193N71k09j597R31K626r20k166N39J803P39m27m06m09K14J033L73O56
1958B068q51j907M82K705l83k127N99K68j916kK610o32j983j58N89r07P58J127
1976C40j206n61j45q6J677J349k067j359K297R07j758J133J084k400J47L442p53
1993B041k565P21J053o19O48L91j880l07P72p72P00J359k062j770K135p4k059
2010b288K232J887k868k005K553Q06q98J712n16k696Q42K349m35J31L58k183M95
2027e24L122j313k507J906Q93j986J546J250l592j276M022K83k594K81l3j725
$$ y = [1077, 189, -1718, -2557, -1104, -144, -371, -540, -837, -1583, -1271, 878, 1906, -331, -1772, 485, 1877, 1039, 407, 1316, 1155, 205, 1143, 1727, 898, 292, 506, 809, 168, -804, -258, 1099, 509, -1996, -2027, -223, -90, -1283, -712, -921, -2518, -1587, 1039, 119, -2047, -1508, 295, 1034, 607, 201, -208, 6, 1039, 1412, 2068, 1217, -690, -208, 2497, 2114, -13, 586, 854, -1062, -1064, 1546, 914, -1069, -1227, -638, -1545, -787, 340, -866, -1427, -1572, -1658, 19, 1368, -699, -2058, 239, 1146, -612, 521, 1605, -795, -648, 2794, 2041, -524, 197, 1250, 631, 1279, 1670, -210, -517, 255, -517, 183, 1542, -520, -2290, -155, -229, -2288, -56, 1831, -1037, -3042, -489, 317, -581, 1131, 615, -2081, -1239, 1110, 675, 806, 1164, -1019, -524, 2598, 1285, -1222, 684, 1577, -409, 1137, 2387, -1205, -2481, 1541, 1824, -770, -489, -522, -2247]
2043b247J387K409j867n84P98j309m59K652n59j857K714L63l896J086L719j575
2059G75j303K392j239k541K479J916k229J0J073j820M22J624j970n63K493r67
2075E52k467J842R38l175J591L034k732k053K362N7j619J768J413k282l94J295
2091A30r93P40K060j395j526J993p44j707K994J235l651j0L094k036j715K697
2107A166M05k565J115R68k497M27J820q85j36L24j704l80K962N5k336J355M55
2124E49k738Q99L338j887k011K861L83k153K94J220p42P37J201j648n93O21l11
2141B0n9K048j072k631J500J064j703R7K452j452k716J704J062j767M08J662j103
2158d86o42L98j62P78J040j107p63J617k49j013J426J071k151m48K885p20k071
$$ y = [-2247, -860, 1549, -318, -902, -104, -1413, -1872, 780, 221, -1636, 1078, 1441, -2455, -1369, 2350, 775, -528, 1864, 625, -1916, 563, 2479, 250, 260, 1333, -487, -65, 1559, -411, -974, 1519, 552, -1915, -73, 865, -2310, -719, 2315, -417, -2470, -108, -51, -1670, 98, 1511, -771, -1165, 130, -863, -123, 1937, 542, -984, 1009, 265, -1442, 1552, 2787, -864, -874, 2220, 184, -1531, 1166, 1571, -994, 121, 1089, -1408, -981, 839, -46, -182, 142, -1562, -1942, 1020, 1075, -1261, 94, 549, -2189, -1290, 2048, 161, -1850, 1011, 1394, -759, -465, 755, 13, 750, 1951, 303, -290, 331, 20, -39, 2009, 937, -1694, -194, 870, -833, -736, 1716, 264, -2452, -748, 314, -1453, -1045, 617, -486, -1128, -730, -892, -114, 926, -181, -944, 673, 424, -589, 837, 1908, -243, -691, 2194, 1474, -597]
2175e97R12J251j530J02M51p71m41L19J70N09l71j539m27J651J87j377J178Q14
2193D91j959m25K330M26j621L97J060o26m21J340R0j02n61L4O66J90p90j74P94
2212A139n56j053O01Q70j150j279J209N37j194k78O58l89o28K33J484k34j314
2229a344K75J001R48p19l76O35J76q55J104J251p87j387Q61R41j033n97P94J43
2247A031j249k96J138j63j401k40J045Q2j306J57R61n26r96O63J221n49r81Q62
2265e47J250j060l81J286P15q33m42J230N86j302j57R91m0j073OJ179l70j674
2283f36m5R59q2j250L49Q92j278r65J320J089j203j127J183P62p38j37J232j17
2301B08q36K04J773K23j599k03J588J44r84k7J230q86q91N30R33r33j354Q44P61
$$ y = [-597, 315, 1566, 36, 138, 589, -182, -623, -304, -134, 375, 4, -1535, -1962, -311, -124, -1501, -323, 491, -1468, -1893, 437, 863, -758, -361, 699, 73, -348, 992, 1082, 980, 419, 453, 1119, 1309, 519, 345, 1139, 583, -470, 131, 1001, -149, -1428, -219, 318, -876, -1154, -496, -885, -1513, -1280, 204, -30, -1344, -1069, -68, 880, 161, -215, 420, 596, -259, 845, 2096, 1309, -78, 783, 1724, 691, 94, 888, 1031, -218, -514, 624, 461, -940, -1180, -135, -53, -1359, -1202, -241, -767, -1763, -1100, 121, -428, -1409, -547, 703, -357, -738, 548, 1263, 430, -12, 1218, 1804, 502, 345, 1336, 1296, 223, 229, 1408, 1038, -636, -681, 278, 196, -1054, -705, 187, -1091, -2056, -736, 353, -850, -1977, -794, -32, -770, -907, 325, 208, -628, -424, 1349, 1572, -27, -230, 1358, 1502, 518, 491, 1721, 835, -56, 474, 1407, 474, -880, -36, 725]
2320G25j470q49R31J065j464n34Q95L52n46m48J413J7j592K52K265pj698Q0J456
2339H43L09p63N72M54q96q67J313J101j472r21O66Q20p48r99O81J93j292n4J121
2358F1K00j778K03J154P9j077K96J400m89j129N26J304j70j471J141Q12o00p16
2376b54J249P94j818l88J492M56j455o22J199J16j549J77J258k81j195k29J167
2393A17m8j475K49J555q61j104J123J562q49j586J235P32n15m20J154l85p82j6
2411c14J617J32k135p6J560M09j281n07Q99K36j690J171J418j470j909J649J468
2428A177j303j002R12L58m95n69J021M80p36n61P42P42j140n21J938K22k276K40
2446g71J769l15j503P85J176j428n23J446L11j477m96R98R91n56j401M74J124
$$ y = [725, -745, -1594, -663, 402, -1062, -1596, -701, -349, -895, -1343, 70, 87, -1505, -1253, 1012, 1005, -693, -613, 843, 1152, 389, 961, 1415, 519, -348, 965, 2066, 594, -327, 339, 1159, 411, -588, 93, 286, -1006, -1060, 61, 261, -1517, -1314, -160, -81, -1158, -862, 538, 49, -1080, -554, 750, 580, -891, 250, 1062, 462, -254, 995, 1789, -29, -417, 1075, 1531, 76, -546, 653, 769, -780, -603, 655, 374, -821, -1050, 117, 69, -1406, -1157, 398, -463, -1567, -444, 1118, 269, -1317, -82, 650, 135, -285, 869, 484, -298, -314, 1303, 1435, -700, -776, 784, 1193, -88, -595, 304, 540, -1150, 21, 1439, -31, -1940, -291, 1177, -126, -1128, -216, 142, -353, -922, 99, 579, -157, -718, 24, 766, -374, -895, 1043, 1265, -1011, -771, 998, 683, -820, -35, 1141, -287, -810, 636, 947, -530, -1026, -28, 963, 407, -994, -520, 604]
$$ [...]
8191B
##END NTUPLES=NMR FID
##END=
