##TITLE=1H_LR-751-KB-R2-C3
 CDCl3
 24 sc, 
 3.7.2024
##JCAMPDX= 6.0         $$ Bruker NMR JCAMP-DX V2.0
##DATA TYPE= NMR FID
##DATA CLASS= NTUPLES
##ORIGIN= UXNMR, Bruker Analytische Messtechnik GmbH
##OWNER= root
$$ XWIN-NMR		Version 3.5
$$ Wed Jul  3 14:12:42 2024 Russian Standard Time (UT+4h)  she@DPX200
##.OBSERVE FREQUENCY= 200.1314
##.OBSERVE NUCLEUS= ^1H
##.DELAY= (6, 6)
##.ACQUISITION MODE= SIMULTANEOUS
##.ACQUISITION SCHEME= undefined
##.AVERAGES= 8
##.DIGITISER RES= 18
##SPECTROMETER/DATA SYSTEM= spect
##.PULSE SEQUENCE= zg30
##.SOLVENT NAME= DMSO
##.SHIFT REFERENCE= (INTERNAL, DMSO, 0, 15.7039)
##AUDIT TRAIL= $$ (NUMBER, WHEN, WHO, WHERE, WHAT)
$$ ##TITLE= Audit trail, XWIN-NMR		Version 3.5
$$ ##JCAMPDX= 5.01
$$ ##ORIGIN= Bruker BioSpin GmbH
$$ ##OWNER= she
$$ F:/spectra/data/she/nmr/H-F/1/audita.txt
$$ ##AUDIT TRAIL=  $$ (NUMBER, WHEN, WHO, WHERE, WHAT)
(   1,<2024-07-03 14:11:25.84 +0400>,<she>,<DPX200>,
      <created by zg, POWCHK disabled, PULCHK disabled
       configuration hash MD5:
       00 E9 B6 7A A2 85 ED C7 34 08 36 98 17 FE 4E 26
       data hash MD5: 16K
       A4 9D AB 25 B2 72 62 C9 A2 5B D6 21 2D 01 F4 05>)
$$ ##END=
$$ 
$$ hash MD5
$$ D8 15 AD E4 A8 20 32 B9 67 34 22 53 EC 75 8B 0E
##$RELAX= 
##$RELAX= 
##$RELAX= 
##$RELAX= 
##$RELAX= 
##$RELAX= 
$$ Bruker specific parameters
$$ --------------------------
##$DU= <F:/spectra>
##$EXPNO= 1
##$NAME= <H-F>
##$PROCNO= 1
##$TYPE= <nmr>
##$USER= <she>
##$AMP= (0..31)
100 100 100 100 100 100 100 100 100 100 100 100 100 100 100 100 100 100 
100 100 100 100 100 100 100 100 100 100 100 100 100 100 
##$AQSEQ= 0
##$AQ_mod= 1
##$AUNM= <au_zg>
##$AUTOPOS= <>
##$BF1= 200.13
##$BF2= 200.13
##$BF3= 200.13
##$BF4= 200.13
##$BF5= 200.13
##$BF6= 200.13
##$BF7= 200.13
##$BF8= 200.13
##$BYTORDA= 1
##$CFDGTYP= 0
##$CFRGTYP= 5
##$CHEMSTR= <none>
##$CNST= (0..31)
1 1 145 1 1 1 1 1 1 1 1 1 1 1 1 1 1 1 1 1 1 1 1 1 1 1 1 1 1 1 1 1 
##$CPDPRG= <>
##$CPDPRG1= <>
##$CPDPRG2= <>
##$CPDPRG3= <>
##$CPDPRG4= <mlev>
##$CPDPRG5= <mlev>
##$CPDPRG6= <mlev>
##$CPDPRG7= <mlev>
##$CPDPRG8= <mlev>
##$CPDPRGB= <>
##$CPDPRGT= <>
##$D= (0..31)
0 1.2 0 0 0 0 0 0 0 0.06 0 0.03 0 0 0 0 0.0002 0 0 0 0 0 0 0 0 0 0 0 0 
0 0 0 
##$DATE= 1720001485
##$DBL= (0..7)
120 120 120 120 120 120 120 120 
##$DBP= (0..7)
150 150 150 150 150 150 150 150 
##$DBP07= 0
##$DBPNAM0= <>
##$DBPNAM1= <>
##$DBPNAM2= <>
##$DBPNAM3= <>
##$DBPNAM4= <>
##$DBPNAM5= <>
##$DBPNAM6= <>
##$DBPNAM7= <>
##$DBPOAL= (0..7)
0.5 0.5 0.5 0.5 0.5 0.5 0.5 0.5 
##$DBPOFFS= (0..7)
0 0 0 0 0 0 0 0 
##$DE= 6
##$DECBNUC= <off>
##$DECIM= 24
##$DECNUC= <off>
##$DECSTAT= 4
##$DIGMOD= 1
##$DIGTYP= 9
##$DL= (0..7)
0 120 120 120 120 120 120 120 
##$DP= (0..7)
150 150 150 150 150 150 150 150 
##$DP07= 0
##$DPNAME0= <>
##$DPNAME1= <>
##$DPNAME2= <>
##$DPNAME3= <>
##$DPNAME4= <>
##$DPNAME5= <>
##$DPNAME6= <>
##$DPNAME7= <>
##$DPOAL= (0..7)
0.5 0.5 0.5 0.5 0.5 0.5 0.5 0.5 
##$DPOFFS= (0..7)
0 0 0 0 0 0 0 0 
##$DQDMODE= 0
##$DR= 18
##$DS= 0
##$DSLIST= <SSSSSSSSSSSSSSS>
$$ [...]
##$SUBNAM2= <"">
##$SUBNAM3= <"">
##$SUBNAM4= <"">
##$SUBNAM5= <"">
##$SUBNAM6= <"">
##$SUBNAM7= <"">
##$SUBNAM8= <"">
##$SUBNAM9= <"">
##$SW= 24.0689651099613
##$SWIBOX= (0..15)
0 0 2 0 0 0 0 0 0 0 0 0 0 0 0 0 
##$SW_h= 4816.95568400771
##$TD= 16384
##$TD0= 1
##$TE= 0
##$TE2= 300
##$TE3= 300
##$TEG= 300
##$TL= (0..7)
0 120 120 120 120 120 120 120 
##$TP= (0..7)
150 150 150 150 150 150 150 150 
##$TP07= 0
##$TPNAME0= <>
##$TPNAME1= <>
##$TPNAME2= <>
##$TPNAME3= <>
##$TPNAME4= <>
##$TPNAME5= <>
##$TPNAME6= <>
##$TPNAME7= <>
##$TPOAL= (0..7)
0.5 0.5 0.5 0.5 0.5 0.5 0.5 0.5 
##$TPOFFS= (0..7)
0 0 0 0 0 0 0 0 
##$TUNHIN= 0
##$TUNHOUT= 0
##$TUNXOUT= 0
##$USERA1= <user>
##$USERA2= <user>
##$USERA3= <user>
##$USERA4= <user>
##$USERA5= <user>
##$V9= 5
##$VALIST= <valist>
##$VCLIST= <CCCCCCCCCCCCCCC>
##$VD= 0
##$VDLIST= <DDDDDDDDDDDDDDD>
##$VPLIST= <PPPPPPPPPPPPPPP>
##$VTLIST= <TTTTTTTTTTTTTTT>
##$WBST= 1024
##$WBSW= 4
##$XGAIN= (0..3)
0 0 0 0 
##$XL= 0
##$YL= 0
##$YMAX_a= 139486
##$YMIN_a= -227784
##$ZGOPTNS= <>
##$ZL1= 120
##$ZL2= 120
##$ZL3= 120
##$ZL4= 120
##$ABSF1= 10
##$ABSF2= 0
##$ABSG= 5
##$ABSL= 3
##$ALPHA= 0
##$AQORDER= 0
##$ASSFAC= 0
##$ASSFACI= 0
##$ASSFACX= 0
##$ASSWID= 0
##$AUNMP= <proc_1d>
##$AZFE= 0.1
##$AZFW= 0.1
##$BCFW= 1
##$BC_mod= 2
##$BYTORDP= 1
##$COROFFS= 0
##$CY= 11.3945322036743
##$DATMOD= 1
##$DC= 2
##$DFILT= <>
##$DTYPP= 0
##$F1P= 15.6554695791079
##$F2P= 12.8336369535428
##$FCOR= 0.5
##$FTSIZE= 0
##$FT_mod= 4
##$GAMMA= 1
##$GB= 0.15
##$INTBC= 1
##$INTSCL= 1
##$ISEN= 128
##$LB= 0.24
##$LEV0= 0
##$LPBIN= 0
##$MAXI= 10000
##$MC2= 0
##$MEAN= 0
##$ME_mod= 0
##$MI= 1.114404
##$NCOEF= 0
##$NC_proc= 0
##$NLEV= 6
##$NOISF1= 3.799351
##$NOISF2= 2.8
##$NSP= 1
##$NTH_PI= 0
##$NZP= 0
##$OFFSET= 15.70392
##$PC= 1
##$PHC0= -25498.45
##$PHC1= 9.387482
##$PH_mod= 1
##$PKNL= yes
##$PPARMOD= 0
##$PSCAL= 0
##$PSIGN= 0
##$REVERSE= no
##$SF= 200.130013532006
##$SI= 16384
##$SIGF1= 3
##$SIGF2= 2
##$SINO= 400
##$SIOLD= 16384
##$SREGLST= <1H.CDCl3>
##$SSB= 0
##$STSI= 0
##$STSR= 0
##$SW_p= 3612.71676300578
##$SYMM= 0
##$S_DEV= 0
##$TDeff= 0
##$TDoff= 0
##$TI= <>
##$TILT= no
##$TM1= 0
##$TM2= 0
##$TOPLEV= 0
##$USERP1= <user>
##$USERP2= <user>
##$USERP3= <user>
##$USERP4= <user>
##$USERP5= <user>
##$WDW= 1
##$XDIM= 8192
##$YMAX_p= 0
##$YMIN_p= 0
$$ End of Bruker specific parameters
$$ ---------------------------------
##NTUPLES= NMR FID
##VAR_NAME=  TIME,          FID/REAL,        FID/IMAG
##SYMBOL=    X,             R,               I
##VAR_TYPE=  INDEPENDENT,   DEPENDENT,       DEPENDENT
##VAR_FORM=  AFFN,          ASDF,            ASDF
##VAR_DIM=   8192,          8192,            8192
##UNITS=     SECONDS,       ARBITRARY UNITS, ARBITRARY UNITS
##FACTOR=    0.0002076,     1,               1
##FIRST=     0,             0,               0
##LAST=      1.7004516,     0,               0
##MIN=       0,             -227784,         0
##MAX=       1.7004516,     139486,          0
$$ Real data points
##PAGE= N=1
##DATA TABLE= (X++(R..R)), XYDATA
$$ [...]
$$ plain form
1710 986 596 474 50 -958 -1494 -1106 -510 -81 94 1240 1785 702 210 105 -527 -1309 -1648 -952 350
1729 350 430 711 1268 1372 749 -192 -677 -1136 -1209 -960 -427 563 738 1281 1308 560 157 -390 -921 -1545 -1218
1750 -1218 -78 630 606 1013 1411 1131 -175 -1104 -745 -992 -1394 -836 409 1372 1004 837 1152 864 -717
1769 -717 -1481 -954 -824 -767 -570 754 1448 1228 549 446 75 -1120 -1650 -1013 -651 -116 502 1134 1147 834
1789 834 376 -260 -1023 -1213 -905 -583 -483 323 1321 1711 742 -42 293 -431 -1361 -1616 -344 355 -186 410
1809 410 1741 1608 165 -808 -336 -500 -1496 -1558 -9 914 868 618 1057 1010 -25 -1000 -1040 -736 -905 -828
1829 -828 262 1135 1319 918 556 124 -505 -822 -1011 -987 -590 418 734 722 831 1259 401 -842 -915 -541
1849 -541 -702 -1256 -224 1180 1425 558 606 883 165 -1169 -1365 -301 -130 -598 -165 1261 1419 328
$$ packed form
1710I86l90j22m24j008n36L88N96M29J75J146N45j083m92j05o32p82l39O96J302
1729C50Q0K81N57J04o23r41m85m59p3K49N33R90J75N43K7p48m03n47n31o24L27
1750a218J140P08k4M07L98k80j306r29L59k47m02N58J245R63l68j67L15k88j581
1769g17p64N27J30N7J97J324O94k20o79j03l71j195n30O37L62N35O18O32J3l13
1789H34m58o36p63j90L08L22J00Q06R98L90r69p84L35p24r30k55J272O99n41N96
1809D10J331j33j443r73M72j64r96o2J549R23m6k50M39m7j035r75m0L04j69P7
1829h28J090Q73J84m01l62m32o29l17j89K4L97J008L16j2J09M28q58j243p3L74
1849e41j61n54J032J404K45q67M8K77p18j334j96J064J71m68M33J426J58j091
$$ plain form
1867 328 -40 225 -41 -1144 -1351 -475 94 309 588 1119 1042 325 -285 -590 -827 -684 -559 -215 49 757
1887 757 1220 671 33 225 -45 -824 -1393 -702 470 358 -47 819 1725 579 -631 -604 42 -437 -1438
1906 -1438 -820 859 734 256 444 1077 631 -812 -966 -384 -346 -615 -348 704 920 496 246 306 75
1925 75 -441 -858 -765 -489 -29 353 476 724 884 420 -255 -867 -433 -428 -527 -433 436 1062 503 -226 340 531
1947 531 -184 -1397 -629 272 23 -499 343 1470 653 -244 -89 301 -288 -1061 -747 267 412 80 408
1966 408 837 508 62 -478 -266 -531 -517 -291 -28 426 671 704 349 13 -55 -305 -701 -825 -28 139 191
1987 191 351 621 987 -259 -723 -378 -141 -806 -692 335 836 485 29 693 672 -94 -1233 -429 77
2006 77 -322 -559 4 822 703 -126 129 402 -147 -649 -681 -312 204 275 175 492 779 541 94 -514 -686
$$ packed form
1867C28l68K65k66j103k07Q76N69K15K79N31p7p17o10l05k37J43J25L44K64P08
1887G57M63n49o38J92k70p79n69O91J172j12m05Q66R06j146j210K7O46m79j001
1906a438O18J679j25m78J88O33m46j443j54N82L8k69K67J052K16m24k50O0k31
1925G5n16m17R3K76M60L82J23K48J60m64o75o12M34Nr9R4Q69O26n59p29N66J91
1947E31p15j213P68R01k49n22Q42J127q17q97J55L90n89p73L14J014J45l32L28
1966D08M29l29m46n40K12k65J4K26K63M54K45L3l55l36o8k50l96j24P97J67N2
1987A91J60K70L66j246m64L45K37o65J14J027N01l51m56O64k1p66j139Q04N06
2006G7l99k37N63Q18j19q29K55K73n49n02l2L69N16P1j00L17K87k38m47o08j72
$$ plain form
2027 -686 -312 -263 -290 -21 753 707 91 -189 120 104 -845 -1036 -36 285 -150 17 587 967 344 -402 -113
2048 -113 -57 -651 -797 78 584 370 188 417 686 207 -444 -334 -211 -347 -668 -101 578 473 230 240 269
2069 269 -14 -532 -544 -603 -236 297 153 94 657 707 244 -174 -382 -182 -183 -728 -414 671 605 31 216 583
2091 583 433 -434 -794 -351 25 -348 -140 623 839 339 57 112 230 -310 -903 -267 144 -68 35 646
2111 646 642 269 15 -184 -490 -398 -347 -243 88 400 449 548 339 205 133 -438 -569 -516 -116 37 8 396 688
2134 688 522 -109 7 6 -277 -771 -646 115 245 -167 232 595 370 -109 -511 -273 -229 -386 -219 485 579
2155 579 289 414 214 133 -171 -213 -474 -214 -308 113 392 174 466 220 -32 -213 2 -340 -501 -130 49
2176 49 264 330 239 234 368 -182 -488 -137 -158 -270 -193 8 400 402 118 35 183 71 -261 -424 -55 57 -136
$$ packed form
2027f86L74M9k7K69P74m6o16k80L09j6r49j91J000L21m35J67N70L80o23p46K89
2048a13N6n94j46Q75N06k14j82K29K69m79o51J10J23j36l21N67O79j05k43J0K9
2069B69k83n18j2n9L67N33j44n9N63N0m63m18k08K00jn45L14J085o6n74J85L67
2091E83j50q67l60M43L76l73K08P63K16n00k82N5J18n40n93O36M11k12J03O11
2111F46ml73k54j99l06R2N1J04L31L12M9R9k09j34p2n71j31N3M00J53k9L88K92
2134F88j66o31J16jk83m94J25P61J30m12L99L63k25m79m02K38M4j57J67P04R4
2155E79k90J25k00q1l04m2k61K60r4M21K79k18K92k46k52j81K15l42j61L71J79
2176D9K15O6r1nJ34n50l06L51k1j12P7K01L92Kk84q3J48j12l32j63L69J12j93
$$ plain form
2199 -136 122 334 319 135 -115 -198 -2 -79 -253 -80 404 -116 -48 298 194 45 -374 -280 -182 -98 -164 -55 128
2222 128 2 155 -79 79 254 -36 -239 -208 -30 135 -223 -40 236 89 -108 25 146 251 -114 -186 36
2243 36 -96 33 29 -41 30 252 -47 27 42 174 -142 -159 111 -88 69 -61 29 106 29 -89 -87 56 -50 -94 -5
2268 -5 55 91 60 -76 99 309 55 35 -86 -48 -83 -157 -133 124 90 160 156 280 88 88 -57 -228 -146 3 4 57 431
2295 431 402 185 -9 -111 8 -254 -293 -60 -10 128 -120 196 422 210 32 -130 133 -178 -118 -281 307
2316 307 275 317 243 445 89 -189 -345 -123 -164 -171 136 47 149 182 -6 -37 -155 -317 -208 -228 -212 71 138 141 282
2341 282 211 296 7 -218 -383 44 -292 -219 177 491 265 20 124 173 -206 -428 -277 34 110 -174 261 481
2363 481 463 38 62 -162 -181 -230 -168 45 208 164 212 311 259 134 -93 -353 -144 -203 -99 42 -110 409 546
$$ packed form
2199a36K58K12j5j84k50q3J96p7j74J73M84n20O8L46j04j49m19R4R8Q4o6J09J83
2222A28j26J53k34J58J75k90k03L1J78J65l58J83K76j47j97J33J21J05l65p2K22
2243C6j32J29mp0P1K22k99P4J5J32l16j7K70j99J57j30R0P7p7j18KJ43j06m4Q9
2268eO0L6l1j36J75K10k54k0j21L8l5p4K4K57l4P0mJ24j92%j45j71Q2J49JN3L74
2295D31k9k17j94j02J19k62l9K33N0J38k48L16K26k12j78j62K63l11O0j63N88
2316C07l2M2p4K02l56k78j56K22m1pL07q9J02L3j88l1j18j62J09k0J6K83O7LJ41
2341B82p1Q5k89k25j65M27l36P3L96L14k26k45J04M9l79k22J51L11P6k84M35K20
2363D81j8m25K4k24j9m9O2K13J63m4M8R9n2j25k27k60K09n9J04J41j52N19J37
$$ plain form
2386 546 61 -256 0 -51 -247 -258 32 171 293 -74 117 425 94 -381 -158 -114 -188 -276 47 216 492 175
2408 175 127 187 -46 -249 -185 -222 9 218 -121 126 296 140 -14 77 -85 -133 -161 -147 -110 298 399 102 173
2431 173 234 86 -169 -376 -127 144 -272 -244 326 510 31 -90 -107 163 -248 -588 -145 298 172 4 -25
2452 -25 319 153 -119 -220 64 -150 -286 -38 25 238 131 172 134 165 37 -268 -307 -18 61 -65 -41 177 445
2475 445 4 -137 -85 -69 94 -438 -360 253 358 -21 -99 334 378 -336 -469 -137 296 -128 -235 170 373 195
2497 195 -336 47 -9 -96 -404 -240 146 91 110 15 95 126 -30 -293 -34 150 9 -201 -97 280 342 181 -333
2520 -333 -73 346 -273 -412 -98 54 335 5 -49 468 135 -121 -514 -66 48 -336 -130 274 392 198
2540 198 -66 161 391 -221 -333 51 227 23 -396 145 225 196 -62 -165 139 144 -270 -90 -255 272 168
$$ packed form
2386E46m85l17K56n1j96j1K90J39J22l67J91L08l31m75K23M4p4q8L23J69K76l17
2408A75m8O0k33k03O4l7K31K09l39K47J70j56j54R1j62m8k8J4L7M08J01k97P1
2431A73O1j48k55k07K49K71m16K8N70J84m79j21j7K70m11l40M43M43j26j68k9
2452b5L44j66k72j01K84k14j36K48O3K13j07M1l8L1j28l05l9K89P9j26K4K18K68
2475D45m41j41N2J6J63n32P8O13J05l79p8M33M4p14j33L32M33m24j07M05K03j78
2497A95n31L83n6q7l08J64L86n5J9r5Q0L1j56k63K59J84j41k10J04L77O2j61n14
2520c33K60M19o19j39L14J52K81l30n4N17l33k56l93M48J14l84K06M04J18j94
2540A98k64K27K30o12j12L84J76k04m19N41Q0k9k58j03L04Nm14J80j65N27j04
$$ plain form
2561 168 -16 85 178 87 -336 -280 -85 -68 -125 -291 31 491 60 -295 -98 380 175 -451 -277 28 236 -5
2583 -5 -232 277 325 36 -356 96 189 -216 -228 140 202 136 23 121 367 -36 -311 -176 48 -25 -237 -164 318
2606 318 452 183 -12 57 -126 -27 -195 -446 -68 78 70 104 313 422 -157 -567 -266 91 -157 -388 142 209
2628 209 255 34 -203 296 193 -448 -182 75 22 -99 -98 289 500 126 -264 155 -82 -202 -250 -251 0 266
2650 266 133 86 213 106 -129 -252 -173 -169 42 -74 70 324 330 -47 -18 54 -89 -318 -184 -68 185 32 -206
2673 -206 142 320 149 -232 -353 -112 -53 -435 -118 279 215 3 -20 396 142 -216 -315 44 -94 -82 -93 56
2695 56 177 392 17 -51 21 -71 -284 -224 -47 171 49 95 163 179 69 -350 -224 -273 -67 -63 7 375 405 128
2719 128 -48 -54 -40 -387 -381 -277 8 144 7 132 315 197 -140 -176 50 -61 -334 -459 -192 122 166 -67
$$ packed form
2561A68j84J01R3r1m23N6J95J7n7j66L22M60m31l55J97M78k05o26J74L05K08k41
2583ek27N09M8k89l92M52R3m05j2L68O2o6j13R8K46m03k75J35K24p3k12P3M82
2606C18J34k69j95O9j83R9j68k51L78J46qL4K09J09n79m10L01L57k48k31N30O7
2628B09M6k21k37M99j03o41K66K57n3j21JL87K11l74l90M19k37j20m8jK51K66
2650B66j33m7J27j07k35j23P9MK11j16J44K54Ol77K9P2j43k29J34J16K53j53k38
2673b06L48J78j71l81j21K41N9l82L17L97o4k12k3M16k54l58r9L59j38J2j1J49
2695E6J21K15l75o8P2r2k13O0J77K18j22M6O8J6j10m19J26m9K06MP0L68L0k77
2719A28j76oJ4l47OJ04K85J36j37J25J83j18l37l6K26j11k73j25K67L14M4k33
$$ plain form
2741 -67 259 57 -178 -383 -271 -103 -43 -47 -73 107 145 123 124 -68 21 -254 -422 -216 -48 296 -1 6 326 186
2765 186 -241 -204 -237 -257 -237 -69 269 291 102 -72 117 44 -133 -323 -168 286 -56 12 100 74 171 -70 -83 5
2789 5 33 -266 -157 -127 237 265 184 108 9 -191 -1 -221 -65 -17 -42 144 83 248 98 -5 -7 -25 -88 -370 -29
2814 -29 14 259 322 230 92 65 -146 -309 -164 2 -133 32 74 260 175 -12 111 -111 -174 -296 -11 -141 98
2837 98 137 -50 318 250 -81 -230 -158 -277 -299 -248 24 145 255 103 203 144 -147 -22 -157 -142 -113 -10 121
2860 121 12 168 113 35 -183 -95 -200 -363 -247 -67 35 173 151 9 228 -70 -134 -191 -29 -150 -16 222
2882 222 260 167 332 53 -46 -51 -95 -103 -236 51 -67 37 231 64 -108 -198 -180 -153 -275 -112 3 -17 238 -26
2906 -26 359 207 181 -155 -314 -70 -69 48 -29 103 152 74 -152 -46 -24 0 -194 -329 -145 208 29 94 259
$$ packed form
2741f7L26k02k35k05J12J68O0mk6J80L8k2Jj92Q9k75j68K06J68L44k97PL20j40
2765A86m27L7l3k0K0J68L38K2j89j74J89p3j77j90J55M54l42O8Q8k6R7k41j3Q8
2789EK8k99J09L0L64K8q1p6r9k00J90k20J56M8k5J86o1J65j50j03kj8o3k82L41
2814b9M3K45O3r2j38k7k11j63J45J66j35J65M2J86q5j87J23k22o3j22K85j30K39
2837I8L9j87L68o8l31j49P2j19k2N1K72J21J10j52J00n9k91J25j35J5K9J03J31
2860A21j09J56n5p8k18Q8j05j63J16J80J02J38k2j42K19k98o4n7J62j21J34K38
2882B22L8r3J65k79r9nm4qj33K87j18J04J94j67j72r0J8K7j22J63J15k0K55k64
2906b6L85j52k6l36j59K44JJ17p7J32M9p8k26J06K2K4j94j35J84L53j79O5J65
$$ plain form
2929 259 218 66 -131 -241 -38 -229 -133 -133 251 191 96 237 38 -34 -74 -386 -216 105 -26 53 314 168 176 -149
2953 -149 -253 -181 77 -224 -72 9 160 193 37 64 271 13 -329 -279 -155 -210 -106 -88 110 260 204 -108 49
2976 49 -152 -124 -1 -29 20 38 98 138 -42 116 -254 -155 -180 -157 -223 -93 70 137 255 -105 -26 49 -37 -299 -107
3001 -107 -37 -145 -24 -1 74 182 -69 -88 -340 -336 5 -297 -8 -62 145 258 90 260 196 -23 9 -69 4 -70
3025 -70 -109 84 84 86 -24 -43 -148 -81 -193 -89 -57 62 44 -66 246 99 -93 -376 -163 -216 -34 21 60 321
3049 321 248 201 50 -34 -51 -151 -182 -238 -220 -62 62 28 264 225 -110 -40 4 6 -310 -192 45 362 85 109 6
3074 6 36 130 -323 -250 -123 -123 -108 -45 105 396 221 43 26 11 -232 -238 -228 -119 148 -95 51 56 367 8 -170
3099 -170 -149 -67 -108 -134 29 133 76 -269 204 33 -72 -384 -277 27 195 -56 111 159 114 29 -148 -123 -159
$$ packed form
2929B59m1j52j97j10K03j91R6%L84o0r5J41j99p2m0l12J70L21j31P9K61j46Ql25
2953a49j04P2K58l01J52Q1J51L3j56K7K07k58l42N0J24n5J04J8J98J50n6l12J57
2976D9k01K8J23k8M9J8O0M0j80J58l70R9k5K3o6J30J63O7J18l60P9P5q6k62J92
3001a07P0j08J21K3P5J08k51j9k52ML41l02K89n4K07J13j68J70o4k19L2p8P3p4
3025g0l9J93%Kj10j9j05O7j12J04L2J19j8j10L12j47j92k83K13n3J82N5L9K61
3049C21p3m7j51q4j7j00l1n6J8J58J24l4K36l9l35P0M4Kl16J18K37L17k77K4j03
3074FL0R4m53P3J27%J5O3J50K91j75j78j7j5k43oJ0J09K67k43J46NL11l59j78
3099a70K1Q2m1k6J63J04n7l45M73j71j05l12J07L04J68k51J67M8m5q5j77K5l6
$$ plain form
3122 -159 -135 -181 -271 331 99 10 84 196 214 -20 -183 -122 -154 -164 -77 21 189 433 228 -49 72 2 -370 -239
3146 -239 -94 9 150 173 326 210 -61 -246 -225 12 -141 -420 -281 59 172 229 127 107 64 -43 -407 -372
3168 -372 38 -117 -6 -10 398 182 233 -134 104 -181 -469 -248 -87 79 114 121 143 99 63 142 -324 -194 -275 -158
3192 -158 -22 219 426 262 145 50 138 -141 -293 -213 2 200 -41 184 440 297 86 -99 -335 -65 -189
3213 -189 -272 11 186 221 19 173 230 138 -42 -263 2 -48 -323 -18 149 201 116 -108 -103 3 -246 -209 -267 -100
3237 -100 111 308 145 269 227 131 22 -295 -85 -301 -288 3 154 64 -33 -1 105 -109 -285 -123 -71 159
3259 159 125 133 264 395 158 45 -160 -89 -73 -201 -166 180 236 -19 63 245 308 -82 -91 -255 -179 -128 -208 102 137
3284 137 60 161 138 83 -71 -407 -208 -70 53 35 -15 128 138 -62 62 -181 -19 -254 -160 -179 -16 142 -74
$$ packed form
3122a59K4m6r0O02k32q9P4J12J8k34j63O1l2j0Q7R8J68K44k05k77J21p0l72J31
3146b39J45J03J41K3J53j16k71j85K1K37j53k79J39L40J13N7j02k0m3j07l64L5
3168c72M10j55J11mM08k16N1l67K38k85k88K21J61J66L5PK2m4l6P9m66J30q1J17
3192a58J36K41K07j64j17r5Q8k79j52Q0K15J98k41K25K56j43k11j85k36K70j24
3213a89q3K83J75L5k02J54N7r2j80k21K65n0k75L05J67N2q5k24NJ06k49L7n8J67
3237a00K11J97j63J24m2r6j09l17K10k16J3K91J51r0r7L2J06k14j76J62N2K30
3259A59l4QJ31J31k37j13k05P1J6j28L5L46N6k55Q2J82O3l90rj64P6N1q0L10L5
3284A37p7J01k3n5j54l36J99J38J23j8n0J43J0k00J24k43J62k35R4j9J63J58k16
$$ plain form
3307 -74 103 43 40 -276 -124 99 -9 -80 -133 69 191 203 61 -221 -29 -5 -271 -79 -8 177 -8 73 169 291
3331 291 26 -28 74 -152 -254 -146 47 122 188 -26 34 -42 -6 -124 -289 -8 -72 -5 -162 15 163 -4 137
3354 137 -42 107 -10 -276 -143 65 178 50 -31 -112 258 -39 -206 -20 229 26 -229 34 172 26 80
3375 80 -72 281 106 -141 50 49 55 -92 -26 300 267 65 59 -37 1 9 -123 124 -64 -68 115 144 83 154 57 -57
3401 -57 108 -20 23 -82 183 78 185 137 33 -173 52 -108 -171 -96 -78 7 152 235 23 95 -15 -188 62
3424 62 -51 2 -71 52 51 -100 7 -18 97 121 55 -220 68 -259 -34 24 -52 43 240 -123 99 -31 -82 -67
3448 -67 -161 59 18 -50 116 214 18 37 -71 70 -236 -61 208 -95 33 -154 15 66 48 -120 -168 0 -69
3471 -69 40 49 -5 188 167 -53 0 -69 -23 -51 9 83 -48 7 13 -81 154 -80 -111 -168 -77 19 -303 -38 -140 24
$$ packed form
3307g4J77o0ll16J52K23j08p1n3K02J22J2j42k82J92K4k66J92P1J85j85Q1R6J22
3331B91k65n4J02k26j02J08J93P5O6k14O0p6L6j18j65K81o4O7j57J77J48j67J41
3354A37j79J49j17k66J33K08J13j28q1q1L70k97j67J86K49k03k55K63J38j46N4
3375H0j52L53j75k47J91jOj47O6L26l3k02or6L8Qj32K47j88mJ83K9o1P1r7j14
3401e7J65j28M3j05K65j05J07m8j04k06K25j60o3P5J8Q5J45Q3k12P2j10j73K50
3424F2j13N3p3J23jj51J07k5J15K4o6k75K88l27K25N8p6R5J97l63K22j30n1J5
3448f7r4K20m1o8J66R8j96J9j08J41l06J75K69l03J28j87J69N1j8j68m8J68o9
3471f9J09Rn4J93k1k20N3o9M6k8O0P4j31N5Or4K35k34l1n7R1R6l22K65j02J64
$$ plain form
3497 24 102 100 148 45 27 28 55 32 -196 -125 113 11 128 113 117 105 9 -228 40 -14 -75 -35 -108 144 44 3 -65
3524 -65 -40 47 -63 -47 -52 54 -129 30 123 -44 165 -46 -223 98 20 35 -48 142 10 -70 -18 15 66 -40 -109
3549 -109 -7 63 -67 -119 -131 -64 -54 178 -42 68 2 -84 -94 -49 34 54 -183 -215 89 158 29 -102 -64 14 -160
3574 -160 -182 -121 -33 31 -93 128 66 15 -193 -147 15 -6 -180 -318 -49 17 -137 115 107 -9 61 -77 -28 7 111
3599 111 37 38 158 68 154 124 -105 140 -199 -47 10 -151 48 192 4 90 30 5 -91 -176 -270 -77 -88 -74 191
3624 191 179 -60 -115 0 -41 -20 -238 -185 -24 103 65 -59 368 -44 -160 -41 7 -74 -41 118 -47 69 28
3647 28 -34 10 187 65 -131 -6 -82 -70 95 48 156 72 266 17 -284 -36 -191 -93 -137 256 -77 -117 -74 -56
3671 -56 56 63 -177 -10 162 -39 2 48 120 1 141 -26 -34 143 109 22 -60 164 -101 -139 82 47 39 47 -99 -97
$$ packed form
3497B4P8kM8j03j8JK7k3k28P1K38j02J17j5Mj2r6k37K68n4o1M0p3K52j00m1o8
3524f5K5Q7j10J6nJ06j83J59R3j67K09k11j77L21p8J5q3J90j32q0N2L3N1j06o9
3549a09J02P0j30n2j2O7J0K32k20J10o6q6j0M5Q3K0k37l2L04O9j29j31L8P8j74
3574a60k2O1Q8O4j24K21o2n1k08M6J62k1j74j38K69O6j54K52qj16P0j38M9L5J04
3599A11p4JJ20r0Q6l0k29K45l39J52N7j61J99J44j88Q6o0k5r6q5r4J93j1J4K65
3624A91j2k39n5J15m1K1k18N3J61J27l8j24M27m12j16J19M8q1L3J59j65J16m1
3647B8o2M4J77j22j96J25p6J2J65m7J08q4J94k49l01K48j55R8m4L93l33m0M3J8
3671e6J12Pk40J67J72k01M1M6P2j19J40j67qJ77l4q7q2K24k65l8K21l5qQj46K
$$ plain form
3697 -97 41 -126 23 -164 90 27 -123 325 -14 26 -147 -78 -144 98 24 60 225 -1 176 -94 35 82 29
3720 29 31 -103 23 281 -171 134 -57 -1 -202 -263 23 123 -218 -97 -5 75 -32 58 -37 -5 105 -293 36
3743 36 -207 32 -55 55 9 -104 61 42 20 155 94 -171 92 -64 -92 35 121 -36 157 -149 -183 159 -78
3766 -78 100 37 50 119 -24 202 266 55 34 -81 -69 101 -100 -2 -52 75 -46 29 -22 -135 -77 152 -9 86
3790 86 -144 132 5 46 124 70 -173 -21 -28 32 -124 75 217 187 84 -138 -78 -104 -242 -189 -208 87 -53 115
3814 115 130 -58 71 113 6 -221 -125 157 251 13 -39 24 -84 179 -93 77 -115 -301 -73 -20 -75 -24 -4
3837 -4 278 100 -145 72 25 72 -24 370 132 181 -43 -118 152 110 -33 -23 72 77 -229 88 40 15 55 -109 -205
3862 -205 43 -50 -56 82 -151 182 92 -141 27 -27 -65 53 21 -98 -108 233 -17 -38 108 81 106 -64 -28 -161
$$ packed form
3697i7J38j67J49j87K54o3j50M48l39M0j73O9o6K42p4L6J65k26J77k70J29M7n3
3720B9Kj34J26K58m52L05j91N6k01o1K86J00l41J21R2Q0j07R0r5L2J10l98L29
3743C6k43K39q7J10m6j13J65j9k2J35o1k65K63j56k8J27Q6j57J93l06l4L42k37
3766g8J78o3J3O9j43K26O4k11k1j15J2J70k01R8n0J27j21P5n1j13N8K29j61R5
3790H6k30K76j27M1P8n4k43J52pO0j56J99J42l0j03k22O0k6j38N3j9K95j40J68
3814A15J5j88J29M2j07k27R6K82R4k38n2O3j08K63k72J70j92j86K28N3n5N1K0
3837dK82j78k45K17m7M7r6L94k38M9k24p5K70m2j43J0R5Nl06L17m8k5M0j64r6
3862b05K48r3oJ38k33L33r0k33J68n4l8J18l2j19j0L41k50k1J46k7K5j70L6j33
$$ plain form
3886 -161 -93 -155 87 67 297 115 113 -43 -121 -130 84 3 5 -8 131 182 127 -147 53 200 -5 50 55 -47 -175 -55
3912 -55 -53 -63 40 -85 -54 1 129 -33 -69 150 19 -146 -145 -12 98 -134 -21 40 87 -38 30 -150 2 36
3936 36 -8 48 151 22 -97 -13 -56 59 53 48 89 31 -29 51 92 -112 -62 -79 13 258 -41 -240 -25 24 -46 137
3962 137 -92 29 -105 -187 -25 -170 -22 96 -273 -37 -52 2 22 -186 58 78 35 125 -46 128 -37 -197
3984 -197 14 148 240 61 48 -21 -107 74 -181 24 -34 -29 -78 -40 33 90 -34 -71 -64 100 73 -113 23 213 -58
4009 -58 -17 70 -93 -207 121 86 53 -155 -148 75 -6 87 -153 -56 47 -88 -138 38 -44 81 65 -72 -6 36 -159
4034 -159 4 -14 40 76 29 -109 -94 153 -91 -220 52 67 -72 -231 -18 39 -103 9 18 -22 104 55 13 -79
4058 -79 9 -2 9 -58 -85 193 104 96 43 161 82 6 -87 9 -213 -76 151 119 197 67 -8 145 -123 -162 35 -50
$$ packed form
3886a61O8o2K42k0K30j82kj56p8rK14q1Kj3J39N1n5k74K00J47k05N5Nj02j28J20
3912e5Kj0J03j25L1N5J28j62l6K19j31j65JJ33J10k32J13O1M7j25O8j80J52L4
3936C6m4N6J03j29j19Q4m3J15onM1n8o0Q0M1k04N0j7R2K45k99j99K15M9p0J83
3962A37k29J21j34q2J62j45J48J18l69K36j5N4K0k08K44K0m3R0j71J74j65j60
3984a97K11J34R2j79j3o9q6J81k55K05n8Nm9L8P3N7j24l7PJ64k7j86J36J90k71
4009e8M1Q7j63j14L28l5l3k08PK23q1R3k40R7J03j35n0J76q2J25j6j37O6M2j95
4034a59J63j8N4L6m7j38J5K47k44j29K72J5j39j59K13N7j42J12Rm0J26m9m2r2
4058g9Q8j1J1o7k7K78q9qn3J18p9p6r3R6k22J37K27l2P8j30p5J53k68l9J97q5
$$ plain form
4084 -50 19 22 45 166 -47 -44 -50 -53 58 -26 -85 103 -64 198 24 21 213 99 -14 24 22 -38 -191 35 -30 -2 96
4111 96 134 91 215 96 42 126 129 -55 -19 -197 60 116 -140 -31 -39 -36 58 -114 -177 12 -148 -9 16 0 22 -153
4137 -153 -14 -126 13 -152 -108 -78 -2 -30 -38 51 37 -42 -77 86 -145 167 110 -71 126 75 148 80 87 35 142 25
4163 25 58 -23 -46 155 -47 90 -107 68 68 67 -13 30 -66 26 142 -106 198 -18 -33 27 -7 -10 -87 -77 -47 128 303
4190 303 39 -32 7 26 98 -15 -184 64 40 -172 -102 -21 58 56 -119 56 -106 -87 103 -55 -27 -106 10 -171
4214 -171 -132 -52 145 -24 -44 55 9 -66 -101 -141 -243 -146 36 39 -88 -12 50 106 -108 141 -96 -101 -35 -105 -118 -110 -170
4241 -170 226 -119 -23 -182 22 121 -25 -17 -148 -92 -85 54 -1 -47 12 33 113 -43 92 -90 -19 -58 -196 -12 62
4266 62 129 -28 104 -63 52 -35 -222 139 -153 40 208 -73 105 -84 72 -135 -33 -17 123 -164 -171 135
$$ packed form
4084e0O9LK3J21k13LolJ11q4n9J88j67K62j74lJ92j14j13L8ko0j53K26o5K8R8
4111I6L8m3J24j19n4Q4Lj84L6j78K57N6k56J09qLR4j72o3J89j60J39K5j6K2j75
4137a53J39j12J39j65M4L0P6k8qQ9j4p9l5J63k31L12n7j81J97n1P3o8Pn2J07j17
4163B5L3q1k3K01k02J37j97J75%jq0M3r6R2J16k48L04k16j5O0l4lp7J0L0J75J75
4190C03k64p1L9J9P2j13j69K48k4k12P0Q1P9kj75J75j62J9J90j58K8p9J16j81
4214a71L9Q0J97j69k0R9m6p5l5m0j02R7J82Lj27P6O2N6k14K49k37nO6p0j3Qo0
4241a70L96l45R6j59K04R9j46Qj31N6PJ39n5m6N9K1Q0j56J35j82P1l9j38J84P4
4266F2O7j57J32j67J15q7j87L61k92J93J68k81J78j89J56k07J02J6J40k87pL06
$$ plain form
4288 135 24 137 88 206 -37 98 -89 -70 -52 -82 98 -231 -10 39 -21 54 216 -50 44 -111 -62 31 103 -103
4312 -103 -36 51 -138 -14 -32 209 -66 -21 -40 149 68 222 -36 -45 46 -161 -196 114 17 -96 -84 29 36 38 -112
4337 -112 -122 16 70 -85 -23 -121 143 26 122 94 -97 2 193 244 -70 64 -30 27 -29 96 310 51 92 185
4361 185 78 -21 -221 -14 -21 81 17 -38 -43 -135 -67 -63 -9 -1 -109 85 38 -124 65 -70 -75 88 -42 -9 -142 198
4387 198 195 -7 -32 -77 -22 -181 -149 -26 39 -103 -123 -148 -52 145 -174 -96 118 5 -52 7 -128 -72 53 54 199
4412 199 156 -12 -50 -76 -102 99 67 -20 63 -177 97 26 -8 130 -19 60 -56 -37 -116 -152 74 -62 36 53 92
4437 92 109 59 105 26 -55 56 37 22 114 -65 -40 -22 -20 -231 -168 -94 84 60 166 84 70 -125 88 -147 37 -51
4463 -51 -35 131 71 -65 -84 169 -132 212 49 -107 -124 26 -136 -240 -15 -64 92 -143 -215 54 111 219 -117
$$ packed form
4288A35j11J13m9J18k43J35j87J9J8l0J80l29K21M9o0P5J62k66R4j55M9R3P2k06
4312a03O7Q7j89J24j8K41k75M5j9J89q1J54k58rR1k07l5L10r7j13J2J13PKj50
4337a12j0J38N4j55O2r8K64j17R6k8j91R9J91N1l14J34r4N7n6J25K14k59M1R3
4361A85j07r9k00K07pJ02o4n5nr2O8MN4Qj08J94m7j62J89j35nJ63j30L3j33L40
4387A98lk02k5m5N5j59L2J23O5j42k0k5R6J97l19P8K14j13n7N9j35N6J25JJ45
4412A99m3j68l8k6k6K01l2q7Q3k40K74p1l4J38j49P9j16J9p9l6K26j36R8J7L9
4437I2J7n0M6p9q1J11j9j5R2j79K5J8Kk11O3P4J78k4J06q2j4j95K13k35J84q8
4463e1J6J66o0j36j9K53l01L44j63j56j7J50j62j04K25m9J56k35p2K69N7J08l36
$$ plain form
4486 -117 95 -46 14 -40 75 -111 16 80 72 36 46 215 -65 -47 -44 172 64 114 47 -45 95 25 -148 -237 6
4511 6 26 -43 -43 73 5 35 -81 147 -90 -91 -41 -15 -26 -42 86 -34 -12 -218 39 -7 -134 -190 -33 35 -7 31 120
4538 120 200 9 -12 44 -228 -104 41 103 -127 112 -106 -169 -156 149 157 -26 43 36 155 77 12 45 -144 31 191
4563 191 44 67 -26 -14 -42 -27 428 13 62 128 80 54 -15 104 73 117 83 -20 5 -22 75 15 3 56 -28 44 -113
4590 -113 90 -156 -98 -29 37 -54 -41 125 46 83 58 12 -190 -29 45 -231 65 -200 -16 10 -94 -54 61 70 -111
4615 -111 200 158 -60 95 97 -93 -94 -55 -12 -46 131 196 -251 60 64 -13 205 158 69 144 73 62 -147 -48 -11 9 190
4642 190 65 -186 -91 -58 7 207 62 -139 62 -40 -168 55 -102 138 -118 -103 231 2 213 133 -3 197
4664 197 -148 91 -40 183 -57 117 56 -40 -24 -55 -16 -11 -144 -47 -166 -69 83 -104 87 -4 211 -35 41 -43
$$ packed form
4486a17K12j41O0n4J15j86J27O4ql6J0J69k80J8LK16j08N0o7r2J40p0j73q9K43
4511FK0o9%J16o8L0j16K28k37jN0K6j1j6J28j20K2k06K57m6j27n6J57O8m2L8Q9
4538A20Q0j91k1N6k72J24J45O2k30K39k18o3J3L05Qj83O9pJ19p8o5L3j89J75J60
4563A91j47K3r3J2k8J5M55m15M9O6m8k6o9J19l1M4l4j03K5k7R7o0j2N3q4P2j57
4590a13K03k46N8O9O6r1J3J66p9L7k5m6k02J61P4k76K96k65J84K6j04M0J15Rj81
4615a11L11m2k18J55Kj90jL9M3l4J77O5m47L11Mp7K18m7q9P5p1j1k09R9L7K0J81
4642A90j25k51R5L3O5K00j45k01K01j02j28K23j57K40k56J5L34k29K11q0j36K00
4664A97l45K39j31K23k40J74o1r6J6l1L9Nj33R7j19R7J52j87J91r1K15k46P6q4
$$ plain form
4688 -43 -51 -76 124 74 107 -124 -111 -5 -100 32 -113 38 -17 -144 126 30 -71 68 41 -8 -210 -135 23 40 48
4713 48 -133 80 -135 23 55 -3 -60 97 -143 -71 -79 -80 -19 104 -26 -28 73 -51 -18 -159 -24 -11 85 95 -122
4738 -122 -82 -12 95 29 13 -257 85 -53 -35 -108 -25 55 -46 72 48 -47 -15 73 76 14 -63 16 6 -115 29 52
4764 52 -21 -150 -209 123 -78 38 3 138 120 129 -156 18 -247 -44 -1 -17 82 55 -48 -106 -76 -59 89 25 51
4789 51 24 -61 69 230 195 -74 124 55 27 77 73 -76 -75 104 140 115 -113 85 34 98 3 14 130 123 -174 -134 -40
4816 -40 50 -32 -50 21 174 -27 -75 30 131 -23 105 -51 -53 -70 86 -19 62 -46 0 166 -4 340 -23 -25
4840 -25 27 -15 120 -74 -3 -15 -17 66 -34 137 170 1 85 105 -5 1 -10 -15 167 -53 -138 -15 -167 65 -272 36
4866 36 -112 -79 -118 64 304 169 137 -18 112 130 53 -109 36 96 -13 12 -30 -49 117 127 -193 78 34 -33
$$ packed form
4688d3qk5K00n0L3k31J3J06r5J32j45J51n5j27K70r6j01J39k7m9k02P5J58J7Q
4713D8j81K13k15J58L2n8n7J57k40P2qjO1J23j30kJ01j24L3j41J35J3R6J0k17
4738a22M0P0J07o6j6k70L42j38J8p3Q3Q0j01J18k4r5L2Q8Lo2p7P9j0j21J44K3
4764E2p3j29n9L32k01J16l5J35j8Rk85J74k65K03M3j6R9k7j03n8L0J7J48o4K6
4789E1k7q5J30J61l5k69J98o9k8N0mj49JJ79L6k5k28J98n1O4r5J1J16pk97M0R4
4816d0R0q2j8P1J53k01m8J05J01j54J28j56kj7J56j05Q1j08M6J66j70L44l63k
4840b5N2m2J35j94P1j2kQ3j00J71L3j69Q4K0j10Oj1nJ82k20q5J23j52K32l37L08
4866C6j48L3l9J82K40j35l2j55J30J8p7j62J45O0j09K5m2j9J66J0l20K71m4o7
$$ plain form
4890 -33 -77 67 4 51 37 -125 133 20 -9 -23 -74 -44 101 -69 -70 47 158 -193 -185 -90 -156 7 24 15 101 49 -89
4917 -89 -44 61 -56 -7 94 19 -50 10 28 91 -57 -166 -34 100 -161 -58 -7 -42 -84 70 -9 -172 -146 59
4941 59 21 -115 78 95 -24 -229 -145 166 210 -28 4 158 -17 274 196 68 -7 150 115 -48 -31 -93 -79 -4
4965 -4 37 -108 -16 -92 94 -1 34 -10 -198 157 127 66 -36 103 31 -160 -97 -23 -163 50 -149 82 -8 -251 29
4990 29 -2 91 105 8 -164 -80 80 17 -60 148 9 67 39 -18 -115 -127 -200 13 -80 157 -34 -22 21 -18 -194 36
5016 36 -105 119 -34 57 -137 -14 4 130 63 -6 -80 87 -63 175 -11 16 23 77 74 -7 78 -239 11 -16 49
5041 49 -110 -47 -125 -24 -5 38 -58 -241 -137 -15 236 -184 -308 -103 85 64 45 -157 54 24 87 -80 39
5064 39 113 -46 210 -85 153 122 141 118 -20 87 -18 -53 40 -42 -28 -32 -159 67 10 43 -55 -18 -8 -219 124
$$ packed form
4890c3m4J44o3M7j4j62K58j13k9j4n1L0J45j70jJ17J11l51QR5o6J63J7rQ6n2j38
4917h9M5J05j17M9J01p5o9O0J8O3j48j09J32J34k61J03N1l5m2J54p9j63K6K05
4941E9l8j36J93J7j19k05Q4L11M4k38L2J54j75K91p8j28p5J57l5j63J7o2J4P5
4965dM1j45R2p6J86r5L5m4j88L55l0o1j02J39p2j91O3P4j40K13j99K31r0k43K80
4990B9l1R3J4r7j72Q4J60o3p7K08j39N8k8n7r7j2p3K13r3K37j91J2M3l9j76K30
5016C6j41K24j53R1j94J23J8J26o7o9p4J67j50K38j86K7PN4lq1Q5l17K50k7O5
5041D9j59O3p8J01J9M3r6j83J04J22K51m20j24K05J88k1j9k02K11l0O3j67J19
5064C9P4j59K56k95K38l1J9k3j38J07j05l5R3q2J4mj27K26n7L3r8L7J0k11L43
$$ plain form
5089 124 -110 -26 170 76 226 -66 -152 -183 123 17 141 -48 69 -133 138 -163 -9 10 -30 -157 -21 55
5111 55 60 38 -6 2 130 -26 92 151 -49 -293 -120 230 105 -8 -62 5 134 101 -23 -151 6 74 97 29 149
5136 149 119 -46 -17 -112 107 122 158 48 143 -93 -63 -51 -2 -82 -59 40 145 51 36 58 26 209 -5 58 36 42 -31
5163 -31 -115 -122 -150 58 69 110 181 -136 -5 123 -1 -72 143 -155 25 98 -151 180 -12 219 -106 20 -118
5186 -118 2 64 -118 3 2 -150 10 20 114 40 90 122 65 58 181 81 -109 -170 -16 120 85 51 -71 69 55
5211 55 83 -3 -89 155 171 -35 -30 -35 45 5 27 3 2 -3 -91 -116 21 -31 -121 32 -165 -21 -31 105 43 112 15 166
5239 166 42 98 46 -81 49 -187 -81 81 151 2 62 118 -110 108 -117 111 -27 139 101 -82 118 -36
5261 -36 -38 -14 -45 180 -34 -9 -18 -119 34 75 -78 123 152 8 60 34 -142 -101 -21 124 121 237 -99 72 -19 -89
$$ packed form
5089A24k34Q4J96r4J50k92q6l1L06j06J24j89J17k02K71l01J54J9m0j27J36P6
5111E5Nk2m4QJ28j56J18N9k00k44J73L50j25j13n4O7J29l3j24j28J57O8K3o8J20
5136A49l0j65K9r5K19J5L6j10R5k36L0J2M9q0K3R9J05r4j5K2l2J83k14O3k2Op3
5163c1q4pk8K08J1M1P1l17J31J28j24p1K15k98J80P3k49L31j92K31l25J26j38
5186a18J20O2j82J21jj52J60J0R4p4N0L2n7pJ23j00j90o1J54J36l5l4j22J40j4
5211E5K8q6q6K44J6k06NnQ0m0K2k4jnq8k5J37n2r0J53j97J44j0J36o2O9r7J51
5239A66j24N6n2j27J30k36J06J62P0j49O0N6k28K18k25K28j38J66l8j83K00j54
5261c6kK4l1K25k14K5rj01J53M1j53K01K9j44N2k6j76M1Q0J45lJ16l36J71r1p0
$$ plain form
5287 -89 55 -28 3 -162 12 80 -172 129 145 -80 41 -58 -92 15 174 174 -20 21 15 47 7 14 59 -30 176 -60
5313 -60 -86 -45 101 10 102 -19 -86 4 -61 69 60 103 51 20 127 -80 -100 178 72 283 -159 35 172 65 -95
5338 -95 -77 16 -119 12 -121 72 -19 -146 -27 17 -122 48 35 149 56 -117 -30 -160 -177 26 -65 75 1 -61
5362 -61 25 208 -275 -117 -70 -143 -59 -3 -16 9 -116 -33 154 -131 -50 -82 40 17 100 -86 15 -58 35 -136 71
5387 71 -31 121 -40 141 109 -156 49 13 55 59 -79 -51 121 -64 27 -86 104 44 -140 -128 -230 -83 -182 86
5411 86 -6 -20 -154 -216 -91 90 -15 45 32 -14 129 -17 20 -9 103 68 13 -24 210 92 -66 -51 51 -80
5435 -80 94 -115 -106 114 -166 152 159 212 -88 -139 -19 -13 60 -26 135 58 65 -159 60 -113 106 -35 -41 94 122 -164
5461 -164 124 -151 -6 92 14 23 -76 102 33 172 61 76 -53 67 117 -150 -24 33 52 173 144 -98 -150 35
$$ packed form
5287h9J44q3L1j65J74O8k52L01J6k25J21r9l4J07J59%j94M1oL2m0PM5q9K06k36
5313f0k6M1J46r1R2j21o7R0o5J30rM3n2l1J07k07k0K78j06K11m42J94J37j07j60
5338i5J8R3j35J31j33J93r1j27J19M4j39J70j3J14r3j73Q7j30j7K03r1J40p4o2
5362f1Q6J83m83J58M7p3Q4N6j3K5j25Q3J87k85Q1l2J22k3Q3j86J01p3R3j71K07
5387G1j02J52j61J81l2k65K05l6M2Mj38K8J72j85R1j13J90o0j84J2j02J47r9K68
5411H6r2j4j34o2J25J81j05O0j3m6J43j46L7k9J12l5n5l7K34j18j58J5J02j31
5435h0J74k09RK20k80L18PN3l00n1J20OP3q6J61p7Pk24K19j73K19j41oJ35K8k86
5461a64K88k75J45R8p8Rr9J78o9J39j11J5j29J20N0k67J26N7J9J21k9k42n2J85
$$ plain form
5485 35 86 -130 -89 12 44 254 91 -89 105 -79 -98 -53 102 -16 -88 -210 -81 102 20 -31 -63 4 -147 114
5509 114 9 63 -28 -1 -31 139 -11 35 -70 166 96 -23 -37 22 39 14 -69 -45 131 87 -43 -86 118 -21 22
5534 22 -134 80 -65 -101 -29 153 -83 -16 168 -65 -71 -40 63 -55 -21 -8 11 -9 -20 125 -101 -95 159 -80 66
5559 66 6 176 61 124 -91 17 -146 126 205 -11 26 40 -86 106 -29 97 -10 -67 37 -21 50 186 26
5582 26 81 50 -80 -90 -60 106 -174 -114 -21 20 -104 -50 -44 70 3 261 4 -202 -63 61 95 213 99 79 213
5607 213 -120 -37 2 33 -114 33 3 130 15 10 43 -74 -49 -85 46 142 -19 -139 36 89 -183 -31 -17 76
5631 76 -15 -3 143 85 -26 115 114 66 218 122 -14 -90 -77 178 17 17 44 298 -113 -67 135 16 8 -156 -218 68
5657 68 -77 -125 -226 212 30 -72 21 -186 37 -92 -79 -173 -216 -83 150 -21 -145 -54 178 147 174 -19 28
$$ packed form
5485C5N1k16M1J01L2K10j63j80J94j84j9M5J55j18p2j22J29J83q2n1l2O7j51K61
5509A14j05N4r1K7l0J70j50M6j05K36p0j19j4N9J7k5q3K4J76m4j30m3K04j39M3
5534B2j56K14j45l6P2J82k36O7J84k33oL1J03j18L4J3J9k0j1J45k26OK54k39J46
5559F6o0J70j15O3k15J08j63K72P9k16L7J4j26J92j35J26j07n7J04n8P1J36j60
5582B6N5l1j30j0L0J66k80O0R3M1j24N4OJ14o7K58k57k06J39J24L4J18j14k0J34
5607B13l33Q3L9L1j47J47l0J27j15nL3j17K5l6J31R6j61j20J75N3k72J52J4R3
5631G6r1J2J46n8j11J41jm8J52r6j36p6J3K55j61%K7K54m11M6K02j19qj64o2K86
5657F8j45m8j01M38j82j02R3k07K23j29J3r4m3J33K33j71j24R1K32l1K7j93M7
$$ plain form
5680 28 -12 -26 -6 -63 78 -9 -71 61 -23 -65 273 -153 -64 122 -11 -117 21 51 -23 85 73 113 -58 9 -73
5705 -73 118 91 188 89 -111 126 168 -69 -48 -148 -38 -9 57 -129 168 -84 16 155 20 17 -88 -161 -68 189
5729 189 -143 -56 -241 -99 -30 -61 -3 -215 34 123 10 -214 -8 -72 -20 -115 214 -82 125 10 -66 4 -75 21
5753 21 9 10 72 65 71 -73 40 -25 -56 -19 145 39 48 -221 119 75 138 -102 -17 -222 94 91 57 -1 -126 -11 -112
5780 -112 -72 -32 101 243 53 43 -207 85 -165 10 -101 98 -61 -5 150 12 120 -72 54 -165 74
5801 74 -58 -13 -117 78 -75 137 57 70 -98 -39 -160 71 132 42 71 104 25 -78 -21 205 -172 184 241 -37
5825 -37 36 30 -99 60 3 -11 -9 -92 -95 -79 88 -165 -179 -48 1 95 130 2 85 46 -70 -140 -188 155 89 229 56
5852 56 17 14 104 12 122 -75 204 42 -36 -25 83 85 4 59 7 -21 54 105 -160 1 -83 -54 -59 -151 -114 141 -139
$$ packed form
5680B8m0j4K0n7J41q7o2J32q4m2L38m26Q9J86j33j06J38L0p4J08j2M0j71O7q2
5705g3J91k7R7r9k00K37M2k37K1j00J10K9O6j86K97k52J00J39j35lj05p3R3K57
5729A89l32Q7j85J42O9l1N8k12K49Q9j13k24K06o4N2r5L29k96K07j15p6P0p9R6
5753B1j2JO2pOj44J13o5l1L7J64j06Rk69L40m4O3k40Q5k05L16ll4n8j25J15j01
5780a12M0M0J33J42j90j0k50K92k50J75j11J99j59N6J55j38J08j92J26k19K39
5801G4j32M5j04J95j53K12q0J3j68N9j21K31O1r0K9L3p9j03N7K26l77L56N7k78
5825c7P3oj29J59n7j4Kq3lJ6J67k53j4J31M9R4L5j28Q3l9j16p0m8L43o6J40j73
5852E6l9lR0r2J10j97K79j62p8J1J08Kq1N5n2k8P5N1k65J61q4K9nr2L7K55k80
$$ plain form
5879 -139 82 3 -30 76 90 163 -79 -112 174 -191 -75 50 -104 -121 -198 -81 104 -57 94 -172 144 -113
5901 -113 195 172 -18 45 -95 -269 168 118 0 -49 -148 -9 -93 218 152 93 -42 82 53 -87 73 200 58
5924 58 13 -75 -30 61 4 -55 -114 105 33 -15 -29 80 -78 -85 -22 -26 -131 -15 -8 69 52 -22 173 -93 -51 -37 -136 -21
5952 -21 109 -190 108 -34 -53 32 -66 -32 -100 -112 -112 18 -100 -204 84 -200 -45 -62 -2 39 2 -39 9 -30 -86 130
5978 130 105 78 -35 -16 78 -58 -92 -38 196 -180 134 40 -68 -28 -58 56 -38 1 -125 5 -23 23 95 10 -130
6003 -130 172 -160 -105 -129 123 -121 -16 -200 -55 -50 -1 85 298 -47 -116 -85 -14 -38 -56 -228 100 31 -105 -118
6027 -118 -257 236 255 45 44 159 -56 139 -85 71 63 -9 -72 -76 -110 -84 -68 95 39 61 46 42 -15 66 99 150 29
6054 29 72 -92 9 -56 256 -91 -60 30 74 21 -27 -121 53 -121 -83 -10 4 190 -23 -20 -58 -47 61 263 -87
$$ packed form
5879a39K21p9l3J06J4P3k42l3K86l65J16J25j54j7p7J17J85j61J51k66L16k57
5901a13L08k3j90O3j40j74M37n0j18m9r9J39q4L11o6n9j35J24k9j40J60J27j42
5924E8m5q8M5R1n7n9n9K19p2m8j4J09j58pO3mj05J16PP7j7p4J95k66M2J4r9J15
5952b1J30k99K98j42j9Q5r8L4o8j2%J30j18j04K88k84J55j7O0M1l7m1M8l9n6K16
5978A30k5k7j13J9R4j36l4N4K34l76L14r4j08M0l0J14r4L9j26J30k8M6P2q5j40
6003a30L02l32N5k4K52k44J05j84J45NM9Q6K13l45o9L1P1k4j8j72L28o9j36j3
6027a18j39M93J9k10jJ15k15J95k24J56qp2o3ml4K6J6J63n6K2j5mn7Q1L3N1j21
6054B9M3j64J01o5L12l47L1R0M4n3m8r4J74j74L8P3J4J86k13Ll8J1J08K02l50
$$ plain form
6079 -87 -166 -69 -132 -26 -108 5 96 94 143 -108 -28 105 12 80 -42 -106 -14 -33 -33 171 -169 89 64 -41 228 -107
6105 -107 118 83 23 111 -80 -226 160 -90 122 -158 -12 -28 134 61 135 -177 99 46 -44 23 -24 -33 33 52 11
6130 11 -162 43 -7 32 92 -145 0 8 131 45 -116 -116 -177 18 2 -11 102 -354 -149 132 -2 -107 -112 58 47
6155 47 31 27 -56 98 -64 -13 -86 71 199 107 -37 57 -9 -11 209 -99 51 56 -129 -1 -134 -207 -242 78 -29
6180 -29 -23 -11 36 -36 -142 2 44 -60 -11 86 -1 -49 98 -40 57 94 121 -144 193 258 33 -42 162 -97 121
6205 121 -33 103 143 -95 -7 12 -3 86 118 -118 -198 7 87 -2 87 49 -107 170 49 -196 25 -190 89 -58
6229 -58 -36 28 -62 -103 -42 106 -3 82 33 25 -189 -73 -85 -142 -46 11 -2 40 26 -29 144 -6 -22 -152 42 -189
6255 -189 93 95 36 39 48 -87 -54 96 62 -96 132 -24 -18 254 -97 106 188 66 -18 -175 95 49 -152 -46 100
$$ packed form
6079h7p9R7o3J06q2J13R1kM9k51Q0J33r3O8j22o4R2j9%K04l40K58k5j05K69l35
6105a07K25l5o0Q8j91j46L86k50K12k80J46j6J62p3P4l12K76n3r0O7m7rO6J9m1
6130A1j73K05n0L9O0k37J45QJ23q6j61%o1J95j6j3J13m56K05K81j34j05nJ70j1
6155D7j6mq3J54j62N1p3J57J28r2j44R4o6kK20l08J50Nj85J28j33p3l5L20j07
6180b9OJ2M7p2j06J44M2j04M9R7q7m8J47j38R7L7K7k65L37O5k25p5K04k59K18
6205A21j54J36M0k38Q8J9j5Q9L2k36q0K05Q0q9Q9l8j56K77j21k45K21k15K79j47
6229e8K2O4r0m1O1J48j09Q5m9qk14J16j2n7R6N7j3M2j4n5J73j50j6j30J94k31
6255a89K82Kn9LRj35L3J50l4j58K28j56OK72l51K03Q2j22q4j57K70m6k01J06J46
$$ plain form
6280 100 -1 136 -47 -66 38 13 45 169 -155 -22 70 -92 2 243 171 -25 -52 -142 87 114 96 -67 -139 9
6304 9 101 57 20 7 13 -94 3 -30 99 -81 -169 -9 -4 -109 -110 -181 30 36 -103 56 76 125 266 179 -35 -218 0
6331 0 -28 -9 137 -242 41 -18 -145 -187 -18 6 -8 -168 44 106 -149 -67 -45 -216 87 158 -63 -19 130 64 -85
6356 -85 14 -58 122 -36 -218 -61 101 -114 2 -23 71 -113 58 271 187 -41 -5 -34 -173 -75 68 -21 11 146
6380 146 84 -45 -18 153 -270 21 10 65 -100 -53 -83 -121 -28 24 79 -91 37 -30 250 17 -146 -76 19 -3 -74
6405 -74 72 -120 29 -66 -95 95 -118 -31 104 -23 118 -121 81 -58 -93 55 20 -8 5 131 -135 36 48
6428 48 -5 66 64 55 77 53 -71 62 -12 143 -231 -22 -133 -194 52 21 12 19 3 152 61 82 79 -84 45 -96 -66
6455 -66 26 87 -110 24 -116 -83 -40 193 -172 21 68 -106 26 -121 19 -18 -50 -143 67 -76 303 -4 30
$$ packed form
6280A00j01J37j83j9J04k5L2J24l24J33R2j62R4K41p2j96k7r0K29K7j8j63p2J48
6304IR2m4l7j3Oj07R7l3J29j80q8J60Nj05jp1K11Oj39J59K0M9J41q7k14j83K18
6331@k8J9J46l79K83n9j27m2J69K4j4j60K12O2k55Q2K2j71L03P1k21M4J49o6j49
6356h5R9p2J80j58j82J57J62k15J16k5R4j84J71K13q4k28L6k9j39R8J43q9L2J35
6380A46o2j29K7J71m23K91j1N5j65M7l0l8R3N2N5j70J28o7K80k33j63P0R5k2p1
6405g4J46j92J49r5k9J90k13Q7J35j27J41k39K02j39l5J48l5k8J3J26k66J71J2
6428D8n3P1krK2k4j24J33p4J55l74K09j11o1K46l1rPj6J49r1K1lj63J29j41L0
6455f6R2O1j97J34j40L3M3K33l65J93M7j74J32j47J40l7l2r3K10j43L79l07L4
$$ plain form
6478 30 -151 76 26 -40 47 -79 -60 -75 -109 6 -76 -71 105 15 55 52 69 28 -42 -58 28 -104 -210 -145 53 56 -124
6505 -124 -59 64 63 107 -5 15 -71 100 12 45 -109 2 50 19 -56 -102 160 20 174 -111 -60 -142 -152 -61 -62 173
6531 173 8 -144 9 -43 -2 120 -114 173 121 58 39 121 -147 14 -119 -134 185 -17 2 50 -164 -177 -14
6554 -14 -4 -103 -90 -72 51 103 -181 5 -126 162 -63 53 46 -53 -62 -268 -175 -51 -101 64 -142 12 -108 -122 4
6579 4 6 -78 -11 -144 -53 34 -22 -165 -17 8 -38 -93 45 -151 129 7 -117 -14 -78 50 -41 14 -227 -62 -112
6604 -112 22 -11 50 28 36 37 -72 156 -84 120 135 -148 61 76 -53 99 -334 -140 -132 -120 -81 81 80 -49 -9
6629 -9 -96 181 78 67 -78 81 -254 46 -147 17 71 -67 230 -166 -104 -50 58 -94 73 -80 125 12
6651 12 22 -71 54 -52 190 -4 -19 155 56 -39 -150 12 -20 -137 -108 7 44 -38 105 73 -51 -112 -179 -49
$$ packed form
6478C0j81K27n0o6Q7j26J9j5l4J15q2NJ76r0M0lJ7m1p0j6Q6j32j06O5J98Lj80
6505a24O5J23jM4j12K0q6J71q8L3j54J11M8l1p5m6K62j40J54k85N1q2j0R1jK35
6531A73j65j52J53n2M1J22k34K87n2o3j9Q2k68J61j33j5L19k02J9M8k14j3J63
6554a4J0r9J3J8J23N2k84J86j31K88k25J16pr9rk06R3J24n0J65k06J54j20j4J26
6579DKq4O7j33R1Q7n6j43J48K5m6n5J38j96K80j22j24J03o4J28r1N5k41J65n0
6604a12J34l3O1k2QJj09K28k40K04J5k83K09J5j29J52m33J94QJ2L9J62jj29M0
6629iq7K77j03j1j45J59l35L00j93J64N4j38K97l96O2N4J08j52J67j53K05j13
6651A2J0r3J25j06K42j94j5J74r9r5j11J62l2j17K9J15L7q2J43l2j24o1o7J30
$$ plain form
6675 -49 -40 31 -51 -180 -97 57 -89 81 -14 143 172 -14 80 32 -36 39 -105 -51 -58 -54 -226 -52 33 95 108 169 16
6702 16 165 61 -8 55 130 24 98 16 61 55 -68 -52 -25 45 8 22 -43 -23 -207 104 5 -108 229 -13 -146 -16
6728 -16 92 -92 -39 161 96 143 162 56 36 -51 51 212 -175 -8 -17 -185 1 71 -19 228 146 109 56 -212 -9
6753 -9 168 123 122 -126 -44 19 -118 -308 -83 96 -96 131 -50 42 3 -157 19 1 80 2 9 -48 -40 -7 29 46 146
6780 146 134 8 74 81 -72 -147 -66 82 38 -94 61 -134 52 -66 -53 86 29 -72 9 -95 -143 -3 -36 -51
6804 -51 -7 -60 12 88 42 14 57 -128 -50 -77 90 -46 62 45 -12 100 -117 -46 -2 16 -179 161 45 55 45 -88
6830 -88 109 -50 19 61 -42 -35 -102 -67 103 101 -59 172 -30 77 44 4 -43 6 -73 173 -58 21 -76 -87 -244 -186
6856 -186 -63 -189 -50 1 41 34 -17 80 117 119 -3 -37 -142 -62 -50 -58 -186 -1 3 13 169 69 208 -62 -114 -1
$$ packed form
6675d9RP1q2j29Q3J54j46J70r5J57K9j86R4m8o8P5j44N4pMj72J74Q5O2J3O1j53
6702A6J49j04o9O3P5j06P4q2M5oj23J6K7P0l7J4o5K0j84L11r9j13L37k42j33J30
6728a6J08j84N3K00o5M7J9j06k0q7J02J61l87J67rj68J86P0r0K47q2l7n3k68K03
6753iJ77m5jk48Q2O3j37j90K25J79j92K27j81R2l9j60J76j8P9p8Pn7QL3L6J7J00
6780A46j2j26O6Pj53p5Q1J48m4j32J55j95J86j18J3J39n7j01Q1j04m8J40l3j5
6804e1M4n3P2P6m6k8M3j85P8k7J67j36J08j7n7J12k17P1M4J8j95L40j16J0j0j33
6830h8J97j59O9M2j03Po7L5J70kj60K31k02J07l3m0m7M9p9K46k31P9r7j1j57N8
6856a86J23j26J39N1M0pn1R7L7Kj22l4j05Q0J2qj28J85MJ0J56j00J39k70n2J13
$$ plain form
6882 -1 89 -40 -45 -13 47 85 16 27 97 -49 -193 59 -93 -22 56 -121 -134 28 28 -57 -58 -23 162 -27 -221 92 -202
6909 -202 72 -56 -89 -184 97 68 -53 -91 -59 119 -130 116 -125 31 -38 -188 99 23 -170 -3 87 65 151
6932 151 103 18 -24 -57 90 -116 -210 34 5 -56 -118 71 -39 80 46 -73 -22 -86 290 -18 48 82 -108 -20 -31
6957 -31 22 -119 62 -29 -259 -30 81 -219 -73 -159 9 -309 -52 -85 -192 -69 -100 66 -134 46 31 76 -17
6980 -17 60 43 -64 -62 -2 233 35 6 1 186 -17 -15 101 116 -120 -118 201 42 -100 -85 -150 -8 -41 -29 -29 -2 83
7007 83 -25 -84 87 -104 -230 -148 -25 -142 12 -9 -37 -23 -61 5 108 -47 34 130 42 157 -83 -178 -7 -20
7031 -20 -105 -154 -60 52 14 -4 55 -96 197 112 18 38 -2 -27 -54 144 29 -53 73 -65 -102 126 -84 -127 -14
7056 -14 149 -46 -99 -68 77 -18 -5 -124 -17 128 133 -127 -118 24 -21 -298 -198 39 5 244 -28 -136 43 -188
$$ packed form
6882aR0j29nL2O0L8o9J1P0j46j44K52j52P1P8j77j3J62%q5jL5J85j89j94L13k94
6909b02K74j28l3r5K81k9j21l8L2J78k49K46k41J56o9j50K87p6j93J67R0k2Q6
6932A51m8q5m2l3J47k06r4K44k9o1o2J89j10J19l4j19N1o4L76l08O6L4j90Q8j1
6957c1N3j41J81r1k30K29J11l00J46q6J68l18K57l3j07J23l1J66k00J80j5M5r3
6980a7P7j7j07KO0K35j98k9nJ85k03KJ16J5k36KL19j59j42J5o5J42l3J2%K7Q5
7007H3j08n9J71j91j26Q2J23j17J54k1k8J4l8O6J03j55Q1R6q8J15k40r5J71j3
7031b0q5m9R4J12l8j8N9j51K93q5r4K0m0k5k7J98j15q2J26j38l7K28k10m3J13
7056a4J63j95n3L1J45r5J3j19J07J45Nk60RJ42m5k77J00K37l4K39k72j08J79k31
$$ plain form
7080 -188 241 56 48 47 -26 36 -45 140 -111 20 -26 21 -46 -51 157 95 137 98 56 6 70 25 61 -34 19 -87 -58 -32
7108 -32 35 9 33 103 -26 25 -122 58 -169 -16 -111 -107 70 69 -11 12 120 82 -22 96 -71 83 15 116 -76
7133 -76 68 -6 67 251 -194 181 71 -33 99 98 -17 -197 -166 151 124 -145 -129 -66 10 69 -31 77 -127 -134
7157 -134 -93 -121 18 53 147 -19 92 -53 54 -5 3 -189 96 -91 -80 -66 -60 113 15 158 149 22 12 91 71 -53
7183 -53 -222 51 68 -160 24 -69 -42 46 -33 -20 -43 80 47 67 137 30 -72 89 90 25 -26 -109 -73 131 -39 -20
7209 -20 4 -203 -164 104 103 -82 50 141 -217 37 -85 23 -183 2 95 151 -20 239 -192 -130 -77 -12 -102 -72
7233 -72 151 -161 -234 9 -78 -52 -111 -122 134 35 41 90 -20 225 -53 128 -18 -49 120 67 -70 42 -162 -99
7257 -99 -76 48 5 36 89 -69 -190 12 86 -10 32 32 -75 85 126 180 -156 128 -28 -195 -52 122 -94 -162
$$ packed form
7080a88M29j85qjp3O2q1J85k51J31m6M7o7nK08o2M2l9m2n0O4m5L6r5N3j06K9K6
7108c2O7k6K4P0j29N1j47J80k27J53r5MJ77jq0K3J08l8j04J18j67J54o8J01j92
7133g6J44p4P3J84m45L75j10j04J32jj15j80L1L17k7k69J6O3P6N9j00J08k04p
7157a34M1k8J39L5R4j66J11j45J07n9Qj92K85j87J1J4OJ73r8J43rj27j0P9k0j24
7183e3j69K73J7k28J84r3K7Q8p9J3k3J23l3K0P0j07j02J61Jo5n1q3L6K04j70J9
7209b0K4k07L9K68jj85J32R1l58K54j22J08k06J85R3N6j71K59m31O2N3O5r0L0
7233g2K23l12p3K43q7K6n9j1K56r9OM9j10K45k78J81j46l1J69n3j37J12k04O3
7257i9K3J24m3L1N3j58j21K02P4r6M2%j07J60M1N4l36K84j56j67J43J74k16o8
$$ plain form
7281 -162 -196 -89 67 -61 143 125 63 110 149 -106 75 95 83 72 -146 -124 -56 -59 48 -42 -120 -18 67 -79 94
7306 94 139 -176 24 -6 -218 73 -47 -80 8 100 33 -18 21 16 -77 -86 -113 -2 125 89 -58 68 89 -164 16 -27
7332 -27 -2 110 -81 105 -142 -42 77 -19 132 93 2 -5 -20 83 -63 -35 -57 -59 104 -64 -79 112 7 -287
7356 -287 39 266 3 111 0 -175 -19 86 -49 -79 6 -158 -120 -43 -146 37 61 -43 -11 -21 16 -48 -149
7379 -149 -112 10 -201 134 102 70 -143 78 66 -36 -114 61 7 0 -17 35 -61 71 -24 27 222 171 21 -37 74
7404 74 -180 -107 23 -45 199 170 -167 121 -73 -49 117 -165 -52 -141 150 124 -80 -6 -83 128 188 -34 35 -137
7428 -137 -10 -123 -48 279 3 -59 17 122 -63 -172 12 176 52 -42 -25 -44 78 39 -63 47 -105 87
7450 87 96 -95 -55 -59 -55 -93 12 30 -87 -83 -96 -3 43 59 55 10 13 -35 29 -119 232 172 21 4 -71 -71 31 -17 -131 -93
$$ packed form
7281a62l4J07J56j28K04j8o2M7L9k55J81K0j2j1k18K2O8lJ07r0p8J02Q5j46J73
7306I4M5l15K00l0k12K91j20l3Q8R2o7n1L9nr3rk7J11J27l6j47J26K1k53J80m3
7332b7K5J12j91J86k47J00J19r6J51l9r1pj5J03j46K8k2kJ63j68j5J91j05k94
7356b87L26K27k63J08j11j75J56J05j35l0Q5j64L8P7j03J83K4j04L2j0L7o4j01
7379a49L7J22k11L35l2l2k13K21j2j02p8J75n4pj7N2r6J32r5N1J95n1j50n8J11
7404G4k54P3J30o8K44k9l37K88j94K4J66k82J13q9K91k6k04P4p7K11O0k22O9j72
7428a37J27j13P5L27k76o2P6J05j85j09J84J64j24r4J7j9J22l9j02J10j52J92
7450H7Rj91M0mMl8J05J8j17Mj3R3M6J6mm5Lm8O4j48L51o0j51j7p5%J02m8j14L8
$$ plain form
7480 -93 -157 -118 -132 58 -111 -156 -27 115 -68 -77 -11 6 -60 11 31 -57 -120 141 20 15 245 -23 4 151 111 62
7506 62 -15 -8 124 76 10 -128 -26 265 -43 24 -2 9 -92 154 -48 4 36 -111 -63 86 -62 -4 19 -92 138
7531 138 48 -129 33 -104 94 -35 -29 60 44 -13 0 6 -197 -122 -79 -179 -38 -16 136 18 77 139 9 -5 -116
7556 -116 -25 47 -84 78 99 -63 -98 25 5 -194 -127 91 226 -83 -55 82 -39 41 152 -142 -132 -69 -183
7579 -183 -1 -96 -223 -33 13 -137 -2 -20 -85 12 35 33 -244 -39 -71 61 -126 -27 12 1 -13 -19 126 -1 -5 28
7605 28 -190 10 20 30 140 29 -17 152 -33 -17 -41 -34 10 -113 26 -163 80 -158 5 81 103 -50 -90 16
7629 16 -90 -96 60 42 38 35 -131 -22 -124 -62 87 51 143 -95 220 69 33 -49 -128 28 52 -249 18 99 -28
7654 -28 -12 102 152 34 -35 14 40 58 48 -105 86 -14 106 251 3 46 53 71 -27 72 -7 68 63 -178 18 -97
$$ packed form
7480i3o4L9j4J90j69m5J29J42j83rO6J7o6P1K0q8o3K61j21nK30k68K7J47m0m9
7506F2p7PJ32m8o6j38J02K91l08O7k6J1j01K46k02N2L2j47M8J49j48N8K3j11K30
7531A38r0j77J62j37J98j29OQ9j6n7J3Ok03P5M3j00J41K2J52j18N9O2j30j4j11
7556a16R1P2j31J62K1j62l5J23k0j99O7K18J35l09K8J37j21Q0J11k94J0O3j14
7579a83J82r5j27J90M6j50J35j8o5R7K3kk77K05l2J32j87R9L9j1j4oJ45j27mL3
7605B8k18K00J0J0J10j11m6J69j85J6k4PM4j23J39j89K43k38J63P6K2j53m0J06
7629A6j06oJ56j8mlj66J09j02O2J49l6R2k38L15j51l6q2p9J56K4l01K67Q1j27
7654b8J6J14N0j18o9M9K6J8j0j53J91j00J20J45k48M3PJ8r8R9p9P5nk41J96j15
$$ plain form
7680 -97 66 63 198 -92 -38 78 -61 -54 -173 -136 -38 -138 76 27 -27 -88 75 181 81 55 -53 62 167 -104
7704 -104 92 -12 52 -4 -109 160 -66 55 -124 109 95 221 -23 -49 -70 135 103 120 -10 -127 24 12 96
7727 96 136 130 -153 53 -146 -48 -65 -153 -77 -9 -113 -145 62 -327 -23 59 -17 104 137 144 19 -1 69 -246 -80 -118
7753 -118 3 95 -179 100 -31 -35 142 -209 -122 -19 -27 90 193 13 76 -80 162 38 27 48 84 86 -24 -49
7777 -49 18 11 -87 79 -74 -98 4 -114 -34 66 -78 -67 89 241 87 108 52 49 -56 -41 57 127 -25 111 -51
7802 -51 15 -16 -61 -76 151 185 -118 82 68 130 47 -33 274 85 -33 129 103 65 -80 177 -25 161 -6 -53
7826 -53 -2 25 -191 -39 -160 64 -36 71 95 70 36 -4 121 112 171 -98 -122 -73 56 7 -40 -59 30 107 -103 -9
7852 -9 180 118 11 -8 -48 83 14 -92 104 -183 21 -106 -20 144 -124 -78 103 160 -61 34 -30 175 -91 -52
$$ packed form
7680i7J63lJ35k90N4J16j39Pj19L7R8j00K14m9n4o1J63J06j00k6j08J15J05k71
7704a04J96j04O4n6j05K69k26J21j79K33j4J26k44k6k1K05l2J7j30j17J51j2Q4
7727I6M0ok83K06j99R8j7q8P6O8j04l2K07l89L04Q2p6J21L3Pj25k0P0l15J66l8
7753a18J21R2k74K79j31mJ77l51Q7J03qJ17J03j80O3j56K42j24j1K1L6Kj10k5
7777d9O7pr8J66j53k4J02j18Q0J00j44J1J56J52j54K1n6lj05J5R8P0j52J36j62
7802e1O6l1m5j5K27L4l03K00j4O2q3q0L07j89j18J62k6l8j45K57k02J86j67m7
7826e3N1K7k16J52j21K24j00J07K4k5l4m0J25rN9k69k4M9J29m9m7j9Q9P7k10R4
7852iJ89o2j07j9m0J31o9j06J96k87K04j27Q6J64k68M6J81N7k21R5o4K05k66L9
$$ plain form
7876 -52 -27 -260 -225 -178 36 8 -27 -117 -94 -116 -100 76 129 -12 -18 5 109 43 -49 45 -115 108 -77 84 -70 68
7902 68 -23 122 102 -14 -51 55 36 133 69 -7 -45 103 95 -69 -6 48 188 79 44 154 26 59 55 258 -77 -152
7928 -152 -94 64 -1 -3 121 20 92 66 -60 8 121 80 -51 -191 -53 158 -10 -91 14 -95 9 -47 -55 34
7952 34 76 82 -39 114 -18 41 97 -170 -95 182 27 -133 37 84 143 -97 78 -145 5 -169 175 -61 20
7975 20 131 -164 -8 -133 -158 -214 -248 -63 39 -95 -19 -10 -27 -141 81 26 72 -104 80 -73 -135 -37 41 21 73
8000 73 111 0 -140 85 -78 -124 -14 -23 -33 75 -15 -90 160 -39 -143 -56 126 16 -68 14 114 -155 177 194
8024 194 44 -1 -118 40 24 -167 -18 -68 -19 -51 -135 61 -1 40 20 42 -86 -29 125 -5 43 67 -8 48 108
8049 108 18 77 -71 106 -110 -3 50 -46 108 5 297 -27 92 -41 -29 195 -66 69 -104 178 61 -32
$$ packed form
7876e2K5k33L5M7K14k8l5r0K3k2J6J76N3j41oK3J04o6r2R4j60K23j85J61j54J38
7902F8r1J45k0j16l7J06j9R7o4p6l8J48qj64O3N4J40j09l5J10j28L3mK03l35p5
7928a52N8J58o5kJ24j01P2k6j26O8J13m1j31j40J38K11j68q1J05j09J04n6qQ9
7952C4M2Oj21J53j32N9N6k67P5K77j55j60J70M7N9k40J75k23J50j74L44k36Q1
7975B0J11k95J56j25k5n6l4J85J02j34P6Rj7j14K22n5M6j76J84j53o2R8P8k0N2
8000G3L8j11j40K25j63m6J10rj0J08r0p5K50j99j04Q7J82j10q4Q2J00k69L32J7
8024A94j50m5j17J58j6j91J49n0M9l2q4J96o2M1k0K2j28N7J54j30M8K4p5N6O0
8049A08r0N9j48J77k16J07N3r6J54j03K92l24J19j33J2K24k61J35j73K82j17r3
$$ plain form
8071 -32 143 22 81 -35 -200 123 -70 -33 214 -179 -131 61 -68 -23 -39 79 53 -82 27 -179 -60 -217
8093 -217 -6 -22 -151 69 160 -66 4 -85 -150 24 -64 -20 -63 -117 -107 -21 -41 133 -120 -15 -49 -69 -101 70 -6
8118 -6 80 60 -149 -9 97 -15 -1 -15 133 46 75 -32 -116 -29 -141 88 -13 20 -31 -92 -2 126 132 -37 -33 277
8144 277 -102 -62 -39 1 193 -121 -92 8 155 175 74 28 41 -14 -28 -35 33 -68 -81 26 -24 90 -152 -31 36
8169 36 -32 -104 -43 30 128 -28 -46 -62 -111 310 -11 -47 19 -131 76 2 129 99 43 110 189 -24
$$ packed form
8071c2J75j21N9j16j65L23j93L7K47l93M8J92j29M5j6J18k6j35J09k06J19j57
8093b17K11j6j29K20R1k26P0q9o5J74q8M4m3n4J0Q6k0J74k53J05l4k0l2J71p6
8118fQ6k0k09J40J06j12J4j4J48q7K9j07q4Q7j12K29j01L3n1o1R0J28Oj69ML10
8144B77l79M0K3M0J92l14K9J00J47K0j01m6J3n5j4pO8j01j3J07n0J14k42J21O7
8169C6o8p2O1P3R8j56j8j6m9M21l21l6O6j50K07p4J27l0n6O7P9k13
8191b4
$$ Imaginary data points
##PAGE= N=2
##DATA TABLE= (X++(I..I)), XYDATA
$$ plain form
0 0 0 0 0 0 0 0 -7 7 -7 14 -14 14 -21 28 -32 35 -49 56 -63 77 -91 105 -119 140 -160 181 -208 236 -268 303
30 303 -342 385 -429 483 -537 599 -667 740 -823 909 -1008 1118 -1236 1370 -1518 1682 -1869
47 -1869 2082 -2325 2607 -2941 3339 -3828 4444 -5244 6336 -7918 10439 -15085 26593 -117215
61 -117215 -127642 38277 -58619 -20075 82231 107109 -153 -80436 -94240 -68383 -116425
72 -116425 -128058 -33432 63131 65933 78543 105246 81544 4719 -39446 -46418 -53237 -54181 5208
85 5208 79672 108004 113860 135361 122921 54043 -12522 -18798 -9732 -32342 -20454 72593 134841
98 134841 106412 88841 117877 90300 -10112 -65840 -30352 -4836 -34986 -17235 79741 121936
110 121936 65437 27660 42296 14233 -72126 -113254 -67299 -24130 -33179 -15452 49974 67750
$$ packed form
0@%%%%%%pJ4j4K1k8K8l5M9o0O7q4J05j19J40j68J96k24K59l00L41l89M44n04N71
30C03o45P27q14R12j020J136j266J407j563J732j917K126k354K606k888L200l551
47a869L951m407M932n548O280p167Q272r688J1580j4254J8357k5524M1678j43808
61a17215j0427J65919r6896L8544J02306K4878j07262q0283j3804K5857m8042
72a16425j1633R4626R6563K802J2610K6703k3702p6825m4165o972o819r44N9389
85E208P4464K8332N856K1501j2440o8878o6565o276R066k2610J1888R3047O2248
98A34841k8429j7571K9036k7577j00412n5728L5488K5516l0150J7751R6976M2195
110A21936n6499l7777J4636k8063q6359m1128M5955M3169r049J7727O5426J7776
$$ plain form
122 67750 19605 -18889 -34052 -64050 -102535 -108403 -71967 -39019 -24236 12846 44209 13784
134 13784 -24352 -25898 -47982 -98775 -105034 -56559 -20895 -20716 -1044 52057 58319 -2252 -34362
147 -34362 -14969 -27743 -75698 -66055 4314 38374 19918 32202 78873 67368 404 -23893
159 -23893 -1255 -6412 -33659 -14910 44043 70013 51895 50952 70610 48994 -2720 -17044 -1942
172 -1942 -4981 -8923 19412 54703 58033 46046 46066 36811 1105 -24711 -18372 -13084 -21934 -7949
186 -7949 30070 42890 20647 10692 21655 2334 -45378 -54258 -22849 -17028 -34287 -15817 25188
199 25188 26025 -9024 -19765 -5222 -21470 -60757 -58314 -21026 -12695 -25579 -8503 22178 14475
212 14475 -17292 -24619 -14588 -26715 -46314 -34146 -5515 2423 -100 12890 24351 10539 -8088
$$ packed form
122F7750m8145l8494j5163k9998l8485n868L6436L2948J4783L7082L1363l0425
134A3784l8136j546k2084n0793o259M8475L5664J79J9672N3101O262o0571l2110
147c4362J9393j2774m7955R643P0369L4060j8456J2284M6671j1505o6964k4297
159b3893K2638n157k7247J8749N8953K5970j8118r43J9658k1616n1714j4324J5102
172a942l039l942K8335L5291L330j1987K0r255l5706k5816O339N288q850J3985
186g949L8019J2820k2243r955J0963j9321m7712q880L1409N821j7259J8470M1005
199B5188Q37l5049j0741J4543j6248l9287K443L7288Q331j2884J7076L0681p703
212A4475l1767p327J0031j2127j9599J2168K8631P938k523J2990J1461j3812j8627
$$ plain form
225 -8088 -9304 -8940 -19339 -18593 2663 17195 14999 20789 34730 28535 5067 -1967 7020 2326
239 2326 -11016 414 27452 31059 17727 23831 37177 21780 -4482 -4335 8873 2667 -7918
252 -7918 6180 28210 25209 10545 12805 18374 2960 -15497 -12609 -2947 -5993 -9042 2766 14171
266 14171 8337 -1533 -642 -3442 -16971 -23898 -16993 -11981 -14141 -9681 2074 3841 -6319 -10060
280 -10060 -6018 -13108 -26146 -22726 -10101 -9477 -13542 -3789 8356 3076 -9909 -8761 -2239 -10393
294 -10393 -20123 -11614 2197 1526 -2227 6627 15174 7961 -3129 -1173 3963 -2323 -7513 1952 12451
309 12451 11193 8667 14068 17350 9254 1519 3708 6112 1256 703 9282 14199 11707 11111 13961
324 13961 11204 3528 -569 1574 1129 -2371 935 7585 8450 5204 5348 5589 1017 -5803 -7382 -4785
$$ packed form
225h088j216L64j0399P46K1256J4532k196N790J3941o195k3468p034Q987m694
239B326j3342J1430K7038L607j3332O104J3346j5397k6262J47J3208o206j0585
252g918J4098K2030l001j4664K260N569j5414j8457K888R662l046l049J1808J1405
266A4171n834r870Q91k800j3529o927O905N012k160M460J1755J767j0160l741
280a0060M042p090j3038L420J2625O24m065R753J2145n280j2985J148O522q154
294a0393r730Q509J3811o71l753Q854Q547p213j1090J956N136o286n190R465J0499
309A2451j258k526N401L282q096p735K189K404m856n53Q579M917k492n96K850
324A3961k757p676m097K143m45l500L306O650Q65l246J44K41m572o820j579K597
$$ plain form
340 -4785 -5174 -7234 -3416 2041 1487 -1587 -2596 -2977 -6741 -11928 -11864 -8485 -8011 -7862 -4203 -458 -1468
357 -1468 -3677 -4855 -6066 -8252 -10515 -9488 -6090 -4032 -2569 542 2112 1322 -421 -2329 -3310 -3662
373 -3662 -4322 -2921 383 2836 4621 6267 6562 5307 3059 1221 780 907 719 2601 5787 7387
389 7387 7648 8153 7646 5870 2747 1024 2001 1976 1326 3505 6925 7120 4935 4806 4625 1584 -2113 -2202
407 -2202 -41 -699 -2109 1106 4310 2318 -555 -99 -739 -4384 -6818 -5026 -2919 -3859 -3658 -513
423 -513 819 -2289 -3717 -2747 -4207 -7149 -7214 -4069 -2757 -4501 -2744 1417 242 -4061 -3361 -801
439 -801 -3095 -7048 -4001 1334 85 -3532 664 6006 1692 -4050 -552 3938 -461 -4675 402
454 402 6767 3186 -1274 3891 8656 2558 -2720 1933 6393 1412 -2188 3447 7181 2834 -453
$$ packed form
340d785l89k060L818N457n54l074j009l81l764n187O4L379M74J49L659L745j010
357a468k209j178j211k186k263J027L398K058J463L111J570p90j743j908r81l52
373c662o60J401L304K453J785J646K95j255k248j838m41J27j88J882L186J600
389G387K61N05n07j776l123j723R77k5o50K179L420J95k185j29j81l041l697q9
407b202K161o58j410L215L204j992k873M56o40l645k434J792K107r40K01L145
423e13J332l108j428R70j460k942o5L145J312j744J757M161j175m303P00K560
439h01k294l953L047N335j249l617M196N342m314n742L498M490m399m214N077
454D02O365l581m460N165M765o098n278M653M460m981l600N635L734m347l287
$$ plain form
469 -453 4587 6833 642 -2180 2715 4039 -387 -1067 4259 4384 -946 -912 4063 1551 -4422 -1854
485 -1854 3376 189 -5031 -899 4360 -486 -6293 -1600 3727 -2473 -8332 -1839 4510 -2293 -8473
500 -8473 -1678 4380 -2632 -9078 -2034 4521 -2417 -8184 -1270 4909 -2077 -7564 -1285 3909 -2192
515 -2192 -6167 480 4445 -1245 -3512 1988 3472 -2328 -2649 1983 1946 -2432 84 5013 2945 -1888
531 -1888 2299 6029 36 -4375 1245 6660 -788 -3491 3630 10409 150 -3752 3487 8311 -2111
546 -2111 -8306 3210 7111 -334 -5683 4854 10510 -1668 -5686 1006 5506 -3505 -9201 1786
560 1786 6406 -1566 -3143 3294 4784 -2380 -5955 -931 -629 -5595 -3786 2177 1139 -1961 1637
575 1637 4043 -3016 -5932 -1701 -61 -6602 -6259 1736 6285 -1566 -4040 4981 6687 -5960 -10803
$$ packed form
469d53N040K246o191k822M895J324m426o80N326J25n330L4M975k512n973K568
485a854N230l187n220M132N259m846n807M693N327o200n859O493O349o803o180
500h473O795O058p012o446P044O555o938n767O914O179o986n487O279N194o101
515b192l975O647L965n690k267N500J484n800l21M632l7m378K516M929k068m833
531a888M187L730n993m411N620N415p448k703P121O779j0259l902P239M824j0422
546b111o195J1516L901p445n349J0537N656j2178m018O692M500r011n696J0987
560A786M620p972j577O437J490p164l575N024L02m966J809N963j038l100L598
575A637K406p059k916M231J640o541L43P995M549p851k474R021J706j2647m843
$$ plain form
590 -10803 1370 4210 -6091 -8541 7421 12236 -1965 -5963 6194 8498 -7461 -11629 2204
603 2204 7017 -2809 -5516 8313 12957 94 -4189 2950 3445 -5148 -7188 755 4611 515 2711
618 2711 7885 4412 -413 67 726 -4575 -7013 -110 3249 -941 866 9690 7410 -3775 -5408
633 -5408 2382 1242 -10025 -10237 3860 7254 -2037 -1326 10588 7893 -8889 -10711 727 580 -9106
648 -9106 -7162 5078 8213 -530 -2288 6098 5978 -6371 -10191 -2646 -923 -5845 -2782 5770 7559
663 7559 3201 1601 2202 -2135 -6468 -4800 -2853 -4427 -1259 6515 7193 1985 2160 6481 1754 -9027
679 -9027 -7507 1886 653 -5742 260 11877 9335 -1963 -2330 5720 1638 -11524 -8755 5756
693 5756 5906 -3147 1402 12964 8894 -4667 -6622 943 -1941 -11871 -8220 3990 6133 1498 3374
$$ packed form
590a0803J2173K840j0301k450J5962M815j4201l998J2157K304j5959m168J3833
603B204M813r826k707J3829M644j2863m283P139M95q593k040P943L856m096K196
618B711N174l473m825M80O59n301k438O903L359m190J807Q824k280j1185j633
633e408P790j140j1267k12J4097L394r291P11J1914k695j6782j822J1438j47r686
648i106J944J2240L135q743j758Q386j20j2349l820P545J723m922L063Q552J789
663G559m358j600O01m337m333J668J947j574L168P774O78n208J75M321m727j0781
679i027J520R393j233o395O002J1617k542j1298l67Q050m082j3162K769J4511
693E756J50r053M549J1562m070j3561j955P565k884r930L651J2210K143m635J876
$$ plain form
708 3374 7434 3845 -3193 -4568 -3929 -7156 -6499 983 3947 1532 4222 8100 2909 -4099 -3854 -2023
724 -2023 -6159 -9768 -1856 8797 5991 -1011 3932 10958 2697 -9433 -6904 1358 -2320 -8808 -248
739 -248 12799 10185 -457 426 6810 1278 -9331 -8142 993 859 -3789 1865 10534 8450 1844
754 1844 509 -213 -4563 -7649 -5072 -803 1051 3157 6928 6247 2172 1176 1413 -3253 -7578 -4477
770 -4477 870 -146 -1533 5024 10895 4946 -2944 -975 1055 -5999 -12013 -5384 4247 3178 -1526
785 -1526 4834 11686 3691 -6800 -4550 -188 -4699 -8454 -2012 6405 5892 1617 3381 5093 -912
800 -912 -6622 -5974 -3956 -4352 -2298 2587 5383 4617 4116 3947 -471 -5259 -5104 -3326 -4566 -4009 2354
817 2354 7325 5286 1644 3745 4238 -3635 -8809 -4024 3 -2868 -2982 4563 9754 4931 -535 1804
$$ packed form
708C374M060l589p038j375O39l227O57P482K964k415K690L878n191p008K45J831
724b023m136l609P912J0653k806p002M943P026q261j2130K529Q262l678o488Q560
739b48J3047k614j0642Q83O384n532j0609J189R135j34m648N654Q669k084o606
754A844j335p22m350l086K577M269J854K106L771o81m075r96K37m666m325L101
770d477N347j016j387O557N871n949p890J969K030p054o014O629R631j069m704
785a526O360O852p995j0491K250M362m511l755O442Q417n13m275J764J712o005
800i12n710O48K018l96K054M885K796p66n01j69m418m788J55J778j240N57O363
817B354M971k039l642K101M93p873n174M785M027k871j14P545N191m823n466K339
$$ plain form
833 1804 2594 -4516 -8860 -3643 1757 -10 -811 4783 7908 2996 -2048 -667 -503 -4572 -5714 -1428
849 -1428 2190 2329 3118 5304 4759 678 -2600 -2898 -4370 -6398 -3520 776 1677 2255 5421 5917 1645
866 1645 -2541 -2217 -2149 -5181 -5268 333 4208 2748 1814 4174 4030 -1976 -5734 -3545 -2158 -4608 -3903
883 -3903 1716 5056 3415 1916 3580 2258 -2538 -5380 -3366 -1576 -1852 217 4313 5906 4134
898 4134 2213 1293 -1044 -3984 -4165 -2646 -1518 -56 2660 4665 3689 2059 1151 -893 -4630 -5380
914 -5380 -2962 -1067 -873 1193 4063 4491 1679 -229 -378 -1890 -4907 -5351 -1686 995 1008 2478 4736
931 4736 4016 324 -2307 -1926 -2548 -4199 -3193 394 2204 2391 3379 3850 2314 -985 -2737 -3116 -3158
948 -3158 -2915 -535 2064 3026 3338 3560 2506 -168 -2106 -2795 -2932 -2614 -1296 1739 3474 3196 3202 2890
$$ packed form
833A804P90p110m344N217N400j767q01N594L125m912n044J381J64m069j142M286
849a428L618J39P89K186n45m081l278k98j472k028K878M296R01N78L166M96m272
866A645m186L24O8l032q7N601L875j460r34K360j44o006l758K189J387k450P05
883c903N619L340j641j499J664j322m796k842K014J790k76K069M096J593j772
898D134j921r20k337k940j81J519J128J462K716K005r76j630r08k044l737p50
914e380K418J895J94K066K870M28k812j908j49j512l017m44L665K681J3J470K258
931D736p20l692k631L81o22j651J006L587J810J87R88M71j536l299j752l79m2
948c158K43K380K599R62L12K22j054k674j938o89j37L18J318L035J735k78Ol12
$$ plain form
966 2890 1099 -1800 -3448 -2795 -1846 -1424 266 3068 4133 2977 1728 1067 -482 -2899 -3830 -2655
982 -2655 -908 290 1661 3574 3694 2161 396 -801 -2106 -3361 -3514 -1967 545 1540 2198 2994
998 2994 2578 704 -1335 -2623 -3107 -3266 -2576 -781 1457 2336 2752 2281 824 -586 -2477 -3247 -2867
1015 -2867 -2267 -821 1083 2605 2820 2515 1730 75 -1832 -2964 -2664 -1599 -788 945 2819 3354 2462
1032 2462 1305 712 -850 -2564 -3210 -1853 -464 252 1563 2980 3047 1109 -478 -943 -1971 -3071
1048 -3071 -2991 -990 700 1263 2022 2814 2092 306 -857 -1909 -2293 -2292 -1151 575 1826 2231 2977 2892
1066 2892 674 -972 -1223 -1900 -2847 -1698 439 1605 1380 1593 2628 1281 -1562 -2530 -1782 -1901 -2644
1083 -2644 -1231 1587 2614 1686 1322 1919 553 -1900 -2585 -1518 -944 -1143 79 2536 2718 1088 269
$$ packed form
966B890j791k899j648O53R49M22J690K802J065j156j249o61j549k417r31J175
982b655J747J198J371J913J20j533j765j197j305j255j53J547K512R95O58P96
998B994m16j874k039j288m84j59O90J795K238Q79M16m71j457j410j891p70L80
1015b867O00J446J904J522K15l05p85j655j907j132L00J065Q11J733J874N35q92
1032B462j157n93j562j714o46J357J389P16J311J417O7j938j587m65j028j100
1048c071Q0K001J690N63P59P92p22j786j163j052l84JJ141J726J251M05P46q5
1066B892k218j646k51o77r47J149K137J166k25K13J035j347k843r68P48j19p43
1083b644J413K818J027r28l64N97j366k453o85J067N74j99J222K457J82j630q19
$$ plain form
1100 269 712 -815 -2659 -2649 -1363 -683 -270 1166 2360 1826 778 829 -196 -2017 -2528 -901 -537 -557
1118 -557 902 3048 2516 131 -252 764 -838 -3357 -2607 126 595 -762 631 3147 2283 -582
1134 -582 -1208 271 -834 -2904 -1581 1271 1399 304 912 2484 1286 -1396 -1701 -609 -1147 -2327
1150 -2327 -854 1254 1282 845 1170 1453 32 -1185 -744 -903 -1653 -668 1079 1026 333 842 1953 164
1168 164 -2130 -1475 525 -733 -2574 -612 2857 1739 -846 45 2392 789 -2736 -2229 833 336
1184 336 -1691 -575 2115 1859 -438 -349 1234 84 -1966 -1351 624 455 -441 384 1473 880 75
1201 75 96 -228 -1122 -771 114 -301 -638 697 1790 604 -964 195 1261 -516 -2242 -70 1658
1218 1658 -92 -1498 833 2293 2 -1815 -129 1775 -318 -2526 -66 2687 340 -1995 166
$$ packed form
1100B69M43j527j844J0J286O80M13J436J194n34j048N1j025j821n11J627L64k0
1118e57J459K146n32k385l83J016j602k519P50K733M69j357J393K516q64k865
1134e82o26J479j105k070J323K852J28j095O08J572j198k682l05J092n38j180
1150b327J473K108K8m37L25K83j421j217M41j59p50R85J747n3o93N09J111j789
1168A64k294O55K000j258j841J962L469j118k585Q91K347j603l525N07L062m97
1184C36k027J116K690k56k297Q9J583j150k050O15J975j69q96Q25J089n93q05
1201G5K1l24q94L51Q85m15l37J335J093j186j568J159J066j777j726K172J728
1218A658j750j406K331J460k291j817J686J904k093k208K460K753k347k335K161
$$ plain form
1233 166 2524 387 -2242 -777 1579 198 -1790 -651 1400 807 -806 -231 933 75 -891 -265
1249 -265 196 -174 -211 629 147 -556 273 815 -584 -1093 598 1262 -400 -1305 825 1776 -895 -2081
1267 -2081 663 2049 -961 -2395 716 2772 -343 -2809 453 2709 -431 -2844 -72 2305 308
1282 308 -1871 -218 2207 591 -1790 -361 1086 -23 -1075 -366 619 717 154 280 191 -230 -56 122
1300 122 -781 -826 674 678 -833 -244 1386 1332 -1226 -1672 872 811 -1909 -1785 1626 2122 -669 -1242 1620
1319 1620 2231 -1383 -2868 562 1642 -1346 -2088 981 2651 365 -1652 408 1735 -269 -2392
1334 -2392 -493 1000 266 -660 228 1228 1000 -173 -356 -213 -568 -561 -105 -588 -138 1491 1133 -521
1352 -521 -68 888 311 -1862 -1490 992 838 -1333 -511 2401 1586 -1416 -1296 926 742 -2163 -2372 1218
$$ packed form
1233A66K358k137k629J465K356j381j988J139K051n93j613N75J164q58r66O26
1249b65M61l70l7Q40m82p03Q29N42j399n09J691O64j662r05K130R51k671j186
1267b081K744J386l010j434L111K056l115k466L262K256l140k413K772K377j997
1282C08k179J653K425j616k381J429J447j109j052P09R85R8n63J26q9m21J74J78
1300A22r03m5J500Mj511N89J630n4k558m46K544o1k720J24L411M96k791n73K862
1319A620O11l614j485L430J080k988p42L069J670k286k017K060J327k004k123
1334b392J899J493p34r26Q88J000k28j173j83J43l55PM56m83M50J629l58j654
1352e21M53R56n77k173L72K482j54k171Q22K912q15l002J20K222j84k905k09L590
$$ plain form
1370 1218 1761 -831 -694 1813 1823 -759 -1933 -111 569 -1180 -1660 695 1790 406 -208 937 578
1387 578 -281 -919 -736 -604 -612 181 773 338 492 1195 168 -1249 -785 317 -295 -1670 -674 1673 1417
1406 1417 -681 -236 1516 834 -1602 -1624 470 504 -1066 -704 1781 1961 -474 -796 853 596 -1343
1423 -1343 -1524 184 913 -372 -240 1307 1220 -263 -807 -136 -470 -980 -820 5 486 559 766 878 -81
1442 -81 -131 -15 -747 -1339 -430 626 162 -172 722 1769 552 -1241 -569 600 -584 -2052 -724 1446
1460 1446 1003 -414 192 1867 560 -1515 -1216 185 -121 -1222 -319 1302 1574 241 -72 913 181
1477 181 -1029 -1158 -528 -71 -77 284 676 970 419 403 -21 -781 -963 -424 -482 -534 507 1170 630 146 182
1498 182 482 -579 -1516 -662 383 -190 -230 756 1465 689 -566 -281 312 -603 -1518 -585 621 648 191
$$ packed form
1370A218N43k592J37K507J0k582j174J822O80j749m80K355J095j384o14J145l59
1387E78q59o38J83J32qP93N92m35J54P03j027j417M64J102o12j375R96K347k56
1406A417k098M45J752o82k436k2K094L4j570L62K485J80k435l22J649k57j939
1423a343j81J708P29j285J32J547q7j483n44O71l34n10J60Q25M81P3K07J12r59
1442h1n0J16p32n92R09J056m64l34Q94J047j217j793O72J169j184j468J328K170
1460A446m43j417O06J675j307k075K99J401l06j101R03J621K72j333l13R85p32
1477A81j210j29O30M57oL61L92K94n51j6m24p60j82N39n8n2J041O63n40m84L6
1498A82L00j061r37Q54J045n73m0R86P09p76j255K85N93r15r15R33J206K7m57
$$ plain form
1517 191 663 1206 493 -809 -833 -518 -708 -921 -126 859 1014 665 568 543 -140 -974 -990 -976 -1132 -157 470
1538 470 884 886 848 608 102 -878 -1071 -685 -671 -639 611 1277 945 686 812 358 -750 -1432 -1135 -582 -466
1559 -466 -181 863 1646 1104 591 132 -46 -903 -1524 -1093 -246 111 513 1137 1433 910 248 -296 -886 -1147
1579 -1147 -990 -653 35 490 895 1431 774 340 -15 -745 -1547 -1235 -657 -68 422 780 1252 1304 346 -179
1599 -179 -695 -807 -1157 -1162 -100 652 629 966 1128 892 128 -792 -952 -988 -705 -515 229 955 1265 838 694
1620 694 385 -442 -1152 -1167 -686 -502 130 605 1185 1091 844 50 -413 -815 -1059 -968 -428 320 575 1157 1211
1641 1211 757 258 -257 -1024 -1022 -1139 -536 244 721 1066 1259 827 -8 -471 -830 -1189 -980 -653 -4 791
1661 791 870 1094 923 510 -441 -1116 -1019 -1020 -768 -96 742 1190 1004 656 429 -66 -776 -1245 -986 -586 67
$$ packed form
1517A91M72N43p13j302k4L15j90k13P95R85J55l49r7k5o83q34j6J4j56R75O27
1538D70M14Kl8k40n06r80j93L86J4L2J250O66l32k59J26m54j108o82K97N53J16
1559d66K85J044P83n42n13m59j78q57o21M31Q47L57M02O24K96n23o62n44n90k61
1579a147J57L37O88M55M05N36o57m34l55p30q02L12N78N89M90L58M72N2r58n25
1599a79n16j12l50nJ062P52k3L37J62k36p64r20j60l6K83J90P44P26L10m27j44
1620F94l09q27p10j5M81J84O32M75N80r4k47p94m63m02k44R1N40P48K55N82N4
1641A211m54m99n15p67Kj17O03P80M77L45J93m32q35m63l59l59K09L27O49P95
1661G91P9K24j71m13r51o75R7jK52O72Q38M48j86l48k27m95p10m69K59M00O53
$$ plain form
1682 67 428 955 1327 867 326 -149 -649 -1136 -1241 -671 -31 457 854 1436 1145 290 -37 -507 -1255 -1328 -793
1703 -793 -101 356 620 1389 1373 609 -358 -569 -838 -1522 -1360 -264 590 801 668 1363 990 -165 -1081 -1113
1723 -1113 -908 -1173 -753 80 1229 1215 743 897 408 -711 -1332 -1296 -744 -512 134 771 1322 1276 677 126
1743 126 -607 -1193 -974 -782 -660 82 906 1341 843 438 929 -44 -1283 -1654 -621 -254 -380 379 1332
1762 1332 1805 542 -11 131 -360 -1347 -1664 -456 334 389 818 1559 1410 307 -714 -994 -961 -1395 -997
1781 -997 17 701 967 1021 1087 650 -36 -779 -1037 -1506 -929 -75 461 720 1047 1452 839 -256 -825 -692
1801 -692 -661 -1282 -1052 730 1406 889 579 1271 794 -983 -1525 -772 -387 -737 -498 1115 1738 1045 358
1820 358 413 168 -1065 -1569 -842 -67 -136 300 1049 1275 852 50 -481 -820 -1276 -871 -638 -171 731 1251
$$ packed form
1682F7L61N27L72m60n41m75n00m87j05N70O40M88L97N82k91q55l27m70p48p3N35
1703g93O92M57K64P69j6p64r67k11k69o84J62J096Q54K11j33O95l73j155r16l2
1723a113K05k65M20Q33J149j4m72J54m89j119o21L6N52K32O46O37N51m6n99n51
1743A26p33n86K19J92J22P42Q24M35m98m05M91r73j239l71J033L67j26P59R53
1762A332M73j263n53J42m91r87l17J208P90N5M29P41j49j103j021k80L3m34L98
1781i97J014O84K66N4O6m37o86p43k58m69N77Q54N36K59L27M05o13j095n69J33
1801f92L1o21K30J782O76n17l10O92m77j777n42P53L85l50K39J613O23o93o87
1820C58N5k45j233n04P27P75o9M36P49K26m23q02n31l39m56M05K33M67R02N20
$$ plain form
1840 1251 1205 263 341 -56 -725 -1476 -1218 -18 63 -320 671 1793 1317 -200 -343 -22 -506 -1495 -1030 458
1860 458 985 274 435 1322 928 -347 -1266 -580 -428 -910 -708 427 1123 789 600 647 -15 -455 -824 -1038
1880 -1038 -770 -358 274 635 675 954 790 -39 -750 -619 -536 -746 -961 181 1212 1059 146 545 788 -189
1900 -189 -1389 -1096 -169 -67 -684 -11 1496 1159 -3 -215 183 -151 -1260 -1180 -72 518 158 290 1156
1919 1156 1061 140 -420 -373 -287 -626 -687 -162 447 703 716 679 408 64 -259 -818 -1017 -303 373 155 164 683
1941 683 1222 226 -651 -289 157 -804 -1204 -211 835 438 8 478 905 176 -769 -876 -111 -328 -710 -217
1961 -217 951 864 218 30 560 5 -627 -598 -350 -127 -80 384 469 829 618 120 -98 -583 -490 -269 -473
1982 -473 -190 465 982 354 78 538 132 -726 -1005 -304 126 -165 -215 654 1230 483 -485 163 354 -716
$$ packed form
1840A251m6r42P8l97o69p51K58J200Q1l83R91J122m76j517j43L21m84r89M65J488
1860D58N27p11J61Q87l94j275r19O86J52m82K02J135O96l34j89M7o62m40l69k14
1880a038K68M12O32L61M0K79j64q29p11J31Q3k10k15J142J031j53r13L99K43r77
1900a89j200K93R27J02o17O73J507l37j162k12L98l34j109Q0J108N90l60J32Q66
1919A156r5r21n60M7Q6l39o1N25O09K56J3l7k71l44l23n59j99P14O76k18RN19
1941F83N39r96q77L62M46r61m00R93J046l97m30M70M27p29r45j07P65k17l82M93
1961b17J168q7o46j88N30n55o32K9K48K23M7M64Q5L60k11m98k18m85R3K21k04
1982d73K83O55N17o28k76M60m06q58k79P01M30k91n0Q69N76p47r68O48J91j070
$$ plain form
2002 -716 -1152 -181 354 83 79 432 971 432 -674 -428 -189 -515 -635 -271 271 484 434 307 423 118 -290
2023 -290 -432 -687 -489 10 160 239 407 934 580 -258 -353 -182 -250 -1118 -660 403 642 206 108 657 536
2044 536 -374 -809 -371 111 -516 -424 528 855 289 184 219 147 -272 -914 -686 -58 -72 -268 529 727 501
2065 501 181 -314 -147 -405 -612 -459 -171 258 622 531 192 270 342 -534 -783 -565 17 103 -317 141 805
2086 805 743 56 -214 161 -43 -663 -792 -251 502 267 150 874 687 28 -499 -453 -317 -420 -491 -55 452
2107 452 379 421 411 243 -202 -433 -453 -449 -169 -12 -109 294 653 539 145 -82 -256 -176 -454 -555 -163 442 422
2130 422 247 361 627 94 -608 -417 -209 -167 -365 -194 627 722 225 44 423 0 -487 -491 -274 -59 -105 -69
2152 -69 536 644 141 43 -239 -72 -360 -270 -45 114 268 314 379 311 177 92 -380 -406 -314 -78 -105 131 296
$$ packed form
2002g16m36R71N35k71mL53N39n39j106K46K39l26j20L64N42K13n0j27J16l05m08
2023b90j42k55J98M99J50P9J68N27l54q38r5J71o8q68M58J063K39m36r8N49j21
2044E36r10m35M38M82o27R2R52L27n66j05L5p2m19o42K28O28j4j96P97J98k26
2065E01l20m95J67k58k07J53K88M29L64r1l39P8P2q76k49K18N82Q6m20M58O64
2086H05o2o87k70L75k04o20j29N41P53k35j17P24j87o59n27M6J36j03p1M36N07
2107D52p3M2j0j68m45k31k0MK80J57r7M03L59j14l94k27j74Q0k78j01L92O05k0
2130D22j75J14K66n33p02J91K08M2j98J71Q21R5m97j81L79m23m87mK17K15m6L6
2152f9O05J08n03r8k82J67k88R0K25J59J54M6O5o8j34q5m72k6R2K36k7K36J65
$$ plain form
2175 296 112 540 190 -66 82 -321 -334 -392 -4 83 149 192 404 226 -191 -155 -28 -251 -333 -110 96 334
2197 334 192 43 247 196 -124 -180 -157 -117 -92 40 81 250 295 -12 42 -213 -103 -414 -202 -44 -103 97 -111
2220 -111 93 129 48 0 -215 -141 -164 -143 -127 249 53 112 69 278 171 -155 -57 -207 152 -73 -117 -1 142 167
2244 167 1 65 4 60 -88 -63 -7 116 -105 -248 171 168 -45 32 -72 97 82 -132 -327 -7 -55 -142 5 79
2268 79 -14 163 109 -4 -26 -78 -170 -356 12 -17 112 176 88 271 -184 -51 5 1 86 -172 -134 28 221 28 136
2293 136 468 162 -130 -221 -130 -52 -200 -112 44 314 203 114 200 175 -113 -242 -105 -113 -151 -95 174 325 149 147
2317 147 115 50 -188 -254 -174 -34 96 152 278 340 171 4 10 -145 -456 -177 -22 -37 99 36 345 53 78 -98
2341 -98 79 -348 -311 -104 279 322 150 261 198 34 -170 -172 -215 -540 -357 -252 249 243 147 370 343 217 -248 -393
$$ packed form
2175B96j84M28l50k56J48m03j3n8L88Q7O6M3K12j78m17L6J27k23q2K23K06K38
2197C34j42j49K04n1l20n6K3M0K5J32M1J69M5l07N4k55J10l11K12J58n9K00k08
2220a11K04L6q1m8k15P4k3K1J6L76j96N9m3K09j07l26R8j50L59k25m4J16J43K5
2244A67j66O4o1N6j48K5N6J23k21j43M19lk13P7j04J69j5k14j95L20m8q7J47P4
2268G9r3J77n4j13k2n2r2j86L68k9J29O4q8J83m55J33N6mQ5k58L8J62J93j93J08
2293A36L32l06k92r1R1P8j48Q8J56K70j11q9Q6k5k88j29J37ql8N6K69J51j76k
2317A47l2o5k38o6Q0J40J30N6J26O2j69j67Oj55l11K79J55j5J36o3L09k92K5j76
2341i8J77m27L7K07L83M3j72J11o3j64k04km3l25J83J05N01or6K23k7j26m65j45
$$ plain form
2365 -393 -422 -66 32 143 340 336 247 269 135 -138 -19 -266 -171 -78 343 289 144 34 233 103 -144 -433 -398
2388 -398 -18 -100 -157 243 439 330 203 74 188 -105 -359 -523 17 79 -168 347 437 223 -127 -174 7 -181
2410 -181 -341 -180 130 400 173 48 172 215 161 -74 -393 -332 -172 -172 -34 40 306 169 -16 -266 -61 -8
2432 -8 -434 -446 199 403 -15 81 307 311 -80 -490 -116 128 35 -423 83 453 267 -275 -76 351 256 -528 -554
2455 -554 -29 167 -238 -3 132 279 230 -206 -220 -103 -6 -333 -191 9 445 235 -13 -35 85 -159 -273
2476 -273 -43 155 53 -55 17 261 463 117 -60 73 104 -195 -450 -123 295 101 -155 320 444 -19 -247
2497 -247 -201 80 -187 -169 -70 503 418 69 -65 112 43 -374 -363 15 39 -10 -140 17 416 135 -91 -57 -188
2520 -188 78 41 -483 -68 509 264 -138 -189 297 361 -371 -448 29 159 -161 -155 410 588 -41 -499 -1 167
$$ packed form
2365c93k9L56R8J11J97mq9K2j34k73J19k47R5R3M21n4j45j10J99j30k47k89L5
2388c98L80q2n7M00J96j09j27j29J14k93k54j64N40O2k47N15R0k14l50m7J81j88
2410a81j60J61L10K70k27j25J24M3n4k35l19O1J60%J38P4K66j37j85k50K05N3
2432hm26j2O45K04m18R6K26Ml91m10L74K44r3m58N06L70j86n42J99M27r5p84k6
2455e54N25J96m05K35J35J47m9m36j4J17R7l27J42K00M36k10k48k2J20k44j14
2476b73K30J98j02j08P2K44K02l46j77J33L1k99k55L27M18j94k56M75J24m63k28
2497b47M6K81k67J8R9N73q5l49j34J77o9m17J1L78K4m9j30J57L99k81k26L4j31
2520a88K66l7n24M15N77k45m02n1M86O4p32p7M77J30l20ON65J78o29m58M98J68
$$ plain form
2542 167 -138 -157 37 242 46 -115 -28 288 93 -192 -339 -80 -152 -203 -17 197 255 330 -61 -11 -37 -84 -176
2565 -176 -200 -103 126 -68 -255 100 247 136 -422 -88 -4 114 -320 18 376 180 42 -154 153 241 -252
2586 -252 -319 62 140 -69 -14 186 253 291 -336 36 94 -328 -336 -98 -24 219 -195 150 230 260 2 -263 -12 -75
2610 -75 -155 -192 104 258 327 -82 32 105 156 -419 -477 -83 139 -3 -120 -57 317 12 -108 -64 149 -55 -434
2633 -434 -307 270 252 25 71 255 148 -14 -132 -199 -43 -210 -379 253 375 114 -42 -83 -27 -225 -472 -98
2655 -98 70 -53 231 -38 172 224 280 -358 -227 59 53 -228 -264 124 387 149 27 134 237 -236 -275 -314 222
2678 222 -6 -11 42 276 445 -186 -18 24 13 -501 -472 11 34 -108 18 243 220 -28 -388 -240 -14 -106 -44
2701 -44 5 -23 372 383 205 70 152 8 -445 -349 12 8 58 18 110 160 -90 -201 -237 -141 -366 -130 150 203 199 107
$$ packed form
2542A67l05j9J94K05j96j61Q7L16j95k85j47K59p2n1J86K14N8P5l91N0k6m7r2
2565a76k4R7K29j94j87L55J47j11n58L34Q4J18m34L38L58j96j38j96L07Q8m93
2586b52o7L81P8k09N5K00O7L8o27L72N8m22qK38P4K43m14L45Q0L0k58k65K51o3
2610g5q0l7K96J54O9m09J14P3N1n75n8L94K22j42j17O3L74l05j20M4K13k04l79
2633d34J27N77j8k27M6J84j07j62j18o7J56j67j69O32J22k61j56m1N6j98k47L74
2655i8J68j23K84k69K10N2N6o38J31K86ok81l6L88K63k38j22J07J03m73l9l9N36
2678B22k28nN3K34J69o31J68M2j1n14K9M83K3j42J26K25k3k48l60J48K26r2O2
2701d4M9k8L95J1j78j35Q2j44m53R6L61mN0m0R2N0k50j11l6R6k25K36K80N3mr2
$$ plain form
2727 107 122 361 -67 -263 -73 -85 -18 -131 151 350 217 -63 -3 87 -171 -159 -244 -69 251 193 107 138 59 69
2751 69 30 -169 -226 -149 -276 -241 58 295 300 113 -24 163 -115 -219 -409 5 -33 76 61 211 303 25 2 112
2775 112 -28 -297 -190 113 102 114 129 154 219 112 -255 -318 -142 -284 -120 -181 315 242 128 58 52 -61 30 -283
2799 -283 -139 -12 200 294 182 303 80 21 -30 -187 -44 -113 -28 187 225 236 48 27 139 -80 -275 -460 -14
2822 -14 -175 53 -82 194 56 -5 -14 -124 -61 -429 -87 -45 152 227 116 -18 -3 -72 -111 -413 -236 -52 68
2845 68 47 164 350 73 -5 143 -108 -212 -13 -215 8 17 238 133 166 305 -65 -245 -216 -125 -272 -119 51
2868 51 181 109 346 203 -2 -31 -130 95 -122 -96 124 -65 117 137 115 -2 -76 -64 -289 -195 -33 -31 291 60
2892 60 130 173 11 -74 -188 -10 -122 -152 -96 157 321 457 55 -21 37 -171 -83 -169 -202 59 127 44 127 274 86
$$ packed form
2727A07J5K39m28j96J90j2O7j13K82J99j33k80O0R0k58J2q5J75L20n8q6L1p9J0
2751F9l9j99n7P7j27L5K99K37Nj87j37J87k78j04j90M14l8J09j5J50R2k78k3J10
2775A12j40k69J07L03j1J2J5K5O5j07l67o3J76j42J64o1M96p3j14p0oj13R1l13
2799b83J44J27K12R4j12J21k23n9n1j57J43o9Q5K15L8J1j88k1J12k19j95j85M46
2822a4j61K28j35K76j38o1rj10O3l68L42M2J97P5j11j34J5o9l9l02J77J84J20
2845F8k1J17J86k77p8J48k51j04J99k02K23RK21j05L3J39l70j80K9R1j47J53J70
2868E1J30p2K37j43k05k9r9K25k17K6K20j89J82K0k2j17p4J2k25R4J62KL22k31
2892F0P0M3j62q5j14J78j12l0N6K53J64J36m02p6N8k08Q8q6l3K61O8q3Q3J47j88
$$ plain form
2917 86 -51 -151 -273 6 -140 66 141 255 126 11 -13 35 -168 -155 -98 -168 126 -40 -18 195 165 196 -80
2940 -80 -42 -28 -361 -114 179 23 136 36 28 -53 92 -6 -213 -136 -272 -38 46 313 413 170 -59 -15 -156
2963 -156 -323 -180 -197 31 136 57 17 11 205 -153 -210 -185 -110 -157 -54 64 270 129 245 125 -38 -37 -2 -342
2987 -342 -205 225 150 205 170 280 114 -44 -112 -187 -34 -327 17 106 161 115 298 147 -15 35 -203 -109 -64 -183
3011 -183 -6 -122 164 171 68 -152 -82 -75 -303 -222 3 -30 154 -60 65 233 78 -81 -122 -330 -54 -268 -127
3034 -127 191 303 266 -22 64 111 -108 -420 -196 79 -85 88 104 279 141 -34 -43 -272 -52 -69 -16 -94 143
3057 143 241 153 96 120 -6 -319 -318 -64 94 -103 -210 240 322 258 -10 -11 132 -61 -336 -34 153 164 104 -145
3081 -145 243 303 -194 -223 -187 -187 -120 -170 63 280 280 303 172 -4 -94 -331 -223 -31 -39 -263 222 183 277 247 96
$$ packed form
2917H6j37j00j22K79j46K06P5J14j29j15k4M8k03J3N7p0K94j66K2K13l0L1k76
2940h0L8J4l33K47K93j56J13j00qq1J45r8k07P7j36K34Q4K67J00k43k29M4j41
2963a56j67J43j7K28J05p9m0oJ94l58n7K5P5m7J03J18K06j41J16j20j63JL5l40
2987c42J37M30p5N5l5J10j66j58o8p5J53k93L44Q9N5m6J83j51j62N0k38R4M5j19
3011a83J77j16K86Pj03k20P0Pk28Q1K25l3J84k14J25J68j55j59m1k08K76k14J41
3034a27L18J12l7k88Q6M7k19l12K24K75j64J73J6J75j38j75rk29K20j7N3p8K37
3057A43R8q8n7K4j26l13JK54J58j97j07M50Q2o4k68jJ43j93k75L02J87J1o0k49
3081a45L88O0m97k9L6%O7n0K33K17%K3j31j76r0k37J08J92qk24M85l9R4l0j51
$$ plain form
3106 96 -4 -63 -137 -245 -257 103 171 46 52 112 204 70 -328 -285 -131 -61 -83 -115 385 273 194 -48 189 100 -233
3131 -233 -237 -387 38 -53 91 275 216 148 -128 -208 -79 -40 -195 42 248 341 133 189 196 53 -170 -216 -274 -199 78
3156 78 107 70 164 268 112 -52 -27 -22 -263 -317 -219 132 139 26 138 319 -1 -154 -350 -141 -5 -179 -33 182
3180 182 387 251 89 162 -20 -137 -244 -95 -227 186 56 -13 215 335 -38 -82 6 -153 -295 -220 -160 151
3202 151 74 153 160 238 52 -332 -299 -127 -16 -103 -78 271 417 362 -57 -11 -28 -269 -271 -198 -121 -51 -154 165 268
3227 268 340 -98 -225 -241 -155 -98 -206 -108 102 133 214 68 -111 58 -70 -245 -275 -74 -103 72 188 374 209
3250 209 -41 -124 -95 -257 -192 -55 135 190 -19 147 261 234 20 -285 69 -7 -117 -88 121 183 61 29 69
3273 69 234 90 -200 -147 40 -27 -14 45 186 344 71 -159 -47 -130 -105 -198 -141 38 241 -67 302 107 -28
$$ packed form
3106I6j00n9p4j08j2L60O8j25OO0R2j34l98M3J54P0k2l2N00j12p9k42K37q9l33
3131b33mj50M25r1J44J84n9o8k76q0J29L9j55K37K06R3k08N6Pj43k23m6n8P5K77
3156G8K9l7R4J04j56j64K5Nk41n4R8L51Pj13J12J81l20j53j96K09J36j74J46K15
3180A82K05j36j62P3j82j17j07J49j32M13j30o9K28J20l73m4Q8j59j42P5O0L11
3202A51p7P9PP8j86l84L3J72J11q7K5L49J46n5m19M6j7k41kP3P7P0j03L19J03
3227B68P2m38j27j6Q6N7j08R8K10L1Q1j46j79J69j28j75l0K01k9J75J16J86j65
3250B09k50q3K9j62O5J37J90N5k09J66J14k7k14l05L54p6j10K9K09O2j22l2M0
3273F9J65j44k90N3J87o7J3N9J41J58k73k30J12q3K5r3N7J79K03l08L69j95j35
$$ plain form
3296 -28 -89 -215 -121 -44 -125 -38 160 184 157 -145 32 -58 -62 -177 -243 -94 31 67 20 46 112 111 -179 15 -6 -15 91
3323 91 -10 223 138 85 124 177 -24 -45 -264 -81 95 60 11 286 222 255 87 -138 -24 -260 -321 -224 -20 19
3347 19 -34 -68 192 134 -132 -146 -35 -59 -6 29 -89 257 168 -66 14 177 14 -191 -74 -181 82 -3 212 88
3371 88 308 39 -87 -5 -36 -95 -74 -200 -26 173 133 68 -70 -142 -163 -267 -155 -48 -91 -74 -21 112 50 138 65
3396 65 108 63 -168 -58 45 210 8 -269 -36 152 59 -97 -30 -109 -153 -191 -137 32 -83 -61 27 216 26 -73
3420 -73 -149 -231 -34 197 -127 -35 392 137 54 8 174 138 -80 -146 -156 -20 -60 8 -78 190 -36 -20 -27 42 92 -204
3446 -204 -92 50 175 -97 25 115 133 5 8 -7 -168 -106 -138 4 197 107 -43 149 -1 -51 -39 -4 109 -156
3470 -156 -91 65 34 18 -19 -113 -198 -101 23 -104 192 -44 47 -64 28 43 60 -49 -64 -113 87 88 70 -7 198 -132
$$ packed form
3296b8o1j26R4P7q1Q7J98K4k7l02J77r0mj15o6J49J25L6m7K6O6jk90J94k1rJ06
3323I1j01K33q5n3L9N3k01k1k19J83J76l5m9K75o4L3j68k25J14k36o1R7K04L9
3347A9n3l4K60n8k66j4J11k4N3L5j18L46q9k34Q0J63j63k05J17j07K63q5K15j24
3371H8K20k69j26Q2l1n9K1j26J74J99m0o5j38p2k1j04J12J07m3J7N3J33o2Q8p3
3396F5M3m5k31J10J03J65k02k77K33J88r3j56O7p9m4l8N4J69j15K2Q8J89j90r9
3420g3p6q2J97K31l24R2M27k55q3m6J66l6k18o6j0J36m0O8q6K68k26J6pO9N0k96
3446b04J12J42J25k72J22R0J8j28Lj5j61O2l2J42J93r0j50J92j50n0J2L5J13k65
3470a56O5J56l1j6l7r4q5R7J24j27K96k36R1j11R2J5J7j09j5m9K00Jj8p7K05l30
$$ plain form
3496 -132 74 -126 -48 138 39 -207 -262 -21 -119 82 134 106 216 -91 42 43 -101 -222 -229 -122 -69 49 -83 63
3520 63 194 -41 202 -27 63 -164 10 -101 -237 67 -95 95 16 122 87 -33 -230 26 -220 -72 -77 156
3542 156 4 -59 -76 3 -84 -210 127 -12 122 -88 262 232 146 163 -107 -22 21 32 88 41 64 145 -40 -153 114
3567 114 -16 -115 78 -132 -18 -102 -48 -67 27 7 110 -15 -92 -224 53 -148 -286 84 51 42 24 212 -109 91
3591 91 28 42 165 -106 -173 290 118 -67 2 -19 -88 -25 -79 15 21 -31 -43 31 206 84 246 114 -157 97 -36
3616 -36 -155 -134 7 40 35 24 19 37 -76 16 -220 4 -69 -179 -32 116 15 17 -71 64 -77 -147 -210 -120 -35 -140
3642 -140 -113 -65 -14 12 123 -4 -21 -36 -114 -12 -31 35 75 34 48 -45 93 8 -28 -60 -161 -20 25 -204 -80 -108
3668 -108 183 4 -84 14 70 77 -65 35 -126 -45 109 -173 -31 -80 -9 68 21 -45 -79 133 -22 -120 33 40 104
$$ packed form
3496a32K06k00P8J86r9k46n5K41r8K01N2k8J10l07J33Jj44j21pJ07N3J18j32J46
3520F3J31k35K43k29R0k27J74j11j36L04j62J90p9J06l5j20j97K56k46J48nK33
3542A56j52o3j7P9q7j26L37j39J34k10L50l0q6J7k70Q5M3J1N6m7K3Q1j85j13K67
3567A14j30r9J93k10J14q4N4j9R4k0J03j25p7j32K77k01j38L70l3rj8J88l21K00
3591I1o3J4J23k71o7M63j72j85O9k1o9O3n4R4On2j2P4J75j22J62j32k71K54j33
3616c6j19K1J41L3nj1nJ8j13R2k36K24p3j10J47J48j01Kq8J35j41p0o3R0Q5j05
3642a40K7M8N1K6J11j27j7j5p8J02j9O6M0m1J4r3J38q5l6l2j01J41M5k29J24k8
3668a08K91j79q8R8N6Pj42J00j61Q1J54k82J42m9P1P7m7o6l4K12j55r8J53PO4
$$ plain form
3693 104 129 -11 86 -113 -18 -85 46 -79 110 77 347 -62 -28 44 -9 62 -141 -50 26 29 50 -141 143 100 93 -76
3719 -76 26 232 -41 244 -21 88 -7 -54 -81 -41 12 70 184 11 0 139 -111 -32 -34 17 95 105 -36 166 97
3744 97 -29 -117 237 57 -36 -51 -87 84 -171 -8 80 188 84 57 34 27 -61 -139 38 -34 182 -10 144 99 -92
3769 -92 -105 97 -30 -156 -179 -72 89 162 197 -3 -74 126 -198 -115 245 50 -100 23 -95 132 -60 139
3791 139 -148 -172 -15 -98 -14 -41 137 15 10 -3 -2 -60 -155 -62 0 121 93 -4 -91 -28 114 117 -70 -102 -37 -195 -44
3818 -44 73 -49 -50 -148 198 -35 -52 -80 -26 63 39 -81 -109 57 126 48 -31 -32 -47 -91 -160 19 150 95 -271 85
3844 85 -35 0 -18 -81 59 95 89 -117 136 238 49 163 191 -43 -58 -105 54 -55 78 -133 -79 345 -97 -122
3868 -122 -161 -13 -63 251 -315 -180 86 105 73 -118 -161 -18 -80 121 117 74 -129 -30 63 -33 44 -117 13 68 -97
$$ packed form
3693A04K5j40R7j99R5o7J31j25J89l3K70m09L4P2n3P1k03R1P6LK1j91K84m3pj69
3719g6J02K06k73K85k65J09r5m7k7M0N3N8J14j73j1J39k50P9kN1P8J0j41K02o9
3744I7j26q8L54j80r3j5l6J71k55J63Q8J08j04k7k3pq8p8J77p2K16j92J54m5j91
3769i2j3K02j27j26k3J07J61P3L5k00p1K00l24Q3L60j95j50J23j18K27j92J99
3791A39k87k4J57q3Q4k7J78j22nj3Jn8r5R3O2J21k8r7q7O3J42Lj87l2O5j58J51
3818d4J17j22jr8L46k33j7k8N4Q9k4j20k8J66O9p8p9jj5m4o9J79J31n5l66L56
3844H5j20L5j8o3J40L6ok06K53J02j89J14K8k34j5m7J59j09J33k11N4M24m42k5
3868a22l9J48n0L14n66J35K66J9l2j91m3J43o2K01mm3k03R9R3r6P7j61J30N5j65
$$ plain form
3893 -97 -29 64 62 155 -103 102 75 -31 -112 -115 -9 82 177 -100 75 172 -7 13 7 17 5 28 -104 -121 75 -38 -173
3920 -173 -33 55 -188 -7 -41 58 -228 83 17 -4 181 33 -7 186 5 47 -120 -75 -12 -41 -166 -99 34 -75
3944 -75 -11 -40 4 -120 -1 55 -70 52 53 -105 50 180 -41 -19 -18 17 -78 -45 147 -22 220 11 -159 -74 166
3969 166 88 173 -111 86 -8 -59 -1 78 -58 95 -67 -64 4 79 -63 268 70 90 180 28 10 -183 -13 -114
3993 -114 -76 -104 27 117 -10 -10 112 -59 -41 0 -40 -117 -17 191 176 -71 13 -95 137 -35 -106 154 -101 -70
4017 -70 -57 134 28 -105 -84 105 166 30 -18 -195 169 44 39 31 -132 -47 75 -43 85 -185 -83 -3 86 -50
4041 -50 51 118 43 -75 -15 -120 166 201 175 0 15 -44 -183 -139 -50 -5 -21 -68 -148 144 -83 -61 -266 118 -33
4066 -33 7 -131 -147 257 32 -40 -149 -82 -184 -241 -193 37 -124 -93 -22 -31 62 54 -35 99 177 116 -51 -131 -26 45
$$ packed form
3893i7O8R3kR3k58K05k7j06q1lJ06R1R5k77J75R7j79K0oJ0j2K3j32j7J96j13j35
3920a73J40Q8k43J81l4R9k86L11o6k1J85j48m0J93j81M2j67M5O3k9j25O7J33j09
3944g5O4k9M4j24J19N6j25J22Jj58J55J30k21K2JL5r5L3J92j69K42k09j70Q5K40
3969A66p8Q5k84J97r4n1N8P9j36J53j62LO8P5j42L31j98K0R0j52j8j93J70j01
3993a14L8k8J31R0j27%J22j71J8M1m0p7J00K08j5k47Q4j08K32j72p1K60k55L1
4017g0J3J91j06j33K1J89O1j36m8j77L64j25nqj63Q5J22j18J28k70J02Q0Q9j36
4041e0J01O7p5j18O0j05K86L5k6j75J5n9j39M4Q9M5j6m7q0K92k27K2k05L84j51
4066c3M0j38j6M04k25p2j09O7j02n7M8K30j61L1P1rR3qq9J34P8o1j67q0J05P1
$$ plain form
4092 45 -38 -71 81 128 71 110 -74 86 28 87 -72 -118 31 2 -80 8 119 -1 193 -66 43 -72 -187 -106
4116 -106 53 -111 -23 -27 36 31 -62 -71 -80 -7 6 -24 -14 83 -41 29 -65 74 -77 -109 -29 -166 144 101 38 -112 52
4143 52 89 -93 20 66 122 -121 8 46 -133 -112 -38 64 172 22 -184 -267 -117 44 72 210 256 115 86 -124
4167 -124 13 141 -56 -231 34 -63 116 19 82 63 51 -107 -84 -84 -9 3 -224 112 101 -45 -52 -34 -42 123 72 -51
4193 -51 51 56 -61 -51 127 -34 171 27 149 182 -51 -180 -115 146 -35 -36 24 25 43 -10 11 -124 -120 74 -29
4218 -29 83 -60 -184 62 28 21 -101 -136 -50 179 33 -60 92 46 -55 -40 -45 21 170 52 59 214 86 203 98
4243 98 151 27 158 -336 -91 79 -156 21 -78 -12 -29 203 -145 132 98 -60 -45 65 -131 190 68 284
4265 284 133 -87 -6 19 -66 -59 -23 -41 9 -101 73 149 -104 -12 169 -26 41 106 38 -173 -59 98 186 169 13
$$ packed form
4092D5q3l3J52M7n7L9j84J60n8N9j59m6J49k9q2Q8J11j20J94k59J09j15j15Q1
4116a06J59j64Q8mO3nr3rrP3J3l0J0R7j24P0r4J39j51l2Q0j37L10m3o3j50J64
4143E2L7j82J13M6N6k43J29L8j79K1P4J02J08j50k06q3J50J61K8J38M6j41k9k10
4167a24J37J28j97j75K65r7J79r7O3j9j2j58K3%P5J2k27L36j1j46pJ8qJ65n1j23
4193e1J02Nj17J0J78j61K05j44J22L3k33j29O5K61j81jO0JJ8n3K1j35MJ94j03
4218b9J12j43j24K46l4pj22l5Q6K29j46r3J52m6j01J5nO6J49j18PJ55j28J17j05
4243I8N3j24J31m94K45J70k35J77r9O6j7K32l48K77l4j58J5J10j96L21j22K16
4265B84j51k20Q1K5q5PL6j8N0j10J74P6k53R2J81j95O7O5o8k11J14J57Q8j7j56
$$ plain form
4290 13 121 138 -92 101 19 -11 -22 66 20 -155 264 -66 24 -188 -4 -60 15 83 49 121 106 -141 33 11 -197
4315 -197 -30 -148 -14 -138 -130 59 110 -83 -53 -57 52 -123 68 82 -24 105 -30 -43 12 -129 -197 186 44
4338 44 -28 -44 -22 161 -70 4 82 226 41 31 -42 37 -82 -187 99 -27 -22 221 62 83 -58 -52 -179 -19 -134
4363 -134 48 35 97 -51 171 112 -178 5 20 -110 107 -29 174 -11 47 -63 3 -6 10 19 -14 -26 -27 -13 2 151
4389 151 44 93 56 -154 -21 110 -156 -27 -157 -85 299 108 110 104 106 37 41 99 -46 34 17 180 -139 -225 -193 38
4415 38 27 22 -57 -175 -14 52 -86 103 121 155 -87 47 -189 15 121 221 89 -89 -187 -25 -133 129 30
4438 30 -22 36 -7 205 24 25 151 191 91 126 -54 -50 -25 -29 -40 151 11 -99 -199 19 25 -80 -20 -21 107 3
4464 3 30 12 -50 -177 -121 72 170 67 11 -36 -43 169 -156 -143 -88 108 20 112 54 -25 -131 -134 30 -131 244 110
$$ packed form
4290A3J08J7k30J93q2l0j1Q8m6j75M19l30R0k12J84n6P5O8l4P2j5k47J74k2k08
4315a97J67j18J34j24QJ89N1j93L0mJ09j75J91J4j06J29j35j3N5j41o8L83j42
4338D4p2j6K2J83k31P4P8J44j85j0p3P9j19j05K86j26NK43j59K1j41Oj27J60j15
4363a34J82j3O2j48K22n9k90J83J5j30K17j36K03j85N8j10O6rJ6Rl3j2jJ4J5J49
4389A51j07M9l7k10J33J31k66J29j30P2L84j91KoKo9MN8j45Q0j7J63l19q6L2K31
4415C8j1np9j18J61O6j38J89J8L4k42J34k36K04J06J00j32j78r8J62j08K62r9
4438C0n2N8m3K12j81JJ26M0j00L5j80MK5mj1J91j40j10j00K18Oj05O0jJ28j04
4464CK7j8o2j27N6J93R8j03n6m7pK12l25J3N5J96q8R2n8p9j06lJ64j61L75j34
$$ plain form
4490 110 -54 57 -29 -77 -48 -61 -99 -100 -161 20 -8 59 -64 -106 54 -1 9 -102 -8 118 9 124 1 -156 105
4515 105 -212 66 76 35 -145 80 3 -46 -100 -77 27 43 -97 102 69 40 64 66 50 83 -251 0 -25 -82 -77 37
4541 37 73 -106 -102 89 17 -90 3 -11 90 -69 -45 174 -5 20 57 -78 -36 -113 109 -118 -41 18 -51 -140 -11
4566 -11 30 150 -44 24 -54 38 128 -215 102 115 106 -20 198 74 106 -201 150 216 -31 -168 -14 0 157 179
4590 179 -162 -113 -111 -43 -28 179 41 67 103 -24 -76 122 -5 148 -17 -40 -90 59 -2 57 -61 164 -86 -16
4614 -16 -62 -110 84 161 86 -145 105 26 69 146 -81 33 -58 -117 6 -73 11 82 43 -33 3 13 -220 -46 195 134
4640 134 42 -91 19 -197 143 94 -139 -107 -96 114 -93 -37 85 -80 -15 -68 -270 206 -39 59 47 -41 -126 -29
4664 -29 -123 -135 112 -48 222 -44 -17 -13 155 -87 -81 47 -207 -32 217 -143 192 -102 64 -185 -50 -9 -117
$$ packed form
4490A10j64J11q6m8K9j3l8jo1J81k8O7j23m2J60n5J0j11R4J26j09J15j23j57K61
4515A05l17K78J0m1j80K25p7m9n4K3J04J6j40J99l3k9K4Kj6L3l34K51k5n7NJ14
4541C7L6j79MJ91p2j07R3j4J01j59K4K19j79K5L7j35M2p7K22k27P7N9o9q9J29
4566a1M1J20j94O8p8R2R0l43L17J3rj26K18j24L2l07L51O6k47j37J54J4J57K2
4590A79l41M9KO8J5K07j38K6L6j27n2J98j27J53j65k3n0J49o1N9j18K25k50P0
4614a6m6m8J94P7p5k31K50p9M3P7k27J14r1n9J23p9Q4P1l9p6L6J0k33J74K41o1
4640A34r2j33J10k16L40m9k33L2J1K10k07N6J22j65O5n3k02M76k45R8j2q8q5R7
4664b9r4j2K47j60K70k66K7MJ68k42OJ28k54J75K49l60L35k94J66k49J35M1j08
$$ plain form
4687 -117 -77 -10 29 -1 -2 -43 243 -128 -71 116 40 70 274 171 -70 -9 75 26 24 -20 -5 -78 -47 147 142 -30 -24 -52
4715 -52 155 -30 126 -94 79 -170 6 79 98 -4 -52 -18 60 62 103 88 48 -81 -129 -26 -12 96 58 50 -83
4740 -83 -140 -123 -107 -49 -56 -172 121 117 -16 98 1 -52 -26 68 20 147 54 75 -166 210 23 -151 -94 -57 251 -48
4766 -48 150 35 37 81 -100 54 129 8 -58 -68 70 -11 -79 59 133 -40 -193 145 98 -146 70 -130 -67 -157
4790 -157 -25 -5 98 83 -83 -46 96 130 -56 -75 79 -22 108 -82 7 -84 17 19 -174 -254 103 7 131 -148
4814 -148 11 -62 100 209 123 -121 -13 -71 6 182 127 57 118 -16 22 30 -73 -2 -76 95 83 235 -4 -24 42
4839 42 5 -3 127 186 -113 40 94 -98 10 68 78 16 141 -34 -40 111 -61 -161 80 -141 -260 113 -67 -155
4863 -155 -21 -71 142 156 -18 -143 -73 25 -157 29 100 27 -148 -124 -142 -66 147 122 59 -35 -52 20 -57 183 95
$$ packed form
4687a17M0O7L9l0jm1K86l71N7J87p6L0K04j03k41O1Q4m9km4J5p3L1J94nj72Ok8
4715e2K07j85J56k20J73k49J76P3J9j02m8L4P8KM1j5m0j29m8J03J4J08l8qj33
4740h3n7J7J6N8pj16K93mj33J14r7n3K6R4m8J27r3K1k41L76j87j74N7L7L08k99
4766d8J98j15KM4j81J54P5j21o6j0J38q1o8J38P4j73j53L38m7k44K16k00O3r0
4790a57J32K0J03j5j66L7J42L4j86j9J54j01J30j90Q9r1J01Kj93q0L57r6J24k79
4814a48J59p3J62J09q6k44J08n8P7J76n5p0O1j34L8Qj03P1p4J71j2J52k39k0O6
4839D2l7qJ30N9k99J53N4j92J08N8J0o2J25j75oJ51j72j00K41k21j19L73j80q8
4863a55J34n0K13J4j74j25P0R8j82J86P1p3j75K4j8P6K13k5o3r4j7P2p7K40q8
$$ plain form
4888 95 168 -130 -149 -36 -51 76 40 74 128 -7 189 -81 -38 -137 40 -33 285 64 -152 58 55 127 -67 -55 116
4913 116 -155 -37 -124 -104 102 82 -61 -161 63 -126 57 24 -232 22 8 -67 -51 43 -1 -82 -107 56 -45 -136
4937 -136 106 184 -196 -47 27 75 -94 -84 174 -124 -69 2 21 -70 29 -1 -3 65 -70 82 -97 -9 -31 -29 181 22
4963 22 264 -89 -84 127 64 41 -91 68 184 73 -20 -59 -55 -143 -22 101 -56 -28 -145 3 -241 19 230 31
4987 31 12 -142 -25 -44 61 -63 159 84 106 174 -89 -30 75 38 352 -80 68 12 19 53 137 -116 46 -129
5011 -129 -145 -73 126 214 233 -4 122 89 -111 141 -123 -181 -174 7 -52 -77 145 142 24 6 156 -69 -218 -25
5035 -25 -12 -15 59 152 9 -57 23 -103 -54 52 -99 80 57 -89 -80 27 1 13 82 -45 94 -137 -18 122 63
5060 63 -12 79 -10 -9 -41 -59 -123 5 3 -158 27 73 46 -113 -7 -175 -53 65 -49 -12 -252 -70 9 116 48
$$ packed form
4888I5P3k98j9J13j5J27l6L4N4j35J96k70M3r9J77p3L18k21k16K10lP2j94J2J71
4913A16k71J18q7K0K06k0j43j00K24j89J83l3k56K54j4p5J6R4m4q1k5J63j01r1
4937a36K42P8l80J49P4M8j69J0K58k98N5P1J9r1R9l0kO8j35J52j79Q8k2KK10j59
4963B2K42l53NK11o3k3j32J59J16j11r3l9Mq8J21J23j57K8j17J48k44K60K11j99
4987C1j9j54J17j9J05j24K22p5K2O8k63N9J05l7L14m32J48n6PL4Q4k53J62j75
5011a29j6P2J99Q8J9k37J26l3k00K52k64n8PJ81n9k5K22lj18j8J50k25j49J93
5035b5J3lP4R3j43o6Q0j26M9J06j51J79k3j46RJ07k6J2O9j27J39k31J19J40n9
5060F3p5R1q9Jl2j8o4J28kj61J85M6k7j59J06j68J22J18j14L7k40J82P9J07o8
$$ plain form
5085 48 134 -24 27 -17 6 -66 -23 -68 -48 -61 -161 17 84 -38 -48 227 -81 -58 -76 66 72 153 184 67 27 106 134
5112 134 -68 179 -65 70 53 -95 -13 218 -112 -76 -2 -18 -140 45 -50 117 -207 11 1 43 -13 -72 -4 -112
5136 -112 82 -145 83 60 91 -1 -16 23 70 159 -110 -8 101 -30 8 -54 -42 -50 3 -79 -77 -35 -7 -71 16 -261 -69
5163 -69 37 -102 50 200 -61 120 -25 12 47 -10 17 -11 -4 -220 37 -159 -63 -238 136 26 33 81 -25 91
5187 91 -4 172 -173 -40 -16 44 -70 -3 -176 -111 -35 28 28 -128 -86 2 223 -182 21 -50 110 -48 4 52 -43
5212 -43 -31 152 74 -21 -14 -124 -12 -116 -18 -61 -47 125 -34 -97 16 -89 -141 -104 -49 -77 -6 96 19 65 146 -46
5238 -46 51 144 -27 40 103 -18 -91 41 -157 9 -103 260 -8 67 51 -22 137 30 60 43 60 109 -185 -84
5262 -84 110 -77 -76 -77 130 -97 29 -1 50 6 -107 248 -17 -27 -76 -146 2 -114 -34 14 -40 -2 4 -120 -210 49
$$ packed form
5085D8Q6j58N1m4K3p2M3m5K0j3j00J78O7j22j0K75l08K3j8J42OQ1L1j17m0P9K8
5112A34k02K47k44J35j7j48Q2K31l30L6P4j6j22J85r5J67l24K18j0M2n6n9O8j08
5136a12J94k27K28k3L1r2j5L9M7Q9k69J02J09j31L8o2J2qN3q2KM2K8o4Q7k77J92
5163f9J06j39J52J50k61J81j45L7L5n7K7k8Pk16K57j96R6j75L74j10PM8j06J16
5187I1r5J76l45J33K4O0j14O7j73O5P6O3%j56M2Q8K21m05K03p1J60j58N2M8r5
5212d3J2J83p8r5Pj10J12j04R8m3J4J72j59o3J13j05n2L7N5k8P1J02p7M6Q1j92
5238d6R7R3j71O7O3j21p3J32j98J66j12L63k68P5j6p3J59j07L0j7J7M9k94J01
5262h4J94j87JjK07k27J26l0N1m4j13L55k65j0m9p0J48j16Q0M8n4L8Oj24r0K59
$$ plain form
5288 49 -66 85 6 166 37 -13 -191 -208 34 -9 -83 26 127 100 39 -65 70 44 137 72 36 76 21 49 41 -71
5314 -71 50 -19 -262 -71 65 -30 -70 70 143 158 151 -226 83 108 -158 -161 52 -16 -128 -9 -73 173 74 -15 -77
5339 -77 -132 -108 62 83 46 80 116 -46 73 96 18 -60 17 141 -2 -132 -36 -52 -158 53 126 49 2 -145 -59 32
5365 32 137 132 71 96 25 -13 -121 -86 -2 -146 78 -169 109 27 90 -57 217 136 -181 94 10 -150 11 25 114
5390 114 176 -180 -11 93 -95 -39 82 177 110 101 -37 5 11 -169 -204 -119 -364 0 4 27 166 69 83 63 -36 86
5416 86 -75 40 -10 -133 95 -6 -157 -51 -19 83 -19 -36 104 32 99 -203 42 -22 156 20 37 28 50 -195
5440 -195 40 -147 48 17 2 71 39 94 -107 -209 73 -24 100 -154 -29 11 -9 -13 53 61 -84 -99 -46 -99 -212
5465 -212 7 -114 79 -116 37 92 -66 -103 114 81 94 200 7 -79 195 -40 267 -148 -1 -71 -87 -75 -51
$$ packed form
5288D9j15J51p9J60j29n0j78j7K42m3p4J09J01k7o1j04J35k6R3o5l6M0n5K8qj12
5314g1J21o9k43J91J36r5m0J40P3J5pl77L09K5k66lK13o8j12J19o4K46r9q9o2
5339g7n5K4J70K1l7L4L6j62J19K3p8p8P7J24j43j30R6j6j06K11P3p7m7j47Q6R1
5365C2J05no1K5p1l8j08L5Q4j44K24k47K78q2O3j47K74q1l17K75q4j60J61J4Q9
5390A14O2l56J69J04j88N6J21R5o7rj38M2Oj80l5Q5k45L64MK3J39r7J4k0r9J22
5416H6j61J15n0j23K28j01j51J06L2J02j02j7J40p2O7l02K45o4J78j36J7rK2k45
5440a95K35j87J95l1j5O9l2N5k01j02K82r7J24k54J25M0k0mO6Qj45j5N3n3j13
5465b12K19j21J93j95J53N5j58l7K17l3J3J06j93q6K74k35L07m15J47p0j6J2K4
$$ plain form
5488 -51 -54 21 159 112 50 -39 -16 25 74 11 25 -30 138 313 -5 -115 123 -54 199 -233 -135 51 65 278 73
5513 73 -38 -10 -29 68 48 -19 78 -8 138 147 -33 83 11 -96 1 -9 -86 -137 15 -63 -73 -8 6 -105 -85 -256 -9
5540 -9 -63 -147 -199 -48 38 -14 52 122 76 100 -25 -64 97 -36 -59 42 -183 267 93 -143 110 -14 -88 3 207
5565 207 -7 30 -72 50 7 -35 77 41 -5 -5 47 -21 -183 119 -228 110 -42 -208 103 87 -46 -114 109 56
5589 56 41 -90 52 -105 63 142 109 -75 50 141 73 -81 -75 15 -77 25 4 60 36 40 111 -276 -19 -184 -34
5614 -34 -64 -10 157 57 -137 -107 31 109 97 -136 -101 82 -71 -74 11 103 -138 108 -68 -38 -102 120 -168 28
5638 28 91 77 62 96 -162 63 -191 172 -40 -164 137 6 -26 60 -186 -129 54 -30 116 8 127 150 -53
5661 -53 -7 98 51 -95 178 -25 -13 -3 -4 -2 66 84 0 -127 -143 -58 5 -60 139 -189 -159 45 4 40 23 -103 76
$$ packed form
5488e1lP5J38m7o2q9K3M1M9o3J4n5J68J75l18j10K38j77K53m32R8J86J4K13k05
5513G3j11K8j9R7k0o7R7q6J46Rj80J16p2j07R7j0p7n1J52p8j0O5J4j11K0j71K47
5540in4q4n2J51Q6n2O6P0m6K4j25l9J61j33k3J01k25M50j74k36K53j24p4R1K04
5565B07k14L7j02J22m3m2J12l6m6%N2o8j62L02l47L38j52j66L11j6j33o8K23n3
5589E6j5j31J42j57J68P9l3j84J25R1o8j54OR0r2J02k1N6k4MP1l87K57j65J50
5614c4l0N4J67j00j94L0J38P8j2k33L5J83j53lQ5R2k41K46j76L0o4K22k88J96
5638B8O3j4j5L4k58K25k54L63k12j24L01j31l2Q6k46N7J83q4J46j08J19K3k03
5661e3M6J05m7j46K73k03J2J0jKO8J8q4j27j6Q5O3o5J99l28L0K04m1L6j7j26J79
$$ plain form
5688 76 62 125 -88 68 96 77 35 147 134 14 54 42 -44 91 223 -101 -133 48 18 61 -14 -129 93 -79 22
5713 22 39 131 227 42 40 17 49 244 16 -95 191 17 -45 55 39 -5 -48 91 -22 126 -36 -130 -41 87 -23
5738 -23 -18 119 36 46 -41 -161 209 23 -53 31 106 -91 165 105 -52 28 -23 88 34 -42 41 -12 90 82 58 -30 22
5765 22 -46 -182 157 -19 36 104 185 -56 0 150 -43 -10 39 95 -237 -157 7 -14 -29 174 66 -132 -145 60
5789 60 -106 79 3 42 -58 -228 3 29 -125 -34 -35 58 117 43 15 107 47 -96 136 52 -199 -24 79 126 31
5814 31 66 412 137 -100 12 -112 -10 -17 14 -114 -67 60 30 192 120 -67 -115 -29 -73 42 -11 -161 -50 -2
5838 -2 -97 38 220 162 48 -166 -175 -206 87 -75 95 145 -46 -136 -76 73 80 1 -103 186 -10 -84 26 -45 130
5863 130 -3 170 41 -202 114 64 -66 122 80 -51 -101 49 -17 239 -6 58 133 -51 -162 -20 -7 -65 -77
$$ packed form
5688G6j4O3k13J56K8j9m2J12j3j20M0j2q6J35J32l24l2J81l0M3p5j15K22j72J01
5713B2J7R2R6j85kk3L2J95k28j11K86j74o2J00j6m4m3J39j13J48j62r4Q9J28j10
5738b3NJ37q3J0q7j20L70j86p6Q4P5j97K56o0j57Q0n1J11n4p6Q3n3J02qk4q8N2
5765B2o8j36L39j76N5O8Q1k41N6J50j93L3M9N6l32Q0J64k1j5K03j08j98j3K05
5789F0j66J85p6L9j00j70K31K6j54R1jR3N9p4k8R2o0j43K32q4k51J75J03M7r5
5814C1L5L46k75k37J12j24J02pL1j28M7J27l0J62p2j87m8Q6m4J15n3j50J11M8
5838br5J35J82n8j14k14rl1K93j62J70N0j91r0O0J49Pp9j04K89j96p4J10p1J75
5863A30j33J73j29k43L16n0j30J88m2j31n0J50o6K56k45O4P5j84j11J42J3n8j2
$$ plain form
5886 -77 49 59 -160 -48 -46 -18 -205 164 -53 185 133 168 -40 259 -163 51 -97 -55 -67 136 -67 73 -45
5909 -45 -196 -16 26 -24 -13 -87 -16 97 -42 -165 -93 -137 -206 -40 -158 -24 72 8 -11 57 225 41 141 71 33
5934 33 -111 -76 -71 11 -142 86 23 33 -99 97 145 -38 -30 63 -16 -33 -105 73 80 148 -122 -112 -86 -38 -27 -125 155
5961 155 71 -285 -74 -81 1 89 16 92 -56 7 72 -83 124 -222 -86 113 41 -22 -20 98 -2 35 173 -109 -150
5986 -150 136 192 -175 42 -145 86 58 -107 -23 -12 -164 -27 -31 11 -127 -278 156 142 123 128 105 -42 -165 -18
6010 -18 -78 -25 27 21 31 181 34 -36 -54 -155 54 -168 -132 -43 -27 -115 -82 -174 20 -259 177 -90 -97 27 -91 -99
$$ packed form
5886g7J26J0k19J12KK8j87L69k17K38n2L5k08K99m22K14j48M2j2K03k03J40j18
5909d5j51J80M2n0J1p4P1J13j39j23P2m4o9J66j18J34R6o4j9O8J68j84J00p0l8
5934C3j44L5NQ2j53K28o3J0j32J96M8j83QR3p9j7p2J78PO8k70J0K6M8J1r8K80
5961A55q4l56K11pQ2Q8p3P6j48O3O5j55K07l46J36J99p2o3KJ18j00L7J38k82m1
5986a50K86N6l67K17j87K31k8j65Q4J1j52J37mM2j38j51M34j4j9Nk3j47j23J47
6010a8o0N3N2oJ0J50j47p0j8j01K09k22L6Q9J6q8L3r2J94k79M36k67pJ24j18q
$$ [...]
8191b9
##END NTUPLES=NMR FID
##END=
