##TITLE=1H_LR-751-KB-R2-C2
 CDCl3
 8 sc, 
 3.7.2024
##JCAMPDX= 6.0         $$ Bruker NMR JCAMP-DX V2.0
##DATA TYPE= NMR FID
##DATA CLASS= NTUPLES
##ORIGIN= UXNMR, Bruker Analytische Messtechnik GmbH
##OWNER= root
$$ XWIN-NMR		Version 3.5
$$ Wed Jul  3 14:16:54 2024 Russian Standard Time (UT+4h)  she@DPX200
##.OBSERVE FREQUENCY= 200.1314
##.OBSERVE NUCLEUS= ^1H
##.DELAY= (6, 6)
##.ACQUISITION MODE= SIMULTANEOUS
##.ACQUISITION SCHEME= undefined
##.AVERAGES= 8
##.DIGITISER RES= 18
##SPECTROMETER/DATA SYSTEM= spect
##.PULSE SEQUENCE= zg30
##.SOLVENT NAME= DMSO
##.SHIFT REFERENCE= (INTERNAL, DMSO, 0, 15.7039)
##AUDIT TRAIL= $$ (NUMBER, WHEN, WHO, WHERE, WHAT)
$$ ##TITLE= Audit trail, XWIN-NMR		Version 3.5
$$ ##JCAMPDX= 5.01
$$ ##ORIGIN= Bruker BioSpin GmbH
$$ ##OWNER= she
$$ F:/spectra/data/she/nmr/H-F/1/audita.txt
$$ ##AUDIT TRAIL=  $$ (NUMBER, WHEN, WHO, WHERE, WHAT)
(   1,<2024-07-03 14:15:54.43 +0400>,<she>,<DPX200>,
      <created by zg, POWCHK disabled, PULCHK disabled
       configuration hash MD5:
       00 E9 B6 7A A2 85 ED C7 34 08 36 98 17 FE 4E 26
       data hash MD5: 16K
       40 00 BF BA 64 21 16 4A F6 B4 28 90 60 56 30 F3>)
$$ ##END=
$$ 
$$ hash MD5
$$ 1E C7 50 84 D4 57 3F 73 61 7E E1 FD 5E 74 E6 64
##$RELAX= 
##$RELAX= 
##$RELAX= 
##$RELAX= 
##$RELAX= 
##$RELAX= 
$$ Bruker specific parameters
$$ --------------------------
##$DU= <F:/spectra>
##$EXPNO= 1
##$NAME= <H-F>
##$PROCNO= 1
##$TYPE= <nmr>
##$USER= <she>
##$AMP= (0..31)
100 100 100 100 100 100 100 100 100 100 100 100 100 100 100 100 100 100 
100 100 100 100 100 100 100 100 100 100 100 100 100 100 
##$AQSEQ= 0
##$AQ_mod= 1
##$AUNM= <au_zg>
##$AUTOPOS= <>
##$BF1= 200.13
##$BF2= 200.13
##$BF3= 200.13
##$BF4= 200.13
##$BF5= 200.13
##$BF6= 200.13
##$BF7= 200.13
##$BF8= 200.13
##$BYTORDA= 1
##$CFDGTYP= 0
##$CFRGTYP= 5
##$CHEMSTR= <none>
##$CNST= (0..31)
1 1 145 1 1 1 1 1 1 1 1 1 1 1 1 1 1 1 1 1 1 1 1 1 1 1 1 1 1 1 1 1 
##$CPDPRG= <>
##$CPDPRG1= <>
##$CPDPRG2= <>
##$CPDPRG3= <>
##$CPDPRG4= <mlev>
##$CPDPRG5= <mlev>
##$CPDPRG6= <mlev>
##$CPDPRG7= <mlev>
##$CPDPRG8= <mlev>
##$CPDPRGB= <>
##$CPDPRGT= <>
##$D= (0..31)
0 1.2 0 0 0 0 0 0 0 0.06 0 0.03 0 0 0 0 0.0002 0 0 0 0 0 0 0 0 0 0 0 0 
0 0 0 
##$DATE= 1720001753
##$DBL= (0..7)
120 120 120 120 120 120 120 120 
##$DBP= (0..7)
150 150 150 150 150 150 150 150 
##$DBP07= 0
##$DBPNAM0= <>
##$DBPNAM1= <>
##$DBPNAM2= <>
##$DBPNAM3= <>
##$DBPNAM4= <>
##$DBPNAM5= <>
##$DBPNAM6= <>
##$DBPNAM7= <>
##$DBPOAL= (0..7)
0.5 0.5 0.5 0.5 0.5 0.5 0.5 0.5 
##$DBPOFFS= (0..7)
0 0 0 0 0 0 0 0 
##$DE= 6
##$DECBNUC= <off>
##$DECIM= 24
##$DECNUC= <off>
##$DECSTAT= 4
##$DIGMOD= 1
##$DIGTYP= 9
##$DL= (0..7)
0 120 120 120 120 120 120 120 
##$DP= (0..7)
150 150 150 150 150 150 150 150 
##$DP07= 0
##$DPNAME0= <>
##$DPNAME1= <>
##$DPNAME2= <>
##$DPNAME3= <>
##$DPNAME4= <>
##$DPNAME5= <>
##$DPNAME6= <>
##$DPNAME7= <>
##$DPOAL= (0..7)
0.5 0.5 0.5 0.5 0.5 0.5 0.5 0.5 
##$DPOFFS= (0..7)
0 0 0 0 0 0 0 0 
##$DQDMODE= 0
##$DR= 18
##$DS= 0
##$DSLIST= <SSSSSSSSSSSSSSS>
$$ [...]
##$SUBNAM2= <"">
##$SUBNAM3= <"">
##$SUBNAM4= <"">
##$SUBNAM5= <"">
##$SUBNAM6= <"">
##$SUBNAM7= <"">
##$SUBNAM8= <"">
##$SUBNAM9= <"">
##$SW= 24.0689651099613
##$SWIBOX= (0..15)
0 0 2 0 0 0 0 0 0 0 0 0 0 0 0 0 
##$SW_h= 4816.95568400771
##$TD= 16384
##$TD0= 1
##$TE= 0
##$TE2= 300
##$TE3= 300
##$TEG= 300
##$TL= (0..7)
0 120 120 120 120 120 120 120 
##$TP= (0..7)
150 150 150 150 150 150 150 150 
##$TP07= 0
##$TPNAME0= <>
##$TPNAME1= <>
##$TPNAME2= <>
##$TPNAME3= <>
##$TPNAME4= <>
##$TPNAME5= <>
##$TPNAME6= <>
##$TPNAME7= <>
##$TPOAL= (0..7)
0.5 0.5 0.5 0.5 0.5 0.5 0.5 0.5 
##$TPOFFS= (0..7)
0 0 0 0 0 0 0 0 
##$TUNHIN= 0
##$TUNHOUT= 0
##$TUNXOUT= 0
##$USERA1= <user>
##$USERA2= <user>
##$USERA3= <user>
##$USERA4= <user>
##$USERA5= <user>
##$V9= 5
##$VALIST= <valist>
##$VCLIST= <CCCCCCCCCCCCCCC>
##$VD= 0
##$VDLIST= <DDDDDDDDDDDDDDD>
##$VPLIST= <PPPPPPPPPPPPPPP>
##$VTLIST= <TTTTTTTTTTTTTTT>
##$WBST= 1024
##$WBSW= 4
##$XGAIN= (0..3)
0 0 0 0 
##$XL= 0
##$YL= 0
##$YMAX_a= 259193
##$YMIN_a= -303639
##$ZGOPTNS= <>
##$ZL1= 120
##$ZL2= 120
##$ZL3= 120
##$ZL4= 120
##$ABSF1= 10
##$ABSF2= 0
##$ABSG= 5
##$ABSL= 3
##$ALPHA= 0
##$AQORDER= 0
##$ASSFAC= 0
##$ASSFACI= 0
##$ASSFACX= 0
##$ASSWID= 0
##$AUNMP= <proc_1d>
##$AZFE= 0.1
##$AZFW= 0.1
##$BCFW= 1
##$BC_mod= 2
##$BYTORDP= 1
##$COROFFS= 0
##$CY= 11.3945322036743
##$DATMOD= 1
##$DC= 2
##$DFILT= <>
##$DTYPP= 0
##$F1P= 15.6554695791079
##$F2P= 12.8336369535428
##$FCOR= 0.5
##$FTSIZE= 0
##$FT_mod= 4
##$GAMMA= 1
##$GB= 0.15
##$INTBC= 1
##$INTSCL= 1
##$ISEN= 128
##$LB= 0.24
##$LEV0= 0
##$LPBIN= 0
##$MAXI= 10000
##$MC2= 0
##$MEAN= 0
##$ME_mod= 0
##$MI= 1.114404
##$NCOEF= 0
##$NC_proc= 0
##$NLEV= 6
##$NOISF1= 3.799351
##$NOISF2= 2.8
##$NSP= 1
##$NTH_PI= 0
##$NZP= 0
##$OFFSET= 15.70392
##$PC= 1
##$PHC0= -25498.68
##$PHC1= 11.18748
##$PH_mod= 1
##$PKNL= yes
##$PPARMOD= 0
##$PSCAL= 0
##$PSIGN= 0
##$REVERSE= no
##$SF= 200.130013532006
##$SI= 16384
##$SIGF1= 3
##$SIGF2= 2
##$SINO= 400
##$SIOLD= 16384
##$SREGLST= <1H.CDCl3>
##$SSB= 0
##$STSI= 0
##$STSR= 0
##$SW_p= 3612.71676300578
##$SYMM= 0
##$S_DEV= 0
##$TDeff= 0
##$TDoff= 0
##$TI= <>
##$TILT= no
##$TM1= 0
##$TM2= 0
##$TOPLEV= 0
##$USERP1= <user>
##$USERP2= <user>
##$USERP3= <user>
##$USERP4= <user>
##$USERP5= <user>
##$WDW= 1
##$XDIM= 8192
##$YMAX_p= 0
##$YMIN_p= 0
$$ End of Bruker specific parameters
$$ ---------------------------------
##NTUPLES= NMR FID
##VAR_NAME=  TIME,          FID/REAL,        FID/IMAG
##SYMBOL=    X,             R,               I
##VAR_TYPE=  INDEPENDENT,   DEPENDENT,       DEPENDENT
##VAR_FORM=  AFFN,          ASDF,            ASDF
##VAR_DIM=   8192,          8192,            8192
##UNITS=     SECONDS,       ARBITRARY UNITS, ARBITRARY UNITS
##FACTOR=    0.0002076,     1,               1
##FIRST=     0,             0,               0
##LAST=      1.7004516,     0,               0
##MIN=       0,             -303639,         0
##MAX=       1.7004516,     259193,          0
$$ Real data points
##PAGE= N=1
##DATA TABLE= (X++(R..R)), XYDATA
$$ plain form
0 0 0 0 0 0 0 0 0 0 -8 8 -8 8 -8 16 -16 21 -24 26 -32 40 -45 53 -61 69 -77 93 -101 117 -133 149 -167 187
32 187 -210 234 -260 292 -323 361 -400 440 -490 541 -601 663 -735 817 -908 1014 -1134 1279
50 1279 -1448 1654 -1914 2240 -2683 3302 -4239 5812 -8949 17599 -91889 -303639 -134522
63 -134522 -51445 -122564 -82120 125723 259193 215554 113756 131061 120320 -42566 -151699
74 -151699 -82879 -17069 5007 78053 189731 236352 188682 123356 87173 -11387 -133282 -134800
86 -134800 -74116 -62716 -25612 76121 150254 130925 54143 8137 -18078 -126196 -230696
97 -230696 -175463 -72952 -70739 -54601 61837 138349 68350 -38078 -45029 -38468 -143962 -220216
109 -220216 -119352 6140 10665 8459 98978 168374 93925 -30134 -42957 -15496 -80928 -122625
$$ packed form
0@%%%%%%%%qJ6j6J6j6K4l2L7m5N0n8P2q5R8j14J30j46J70j94K18k50K82l16L54
32A87l97M44m94N52o15O84p61Q40r30J031j142J264j398J552j725J922k148K413
50A279k727L102l568M154m923N985p541J0051j4761K6548j09488k11750J69117
63a34522Q3077p1119M0444K07843J33470m3639j01798J7305j0741j62886j09133
74a51699O8820O5810K2076P3046J11678M6621m7670o5326l6183r8560j21895j518
86a34800O0684J1400L7104J01733P4133j9329p6782m6006k6215j08118j04500
97b30696N5233J02511K213J6138J16438P6512o9999j06428o951O561j05494p6254
109b20216J00864J25492M525k206R0519O9396p4449j24059j2823K7461o5432m1697
$$ plain form
121 -122625 -27983 69234 85145 97566 132792 133939 70320 -7612 -31326 -39967 -74639 -51909
133 -51909 31274 63418 59377 95234 116753 57130 -28816 -54106 -42457 -76522 -110281 -43100
145 -43100 44938 36837 9583 46722 66599 -4531 -89353 -87950 -50583 -74332 -98124 -24277
157 -24277 58893 43938 5530 27505 41632 -17872 -82126 -69783 -25228 -27255 -34249 18512
169 18512 75243 66400 34605 32530 26808 -15921 -48989 -30668 -3094 -391 17362 58309 68196
182 68196 42566 32445 32834 383 -43312 -40248 -4641 -607 -12858 19469 62347 42701 -2886
195 -2886 -3560 8505 -26211 -66069 -45054 -610 -2624 -19154 9663 42809 18819 -23161 -23866
208 -23866 -10902 -32719 -56648 -31625 8323 8819 -3445 15420 33321 11908 -18521 -18134 -9115
$$ packed form
121a22625R4642R7217J5911J2421L5226J147o3619p7932k3714q641l4672K2730
133e1909Q3183L2144m041L5857K1519n9623q5946k5290J1649l4065l3759O7181
145d3100Q8038q101k7254L7139J9877p1130q4822J403L7367k3749k3792P3847
157b4277Q3170j4955l8408K1975J4127n9504o4254J2343M4555k027o994N2761
169A8512N6731q843l1795k075n722m2729l3068J8321K7574K703J7753M0947R887
182F8196k5630j0121L89l2451m3695L064L5607M034j2251L2327M2878j9646m5587
195b886o74J2065l4716l9858K1015M4444k014j6530K8817L3146k3990m1980p05
208b3866J2964k1817k3929K5023L9948M96j2264J8865J7901k1413l0429L87R019
$$ plain form
221 -9115 -20353 -25174 -698 22277 19837 18101 29854 27086 3200 -9985 -2926 -4876 -16591
234 -16591 -4302 24348 25985 11295 18723 31380 13111 -16790 -16171 1115 -6354 -21662 -3274
247 -3274 24577 18084 -1860 4196 14838 -4432 -29947 -24628 -5837 -8957 -18188 -2493 16178
260 16178 8591 -5440 -1971 2001 -12061 -26544 -18682 -4346 -4684 -5226 8454 16661 7011 -750
274 -750 2689 632 -11040 -13942 -2127 5560 1213 5604 19901 19125 5391 2368 6635 237 -12145
289 -12145 -7919 8408 10421 1019 6585 19473 12682 -2767 -3363 2177 -4952 -15320 -9161 6016
303 6016 6121 -2123 2799 10673 2056 -9983 -9531 -5594 -9806 -13927 -6741 3351 2250 -1421 3263
318 3263 5703 -2183 -9266 -8233 -6542 -7864 -6656 866 7044 4552 3504 7383 6390 -1380 -5089
$$ packed form
221i115j1238m821K4476K2975k440j736J1753k768k3886j3185P059j950j1715
234a6591J2289K8650J637j4690P428J2657j8269k9901O19J7286p469j5308J8388
247c274K7851o493j9944O056J0642j9270k5515N319J8791l120r231J5695J8671
260A6178p587j4031L469L972j4062j4483P862J4336l38n42J3680Q207r650p761
274g50L439k057j1672k902J1815P687m347M391J4297p76j3734l023M267o398j2382
289a2145M226J6327K013r402N566J2888o791j5449n96N540p129j0368O159J5177
303F016J05q244M922P874q617j2039M52L937m212m121P186J0092j101l671M684
318C263K440p886p083J033J691j322J208P522O178k492j048L879r93p770l709
$$ plain form
333 -5089 -3202 -1535 -2144 -108 6923 10567 6965 5619 8284 5290 -2620 -5183 -2460 86 -526 665
349 665 6650 8719 3756 2159 3257 -541 -6349 -7689 -5322 -2466 -2202 -708 3516 4457 466 -1205
365 -1205 -2070 -5859 -7809 -7199 -5312 -2026 -320 264 2752 3616 1391 -647 -2964 -4999 -5062 -3937 -1704
382 -1704 2836 4275 2967 4734 5845 2715 -548 -1395 -1321 -2074 -2140 1716 5785 4722 3467 6354 5664
399 5664 -346 -3293 -1554 -1124 -2686 -1946 2668 4462 1415 928 4355 1874 -4441 -6154 -3737 -2492
415 -2492 -3438 -2475 1877 3623 -429 -1609 1431 -305 -5578 -6416 -2486 -628 -2491 -1497 3925 4257
431 4257 -1001 -627 3114 -896 -6201 -2566 2944 1396 -2024 2105 7652 3103 -3101 1888 6014
446 6014 -2452 -7132 1393 6683 462 -3720 3716 8924 484 -5853 1589 4829 -3797 -7412 1585
$$ packed form
333e089J887J667o09K036P031L644l602j346K665k994p910k563K723K546o12J191
349F65N985K069m963j597J098l798n808j340K367K856K64J494M224R41l991j671
365a205q65l789j950O10J887L286J706N84K488Q64k225k038k317k035o3J125K233
382a704M540J439j308J767J111l130l263q47P4p53o6L856M069j063j255K887o90
399E664o010k947J739M30j562P40M614J794l047m87L427k481o315j713K417J245
415b492r46R63M352J746m052j180L040j736n273q38L930J858j863R94N422L32
431D257n258L74L741m010n305L635N510j548l420M129N547m549o204M989M126
446F014q466m680Q525N290o221m182P436N208q440o337P442L240q626l615Q997
$$ plain form
461 1585 6406 -613 -5453 1684 5997 -1990 -7433 -16 2997 -4525 -5496 2104 4469 -2069 -4539
476 -4539 2057 3284 -4789 -5139 2408 1860 -4797 -1788 5625 2831 -4681 -2010 5866 1807 -7337 -1961
492 -1961 7508 1647 -5493 1876 9191 1047 -8319 -914 9241 661 -9455 492 11122 1398
506 1398 -7828 1301 9508 -884 -10657 -1038 9004 -350 -9084 1082 9698 265 -7230 -433
520 -433 4362 -2958 -7595 -90 4861 -2191 -3729 4618 4353 -3548 -3168 2159 -931 -7435 -2764 6193
536 6193 2344 -6040 720 10488 1908 -9516 -2566 7360 -687 -11280 -1228 13122 4593 -9022
550 -9022 996 13918 1694 -13509 -4909 8482 949 -10825 -411 14092 5320 -7691 285
563 285 9337 -1459 -12426 -4659 5081 -167 -5118 3295 9380 1204 -3336 2070 1003 -8345 -7581
$$ packed form
461A585M821p019m840P137M313p987n443P417L013p522r71P600K365o538k470
476d539O596J227q073l50P547n48o657L009P413k794p512K671P876m059r144N376
492a961R469n861p140P369P315q144r366P405J0155q580j0116R947J0630r724
506A398r226R129Q207j0392r773R619J0042r354q734J0166Q616r433p495O797
520d33M795p320m637P505M951p052j538Q347k65p901L80N327l090o504M671Q957
536F193l849q384O760R768q580j1424O950R926q047j0593J0052J4350q529j3615
550i022J0018J2922j2224j5203Q600J3391p533j1774J0414J4503q772j3011P976
563B85R052j0796j0967P767R740n248m951Q413O085q176m540N406j067r348P64
$$ plain form
578 -7581 986 1134 -3971 915 10455 5733 -5563 -1390 6449 -3048 -15063 -6010 8810 3695 -7469
593 -7469 2337 16974 6257 -11585 -4735 8117 -2248 -17080 -6466 13600 8438 -6534 1565
606 1565 16266 5659 -12423 -8159 3802 -1802 -12225 -3450 11550 8730 -827 3406 8300 -875
620 -875 -9098 -6081 -3637 -6396 -3413 6081 8562 1804 3015 10083 1206 -13171 -8680 1545 -4289
635 -4289 -12009 -356 16805 11296 -5396 185 13591 435 -19877 -12152 4972 1485 -9658
648 -9658 -307 18993 14551 -5429 -3529 8419 -1776 -17544 -12128 2668 4547 -1638 2967 15507
662 15507 11676 -3274 -3910 577 -7667 -13324 -6824 813 3622 4736 9526 11585 2879 -3322 345
677 345 -5549 -16644 -9875 3747 2958 -1443 6478 17687 10579 -8876 -8760 5090 -5060 -22254
$$ packed form
578g581Q567J48n105M886R540m722j1296M173P839r497j2015R053J4820n115j1164
593g469R806J4637j0717j7842O850J2852j0365j4832J0614K0066n162j4972Q099
606A565J4701j0607j8082M264J1961n604j0423Q775J5000k820r557M233M894r175
620h75q223L017K444k759K983R494K481o758J211P068q877j4377M491J0225n834
635d289p720J1653J7161n509j6692N581J3406j3156k0312P725J7124l487j1143
648i658R351J9300m442j9980J900J1948j0195j5768N416J4796J879o185M605J2540
662A5507l831j4950o36M487q244n657O500P637K809J114M790K059q706o201L667
677C45n894j1095O769J3622p89m401P921J1209p108j9455J16J3850j0150j7194
$$ plain form
691 -22254 -9585 11959 10039 -1799 3121 18009 11629 -12556 -14103 1315 -3659 -15897 -6158
704 -6158 10411 12529 4849 3136 9768 5401 -9813 -11309 -4553 -7183 -7112 2950 8713 9081 7763
719 7763 5974 3790 -4496 -11238 -6212 -4676 -10663 -2799 11832 10363 3225 5109 9010 2522 -13801
734 -13801 -15292 -143 -281 -11500 -1535 17570 14190 -777 -2162 7632 3436 -16619 -17976 1089
748 1089 4476 -5515 1020 14948 13837 1887 -4310 -623 -1159 -12130 -12583 -728 2985 1921 7818
763 7818 10750 6112 1632 -1497 -4282 -9087 -10987 -3634 2739 14 3936 13114 9517 -804 -3117
778 -3117 -469 -3732 -12896 -11442 3430 7725 -1025 3064 14862 9014 -5675 -7988 -1084 -2201
792 -2201 -12201 -10343 6327 11416 1776 1951 9933 6419 -5270 -9815 -4859 -2411 -6775 -4603 5822
$$ packed form
691b2254J2669K1544j920j1838M920J4888o380k4185j547J5418m974j2238R739
704f158J6569K118p680j713O632m367j5214j496O756k630P1J0062N763L68j318
719G763j789k184q286o742N026J536n987P864J4631j469p138J884L901o488j6323
734a3801j491J5149j38j1219R965J9105l380j4967j385R794m196k0055j357J9065
748A089L387r991O535J3928j111j1950o197L687n36j0971m53J1855L713j064N897
763G818K932m638m480l129k785m805j900P353O373k725L922R178l597j0321k313
778c117K648l263r164J454J4872M295q750M089J1798n848j4689k313O904j117
792b201j0000J858J6670N089r640J75P982l514j1689m545M956K448m364K172J0425
$$ plain form
807 5822 9057 5277 5012 4292 -899 -5434 -6282 -5401 -5338 -3828 3482 8369 4194 2792 6889 3447 -6460
824 -6460 -8820 -3461 -2248 -6003 -2795 8602 10744 1880 -525 5109 1803 -8519 -10362 -2180 989
839 989 -3722 -1235 9630 11024 1008 -2241 1521 -583 -8307 -9519 -1822 3216 829 1488 7304
854 7304 7395 1044 -2225 -1948 -4238 -6874 -5048 -345 1942 3047 6612 7332 1478 -2169 -935 -2419
870 -2419 -7463 -7335 -672 3633 1839 1990 7234 7239 -1148 -4903 -2140 -2211 -6661 -6193 1459 5980 3353
887 3353 2462 5807 4156 -2670 -5821 -3315 -2849 -5016 -3285 3178 6632 3683 2287 4079 1442 -3882
903 -3882 -6012 -4114 -2905 -2446 236 4799 5844 3525 2738 1633 -2460 -5060 -4200 -3490 -3436 -1105 3894
920 3894 6502 4219 1662 2285 393 -5150 -6537 -3179 -936 -1266 20 4784 7020 3225 -213 308
$$ packed form
807E822L235l780k65p20n191m535q48Q81O3J510P310M887m175j402M097l442r907
824f460k360N359J213l755L208J1397K142q864k405N634l306j0322j843Q182L169
839I89m711K487J0865J394j0016l249L762k104p724j212P697N038k387O59N816
854G304R1o351l269K77k290k636J826M703K287J105L565P20n854l647J234j484
870b419n044J28O663M305j794J51N244Nq387l755K763p1m450M68P652M521k627
887C353q91L345j651o826l151K506M66k167J731O463L454k949j396J792k637n324
903c882k130J898J209M59K682M563J045k319p87j105m093k600Q60P10N4K331M999
920C894K608k283k557O23j892n543j387L358K243l30J286M764K236l795l438N21
$$ plain form
936 308 -1002 -5381 -6504 -3073 417 1368 2519 5479 5598 1541 -1396 -1463 -2855 -5151 -4690 -1757 1038
953 1038 2661 4093 5253 3630 97 -2185 -3089 -4656 -4577 -2135 444 2223 3581 4620 4319 1458
969 1458 -1603 -2662 -3406 -4971 -4008 -637 2700 4069 3713 3694 3133 -489 -3608 -3772 -3057 -3336 -2440 570
987 570 3861 4632 3659 2371 1043 -1431 -3893 -4263 -3548 -2170 165 2385 4139 4391 2769 685 -970
1004 -970 -2747 -4126 -4069 -2477 -18 1852 3515 4440 3815 1412 -726 -2250 -3788 -4235 -2999 -662
1020 -662 1619 2769 3727 4077 2247 -483 -1999 -2480 -3676 -3764 -1927 700 3027 3535 3544 3237 859 -2261
1038 -2261 -3202 -2948 -2716 -2172 -674 2236 3937 3096 2265 2216 -103 -3466 -4120 -2925 -1948 -1270 1073 3956
1056 3956 4243 2032 1098 604 -1594 -3668 -3373 -2189 -1465 -37 2361 4095 3481 1390 29 -1254
$$ packed form
936C08j310m379j123L431L490R51J151K960J19m057k937o7j392k296M61K933K795
953A038J623J432J160j623l533k282r04j567P9K442K579J779J358J039l01k861
969A458l061j059p44j565R63L371L337J369l56j9n61l622l119j64P15k79Q96L010
987E70L291P71r73j288j328k474k462l70P15J378K335K220J754K52j622k084j655
1004i70j777j379N7J592K459J870J663R25o25k403k138j524j538m47J236K337
1020f62K281J150R58L50j830k730j516m81j196q8J837K627K327N08Rl07k378l120
1038b261r41K54K32N44J498K910J701q41q31m9k319l363o54J195R77O78K343K883
1056C956K87k211r34m94k198k074K95J184P24J428K398J734o14k091j361j283
$$ plain form
1072 -1254 -3131 -3585 -2125 -1100 -142 1634 3400 3737 1895 404 -9 -1652 -4074 -3510 -832 268
1088 268 576 2051 3972 3410 238 -1567 -674 -1557 -3834 -3102 -35 1551 1264 1850 3786 2458 -890
1105 -890 -2354 -1378 -2013 -3184 -1633 1057 2145 2052 2532 2547 572 -1642 -1818 -1494 -2768 -2726 390 1947
1123 1947 1257 1778 3296 2108 -1689 -2921 -604 -872 -3427 -1929 2723 3527 427 279 2823 1887
1139 1887 -2519 -3963 -135 354 -2983 -1836 3128 4118 1040 -370 1162 785 -2404 -3280 -701 250
1155 250 -952 -336 2274 2888 1047 219 -113 -743 -2486 -1810 -353 -842 -259 2210 2671 357 -140 1030
1173 1030 611 -2102 -2953 -26 1196 -1413 -1226 3264 3842 -734 -2216 695 1478 -2500 -3574 745
1189 745 2491 -924 -1632 2212 3517 -309 -2676 -169 1174 -1439 -2952 542 2186 110 -213 1377
$$ packed form
1072a254j877m54J460J025R58J776J766L37j842j491m13j643k422N64K678J100
1088B68L08J475J921n62l172j805Q93q83k277P32L067J586k87N86J936j328l348
1105h90j464R76o35j171J551K690J088r3M80J5j975k214j76L24j274M2L116J557
1123A947o90N21J518j188l797j232K317k68k555J498M652Q04l100j48K544r36
1139A887m406j444L828M89l337J147M964R90l078j410J532l77l189q76K579R51
1155B50j202O16K610O14j841q28l32o30j743O76J457m89N83K469M61k314m97J170
1173A030m19k713q51K927J222k609J87M490N78m576j482K911P83l978j074M319
1189G45J746l415p08L844J305l826k367K507J343k613j513L494J644k076l23J590
$$ plain form
1205 1377 1337 -554 -1155 -376 -94 -1085 -493 684 26 -2 1571 1429 -1298 -1528 672 918 -1929 -2152
1223 -2152 1703 2306 -1268 -1756 2282 2359 -2287 -3143 1441 2845 -1774 -3358 1868 3898 -928 -3105
1239 -3105 1102 2944 -1223 -3161 213 2902 -128 -2268 230 2216 64 -1604 -513 984 170
1254 170 -905 -152 751 -34 533 772 -371 -1122 244 353 -959 -1175 1423 2200 -976 -2077 1269
1271 1269 2391 -1571 -3117 728 2333 -1259 -2634 1703 3812 -930 -3110 1130 2377 -1758 -3687
1286 -3687 428 3079 -156 -2555 881 3491 27 -2674 -126 1199 -748 -2179 -423 1776 1607
1301 1607 -265 495 1047 -127 -248 -620 -1382 -1026 644 550 -183 -148 1695 2718 -964 -2813 884 1528
1319 1528 -2833 -3020 1626 3164 30 -2004 1455 3681 -1108 -3964 41 1726 -1805 -2826 1073
$$ packed form
1205A377m0j891o01P79K82r91N92J177o58k8J573j42k727k30K200K46k847k23
1223b152L855O03l574m88M038P7m646q56M584J404m619j584N226K030m826k177
1239c105M207J842m167j938L374K689l030k140K498J986k152j668J091J497q14
1254A70j075P53R03p85N67K39j143p51J366J09j312k16K598P77l176j101L346
1271A269J122l962j546L845J605l592j375M337K109m742k180M240J247m135j929
1286c687M115K651l235k399L436K610l464k701K548J325j947j431J756K199j69
1301A607j872P60N52j174j21l72p62L56J670r4p33L5J843J023l682j849L697O44
1319A528m361j87M646J538l134k034L459K226m789k856M005J685l531j021L899
$$ plain form
1334 1073 3467 1048 -1798 655 2651 -941 -3537 -959 777 -365 -734 335 2166 2017 -542
1349 -542 -275 861 -1150 -1660 -625 -990 -54 1547 1379 602 238 878 1037 -1374 -3228 93 1498
1366 1498 -2132 -1800 2223 3508 533 -2055 386 2576 -1555 -4860 -474 2621 -323 -1438 1400
1381 1400 3200 1070 -2390 -938 1543 -1115 -3566 -719 1699 654 383 1189 1902 782 -1404 -1365
1397 -1365 17 -1233 -1681 499 716 589 1477 1417 371 -290 -657 -360 -1358 -2729 142 2365 116
1414 116 -621 2364 2364 -585 -2298 -806 760 -1379 -3343 399 3431 839 -934 989 2000 164
1430 164 -2762 -2038 789 112 -1761 408 2400 1371 83 -68 215 -99 -1652 -1802 -112 -34 -273
1447 -273 1342 1406 542 742 254 -1025 -1451 -1088 -427 -344 -578 969 2295 589 -775 668 857 -1466
$$ packed form
1334A073K394k419k846K453J996l592k596K578J736j142l69J069J831j49k559
1349e42K67J136k011n10J035l65R36J601j68p77l64O40J59k411j854L321J405
1366A498l630L32M023J285k975k588K441K190m131l305M386L095k944j115K838
1381A400J800k130l460J452K481k658k451K847K418j045k71Q06P13j120k186L9
1397a365J382j250m48K180K17j27Q88o0j046o61l67K97r98j371K871K223k249
1414A16p37K985%k949j713J492J566k139j964L742L032k592j773J923J011j836
1430A64k926P24K827o77j873K169J992j029j288j51K83l14j553j50J690P8k39
1447b73J615O4q64K00m88j279m26L63O61Q3k34J547J326j706j364J443J89k323
$$ plain form
1465 -1466 -2515 -817 1009 202 -1000 1291 3020 517 -1337 -188 519 -707 -2351 -1146 1558
1480 1558 1074 -236 815 2183 354 -1090 -879 -523 -901 -1242 -391 1035 1157 630 1309 673 -753
1497 -753 -807 -610 -1300 -1265 -467 1026 1539 557 823 1575 -105 -1681 -1088 -274 -927 -1343 -43 1852 1570
1516 1570 -13 649 1214 -524 -1929 -1220 -386 -371 -903 550 2317 1378 -106 193 363 -1078 -1998 -1175
1534 -1175 -535 343 210 887 2035 1336 37 -238 -785 -1597 -1372 -1043 -447 375 1035 1828 1519 26 -36
1553 -36 -268 -1250 -1760 -1123 -359 331 912 1259 2046 1034 -579 -873 -525 -1680 -1660 -862 327 1084 1149 1604
1573 1604 1865 697 -1007 -1052 -1024 -1739 -1379 -86 954 1758 1495 1370 1359 -238 -1367 -1588 -1402 -1243 -470
1592 -470 185 1186 2032 1776 738 -30 -838 -1369 -1409 -1645 -949 381 1102 1613 1776 1208 679 -589 -1618
$$ packed form
1465a466j049J698J826q07j202K291J729k503j854J149P07j226j644J205K704
1480A558m84j310J051J368j829j444K11L56l78l41Q51J426J22n27O79o36j426
1497g53n4J97o90L5P98J493N13r82K66P52j680j576N93Q14o53m16J300J895k82
1516A570j583O62N65j738j405P09Q34J5n32J453J767r39j484K99J70j441r20Q23
1534a175O40Q78j33O77J148o99j299k75n47q12K25L29N96Q22O60P93l09j493o2
1553c6k32r82n10O37P64O90N81L47P87j012j613k94L48j155K0P98J189P57O5M55
1573A604K61j168j704m5K8p15L60J293J040Q04k63j25j1j597j129k21J86J59P73
1592d70O55J001Q46k56j038p68q08n31m0k36O96J330P21N11J63n68n29j268j029
$$ plain form
1611 -1618 -1756 -1338 -1059 -381 534 1652 2124 1464 475 -20 -801 -1876 -2001 -1318 -328 601 1253 2004 1843
1630 1843 812 -110 -842 -1346 -1806 -1539 -710 122 1225 1864 1715 1500 385 -637 -1405 -1755 -1417 -1151
1648 -1151 -312 773 1997 1760 1204 713 -129 -1402 -1649 -1640 -1130 -438 622 1633 1872 1400 844 65 -1023
1667 -1023 -1612 -1504 -1209 -790 74 1295 2176 1365 1052 262 -507 -1650 -1827 -1335 -796 -145 686 1982 2209
1686 2209 1127 315 -330 -885 -1729 -1777 -993 165 641 1111 1739 1693 631 -356 -811 -1298 -1714 -1386 -489
1705 -489 716 1338 1435 1528 979 -336 -858 -1081 -1570 -1244 -503 787 821 1147 1703 1248 15 -1354 -1140
1724 -1140 -1086 -1419 -1234 335 1389 1366 861 1206 1287 -570 -1752 -1465 -743 -793 -538 789 1783 1500 754
1743 754 619 4 -1048 -1548 -1384 -959 -472 509 1349 1508 1134 624 -141 -989 -1759 -1260 -672 -710 22 1147
$$ packed form
1611a618j38M18K79O78R15J118M72o60r89m95p81j075j25O83R90R29O52P51j61
1630A843j031r22p32n04m60K67Q29Q32J103O39j49k15j115j022p68l50L38K66
1648a151Q39J085J224k37n56m91q42j273k47RN10O92J060J011K39m72n56p79j088
1667a023n89J08K95M19Q64J221Q81q11l13p90p69j143j77M92N39O51Q31J296K27
1686B209j082q12o45n55q44m8P84J158M76M70O28m6j062r87m55m87m16L28Q97
1705d89J205O22R7R3n49j315n22k23m89L26P41J290L4L26N56m55j233j369K14
1724a140N4l33J85J569J054k3n05L45Q1j857j182K87P22n0K55J327R94k83p46
1743G54j35o15j052n00J64M25M87R81Q40J59l74n10p65q48p70M99N88l8P32J125
$$ plain form
1763 1147 1825 1276 425 191 -310 -1340 -2204 -1207 151 28 424 1357 1949 1074 -329 -502 -346 -1415
1781 -1415 -1960 -713 964 662 710 1645 1707 605 -1049 -1290 -799 -1389 -1253 -141 855 1258 1480 1407 526
1800 526 -394 -835 -917 -1438 -1460 -202 857 808 600 1530 1513 -66 -1465 -1362 -601 -1092 -1399 88 1810
1819 1810 1124 558 890 1012 -311 -2104 -1605 -451 -307 -995 408 1921 1764 547 372 217 -749 -1641
1837 -1641 -1638 -315 26 118 890 1553 1412 573 160 -765 -1240 -1526 -917 -468 -30 1053 1752 993 191 337
1857 337 20 -1404 -1884 -1046 235 74 -422 992 2434 1036 -571 -497 30 -1018 -1926 -1052 975 872
1875 872 7 677 1605 845 -772 -1240 -703 -499 -1181 -968 419 1321 861 997 706 216 -412 -996 -1194
1894 -1194 -1011 -173 82 410 664 881 1412 255 -1008 -633 -386 -1033 -1243 -74 1447 891 -9 762
$$ packed form
1763A147O78n49q51k34n01j030q64R97J358j23L96R33N92q75j403j73J56j069
1781a415n45J247J677l02M8R35O2j102j654k41M91n90J36J112R96M03K22p3q81
1800E26r20m41q2n21k2J258J059m9k08R30j7j579j399J03P61m91l07J487J722
1819A810o86n66L32J22j323j793M99J154J44o88J403J513j57j217j75j55r66q92
1837a641LJ323L41R2P72O63j41q39m13r25m75k86O09M49M38J083O99p59q02J46
1857C37l17j424m80Q38J281j61m96J414J442j398j607P4N27j048r08Q74K027j03
1875H72q65O70R28p60j617m68N37K04o82K13J387R02m60J36k91m90o28n84j98
1894a194J83Q38K55L28K54K17N31j157j263L75K47o47k10J169J521n56r00P71
$$ plain form
1912 762 1465 -225 -1839 -1064 207 -258 -1123 -141 1613 1360 -193 -77 985 296 -1510 -1656 -82
1929 -82 470 -99 24 989 1253 565 -210 -436 -274 -532 -734 -737 76 491 1145 769 137 365 235 -980 -1321
1950 -1321 -610 237 14 -509 468 1520 720 -357 -100 304 -442 -1531 -733 609 421 -300 414 1407
1968 1407 700 -665 -603 78 -202 -1102 -965 241 1254 74 114 773 660 -522 -904 -376 -417 -118 -394
1987 -394 321 795 753 499 266 -404 -195 -60 -728 -950 118 738 419 -28 181 1227 322 -1397 -807
2006 -807 78 -344 -704 -273 629 1052 21 -270 923 287 -1237 -907 158 -12 -422 -95 672 1188 70
2025 70 -506 360 -34 -876 -650 -186 95 303 3 254 1118 197 -115 -189 -871 -486 33 -606 -376 708
2045 708 979 346 -137 -196 468 -87 -1406 -907 551 204 -167 363 1120 1060 -154 -775 2 35 -914 -648
$$ packed form
1912G62P03j690j614P75J271m65q65R82J754k53j553J16J062o89j806j46J574
1929h2N52n69J23R65K64o88p75k26J62k58k02lQ13M15O54l76o32K28j30j215l41
1950a321P11Q47k23n23R77J052q00j077K57M04p46j089P98J342j88p21P14R93
1968A407p07j365O2O81k80r00J37J206J013j180M0O59j13j182l82N28m1K99k76
1987c94P15M74m2k54k33o70K09J35o68k22J068O20l19m47K09J046r05j719N90
2006h07Q85m22l60M31R02M23j031k91J193o36j524L30J065j70m10L27P67N16j118
2025G0n76Q66l94q42K26M64K81K08l00K51Q64r21l12p4o82L85N19o39K30J084
2045G08K71o33m83n9O64n55j319M99J458l47l71N30P57o0j214o21P77L3r49K66
$$ plain form
2065 -648 202 367 183 292 580 953 -68 -835 -271 -404 -656 -209 258 344 570 494 154 429 -262 -731
2085 -731 -235 -462 -162 111 126 238 689 596 10 14 -538 -75 -238 -1033 -358 1035 458 -186 326 889 425
2106 425 -417 -1067 -296 182 -678 -273 545 732 307 182 -13 174 -292 -883 -560 -121 -345 110 453 236
2126 236 463 538 -75 133 -574 -796 -193 -220 -214 298 587 209 221 91 -165 -149 -359 -569 -293 -488 117 794
2148 794 487 146 237 217 -286 -668 -679 149 103 -500 -64 679 581 266 -35 12 -25 -344 -661 -277 59 27 88
2171 88 336 470 271 9 -224 -138 -426 -749 -159 -87 331 340 496 358 261 -273 -223 -187 -477 -349 191 -59 9
2194 9 447 300 180 231 115 -189 -327 -563 -332 12 18 317 633 390 250 -4 -165 -58 -382 -559 -80 306
2216 306 237 459 573 413 334 -374 -367 -150 -529 -419 -23 251 217 369 139 64 314 -65 -269 -186 -281 -254 114
$$ packed form
2065f48Q50J65j84J09K88L73j021p67N64j33k52M47M67Q6K26p6l40K75o91m69
2085g31M96k27L00K73J5J12M51r3n86Mn52M63j63p95O75J393n77o44N12N63m64
2106D25q42o50P71M78q60M05Q18J87m25j25j95J87m66n91L23M39k24M55L43k17
2126B36K27P5o13K08p07k22O03k7ON12K89l78J2j30k56J6k10k10K76j95O05O77
2148G94l07l41R1k0n03l82j1Q28m6o03M36P43r8l15l01M7l7l19l17L84L36l2O1
2171H8K48J34j99k62k33Q6k88l23N90P2M18RJ56j38r7n34N0L6k90J28N40k50O8
2194IM38j47j20N1j16l04j38k36K31L44OK99L16k43j40k54j61J07l24j77M79L86
2216C06o9K22J14j60p9p08PK17l79J10L96K74l4J52k30p5K50l79k04Q3r5K7L68
$$ plain form
2239 114 121 429 447 334 294 -127 -253 -365 -160 -312 -78 49 123 315 526 261 45 7 -338 -176 -198 -430
2261 -430 123 448 258 205 161 229 123 -142 -436 -171 -119 -331 22 266 426 363 -74 -60 141 -106 -317 -166
2283 -166 -244 13 100 220 179 413 63 115 11 -396 -513 -252 -16 -79 428 130 323 423 -14 178 0 -422
2305 -422 -295 -276 -178 61 373 339 351 238 -27 -194 -283 -525 -371 -24 -146 28 559 425 132 35 143 -143
2327 -143 -290 -664 -141 -27 154 242 328 433 245 -202 -133 -129 -185 -469 -240 0 171 469 414 320 7 -172 -148
2350 -148 -319 -437 -225 29 63 68 425 554 95 -166 -243 -213 -252 -467 -161 510 493 128 235 502 149 -470
2372 -470 -274 -165 -152 -461 -13 513 394 277 127 157 236 -215 -530 -263 -85 285 127 286 189 259 194 -287
2394 -287 -246 -443 -360 -444 -357 171 317 387 36 79 91 -77 -614 -432 45 139 -228 119 578 228 -32 -116 136
$$ packed form
2239A14PL08J8j13m0m21j26j12K05j52K34J27P4J92K11k65k16l8l45J62k2k32
2261d30N53L25j90n3m4O8j06k65k94K65N2k12L53K44J60o3m37J4K01k47k11J51
2283a66p8K57Q7J20m1K34l50N2j04m07j17K61K36o3N07k98J93J00m37J92j78m22
2305d22J27J9R8K39L12l4J2j13k65j67q9k42J54L47j22J74N31j34k93r7J08k86
2327a43j47l74N23J14J81Q8Q6J05j88m47O9Mn6k84K29K40J71K98n5r4l13j79K4
2350a48j71j18K12K54L4NL57J29m59k61p7L0l9k15L06O71j7l65J07K67l53o19
2372d70J96J09J3l09M48N26j19j17j50L0P9m51l15K67J78L70j58J59r7P0o5m81
2394b87M1j97Q3q4Q7N28J46P0l51M3J2j68n37J82M77R4l67L47M59l50k60q4K52
$$ plain form
2417 136 -129 -598 -413 -92 214 307 287 465 137 1 -233 -68 -64 -263 -88 -27 191 283 267 384 -83 -119 -49
2440 -49 -378 -424 -88 260 134 -22 155 451 45 -165 -153 -171 -436 -460 -181 343 410 134 170 480 45 -313
2462 -313 -469 -386 64 -155 -247 329 655 239 7 -6 154 -208 -607 -203 -80 -77 92 337 385 220 103 -133
2484 -133 -414 -370 -146 -279 -36 304 436 492 74 136 194 -169 -532 -456 7 5 -21 150 511 712 -144 -447 59
2507 59 -68 -379 -530 -122 431 -39 39 360 511 -188 -294 -461 -70 -345 -353 -234 225 371 180 90 66 170
2529 170 -161 -204 -307 -195 -23 82 150 263 378 294 -397 -255 -57 -157 -647 -409 483 460 268 -35 292
2550 292 384 -436 -540 -275 -170 -326 -351 360 544 312 -53 153 301 -396 -695 -218 -83 -79 211 161 539 382
2572 382 -51 -211 -48 -257 -332 -346 -402 179 222 355 90 142 300 9 -311 -280 -64 6 -98 -46 593 553 224
$$ packed form
2417A36k65m69J85L21L06R3k0J78l28j36k34J65Mj99J75O1K18R2j6J17m67l6P0
2440d9l29m6L36L48j26j56J77K96m06k10J2j8k65k4K79N24O7k76L6L10m35l58
2462c13j56Q3M50k19r2N76L26m16k32j3J60l62l99M04J23LJ69K45M8j65j17k36
2484a33k81M4K24j33K43L40J32N6m18O2N8l63l63P6M63kk6J71L61K01q56l03N06
2507E9j27l11j51M08N53m70P8L21J51o99j06j67L91k75qJ19M59J46j91r0k4J04
2529A70l31m3j03J12J72J05O8J13J15q4o91J42J98j00m90K38Q92k3j92l03L27
2550B92R2q20j04K65J05j56k5P11J84k32l65K06J48o97k99M77J35MK90n0L78j57
2572C82m33j60J63k09p5j4n6N81M3J33k65N2J58k91l20L1K16P0j04N2O39m0l29
$$ plain form
2595 224 -225 60 101 -412 -620 -109 348 -67 -94 442 803 184 -167 -225 18 -315 -665 -188 241 482 262
2616 262 247 434 166 -102 -491 -413 -363 -98 -143 152 411 451 62 -122 -172 -19 -317 -480 -224 203 153 150 222
2639 222 54 507 -65 -306 -30 -159 -438 -299 199 388 203 65 230 267 -160 -633 -234 39 -298 -239 72
2660 72 198 465 182 -39 -24 -90 -430 -398 -199 -19 155 20 279 410 85 -151 -200 -182 -153 -134 -475 35 478
2683 478 304 84 39 -91 67 -382 -421 -172 90 -166 208 337 431 143 -49 -294 119 -329 -479 -216 150
2704 150 -86 297 306 125 214 49 -124 80 -166 -592 55 315 287 223 117 209 245 -219 -513 -40 75 -51
2726 -51 375 154 310 322 -103 -490 -53 -220 -239 -496 -393 257 481 -11 140 342 115 -207 -206 -400 -224 107
2748 107 -23 -69 239 -11 75 0 -187 -183 -558 -311 -16 178 -20 118 251 197 -30 -4 -109 -47 -207 -273 81
$$ packed form
2595B24m49K85M1n13k08N11M57m15k7N36L61o19l51n8K43l33l50M77M29K41k20
2616B62j5J87k68k68l89P8N0K65m5K95K59M0l89j84n0J53k98j63K56M27n0lP2
2639B22j68M53n72k41K76j29k79J39M98J89j85j38J65L7m27m73L99K73l37N9L11
2660G2J26K67k83k21J5o6l40L2J99J80J74j35K59J31l25k36m9J8K9J9l41N10M43
2683D78j74k20m5j30J58m49l9K49K62k56L74J29R4k88j92k45M13m48j50K63L66
2704A50k36L83Rj81Q9j65j73K04k46m26O47K60k8o4j06R2L6m64k94M73J15j26
2726e1M26k21J56J2m25l87M37j67j9k57J03O50K24m92J51K02k27l22Jj94J76L31
2748A07j30m6L08k50Q6p5j87Ml75K47K95J94j98J38J33n4k27K6j05O2j60o6L54
$$ plain form
2771 81 349 272 299 -21 77 16 -154 -328 31 150 3 52 197 328 274 -106 -353 -25 -127 -200 -237 -72 228
2794 228 244 43 111 338 55 -182 -118 -14 -214 42 -14 59 397 184 133 -129 -171 -186 -112 -75 -80 184 -103 181
2818 181 180 180 -55 -83 -121 178 -263 3 54 160 47 163 157 -97 -103 -329 -194 -64 9 -94 -38 136 281 153
2842 153 -241 86 117 -324 -301 -61 -80 316 95 -118 422 -48 -138 -329 -93 -288 -10 -54 -75 294 159 4
2864 4 186 -111 -257 -186 -187 -41 16 -130 197 221 95 -67 -60 -285 -239 -129 -185 -46 196 130 143 310 23 129
2888 129 -146 -355 -118 -12 -129 76 93 228 193 -46 -1 14 -65 -325 -214 55 34 39 117 118 132 -89 -181 -153 -10
2913 -10 -70 -29 -28 59 166 167 113 -89 -70 -231 -102 45 -139 177 -199 52 158 143 -64 112 -247 -178 -76 -46
2937 -46 104 95 119 95 229 8 -110 -188 -134 -108 77 -48 124 -11 112 -30 47 -127 115 63 -245 -108 -73 -4
$$ packed form
2771H1K68p7K7l20R8o1j70j74L59J19j47M9J45J31n4l80k47L28j02p3l7J65L00
2794B28J6k01O8K27k83k37O4J04k00K56n6P3L38k13n1k62m2j5P4L7nK64k87K84
2818A81j%k35k8l8K99m41K66N1J06j13J16ok54ok26J35J30P3j03N6J74J45j28
2842A53l94L27L1m41K3K40j9L96k21k13N40m70r0j91K36j95K78m4k1L69j35j55
2864DJ82k97j46P1jJ46N7j46L27K4j26j62Pk25M6J10n6J39K42o6J3J67k87J06
2888A29k75k09K37J06j17K05J7J35l5k39M5J5p9k60J11K69k1NP8JJ4k21r2K8J43
2913a0o0M1JQ7J07Jn4k02J9j61J29J47j84L16l76K51J06j5k07J76l59O9J02L0
2937d6J50rK4k4J34k21j18p8N4K6J85j25J72j35J23j42P7j74K42n2l08J37L5O9
$$ plain form
2961 -4 -1 71 238 144 -139 -26 -54 2 -132 -32 248 -98 120 -34 104 7 -220 -78 -50 -289 -69 -91 184 135
2985 135 128 105 337 61 -147 -22 37 -91 -25 82 275 32 21 -11 -5 -251 -176 -237 -70 141 -39 57 232 70
3009 70 -46 7 -58 -67 -343 47 -219 -16 232 292 203 227 -60 -47 -114 -239 -176 -26 43 164 202 222 141 -55 -185
3034 -185 -148 -353 -442 17 -9 -124 -69 121 155 -21 55 18 -151 -345 -394 -42 -44 117 126 308 311 -93 5 -87 -125 -180
3060 -180 -277 -17 256 131 277 72 80 -65 -338 -273 -180 -21 67 210 139 150 216 141 -241 -150 -252 -163 -137 -368
3084 -368 96 440 184 208 -1 163 -116 -390 -155 64 -144 -162 177 268 213 269 86 12 -113 -336 -317 -114
3106 -114 -186 -58 315 268 233 279 -162 -220 -155 -229 -144 -45 108 227 283 137 243 93 20 -238 -339 -113 -233 -36
3130 -36 121 377 243 114 -68 -83 -21 -380 -524 -68 61 -43 138 305 424 36 -230 -294 -155 -328 -140
$$ packed form
2961dLP2J67r4k83J13k8N6j34J00K80l46K18j54J38r7k27J42K8k39K20k2K75m9
2985A35pk3K32k76k08J25N9j28O6J07J93k43j1l2Ok46P5o1J67K11j80R6J75j62
3009G0j16N3o5rk76L90k66K03K48O0q9K4k87J3o7j25O3J50O9J21L8K0q1j96j30
3034a85L7k05q9M59k6j15N5J90L4j76P6l7j69j94m9L52kJ61RJ82Lm04R8r2l8n5
3060a80r7K60K73j25J46k05Qj45k73O5R3J59Q8J43p1J1O6p5l82R1j02Q9K6k31
3084c68M64L44k56K4k09J64k79k74K35K19k08j8L39R1n5N6j83p4j25k23J9K03
3106a14p2J28L73m7l5M6m41n8O5p4Q5R9J53J19N6j46J06j50p3k58j01K26j20J97
3130c6J57K56j34j29j82j5O2l59j44M56J29j04J81J67J19l88k66o4J39j73J88
$$ plain form
3151 -140 -269 104 389 201 221 63 70 -252 -215 -171 -122 -55 -67 345 448 270 20 100 -62 -23 -108 -243 -155 -102
3175 -102 23 158 205 188 345 15 -367 -493 -291 -355 -53 126 478 152 139 91 -68 -39 -266 -482 -395 -38
3197 -38 -42 302 56 381 199 -137 -85 -151 -151 -117 -63 -83 -3 195 254 -63 104 -156 -16 -190 -122 -249 -46 174
3221 174 157 224 261 45 171 87 -138 -173 -113 -62 -86 96 256 257 334 -171 -15 -5 -319 -295 -292 130 141 217 48 271
3247 271 -89 -31 -71 -215 -169 -298 -110 -79 152 -59 154 103 4 32 -252 -239 -67 -4 61 -9 220 211 155 -38 -160
3272 -160 -107 -234 -249 -161 25 267 -66 27 108 100 -117 -194 -216 -80 -127 -42 71 77 180 -3 250 101 1 -300
3296 -300 -203 -201 20 -125 37 243 224 -14 86 -187 -114 -29 -409 -91 147 94 318 -8 -95 52 -141 -128 -194
3319 -194 -178 -51 -9 18 149 160 128 77 46 -13 -211 -353 -67 208 115 -104 177 152 306 23 -385 -61 -13 -314
$$ packed form
3151a40j29L73K85j88K0j58Pl22L7M4M9O7j2M12J03j78k50Q0j62L9q5j35Q8N3
3175a02J25J35M7j7J57l30l82j26K02o4L02J79L52l26j3m8j59K9k27k16Q7L57
3197c8mL44k46L25j82l36N2o6%L4N4k0Q0J98N9l17J67k60J40j74O8j27K03K20
3221A74j7O7L7k16J26q4k25l5O0N1k4J82J60JP7n05J56J0l14K4LM22J1P6j69K23
3247B71l60N8m0j44M6j29J88L1K31k11K13n1r9K8k84J3J72O3O5p0K29rn6j93j22
3272a60N3j27j5Q8J86K42l33R3Q1qk17p7k2J36m7Q5J13OJ03j83K53j49j00l01
3296c00R7KK21j45J62K06j9k38J00k73P3Q5l80L18K38n3K24l26q7J47j93J3o6
3319a94J6J27M2K7J31J1l2n1l1n9j98j42K86K75r3k19K81k5J54k83m08L24M8l01
$$ plain form
3343 -314 -115 53 90 187 148 62 167 -111 -163 -108 -94 -246 -18 -32 80 161 70 -48 -28 112 -86 -275 -72 -151
3367 -151 2 226 88 118 122 9 3 -346 -142 -78 -89 -67 126 -122 106 259 98 115 97 -316 -259 -41 -170 53
3391 53 32 46 48 251 6 140 -137 -3 -244 25 -121 22 238 61 265 0 81 -63 61 -174 -12 -10 -134
3414 -134 185 -38 130 286 86 -132 -143 -204 -96 -85 110 -68 -9 375 86 61 29 -35 110 -376 -184 -16
3436 -16 -78 145 136 154 120 142 -9 -60 34 -171 -49 -41 -61 199 39 95 -81 -85 -37 -39 -140 -248 -76 91 88 -61 159
3463 159 159 72 -280 -363 -17 -114 19 -70 -22 95 57 39 -109 145 -35 -108 -115 -4 -5 -60 156 185 130 95 -25 -19 102
3490 102 -86 17 -162 -87 63 -105 79 239 77 -98 -145 -41 11 -200 -179 28 34 216 223 54 325 136 14
3513 14 -5 -70 -167 38 -160 27 96 133 10 -135 -58 -206 -53 -142 -189 -102 175 -112 142 149 90 -33 -43 -150 82
$$ packed form
3343c14J99J68L7R7l9q6J05k78n2N5J4j52K28j4J12Q1r1j18K0J40j98j89K03p9
3367a51J53K24j38L0Mj13ol49K04O4j1K2J93k48K28J53j61J7j8m13N7K18j29K23
3391E3k1J4KK03k45J34k77J34k41K69j46J43K16j77K04k65Q1j44J24k35J62Kj24
3414a34L19k23J68J56k00k18j1o1J08J1J95j78N9L84k89k5l2o4J45m86J92J68
3436a6o2K23rJ8l4K2j51n1R4k05J22Qk0K60j60N6j76mM8kj01j08J72J67lj49K20
3463A59%q7l52q3L46r7J33q9M8J17l8j8j48K54j80p3pJ11jn5K16K9n5l5j20OJ21
3490A02j88J03j79P5J50j68J84J60j62j75m7J04N2k11K1K07OJ82Pj69K71j89j22
3513A4j9o5r7K05j98J87O9L7j23j45P7j48J53q9m7Q7K77k87K54Pn9j23j0j07K32
$$ plain form
3538 82 -92 36 45 97 92 -13 30 50 89 -136 -190 -58 -88 -62 192 171 229 -4 -30 -70 -31 -89 46 -210 -60 -50
3564 -50 -70 27 220 159 -232 -131 -89 1 -114 -84 47 51 177 -98 65 15 43 -182 -178 -106 25 -202 92 95 151 95
3590 95 276 37 -66 70 11 -95 33 -51 150 34 -83 73 -4 -66 -95 -113 -157 84 80 3 154 109 83 168 146
3615 146 47 -86 -95 -156 -28 51 105 80 362 -71 97 42 -175 -84 79 24 67 15 66 286 153 137 -168 -310 -26
3640 -26 -216 -114 -118 13 70 109 204 129 -38 28 -113 -18 -105 -47 83 -2 151 309 -81 -219 51 42 -13 -117 35
3665 35 6 65 24 -86 -20 55 -256 -259 15 -37 -50 -105 21 67 153 -87 169 63 -44 7 -95 -257 4 89 -19
3690 -19 184 351 -31 -147 -151 -200 -213 -47 -5 110 24 -54 -40 -23 -71 -42 75 17 -125 -142 146 28 -167 161 75
3715 75 -286 -100 -109 83 -70 -45 154 91 -177 45 -21 -72 -156 22 22 63 -152 84 -150 159 67 28 -134 49
$$ packed form
3538H2j74J28RN2nj05M3K0L9k25n4J32l0K6K54k1N8k33k6m0L9n8J35k56J50J0
3564e0k0R7J93o1l91J01M2R0j15L0J31MJ26k75J63n0K8k25MP2J31k27K94LN6n6
3590I5J81k39j03J36n9j06J28q4K01j16j17J56p7o2k9j8m4K41mp7J51m5k6Q5k2
3615A46r9j33ro1J28P9N4k5K82m33J68n5k17R1J63n5M3n2N1K20j33j6l05j42K84
3640b6j90J02mJ31N7L9R5p5j67O6j41R5q7N8J30q5J53J58l90j38K70rn5j04J52
3665C5k9N9m1j10O6P5l11lK74n2j3n5J26M6Q6k40K56j06j07N1j02j62K61Q5j08
3690a9K03J67l82j16mm9j3J66M2J15q6p8J4J7m8K9J17n8j42j7K88j18j95L28q6
3715G5l61J86rJ92j53K5J99o3k68K22o6n1q4J78%M1k15K36k34L09r2l9j62J83
$$ plain form
3739 49 -80 -61 -249 -22 -51 -27 62 -73 130 -60 -61 -114 -130 -200 -226 -36 30 -33 310 -150 -52 26 4 -165 -350
3764 -350 164 -3 -111 321 211 296 183 -207 -82 92 -156 -83 25 -84 -33 20 -54 178 30 100 -89 -51
3786 -51 -157 -71 245 194 149 110 15 -113 -104 -1 -217 -29 24 143 -27 -3 57 -63 -52 -71 -53 -99 -57 11 -37 14
3812 14 57 208 -96 169 27 -141 -125 -129 -95 -65 -222 174 241 165 239 42 135 45 -89 -299 19 101 32 199 47
3837 47 142 125 163 169 154 95 141 -146 -46 161 195 -46 -68 -142 -66 -16 -216 -38 11 177 38 226 54 -11 126
3862 126 35 -106 -179 -315 -159 103 -6 -81 255 118 -6 -114 143 52 30 -148 -203 40 204 149 91 75 169
3885 169 9 -67 137 -77 -141 23 -29 136 -61 -6 -27 128 45 98 -111 -107 116 145 -61 -106 53 -161 24 -73
3909 -73 -55 -132 -26 -109 99 159 167 76 -5 -17 25 -168 -76 104 61 54 -44 188 66 -177 -109 64 85 -100 53 -57
$$ packed form
3739D9j29J9j88K27k9K4Q9j35K03j90jn3j6p0k6J90O6o3L43m60R8P8k2j69j85
3764c50N14j67j08M32j10Q5j13l90J25J74k48P3J08j09N1N3p4K32j48P0j89L8
3786e1j06Q6L16n1m5l9r5j28RJ03k16J88N3J19j70K4O0j20J1j9J8m6M2O8m8N1
3812A4M3J51l04K65j42j68J6mL4L0j57L96O7p6P4j97R3r0j34k10L18Q2o9J67j52
3837D7R5j7L8Oj5n9M6k87J00K07L4k41k2p4P6N0k00J78M9J66j39J88j72o5J37
3862A26r1j41p3j36J56K62j09p5L36j37j24j08K57r1k2j78n5K43J64n5n8j6R4
3885A69j60p6K04k14o4J64n2J65j97N5k1J55q3N3k09MK23K9k06m5J59k14J85r7
3909g3J8p7J06q3K08O0Qr1q1j2M2j93R2J80m3pr8K32j22k43O8J73K1j85J53j10
$$ plain form
3935 -57 -136 0 -16 -31 205 -19 0 -16 17 67 -48 40 -80 134 -54 10 -74 -100 25 -6 -1 105 -36 -102 -91 55
3961 55 21 65 -36 -91 -86 -40 200 -5 -151 77 -25 -99 62 -6 168 -175 -34 104 63 -292 30 -40 -15 13
3985 13 9 18 -28 25 -229 54 3 -90 110 -28 28 59 -86 -76 157 75 -37 -79 169 150 94 30 -92 218 -33 -108
4011 -108 2 50 92 44 25 -90 56 -148 -138 -77 -159 27 -20 -51 -2 119 -175 24 -104 -120 58 44 45 162 -62
4036 -62 -42 -57 -7 -66 -64 239 -220 -120 -3 -93 51 202 39 196 -23 0 73 -128 10 -17 59 97 17 108 -101
4061 -101 153 32 -105 180 -44 135 -41 -60 -80 -125 31 -65 -90 -41 207 39 -19 106 96 -82 72 3 -8
4084 -8 -126 -31 -51 15 -78 -36 18 61 82 28 -17 72 342 -137 -58 33 44 57 105 -29 -55 165 105 -175 -147 -72 -69 -23
4112 -23 -126 -72 183 -55 102 21 44 -154 -212 -107 -97 238 0 -119 198 -123 31 -6 -37 17 -149 -21 15
$$ packed form
3935e7p9J36j6j5K36k24J9j6L3N0j15Q8j20K14j88O4q4k6J25l1NJ06j41o6J1J46
3961E5l4M4j01n5NM6K40k05j46K28j02p4J61o8J74l43J41J38m1l55L22p0K5K8
3985A3mRm6N3k54K83n1r3K00j38N6L1j45J0K33q2j12m2K48j9n6o4j22L10k51p5
4011a08J10M8M2m8j9j15J46k04J0O1q2J86m7l1M9J21k94J99j28j6J78j4JJ17k24
4036f2K0j5N0n9KL03m59J00J17r0J44J51j63J57k19K3P3k01J38k7P6L8q0R1k09
4061a01K54j21j37K85k24J79j76j9k0m5J56r6k5M9K48j68n8J25j0j78J54o9j1
4084hj18R5k0O6r3M2N4M3K1n4m5Q9K70m79P9R1J1J3M8j34k6K20o0k80K8P5LM6
4112b3j03N4K55k38J57q1K3j98n8J05J0L35k38j19L17l21J54l7l1N4j66J28L6
$$ plain form
4135 15 86 3 -178 63 24 126 -58 -195 -27 33 -35 -20 -77 108 130 61 117 41 -60 -141 -81 15 37 -135 36
4160 36 -2 123 186 37 187 -261 -116 67 -69 -9 -7 -26 36 161 -25 -28 -92 -52 -71 149 -77 2 -115 176 37
4185 37 2 186 12 73 67 14 -216 -124 -61 123 -64 21 32 133 87 73 -151 -205 52 -22 200 -1 227 5 83
4210 83 68 79 45 -97 -93 -56 -120 11 129 80 117 -145 -233 166 -180 7 65 9 136 109 55 4 184 -22 92
4235 92 -105 -68 46 -15 11 158 85 144 131 12 -147 -130 -134 -226 -44 -99 -157 38 156 -68 -67 73 -193 -118 122
4260 122 144 -29 -49 -67 -41 -16 186 5 -104 -109 37 -149 -10 78 -16 101 -64 -104 -106 -42 65 -183 83 -65
4284 -65 7 229 57 -27 148 0 140 46 -2 26 -124 22 -124 111 40 -3 23 -160 -209 -130 -112 23 58 128 63
4309 63 7 -103 -178 87 -41 -203 -157 126 82 12 -97 141 -10 -13 -30 -82 5 -87 219 -151 5 64 -67 50
$$ packed form
4135A5P1q3j81K41l9J02j84j37J68O0o8J5n7J85K2o9N6p6j01q1O0R6K2j72J71
4160C6l8J25O3j49J50m48J45J83j36O0Kj9O2J25j86lo4M0j9K20k26P9j17K91j39
4185C7l5J84j74O1on3k30R2O3J84j87Q5J1J01m6j4k24n4K57p4K22k01K28k22P8
4210H3j5J1l4j42ML7o4J31J18m9L7k62q8L99l46J87N8n6J27k7n4n1J80k06J14
4235I2j97L7J14o1K6J47p3N9j3j19j59J7mr2J82n5n8J95J18k24JJ40k66P5K40
4260A22K2j73k0j8K6K5K02j81j09nJ46j86J39Q8r4J17j65m0kO4J07k48K66j48
4284f5P2K22j72q4J75j48J40r4m8K8j50J46j46K35p1m3K6j83m9P9J8J35L5P0o5
4309F3n6j10p5K65j28j62M6K83m4p0j09K38j51lj7n2Q7r2L06l70J56N9j31J17
$$ plain form
4333 50 44 -100 -4 -110 -139 76 131 -35 -25 181 132 -29 -41 7 -32 -96 -79 -108 105 45 125 126 72 -237 -51 31 -37
4360 -37 -143 55 30 129 60 -88 150 -5 98 136 -11 -46 -112 126 57 58 87 155 -26 -8 234 41 -42 -19 -115
4385 -115 235 -49 14 -158 22 -19 -159 -29 151 33 -16 -122 103 106 57 -10 -245 -74 34 19 -295 -147 -11
4408 -11 -9 91 -39 54 142 76 27 98 -66 48 58 -52 9 -58 -37 11 81 15 -2 -108 48 -56 -103 30 -48 -136
4434 -136 -29 -41 -58 -286 38 61 118 -48 134 -175 85 80 -202 -52 -121 43 -97 -29 26 34 -86 83 -76 -117
4458 -117 -35 68 -84 -191 -17 130 35 116 -27 2 -117 -88 67 115 -19 -41 73 67 133 149 103 -80 -111 -109 6
4483 6 -92 -15 -71 -108 -23 -84 195 -70 63 106 -69 -82 101 6 100 -72 -33 65 -1 23 195 11 -172 4 -21 -45
4509 -45 139 144 -156 -14 -154 -120 -146 49 153 -17 -21 -7 -2 1 -71 -239 13 -6 19 71 -106 -41 -120 42 -26 29 -6
$$ packed form
4333E0oj44R6j06k9K15N5j66J0K06m9j61j2M8l9o4J7k9K13o0Q0Jn4l09J86Q2o8
4360c7j06J98k5R9o9j48K38j55J03L8j47l5o6K38o9JK9O8j81J8K42j93q3K3r6
4385a15L50k84O3j72J80m1j40J30J80j18m9j06K25Lm9o7k35J71J08j5l14J48J36
4408a1KJ00j30R3Q8o6m9P1j64J14J0j10O1o7K1M8P0o6j7j06J56j04m7J33p8q8
4434a36J07j2j7k28L24K3N7j66J82l09K60nk82J50o9J64j40O8N5Qj20J69j59m1
4458a17Q2J03j52j07J74J47r5Q1j43K9j19K9J55M8j34k2J14oO6J6m6j83l1KJ15
4483Fr8P7n6l7Q5o1K79k65J33M3j75j3J83r5R4j72L9R8o6K4J72j84j83J76k5k4
4509d5J84Nl00J42j40L4k6J95J04j70mJ4NLp2j68K52j9K5N2j77O5p9J62o8N5l5
$$ plain form
4536 -6 19 -107 138 -48 -89 -64 43 79 61 10 -65 -131 -11 -131 -78 -98 120 12 -82 181 -18 -148 9 40 -55
4561 -55 -53 -17 328 4 89 31 -47 12 -122 -61 23 -8 153 99 89 -107 -1 26 39 36 -43 -82 -85 138 133 -65 67 -91
4589 -91 60 41 -82 -193 39 -31 -170 -180 -162 141 -39 -178 175 90 111 -30 -163 -85 -97 248 -200 117 133
4612 133 118 95 -59 -36 112 -88 -107 -55 -124 170 4 93 38 -82 72 126 -37 -45 -84 -72 -18 -10 292 106 -18
4637 -18 -71 -221 39 100 -153 -3 67 -163 111 -96 -57 86 109 -80 54 -11 55 -26 -46 80 129 -261 -80 -31
4661 -31 -144 169 1 34 -99 -6 67 66 -67 -9 -70 -55 -151 26 64 -15 186 12 159 -37 52 -22 -1 -31 110
4686 110 -26 -12 67 11 -86 112 15 -10 82 -1 62 -244 56 -9 -130 -49 150 -121 80 54 112 56 125 88 91 -16
4712 -16 145 40 -100 91 -29 126 -183 -42 -151 -65 -90 -75 -166 208 -211 -180 119 -185 -123 -76 -42 -58 152
$$ packed form
4536fK5j26K45j86m1K5J07L6j8n1p5o6J20j20N3k0K18j08r4K63j99j30J57L1r5
4561e5KL6L45l24Q5n8p8N9j34O1Q4l1J61n4j0j96J06K7J3lp9l9lK23nj98J32j58
4589i1J51j9j23j11K32p0j39j0J8L03j80j39L53q5K1j41j33P8j2L45m48L17J6
4612A33j5k3j54K3J48k00j9N2o9K94j66Q9n5j20J54N4j63ql9J2N4QL02j86j24
4637a8n3j50K60O1k53J50P0k30K74k07L9J43K3j89J34o5O6q1k0J26M9l90J81M9
4661c1j13L13j68L3j33R3P3jj33N8o1J5r6J77L8p9K01j74J47j96Q9p4K1l0J41
4686A10j36J4P9n6r7J98r7k5R2q3O3l06L00o5j21Q1J99k71K01k6N8n6O9l7Lj07
4712a6J61j05j40J91j20J55l09J41j09Q6k5J5r1L74m19L1K99l04O2M7L4j6K10
$$ plain form
4735 152 34 -28 120 206 68 107 122 11 225 46 68 -140 -31 72 -98 -22 -28 -184 -153 -20 -140 51 -4
4758 -4 -130 -103 99 -65 -145 -210 31 -134 -134 -111 -97 46 8 -121 -86 159 -66 -74 -82 52 -165 96 -71 -20 117
4783 117 110 121 -23 151 -71 -121 -41 45 45 75 -61 -32 205 11 258 63 43 39 -71 385 27 23 3 -20 -97 -209
4809 -209 -15 -98 -33 6 270 -47 -55 81 -67 -94 -142 -20 91 -96 45 174 -188 -230 -76 163 108 -226 -15
4832 -15 -27 144 -41 -48 117 -50 85 81 -24 146 64 0 15 -22 216 109 46 91 108 -148 49 -59 -144 39 118
4857 118 -99 122 -32 -99 -162 72 10 -98 -70 131 -88 -47 6 -49 97 -31 -109 123 18 25 16 -202 30 -76
4881 -76 84 -108 -78 -9 -160 75 -12 -10 66 -19 110 -128 -157 -111 -140 133 -13 78 47 40 104 151 -295 174 73 -31
4907 -31 37 -43 -4 -29 37 6 39 -20 65 -144 129 12 30 -46 -93 4 -69 -120 -107 -112 -134 -97 103 7 -17 121 -16 -50
$$ packed form
4735A52j18o2J48Q6j38L9J5j11K14j79K2k08J09J03j70P6oj56L1J33j20J91n5
4758dj26K7K02j64q0o5K41j65%K3J4J43l8j29L5K45k25qqJ34k17K61j67N1J37
4783A17pJ1j44J74k22n0Q0Q6%L0j36K9K37j94K47j95k0mj10M56l58mk0k3p7j12
4809b09J94q3O5L9K64l17qJ36j48k7m8J22J11j87J41J29l62m2J54K39n5l34K11
4832a5j2J71j85pJ65j67J35mj05J70q2o4J5l7K38j07o3M5J7k56J97j08q5J83P9
4857A18k17K21j54o7o3K34o2j08K8K01k19M1N3n5J46j28p8K32j05Prk18K32j06
4881g6J60j92L0O9j51K35q7KP6q5J29k38k9M6k9K73j46R1l1pO4M7m46M69j01j04
4907c1O8q0L9k5O6l1L3n9Q5k09K73j17J8p6m7R7p3n1J3nk2L7K00r6k4J38j37l4
$$ plain form
4935 -50 -37 31 -52 46 58 124 -2 3 -57 -159 137 -136 12 -12 124 36 -105 65 10 -102 -116 18 -107 9 -2
4960 -2 -199 -35 -114 240 -129 -65 18 65 -53 -7 16 -76 42 136 -68 82 14 24 -8 150 26 -41 -34 2 -98 66
4986 66 16 6 73 -11 29 -171 -7 104 -145 -161 64 40 18 -36 129 48 -53 -145 -67 150 -120 36 26 21 30 -21
5012 -21 47 -178 69 138 200 -46 145 -70 32 -169 173 91 -62 -68 -60 94 61 93 118 40 -133 -137 -57 -121 13 -181
5038 -181 -78 44 -87 -58 -82 -136 128 -49 -19 21 -27 -55 16 178 31 -8 17 3 -46 73 -158 -92 -95 61 -16
5063 -16 28 6 -8 -41 -79 -8 45 -16 123 -85 -25 47 -151 -57 -45 132 37 37 -38 74 134 -104 -186 105 170 -63 220
5090 220 140 43 41 60 32 -52 117 12 -37 -19 30 147 -140 2 45 -71 -114 61 -161 -241 -67 27 4 56 85 178
5116 178 11 96 43 55 101 -175 -77 15 4 -79 -75 13 32 134 -85 130 102 -46 55 32 -30 74 79 -195 -159 -12
$$ packed form
4935e0J3O8q3R8J2O6j26No0j02K96k73J48k4J36q8j41J70n5j12j4J34j25J16j1
4960bj97J64p9L54l69O4Q3M7j18M6K3r2J18R4k04J50o8J0l2J58j24o7PL6j00J64
4986F6n0j0O7q4M0k00J64J11k49j6K25k4k2n4J65q1j01r2P8K17k70J56j0nRn1
5012b1O8k25K47O9O2k46J91k15J02k01L42q2j53oQJ54l3L2K5p8j73mQ0o4J34j94
5038a81J03J22j31K9k4n4K64j77L0M0m8k8P1J62j47l9K5j4m9J19k31O6lJ56p7
5063a6M4k2j4l3l8P1N3o1J39k08O0P2j98R4J2J77r5%p5J12O0k38q2K91O5k33K83
5090B20q0r7kJ9k8q4J69j05m9J8M9J17k87J42M3j16m3J75k22q0J74R4k3N2K9R3
5116A78j67Q5n3J2M6k76R8R2j1q3MQ8J9J02k19K15k8j48J01k3o2J04Nk74L6J47
$$ plain form
5142 -12 -48 20 91 147 195 126 -26 -132 19 -39 -62 155 155 20 -81 -213 89 -123 259 -150 -184 -9 65 -21 37
5167 37 -121 -5 64 2 -35 -41 -54 -97 -37 -91 10 63 10 -212 68 -23 -180 -102 82 234 77 -58 -195 41 66
5192 66 107 101 71 -171 5 182 56 -100 128 -54 125 -60 -33 -58 -150 26 -195 113 48 95 143 124 -12 -77
5216 -77 -196 -40 7 -163 65 90 225 57 -38 41 -9 19 151 -186 4 170 70 -78 32 -97 -60 141 101
5239 101 63 15 -148 26 60 -14 -20 -129 -2 77 -50 -2 11 45 -235 115 76 -80 -55 81 -2 92 51 -224 75
5264 75 -34 -15 85 -68 161 -96 46 51 8 92 50 -105 -94 73 44 58 60 241 -4 104 -67 66 101 59 51
5289 51 10 56 77 8 99 101 9 176 -19 91 37 -11 -3 106 108 54 -235 -106 -147 -22 -75 -35 137 -82 66 88 41
5316 41 -177 -29 -16 -13 92 45 241 101 -137 -61 -95 147 66 -7 -84 29 -32 -58 178 -22 248 116 -90 -35
$$ packed form
5142a2l6O8P1N6M8o9j52j06J51n8k3K17%j35j01j32L02k12L82m09l4J75P4q6N8
5167C7j58J16O9o2l7oj3m3O0n4J01N3n3k22K80r1j57P8J84J52j57j35j37K36K5
5192F6M1ol0k42J76J77j26j56K28j82J79j85K7k5r2J76k21L08o5M7M8j9j36o5
5216g7j19J56M7j70K28K5J35j68r5P9n0K8J32l37J90J66j00j48J10j29L7K01m0
5239A01l8m8j63J74L4p4oj09J27P9j27M8J3L4k80L50l9j56K5J36q3R4m1k75K99
5264G5j09J9J00j53K29k57J42Nm3Q4m2j55J1J67k9J4KJ81k45J08j71J33L5m2q
5289E1m1M6K1o9R1Kr2J67j95J10n4m8QJ09Kn4k89J29m1J25n3M0J72k19J48K2m7
5316D1k18J48J3LJ05m7J96j40k38P6l4K42q1p3p7J13o1k6K36k00K70j32k06N5
$$ plain form
5340 -35 304 -51 97 -26 -21 -33 193 141 -62 96 198 -73 230 170 133 130 -22 -113 7 100 159 149 -61 -178
5364 -178 -21 116 83 166 182 -149 -210 67 -57 -126 -199 -74 -90 -144 104 89 -108 30 66 62 -182 -25 104 44
5388 44 94 -105 32 -46 32 91 -34 3 -88 -79 -10 -143 -93 123 -103 -56 196 54 41 -10 -131 -57 119 -239 97
5413 97 92 22 -2 -30 108 -51 -7 47 -89 36 225 135 48 -10 203 -88 -2 -28 -146 -71 -36 17 33 -31 129 44
5439 44 -265 -85 -5 -150 -138 153 -118 160 15 109 17 -78 19 -8 -55 -74 -13 42 -137 -109 9 83 124 -64 -41
5464 -41 11 -68 139 118 -63 96 25 -119 7 -15 -43 -22 -39 25 5 43 89 24 -40 -71 -136 -155 -22 89 10 30 -14
5491 -14 -29 -76 12 -118 48 134 78 -114 -91 -148 -11 -79 27 80 -41 69 -69 6 16 14 -59 -167 22 -140 -125
5516 -125 -110 111 274 121 -76 -92 9 51 34 150 -33 109 20 152 -27 -31 -71 -31 17 -116 -144 -5 76 -114
$$ packed form
5340c5L39l55J48j23Nj2K26n2k03J58J02k71L03o0l7lj52r1J20R3N9j0k10j17
5364a78J57J37l3Q3J6l31o1K77j24o9p3J25j6n4K48j5j97J38L6mk44J57J29o0
5388D4N0j99J37p8P8N9j25L7r1RO9j33N0K16k26M7K52j42j3n1j21P4J76l58L36
5413I7np0k4k8J38j59M4N4j36J25J89r0q7n8K13k91Q6k6j18P5L5N3J6o4J60q5
5439D4l09J80Q0j45J2K91k71K78j45R4r2r5R7k7m7j9O1N5j79K8J18P4M1j88K3
5464d1N2p9K07k1j81J59p1j44J26k2k8K1j7O4k0L8M6o5o4l1o5j9J33J11p9K0m4
5491a4j5m7Q8j30J66Q6n6j92K3n7J37o8J06N3j21J10j38P5J0kp3j08J89j62J5
5516a25J5K21J63j53j97j6J01M2j7J16j83J42q9J32j79mm0M0M8j33k8J39Q1j90
$$ plain form
5540 -114 -101 20 -138 86 2 2 6 62 52 33 150 -60 -82 -14 80 -20 67 111 -52 -96 48 310 112 138 63 -150
5566 -150 -45 -22 60 -102 -5 -48 65 105 -196 166 -31 -55 -60 -36 126 161 29 -106 -99 -27 -81 -165 -99 -102 -84 -18 23
5593 23 -77 -161 12 91 81 11 35 -36 -16 -6 -133 7 102 42 182 -18 28 5 284 -99 -108 49 53 55 -135 -48 -83
5620 -83 -68 23 -77 73 117 81 -82 46 -44 -214 8 13 5 6 -130 3 71 -45 34 -86 159 -195 137 -36 57
5645 57 -58 31 -1 117 117 -45 -6 115 24 -25 -15 -150 32 192 -174 285 92 -13 -169 -15 -9 -200 -42 138
5669 138 -210 -145 -23 -6 54 228 48 -279 -147 -114 16 -107 89 112 -23 62 68 80 118 82 331 -35 -40 208
5693 208 -60 99 -53 -20 63 -38 -80 -72 66 68 -120 70 123 -28 -170 -84 -53 -101 -22 -63 -132 -112 -67 -85 58 24
5719 24 -16 -207 -79 65 149 78 -224 18 -93 9 39 -107 -49 -101 105 -108 -6 -12 -220 -242 -64 172 -17
$$ packed form
5540a14J3J21j58K24q4%MN6j0j9J17k10k2O8R4j00Q7M4j63m4J44K62j98K6p5k13
5566a50J05K3Q2j62R7m3J13M0l01L62j97k4nK4J62L5j32j35PP2n4q4O6lJ8O6M1
5593B3j00q4J73P9j0p0K4p1K0J0j27J40R5o0J40k00M6k3K79l83rJ57MKj90Q7l5
5620h3J5R1j00J50M4l6j63J28r0j70K22NqJj36J33O8j16P9j20K45l54L32j73R3
5645E7j15Q9l2J18%j62L9J21r1m9J0j35J82J60l66M59j93j05j56J54Oj91J58J80
5669A38l48O5J22J7O0J74j80l27J32L3J30j23J96K3j35Q5OJ2L8l6K49l66nK48
5693B08k68J59j52L3Q3j01m2QJ38Kj88J90N3j51j42Q6L1m8P9m1o9K0M5j8J43l4
5719B4m0j91J28J44Q4p1l02K42j11J02L0j46N8n2K06k13J02ok08k2J78K36j89
$$ plain form
5742 -17 -13 -35 -29 -74 126 87 18 4 -267 138 32 52 -27 21 -1 -35 25 53 113 40 -172 72 28 -81 -16 -121 19
5769 19 159 -220 -202 -138 55 59 23 -66 -53 87 -46 31 -97 19 -28 50 198 82 58 7 -73 26 68 49 -43 -38 84
5796 84 51 -141 -22 4 -22 135 -87 -15 -18 -45 2 28 -78 148 10 -105 -64 -179 28 34 -8 119 83 -34 -95
5821 -95 -104 15 62 -88 -42 20 -108 -191 58 -175 167 151 57 89 -176 215 136 131 -71 31 -130 30 -95 27
5845 27 117 43 152 -95 -135 -106 75 -66 -33 111 44 52 256 -46 0 37 -84 85 133 -33 115 -134 232 73
5869 73 -6 83 99 -32 6 85 -158 46 10 67 -249 -64 -82 3 -66 130 -124 136 -54 -87 -57 201 76 -189
5893 -189 -156 -24 -81 -60 -71 83 19 -146 -24 2 147 -279 -9 -56 111 -44 -91 -38 257 -14 -19 131 -155 21
5917 21 124 -72 7 100 -152 137 -34 162 74 -54 -48 -145 10 54 -162 -79 139 75 272 -8 -56 157 117 130
$$ packed form
5742a7Mk2Om5K00l9o9j4k71M05j06K0p9M8k2l4O0K8O0p3k12K44m4j09O5j05J40
5769A9J40l79J8O4J93Ml6q9J3J40j33P7j28J16m7P8J48j16k4n1q0R9M2j9r2NJ22
5796H4l3j92J19K6k6J57k22P2lk7M7K6j06K26j38j15M1j15K07Om2J27l6j17o1
5821i5rJ19M7j50M6O2j28q3K49k33L42j6r4L2k65L91p9nk02J02j61J60j25J22
5845B7R0p4J09k47m0K9J81j41L3J44o7QK04l02M6L7j21J69M8j66J48k49L66j59
5869G3p9Q9J6j31L8P9k43K04l6N7l16J85j8Q5o9J96k54K60j90l3L0K58j25k65
5893a89L3J32n7K1j1J54o4j65J22K6J45m26K70m7J67j55m7N3K95k71nJ50k86J76
5917B1J03j96P9R3k52K89j71J96q8j28Or7J55M4k16Q3K18o4J97k80m8K13m0J3
$$ plain form
5941 130 -18 -205 -2 63 -85 -53 -14 21 -30 82 -35 -66 77 36 -77 -3 145 -17 26 10 75 -120 -41 -233
5965 -233 -18 152 5 -37 28 104 -73 -16 -40 -113 3 -101 -166 157 47 -113 44 -117 15 145 19 -51 -130
5988 -130 -44 25 35 -83 -57 57 -124 -7 -31 -128 -15 -73 56 212 57 -178 135 57 11 84 -40 7 184 -6
6012 -6 -63 142 -21 -26 -82 -28 -3 -20 -97 -77 64 25 36 -67 -117 -63 167 -107 157 81 134 -26 -140 -27 -130 44
6038 44 146 73 -55 97 -232 -64 -41 -44 -96 -91 67 106 67 2 17 -81 178 9 66 -24 -13 -224 -116 -77 -216 293
6064 293 -6 78 39 -83 188 66 24 -238 -87 56 34 127 65 -5 -8 52 -20 -104 -62 46 -3 -92 -184 88 20 44
6090 44 103 -122 -17 -84 -126 -110 -152 -2 -26 -46 -58 19 13 -28 35 9 -21 -155 -62 -12 -176 -94 -45 -52 50 -15 -71 104
6118 104 56 141 -75 117 -31 10 78 -106 -139 -36 3 154 118 -135 -79 -12 -187 -88 -108 92 -178 77 169 55
$$ packed form
5941A30j48j87K03O5j48L2L9L5n1J12j17l1J43m1j13P4J48j62M3j6O5j95P9j92
5965b33K15J70j47m2O5P6j77N7k4p3J16j04o5L23j10j60J57j61J32J30j26p0p9
5988a30Q6O9J0j18K6J14j81J17k4r7J13n8J29J56j55k35L13p8m6P3j24M7J77j90
6012fn7K05j63nn6N4K5j7p7K0J41l9J1j03n0N4K30k74K64p6N3j60j14J13j03J74
6038D4J02p3j28J52l29J68K3ln2NJ58L9l9o5J5r8K59j69N7r0J1k11J08L9j39N09
6064B93k99Q4l9j22K71j22m2k62J51J43k2R3o2p0lO0p2q4M2J08m9q9r2K72o8K4
6090D4N9k25J05o7m2J6m2J50k4k0j2P7om1O3k6l0j34R3N0j64Q2M9pJ02o5n6J75
6118A04m8Q5k16J92j48M1O8j84l3J03L9J51l6k53N6O7j75R9k0K00k70K55R2j14
$$ plain form
6142 55 4 58 63 -65 36 24 27 35 -1 -74 116 -12 -30 -71 -176 -76 147 73 104 -39 -38 -2 67 -12 -215 131 124 -103
6170 -103 -90 86 203 72 -138 56 -98 -83 112 45 35 138 99 -22 -13 -202 31 -56 -117 7 -75 -116 -53 -123
6194 -123 -42 -221 -120 10 32 -25 46 -115 -95 78 100 -109 -62 73 3 -34 153 -86 151 -51 -40 51 -71 -103
6218 -103 -3 -41 -52 146 -228 48 6 -208 -154 3 89 -165 71 67 62 -15 35 -46 154 115 -8 66 116 -43 -239
6243 -239 -40 -37 -91 -65 59 -77 -150 165 219 19 110 59 164 -145 72 -13 33 204 -79 19 179 -30 -70 9
6267 9 -138 -117 -19 14 -90 95 -51 52 -6 -104 -138 81 -174 30 -17 -117 -81 85 78 -26 -199 -46 -39 -33 -55 -1
6293 -1 -39 -72 -3 145 277 99 71 -195 56 43 -117 -58 -34 -50 87 143 102 -49 79 -6 -23 79 -53 -58 -23 -4
6319 -4 92 51 -128 -15 48 -151 112 -167 -54 94 -89 -92 89 -11 -191 13 -76 15 -2 96 22 24 -40 -7 98
$$ packed form
6142E5n1N4Nj28J01j2LQl6p3J90j28j8m1j05J00K23p4L1j43JL6O9p9k03L46pk27
6170a03J3J76J17j31k10J94j54J5J95o7j0J03l9j21Rj89K33q7o1J24q2m1O3p0
6194a23Q1j79J01J30K2n7P1j61K0J73K2k09M7J35p0l7J87k39K37k02J1R1j22l2
6218a03J00l8j1J98l74K76m2k14N4J57Q6k54K36mnp7N0q1K00l9j23P4N0j59j96
6243b39J99Ln4K6J24j36p3L15N4k00R1n1J05l09K17q5M6J71k83R8J60k09m0P9
6267Ij47K1R8L3j04J85j46J03n8r8l4K19k55K04m7j00L6J66pj04j73J53POk2N4
6293al8l3O9J48J32j78k8k66K51j3j60N9K4j6J37N6m1j51J28q5j7J02j32nL5J9
6319dR6m1j79J13O3j99K63k79J13J48j83lJ81j00j80K04q9R1j7R8p4Ko4L3J05
$$ plain form
6344 98 77 1 27 -158 -79 -93 116 216 13 100 -24 -71 -75 87 127 -199 44 -192 -45 -19 98 158 -85 -48 21
6369 21 92 -48 69 144 4 69 42 54 259 -38 -49 -288 -15 -27 13 17 -52 -45 91 73 294 137 -20 97 -228
6394 -228 -110 87 -85 -60 -133 -10 -45 -98 -81 -102 71 -70 -70 96 -16 -116 131 -37 86 -14 -149 -101 -65
6417 -65 241 155 -313 121 -195 107 268 -54 -157 -94 -35 -59 -100 -87 -182 11 -17 20 -71 -38 260 -53 7 -89 -35
6442 -35 97 -35 121 -143 -10 -104 61 -49 -68 74 -122 -39 42 182 40 28 -55 22 -78 -86 -82 46 35 267
6466 267 67 105 138 -243 -230 15 4 -86 69 35 78 104 -69 -99 40 199 -99 -250 -198 -25 148 -168 117
6489 117 -84 246 -51 92 116 143 -19 -33 -55 -39 -105 11 20 124 -73 34 -5 -150 91 49 141 -97 24 -80
6513 -80 116 86 -45 71 -1 2 94 45 10 -65 -204 -328 -17 40 -53 -22 100 -46 -40 -146 96 10 -104 66 -14
$$ packed form
6344I8k1p6K6j85P9j4K09J00k03Q7j24m7mJ62M0l26K43k36J47K6J17O0k43L7O9
6369B1P1j40J17P5j40O5k7J2K05k97j1k39K73j2M0Mo9PJ36j8K21j57j57J17l25
6394b28J18J97j72K5p3J23l5n3J7k1J73j41%J66j12j00K47j68J23j00j35M8L6
6417f5L06q6m68M34l16L02J61l22j03O3N9k4m1J3r5J93k8L7r1L3K98l13O0r6N4
6442c5J32j32J56k64J33r4J65j10j9J42j96Q3Q1J40j42j2q3P7j00qMJ28j1K32
6466B67k00L8L3l81J3K45j1r0J55l4M3K6j73l0J39J59k98j51N2J73J73l16K85
6489A17k01L30k97J43K4K7j62j4k2J6o6J16RJ04j97J07l9j45K41m2R2k38J21j04
6513h0J96l0j31J16p2LR2m9l5p5j39j24L11N7r3L1J22j46Oj06K42q6j14J70q0
$$ plain form
6538 -14 -46 21 51 122 -181 -16 57 206 -4 -186 8 -77 30 -34 29 -172 -113 -88 77 73 -167 0 34 105 -58
6563 -58 34 -27 -6 3 55 -24 14 -58 -141 4 -92 65 21 -35 119 -96 -72 -99 55 27 12 -26 67 19 -100 -47 -157
6590 -157 50 42 123 3 -142 85 85 42 -26 87 76 -26 -2 -8 210 -115 -3 -46 -39 -112 81 -102 61 92 -141
6615 -141 87 62 131 -109 -77 -127 -74 -161 -8 -79 80 -86 25 49 -109 -27 -45 11 -4 55 94 -109 67 -25 -50
6640 -50 14 15 62 -213 -14 -148 89 -59 176 184 -17 13 58 52 199 55 -197 -41 71 121 -61 114 -24 -31 -42
6665 -42 45 -50 101 -46 145 -8 44 -168 -123 -96 3 -9 -18 -11 137 1 -179 -85 202 -98 -170 68 -80 112 52
6690 52 105 -18 -127 51 96 -79 -85 26 -143 -20 133 20 -42 -121 104 -198 -238 -81 94 75 -77 68 16
6713 16 -64 164 -47 44 -94 -54 -37 114 59 43 -216 31 -22 -64 14 -32 46 -262 -87 -180 -70 13 98 78 43 -7
$$ packed form
6538a4l2O7L0P1l03J65P3J49k10j82J94q5J07o4O3k01N9K5J65mk40J67L4P1j63
6563e8R2o1K1RN2p9L8p2q3J45r6J57m4n6J54k15K4k7J54k8j5l8R3m8j19N3j10
6590a57K07qQ1j20j45K27%m3o8J13j1j02K4oK18l25J12m3Pp3J93j83J63L1k33
6615a41K28k5O9k40L2n0N3q7J53p1J59j66J11K4j58Q2j8N6j5N9L9k03J76r2k5
6640e0O4JM7k75J99j34K37j48K35Qk01L0M5oJ47j44k52J56J12N0j82J75j38pj1
6665d2Q7r5J51j47J91j53N2k12M5K7R9j2rPJ48j36j80R4K87l00p2K38j48J92o0
6690E2N3j23j09J78M5j75oJ11j69J23J53j13o2p9K25l02m0J57J75j9j52J45n2
6713A6q0K28k11R1j38M0J7J51n5j6k59K47n3m2P8m6P8l08J75r3J10Q3Q5k0l5n0
$$ plain form
6739 -7 -37 15 -199 -40 2 -76 -32 12 52 -248 106 -98 50 -74 49 6 101 8 85 -104 240 56 -61 -110 82
6764 82 124 -87 -76 -101 6 96 -22 -144 31 -99 -130 -121 -26 -94 12 -45 -124 -28 138 14 -80 -88 -69 -67 56 125 -44
6791 -44 -58 -27 -103 103 192 27 -128 -74 50 72 98 -109 108 12 207 26 117 180 -66 -56 -16 126 -184 -63
6815 -63 99 -79 43 -17 -75 83 187 31 -17 36 -142 49 143 -77 105 31 -110 58 94 145 -37 -141 -136 -47
6839 -47 105 -36 -103 91 90 100 -60 -8 113 -81 -90 75 13 -6 25 -13 35 8 89 -3 -70 77 -6 -77 -139 -115 -140
6866 -140 45 101 -102 127 96 3 -2 -93 -57 74 137 -16 -111 -265 -24 29 -10 50 -75 123 106 123 -23 107 36
6891 36 86 58 -93 -47 121 42 -199 -28 192 33 37 -3 23 153 -20 -27 -22 130 179 -125 -42 34 161 -23 -97 147
6917 147 -36 -68 114 109 17 -42 101 192 195 -132 66 51 -33 -183 -30 35 23 -25 -47 32 -85 -13 -133 -95 -15 9
$$ packed form
6739gl0N2k14J59M2p8M4M4M0l00L54k04J48j24J23m3R5r3P7j89L44j84j17m9J92
6764H2M2k11J1k5J07R0j18j22J75j30l1RR5o8J06n7p9R6J66j24r4qJ9KJ23O9j69
6791d4j4L1p6K06Q9j65j55N4J24K2K6k07K17r6J95j81R1O3k46J0M0J42l10J21
6815f3J62j78J22o0n8J58J04j56m8N3j78J91R4k20J82p4j41J68L6N1j82j04NQ9
6839d7J52j41o7J94jJ0j60N2J21j94rJ65o2j9L1l8M8k7Q1r2o7J47q3p1o2K4k5
6866a40J85N6k03K29l1r3nr1L6J31O3j53r5j54K41N3l9O0j25J98j7J7j46J30p1
6891C6N0k8j51M6J68p9k41J71K20j59Mm0K6J30j73pNJ52M9l04Q3P6J27j84p4K44
6917A47j83l2J82nr2n9J43R1Ll27J98j5q4j50J53O5j2m8k2P9j17P2j20L8Q0K4
$$ plain form
6943 9 134 33 256 49 -30 -199 -90 -43 -118 31 -116 -56 79 7 24 -222 27 87 -126 -110 44 77 -41 -41
6967 -41 -22 -17 -77 -240 89 16 208 -85 -102 -101 119 72 -36 39 -56 -136 87 -5 40 -77 53 180 -49 140 -91
6992 -91 89 135 -72 -60 -21 -22 -60 59 -6 -34 135 -186 -27 42 -15 -85 -54 62 -68 -173 -173 30 -97 -10 107
7017 107 -29 -49 -140 -28 125 212 4 43 -32 -74 -96 192 -93 75 -13 3 141 -59 87 139 175 47 -59 135
7041 135 -25 56 -51 105 2 -56 -169 -25 55 -156 136 -96 163 88 -61 44 -127 -64 52 -18 -62 69
7063 69 297 123 -135 -95 -28 -114 121 -30 124 95 -63 -119 -120 59 80 -37 95 124 -196 24 1 -45 58 94
7087 94 60 24 102 19 20 113 159 -135 163 154 36 -11 -96 -25 -200 17 -85 -66 52 39 123 38 7 11 -23 9 -93 144
7115 144 21 57 99 -140 132 68 8 84 12 24 67 -146 -90 9 162 83 -102 -46 -249 105 -148 9 -37 -13 17
$$ packed form
6943IJ25j01K23k07p9j69J09M7p5J49j47O0J35p2J7k46K49O0k13J6J54L3j18%
6967d1J9No0j63L29p3J92k93j7JK20m7j08P5r5q0K23r2M5j17J30J27k29J89k31
6992i1J80M6k07J2L9jl8J19o5k8J69l21J59O9n7p0L1J16j30j05%K03j27Q7J17
7017A07j36k0r1J12J53Q7k08L9p5m2k2K88k85J68q8J6J38k00J46N2L6j28j06J94
7041A35j60Q1j07J56j03n8j13J44Q0k11K92k32K59p5j49J05j71O3J16p0m4J31
7063F9K28j74k58M0O7q6K35j51J54k9j58n6jJ79K1j17J32K9l20K20k3m6J03L6
7087I4l4l6P8q3JR3M6k94K98rj18m7q5P1j75K17j02J9J18j3Q4q5l1Ml4L2j02K37
7115A44j23L6M2k39K72o4o0P6p2J2M3k13N6R9J53p9j85N6k03L54k53J57m6K4L0
$$ plain form
7140 17 -44 -30 -24 -17 23 113 11 -26 15 102 -47 -16 28 178 140 115 82 -99 -137 -189 -152 55 52 -50 -2 -165 84 -63
7168 -63 5 -50 92 -13 31 -10 81 -20 92 -193 98 -5 43 -187 -87 -78 -57 123 87 -20 29 13 16 -17 -115 -226
7194 -226 -101 118 -84 -8 86 -16 -82 172 186 -145 -4 -17 -76 67 143 80 19 97 -18 -45 -27 98 -128 -67
7218 -67 68 150 -63 56 -89 220 74 -99 2 -132 85 -121 109 -123 153 -97 -92 50 -8 -16 -99 -121 170
7241 170 -7 52 114 38 100 6 -90 -192 -23 -74 -3 -216 -185 -70 -22 155 60 25 28 50 -4 153 -40 -69 -85 54
7267 54 161 220 136 -147 -91 63 -82 -102 50 -41 181 67 -14 -27 10 -13 -11 -97 17 16 -46 47 50 -15 -39 -42 -45 -59 -171
7296 -171 -14 95 -21 -35 -5 150 24 12 -62 -62 -159 -4 31 -72 18 -32 113 -6 32 36 -27 60 -67 -50 49 164
7322 164 -39 29 -17 113 18 -62 99 -207 30 -62 -21 -45 -60 0 11 -6 -28 40 -79 90 98 -74 99 23 -13 -82
$$ packed form
7140A7o1J4OPM0R0j02l7M1Q7j49L1M4J50l8k5l3j81l8n2L7K07lj02M8j63K49j47
7168f3O8n5J42j05M4m1R1j01J12k85K91j03M8k30J00RK1J80l6j07M9j6Ll3r8j11
7194b26J25K19k02P6R4j02o6K54J4l31J41j3n9J43P6o3o1P8j15k7J8J25k26O1
7218f7J35Q2k13J19j45L09j46j73J01j34K17k06K30k32K76k50NJ42n8qq3k2K91
7241A70j77N9O2p6O2r4r6j02J69n1P1k13L1J15M8J77r5l5LK2n4J57j93k9j6J39
7267E4J07N9q4k83N6J54j45k0J52r1K22j14q1j3L7k3Kq6J14jo2R3Lo5k4llj4j12
7296a71J57J09j16j4L0J55j26j2p4%r7J55L5j03R0n0J45j19L8Mo3Q7j27J7R9J15
7322A64k03O8m6J30r5q0J61l06K37r2M1k4j5O0J1j7k2O8j19J69Qj72J73p6l6o9
$$ plain form
7348 -82 -217 -27 -9 87 -8 -26 -77 -80 -117 -19 94 62 44 121 37 80 -157 70 46 91 -103 137 30 -10 51 2 2
7375 2 -78 -33 -53 24 -12 83 51 8 57 -184 -64 -32 -68 -114 -62 36 91 158 13 -11 112 102 -47 74 69 -34 210
7402 210 -171 -284 74 -127 -22 211 9 -50 -134 -5 -192 -86 -273 238 14 195 -65 -119 38 -109 15
7423 15 -126 -98 85 -83 -34 -113 55 65 18 -26 8 155 87 -112 3 -104 127 228 85 11 7 56 136 55 156
7448 156 -25 73 -117 -124 -4 -121 52 158 -45 -146 -153 -26 -42 3 36 -82 2 58 24 33 23 17 -57 86 -220 -39
7474 -39 -16 -75 38 30 -90 -110 -95 62 -49 -55 -84 127 1 147 -68 61 -39 -107 -247 -45 -62 -141 260 -48
7498 -48 -72 -80 -23 -29 33 68 94 -178 -70 53 29 -75 75 75 -31 -56 115 -72 -94 223 197 -125 -63 138 -101 -35
7524 -35 176 107 61 174 -75 135 -182 -10 204 91 -141 -132 215 168 155 -14 36 174 -124 -11 74 -108 45
$$ packed form
7348h2j35J90J8R6r5j8n1ll7R8J13l2j8P7q4M3k37K27k4M5j94K40j07m0O1m9%
7375Bq0M5k0P7l6R5l2m3M9k41J20L2l6m6N2R8N5O7j45k4J23j0j49J21nj03K44
7402B10l81j13L58k01J05K33k02n9q4J29j87J06j87N11k24J81k60n4J57j47J24
7423A5j41K8J83j68M9p9J68J0m7m4L4J47o8j99J15j07K31J01j43p4mM9Q0q1J01
7448A56j81R8j90pJ20j17J73J06k03j01pJ27j6M5L3j18Q4N6l4Rj0op4J43l06J81
7474c9K3n9J13qj20k0J5J57j11ok9K11j26J46k15J29j00o8j40K02j7p9M01l08
7498d8k4qN7oO2L5K6k72J08J23k4j04J50%j06k5J71j87k2L17k6l22O2K01k39O6
7524c5K11o9m6J13k49K10l17J72K14j13k32RL47m7j3j69N0J38k98J13Q5j82J53
$$ plain form
7547 45 103 20 77 11 -9 103 46 16 92 -4 -46 128 315 68 -58 -31 84 -18 102 190 30 91 5 -5 171
7572 171 -170 44 63 114 144 -98 -82 84 0 -184 46 -10 41 -46 86 -101 158 12 -74 11 12 -30 158 120 10
7597 10 128 -98 0 5 -12 -107 72 -70 -8 113 -61 -139 -197 -78 34 -30 76 66 -71 152 79 230 224 -137 7
7622 7 -27 -209 -110 14 -123 -90 23 119 156 65 -20 -139 93 143 -51 -246 -5 9 -42 65 -32 99 156 31 44
7647 44 -72 -24 81 -124 26 37 -93 112 -74 284 14 8 -21 -119 127 33 -77 120 39 -4 98 70 -40 -51
7671 -51 -19 -124 128 173 -10 -7 -93 67 -96 86 77 -84 -24 70 115 12 15 10 146 -54 21 -96 -142 -130 43 40 -10
7698 -10 -26 79 -62 147 53 15 -3 51 -43 -15 96 85 0 -53 -55 86 -30 76 -23 -127 -11 -2 9 131 230 -108
7724 -108 -31 -54 117 178 51 71 -72 112 63 -91 -154 -3 147 25 78 27 79 -39 4 89 15 -190 27 14
$$ packed form
7547D5N8q3N7o6k0J12n7l0P6r6m2J74J87k47j26K7J15j02J20Q8j60O1q6j0J76
7572A71l41K14J9N1L0k42J6J66q4j84K30n6N1q7J32j87K59j46q6Q5Jm2J88l8j10
7597A0J18k26R8Nj7r5J79j42O2J21j74p8n8J19J12o4J06j0j37K23p3J51ol61J44
7622Gl4j82R9J24j37L3J13R6L7r1q5j19K32N0j94j95K41J4n1J07r7J31N7j25J3
7647D4j16M8J05k05J50J1j30K05j86L58k70ok9r8K46r4j10J97q1m3J02k8j10j1
7671e1L2j05K52M5j83Lq6J60j63J82rj61O0R4M5j03LnJ36k00P5j17m6J2J73ln0
7698a0j6J05j41K09r4l8j8N4r4K8J11j1q5n3kJ41j16J06r9j04J16RJ1J22R9l38
7724a08P7k3J71O1j27K0j43J84m9j54o3J51J50j22N3n1N2j18M3Q5p4k05K17j3
$$ plain form
7748 14 -91 -22 -140 -31 -4 -26 207 41 -31 86 50 -135 -13 -84 150 16 -128 -78 22 -8 113 -76 -57
7771 -57 -69 -32 -38 219 169 -26 -19 105 -69 -126 75 39 -140 167 -30 -26 -118 -62 -20 -64 -22 -47 -72 -109 90 65 38
7798 38 -39 -134 1 -8 -91 12 -239 -104 135 -88 -19 -158 -43 -13 71 -175 -71 146 3 -45 58 123 -163 13
7822 13 -28 58 14 -48 -213 119 57 -89 -9 143 55 -6 70 -13 89 163 -72 -72 -4 -50 91 -149 50 -8 -76 21
7848 21 -15 -81 -46 -64 -186 -138 -37 139 -8 -30 11 -63 -193 26 169 -6 57 59 9 164 142 -10 74 -81 145
7873 145 20 19 128 8 -66 -208 96 11 -6 68 109 33 132 0 -210 -55 -77 -145 -190 -27 20 -93 -121 24 -165
7898 -165 4 -137 -44 -59 -50 -141 119 -120 -83 -46 78 53 -54 -51 48 1 -114 61 -95 -116 -24 -36 -82 -37 175 -30
7924 -30 -45 76 1 148 246 13 -117 25 76 -10 64 28 122 -73 -47 98 152 18 -115 -186 -16 -77 -20 34 98
$$ packed form
7748A4j05O9j18J09K7k2K33j66p2J17l6j85J22p1K34j34j44N0J00l0J21j89J9
7771e7j2L7oK57n0j95PJ24j74n7K01l6j79L07j97Mr2N6M2m4M2k5k5l7J99k5k7
7798C8p7r5J35rq3J03k51J35K39k23O9j39J15L0Q4k46J04K17j43m8J03O5k86J76
7822A3m1Q6m4o2j65L32o2j46Q0J52q8o1P6q3J02P4k35%O8m6J41k40J99n8o8R7
7848B1l6o6L5j8j22M8J01J76j47k2M1p4j30K19J43j75O3Kn0J55k2j52Q4j55K26
7873A45j25jJ09j20p4j42L04q5j7P4M1p6R9j32k10J55k2o8m5J63M7j13k8J45j89
7898a65J69j41R3j5Rr1K60k39L7L7J24k5j07LR9m7j15J75j56k1R2j2m6M5K12k05
7924c0j5J21p5J47R8k33j30J42N1q6P4l6R4j95K6J45N4j34j33p1J70o1N7N4O4
$$ plain form
7949 98 79 -79 187 36 105 116 86 84 44 -32 86 126 -6 -62 109 -35 -62 63 -72 -65 19 -41 -36 -232 25 191
7975 191 -88 -45 -45 43 -113 56 -47 -41 32 -86 65 -203 27 76 -21 36 62 -144 130 62 -128 -56 -43 -101 -16
8000 -16 152 161 -135 149 151 -101 74 23 -25 42 146 52 19 -171 1 1 73 109 -58 -189 -202 -67 67 157 -292
8025 -292 -171 -167 60 -71 -29 -55 -87 54 6 70 0 -11 -52 -25 34 27 -1 55 -198 42 71 -165 -10 -82 -29 72
8051 72 85 -32 -291 -125 -90 -61 -48 -52 -109 -166 81 9 55 85 39 21 66 -2 74 -74 36 -73 -48 -170 -22 54
8077 54 -5 160 -22 -78 111 112 15 11 58 -14 -86 40 41 -72 178 -7 13 -2 -104 -60 36 0 121 -116 -252 46
8103 46 12 5 -67 -189 -8 26 -128 111 81 180 -36 14 57 169 6 95 -139 -32 -90 -50 -199 70 57 -48 7
8128 7 -44 -58 -145 35 0 -8 -39 -13 223 182 139 -69 -83 -25 0 123 -84 14 -166 -59 -16 -141 -140 31 83 88 -82
$$ packed form
7949I8j9j58K66j51O9J1l0km0p6J18M0j32n6J71j44k7J25j35PQ4o0Nj96K57J66
7975A91k79M3%Q8j56J69j03OP3j18J51k68K30M9r7N7K6k06K74o8j90P2J3n8Q5
8000a6J68Rk96K84Kk52J75n1m8O7J04r4l3j90J72%P2L6j67j31j3J35J34R0m49
8025b92J21MK27j31M2k6l2J41m8O4p0j1m1K7N9pk8N6k53K40K9k36J55p2N3J01
8051G2J3j17k59J66L5K9J3mn7n7K47p2M6L0m6j8M5o8P6j48J10j09K5j22J48P6
8077E4n9J65j82n6J89Jr7mM7p2p2J26Jj13K50j85K0j5j02M4R6l6J21k37j36K98
8103D6l4pp2j22J81L4j54K39l0R9k16N0M3J12j63Q9k34J07n8M0j49K69j3j05N5
8128Gn1j4q7J80l5ql1K6K36m1m3k08j4N8K5J23k07R8j80J07M3j25JJ71N2Nj70
$$ plain form
8155 -82 -180 24 158 -103 -273 -88 -4 31 -48 -75 -121 19 -63 231 42 -10 98 -70 -23 26 -85 86 72 -171
8179 -171 42 44 15 -68 95 78 67 3 61 43 19 116
$$ packed form
8155h2r8K04J34k61j70J85Q4L5p9k7m6J40q2K94j89n2J08j68M7M9j11J71j4k43
8179a71K13Kk9q3J63j7j1o4N8j8k4R7
8191A16
$$ Imaginary data points
##PAGE= N=2
##DATA TABLE= (X++(I..I)), XYDATA
$$ plain form
0 0 0 0 0 0 -8 8 -8 8 -8 16 -16 24 -32 32 -40 48 -64 72 -88 104 -120 140 -160 187 -214 245 -281 317 -363
29 -363 407 -460 517 -578 649 -723 807 -898 996 -1107 1226 -1357 1504 -1664 1844 -2042
45 -2042 2267 -2516 2802 -3132 3510 -3961 4497 -5157 5987 -7068 8543 -10683 14094 -20404
59 -20404 36090 -159020 -187484 46743 -63259 -19803 118090 172751 12474 -131739 -148293
70 -148293 -112807 -210870 -231323 -75432 68265 87767 129685 178894 155734 46096 -42224
81 -42224 -65972 -89315 -124713 -44395 87253 132733 147487 204534 207272 117241 2471 -49654
93 -49654 -50534 -87141 -116297 -8788 124775 120046 84669 132458 133148 2400 -126902 -126134 -82962
106 -82962 -127045 -149996 -18144 109491 75758 13201 41278 50017 -61398 -182932 -164465
$$ packed form
0@%%%%qJ6j6J6j6K4l2M0n6O4p2Q8j12J36j60J92k24K60l00L47m01M59n26N98o80
29c63P70q67R77j095J227j372J530j705J894k103K333k583K861l168L508l886
45b042M309m783N318n934O642p471Q458r654J1144j3055J5611j9226K4777l4498
59b0404N6494j95110k8464K34227j10002M3456J37893N4661j60277j44213j6554
70a48293L5486r8063k0453J55891J43697J9502M1918M9209k3160j09638q8320
81d2224k3748k3343l5398Q0318J31648M5480J4754N7047K738r0031j14770n2125
93d9654q80l6607k9156J07509J33563m729l5377M7789O90j30748j29302P68M3172
106h2962m4083k2951J31852J27635l3733o2557K8077Q739j11415j21534J8467
$$ plain form
117 -164465 -81804 -87498 -93624 18725 112339 83075 38553 32593 4282 -62873 -113634 -92525
129 -92525 -40882 -21497 21563 105063 122844 78448 69616 62426 -6924 -75417 -63994 -9165
141 -9165 2499 -1155 66810 138468 99257 29798 34028 35280 -37944 -100781 -66482 2803 4357
154 4357 -12250 45772 101008 48332 -27590 -26727 -17281 -68520 -109263 -66880 139 7528 -6479
167 -6479 27152 57701 18665 -37461 -46402 -41174 -62045 -69125 -26220 19137 24687 27982 49261
180 49261 41120 -435 -19490 -13617 -27499 -45719 -18980 32161 43728 27039 43036 67042
192 67042 32707 -21395 -20186 3828 -13225 -34670 256 49823 43256 13369 25347 42775
204 42775 6760 -40051 -34049 -8731 -17169 -30165 -815 35751 24961 -3488 778 9054 -18050
$$ packed form
117a64465Q2661n694o126J12349R3614k9264m4522n960k8311o7155n0761K1109
129i2525N1643J9385M3060Q3500J7781m4396q832p190o9350o8493J1423N4829
141i165J1664l654O7965P1658l9211o9459M230J252p3224o2837L4299O9285J554
154D357j6607N8022N5236n2676p5922Q63R446n1239m0743M2383O7019P389j4007
167f479L3631L0549l9036n6126q941N228k0871p080M2905M5357N550L295K1279
180D9261q141m1555j9055N873j3882j8220K6739N1141J1567j6689J5997K4006
192F7042l4335n4102J209K4014j7053k1445L4926M9567o567k9887J1978J7428
204D2775l6015m6811O002K5318q438j2996K9350L6566j0790k8449M266Q276k7104
$$ plain form
217 -18050 -46825 -37345 -15496 -15888 -16839 6867 24160 11142 -3602 -689 -5904 -27086 -32568 -14662
231 -14662 -4090 -7382 5852 30173 25991 3052 2566 12400 -3706 -25876 -15200 11755 12493
244 12493 451 16261 38754 24810 -2631 -692 10466 -4436 -23126 -9169 15785 14556
256 14556 2524 12250 24113 9366 -11221 -9534 -3631 -13738 -22005 -9136 8111 6582 -183
269 -183 6315 8431 -6432 -17143 -12784 -10695 -17119 -15189 -674 7816 1725 752 9521 5018 -11246
284 -11246 -13810 -5058 -5878 -11800 -3180 13999 15252 3296 4478 14293 6492 -9457 -7308 2930
298 2930 947 -4668 4071 18492 16491 3656 4254 10132 991 -10535 -6712 1371 323 -2211 4643
313 4643 12210 7673 -1102 -116 783 -7678 -13469 -8698 -3484 -3081 -1997 3543 6489 403 -4380 -2611
$$ packed form
217a8050k8775R480K1849l92r51K3706J7293j3018j4744K913n215k1182n482J7906
231a4662J0572l292J3234K4321m182k2939m86R834j6106k2170J0676K6955P38
244A2493j2042J5810K2493j3944k7441J939J1158j4902j8690J3957K4954j229
256A4556j2032R726J1863j4747k0587J687N903j0107q267J2869J7247j529o765
269a83O498K116j4863j0711M359K089o424J930J4515Q490o091r73Q769m503j6264
284a1246k564Q752q20n922Q620J7179J253j1956J182R815p801j5949K149J0238
298B930j983n615Q739J4421k001j2835N98N878r141j1526L823Q083j048k534O854
313D643P567m537q775R86Q99q461n791M771N214M03J084N540K946o086m783J769
$$ plain form
329 -2611 -4092 -10530 -11728 -6124 -1842 -867 1147 5865 6715 741 -2544 -494 -2349 -7395 -6288 306
345 306 4673 4895 5055 8705 8670 2083 -1054 1044 -750 -4365 -1991 3110 6317 6042 5545 6932 5291
362 5291 -147 -3133 -2653 -4222 -4650 -1373 1445 3290 3567 2158 1303 309 -3372 -6155 -6797 -6516 -4460
379 -4460 -1766 417 2953 2689 -684 -1213 -717 -3973 -6663 -5124 -2720 -1495 -177 3093 5943 3641
395 3641 224 1556 904 -3885 -4907 -520 1952 1659 2721 5745 6668 2592 426 2747 1100 -4278
411 -4278 -3981 979 2971 2145 2250 4932 4678 -446 -2658 -354 -1238 -5208 -4466 419 2525 119 -306
428 -306 2965 2113 -3941 -4540 -795 -3116 -7080 -2519 3446 1677 -2618 451 4545 -163 -6480 -2043
444 -2043 3290 -3418 -7102 2361 7843 884 -3717 2840 7365 -958 -6958 718 5934 -1898 -4790
$$ packed form
329b611j481o438j198N604M282R75K014M718Q50n974l285K050j855n046J107O594
345C06M367K22J60L650l5o587l137K098j794l615K374N101L207k75m97J387j641
362E291n438k986M80j569m28L277K818J845K77j409q55r94l681k783o42K81K056
379d460K694K183K536k64l373n29M96l256k690J539K404J225J318L270K850k302
395C641l417J332o52m789j022M387K472k93J062L024R23m076k166K321j647n378
411d278K97M960J992q26J05K682k54n124k212K304q84l970P42M885K106k406m25
428c06L271q52o054n99L745k321l964M561N965j769m295L069M094m708o317M437
444b043N333o708l684R463N482o959m601O557M525q323o000P676N216p832k892
$$ plain form
459 -4790 4677 8728 685 -4166 2340 6356 -1316 -6548 1081 5543 -1733 -3385 4215 5502 -1988
474 -1988 -4837 1370 3110 -4435 -5160 2766 3177 -4184 -2135 4634 1579 -6340 -3639 4106 807 -7594
490 -7594 -2448 6911 1448 -6837 -241 7024 -1064 -9193 -1241 8484 800 -8769 717 11233 1171
505 1171 -8974 487 8900 -934 -9529 333 10756 1626 -7873 2040 10448 36 -8110 -470
519 -470 5327 -1211 -5834 2209 7162 -121 -3689 3599 3820 -4895 -5003 1668 -17 -5415 -1000 6939
535 6939 3000 -5861 -795 7529 -886 -11727 -3932 7053 356 -9264 344 13093 3770 -10838
549 -10838 -2154 10561 -1098 -15042 -4215 10772 3514 -8181 1115 14121 4049 -10657 -2937
562 -2937 7701 -2076 -11489 -1646 9605 3843 -2928 3716 8420 -936 -7069 -1017 378 -6614 -4580
$$ packed form
459d790R467M051q043m851O506M016p672n232P629M462p276j652P600J287p490
474a988k849O207J740p545p25P926M11p361K049O769l055p919K701P745l299q401
490g594N146R359n463q285O596P265q088q129P952R725p684r569R486J0516j0062
505A171j0145R461Q413r834q595R862J0423r130r499R913Q408j0412q146P640
519d70N797o538m623Q043M953p283l568P288K21q715j08O671j685n398M415P939
535F939l939q861N066Q324q415j0841P795J0985o697r620R608J2749r323j4608
549a0838Q684J2715j1659j3944J0827J4987p258j1695R296J3006j0072j4706P720
562b937J0638r777r413R843J1251n762o771O644M704r356o133O052J395o992K034
$$ plain form
577 -4580 5189 5706 -294 1353 8258 2392 -9388 -6008 3264 -3153 -12022 -1576 12889 6671 -6389
592 -6389 273 12189 757 -16550 -8115 7582 -134 -12979 -880 17543 10005 -8012 -3032
605 -3032 10720 206 -17038 -9332 6449 3115 -6415 2004 15247 8913 -4709 -2559 3107 -4829
619 -4829 -11448 -4658 1964 1224 2969 9560 9012 -347 -2781 2654 -4158 -15137 -7573 6054 2708
634 2708 -4360 5391 17734 8083 -10743 -7557 6273 -3786 -20281 -8193 12299 8401 -4113
647 -4113 2876 17110 8612 -13262 -11932 3099 -2964 -15759 -5632 11678 11665 2194 2566 10513
661 10513 4012 -11866 -11620 -2189 -5143 -8059 1912 10352 9582 6735 5693 3805 -5065 -11100 -5710
676 -5710 -4605 -10769 -1697 13043 10505 2018 5365 10620 785 -16528 -14208 2774 -723 -14361
$$ packed form
577d580R769N17o000J647O905n866j1780L380R272o417q869J0446J4465o218j3060
592f389O662J1916j1432j7307Q435J5697p716j2845J2099J8423p538j8017M980
605c032J3752j0514j7244P706J5781l334r530Q419J3243o334j3622K150N666p936
619d829o619O790O622p40J745O591n48r359k434N435o812j0979P564J3627l346
634B708p068R751J2343r651j8826L186J3830j0059j6495J2088K0492l898j2514
647d113O989J4234q498k1874J330J5031o063j2795J0127J7310j3r471L72P947
661A0513o501j5878K46R431k954k916R971Q440p70k847j042j888q870o035N390
676e710J105o164R072J4740k538q487L347N255r835j7313K320J6982l497j3638
$$ plain form
690 -14361 -450 21127 13770 -2910 -1411 9139 1339 -19518 -17792 3422 3801 -7915 2156
703 2156 17622 13372 -247 -4290 240 -2639 -14152 -12458 884 2606 1596 9772 12368 6367
717 6367 928 -3009 -5576 -9139 -11800 -3433 3284 -59 4908 16078 10399 -2338 -2956 -48 -5586
732 -5586 -15765 -12330 5384 9184 -2517 3491 18942 10173 -8964 -10355 123 -1629 -15719
745 -15719 -12792 9458 14106 457 2388 13653 7327 -8106 -12399 -5711 -2362 -8212 -6129 7813
759 7813 11257 5248 6100 6190 -1572 -6920 -7804 -6893 -6436 -4372 3975 10128 5880 4156 8945 2726 -9114
776 -9114 -9437 -3817 -3645 -7379 -3230 10716 13365 1454 221 8935 1588 -13263 -12300 -1343 782
791 782 -5478 -2178 12541 14619 328 -3523 3385 -220 -11065 -11369 -2325 3126 365 1549 9569
$$ packed form
690a4361J3911K1577p357j6680J499J0550p800k0857J726K1214L79j1716J0071
703B156J5466m250j3619m043M530k879j1513J694J3342J722j010Q176K596o001
717F367n439l937k567l563k661Q367O717l343M967J1170n679j2737o18K908n538
732e586j0179L435J7714L800j1701O008J5451q769j9137j391J0478j752j4090
745a5719K927K2250M648j3649J931J1265o326j5433m293O688L349n850K083J3942
759G813L444o009Q52R0p762n348q84R11M57K064Q347O153m248j724M789o219j1840
776i114l23N620J72l734M149J3946K649j1911j233Q714p347j4851R63J0957K125
791G82o260L300J4719K078j4291l851O908l605j0845l04R044N451k761J184Q020
$$ plain form
806 9569 9972 1456 -2056 -2440 -5985 -8218 -5272 -1271 1156 3356 7542 9302 2429 -2218 154 -2009
822 -2009 -9878 -8917 -56 3602 681 2665 10490 9205 -2533 -6532 -772 -1683 -9423 -7873 2977
837 2977 7070 1660 1859 9264 7402 -4787 -8373 -2411 -1988 -6928 -5201 4119 8583 4083 1560
852 1560 4732 2770 -4562 -7163 -4281 -3312 -3670 187 5153 6028 4559 4342 2692 -3769 -6920 -3784
868 -3784 -2422 -4548 -2519 4717 7914 3828 1083 3683 2125 -6250 -8563 -3034 -268 -2539 -744
883 -744 6137 8581 3171 -717 1170 -499 -6763 -7307 -2151 729 -156 1740 6561 7406 1722 -2061
899 -2061 -1155 -2338 -6531 -5694 -1152 1710 2625 3920 5825 4575 33 -2242 -2676 -4918 -5397 -2147
915 -2147 684 1395 3337 5810 5630 1267 -3053 -2578 -2858 -5910 -5180 763 3763 2867 3170 4914 4717
$$ packed form
806I569M03q516l512l84l545k233K946M001K427K200M186J760o873m647K372k163
822b009p869R61Q861L658k921J984P825j285j1738l999N760r11p740J550J0850
837B977M093n410J99P405j862j2189l586N962M23m940J727R320M464m500k523
852A560L172j962p332k601K882R69l58L857M966Q75j469k17j650o461l151L136
868c784J362k126K029P236L197m086k745K600j558q375k313N529K766k271J795
883g44O881K444n410l888J887j669o264n44N156K880q85J896M821Q45n684l783
899b061R06j183m193Q37M542K862R15J295J905j250m542k275m34k242m79L250
915b147K831P11J942K473j80m363m320M75k80l052P30N943L000q96L03J744j97
$$ plain form
932 4717 -734 -4870 -3456 -2635 -4652 -3506 1473 4974 4623 3320 3367 1861 -3093 -5349 -3618 -2519
948 -2519 -2933 -931 2783 4820 4641 3068 2184 -664 -4323 -5298 -3568 -2616 -982 2142 4428 4637 3308
965 3308 2075 294 -2763 -4954 -4154 -2480 -1748 -13 3736 5556 4331 1797 -206 -1449 -3828 -5542
981 -5542 -3532 -511 628 1696 3981 5112 3504 352 -1895 -2605 -4036 -4382 -2430 178 2248 3601
997 3601 4235 3701 1838 -1017 -3377 -3656 -3837 -2809 -718 1416 3585 4099 3474 2487 420 -2536 -4047
1014 -4047 -3837 -3105 -1625 910 3173 4207 3543 2056 759 -1499 -3905 -3961 -2486 -1771 -405 1820
1030 1820 3987 4454 2861 611 -598 -2593 -4528 -3724 -1429 259 1297 2442 3894 3861 1374 -959
1046 -959 -1681 -3094 -4440 -3073 -25 1735 2241 3213 4160 2471 -901 -2486 -2082 -2891 -3644 -1806 831
$$ packed form
932D717n451m136J414Q21k017J146M979L501l51j303M7j506m954k256J731J099
948b519m14K002L714K037j79j573q84k848l659r75J730R52J634L124K286K09j329
965C308j233j781l057k191Q00J674P32J735L749J820j225k534k003j243k379j714
981e542K010L021J139J068K285J131j608l152k247p10j431l46J952K608K070J353
997C601O34n34j863k855k360k79j81J028K091K134K169N14o25r87k067k956j511
1014d047K10P32J480K535K263J034o64j487j297k258k406n6J475P15J366K225
1030A820K167M67j593k250j209j995j935Q04K295J688J038J145J452l3k487k333
1046i59p22j413j346J367L048J760N06R72R47j689l372j585M04q09p53J838K637
$$ plain form
1063 831 2013 2613 3379 3402 980 -2141 -2743 -2938 -3260 -2117 564 1987 2212 3037 3013 1523 -1029 -2697
1081 -2697 -2462 -2641 -3075 -1117 2086 3201 2182 2346 2560 561 -2984 -3861 -1910 -1058 -2075 -534 3148
1098 3148 3542 1998 1019 1365 -305 -3315 -3910 -1271 -609 -1032 907 3423 3092 1648 652 101 -1877
1115 -1877 -3340 -2329 -709 -489 17 2435 3257 1474 689 861 -703 -3544 -3481 -362 791 -869 195
1132 195 4090 3521 -362 -1334 653 -103 -3870 -3965 718 1919 -622 -144 4161 3705 -796 -2899 -896
1149 -896 -258 -2690 -2750 606 2152 496 639 2326 2272 -436 -1699 -1519 -1720 -1881 -718 1189 1005 662
1167 662 2477 1981 -863 -1665 -141 -273 -2300 -2283 1156 2515 -122 -600 2911 2830 -2143 -3554 164
1184 164 1209 -1645 -2772 1890 3722 -336 -1652 2088 2454 -1483 -3784 -510 1723 -837 -2089
$$ packed form
1063H31J182O00P66K3k422l121o02j95l22J143K681J423K25Q25k4j490k552j668
1081b697K35j79m34J958L203J115j019J64K14j999l545q77J951Q52j017J541L682
1098C148L94j544r79L46j670l010n95K639O62m23J939K516l31j444r96n51j978
1115a877j463J011J620K20N06K418Q22j783p85J72j564k841O3L119J153j660J064
1132A95L895n69l883r72J987p56l767r5M683J201k541M78M305m56m501k103K003
1149h96O38k432o0L356J546j656J43J687n4k708j263J80k01j61J163J907j84l43
1167F62J815m96k844q02J524j32k027J7L439J359k637m78L511q1m973j411L718
1184A64J045k854j127M662J832m058j316L740L66l937k301L274K233k560j252
$$ plain form
1199 -2089 1315 2918 464 -791 719 380 -1223 -1627 -195 389 -291 210 1227 600 13 840 408
1216 408 -1485 -1744 645 1076 -1165 -1126 2113 2494 -1420 -2031 1826 1966 -2497 -2759 1875 2882 -1649
1233 -1649 -2835 1860 3915 -1349 -3501 799 2825 -1365 -2997 912 3103 1 -2511 357 2234
1248 2234 -2 -1831 -573 1158 189 -672 17 579 106 30 596 -485 -1084 277 795 -640 -477 1547
1266 1547 1661 -1320 -2166 1025 1883 -1602 -2809 1252 2722 -755 -2091 1674 3465 -1358 -3832 636
1282 636 2592 -1736 -3158 1263 3476 189 -2643 503 2906 -606 -3366 -412 1760 -244 -1710
1297 -1710 203 2658 1439 -770 -573 553 -578 -1105 -478 -661 -129 1289 1248 102 -64 1159 1005
1314 1005 -1759 -2994 709 1932 -1719 -2136 2587 3582 -215 -2441 455 2558 -1708 -4354 371
$$ packed form
1199b089L404J603k454j255J510l39j603m04J432N84o80N01J017o27n87Q27m32
1216D08j893k59K389M31k241L9L239L81l914o11L857J40m463k62M634J007m531
1233a649j186M695K055n264k152M300K026m190j632L909K191l102k512K868J877
1248B234k236j829J258J731r69q61O89N62m73p6N66j081n99J361N18j435J63K024
1266A547J14k981q46L191Q58l485j207M061J470l477j336L765J791m823k474M468
1282F36J956m328j422M421K213l287k832L146K403l512k760K954K172k004j466
1297a710J913K455j219k209J97J126j131n27O27j83N32J418m1j146j66J223j54
1314A005k764j235L703J223l651m17M723R95l797k226K896K103m266k646M725
$$ plain form
1329 371 3036 -1030 -2068 1882 3739 347 -2504 -705 1813 -1479 -3657 -76 2168 467 -69
1344 -69 641 1685 1004 -1494 -1512 346 -921 -1388 275 390 590 1984 1359 -367 -595 -426 -194 -1457
1362 -1457 -2663 515 2718 -541 -1086 2833 2902 -1032 -2959 -724 1856 -1559 -4175 652 4238 511
1378 511 -1520 1246 2417 -390 -2814 -1818 1242 -464 -2817 445 3352 1080 -209 402 613 -474
1394 -474 -2068 -1888 229 -166 -613 1645 1735 439 895 597 -965 -1382 -1268 -633 -469 -1143 968 3313
1412 3313 596 -1062 1141 1188 -2052 -2723 -679 1247 -13 -1924 1240 3951 777 -2152 6 1037
1428 1037 -1246 -2759 -1497 1461 1617 -701 1027 2911 616 -1089 -956 -556 -527 -1325 -1191 880 1316
1445 1316 433 1271 1149 -588 -768 -348 -1428 -1455 -253 574 753 227 1143 1796 -160 -2068 -263 347
$$ packed form
1329C71K665m066j038L950J857l392k851J799K518l292k178L581K244j701n36
1344f9P10J044o81k498j8J858j267m67J663J15K00J394o25j726k28J69K32j263
1362a457j206L178K203l259n45L919O9l934j927K235K580l415k616M827L586l727
1378E11k031K766J171k807k424R96L060j706k353L262K907k272j289O11K11j087
1394d74j594J80K117l95m47K258R0j296M56k98j562m17J14O35J64o74K111K345
1412C313k717j658K203M7l240o71K044J926j260j911L164K711l174k929K158J031
1428A037k283j513J262K958J56k318J728J884k295j705J33M00K9p98J34K071M36
1445A316q83Q38j22j737j80M20j080k7J202Q27J79n26R16O53j956j908J805O10
$$ plain form
1463 347 -1813 -1874 241 2216 1014 -442 812 2095 -854 -2672 -624 402 -739 -1359 197 2313
1479 2313 1793 -326 8 1037 -466 -2216 -1180 -33 -137 54 425 1613 1393 137 80 -558 -1322
1496 -1322 -1217 -328 -402 79 704 1730 1602 91 -299 344 -886 -2234 -1019 517 12 68 1068 2105
1514 2105 1143 -764 -724 173 -1157 -2134 -548 909 619 299 1058 2083 749 -1397 -1138 -420 -1176 -1479
1532 -1479 -249 985 1490 985 815 1271 352 -1520 -1501 -1190 -990 -273 454 940 1400 1152 1033 286 -1181
1551 -1181 -1305 -830 -1235 -1103 -66 1231 1536 1389 879 765 -245 -1921 -1625 -741 -943 -284 588 1645
1569 1645 1687 1145 402 150 -797 -2343 -1651 -800 -508 75 1335 1889 1540 745 -197 -475 -1456 -1989 -1215
1588 -1215 -296 63 1097 1555 1602 1329 476 -966 -1648 -1785 -1293 -638 -277 695 1854 1954 1285 604 -271
$$ packed form
1463C47k160o1K115J975j202j456J254J283k949j818K048J026j141o20J556K116
1479B313n20k119L34J029j503j750J036J147j04J91L71J188k20j256n7o38p64
1496a322J05Q89p4M81O25J026j28j511l90O43j230j348J215J536n05N6J000J037
1514B105r62j907M0Q97j330r77J586J457k90l20P59J025j334k146K59P18p56l03
1532a479J230J234N05n05j70M56r19j872J9L11K00P17P27M86M60k48j19p47j467
1551a181j24M75m05J32J037J297L05j47n10j14j010j676K96Q84k02O59Q72J057
1569A645M2n42p43k52r47j546O92Q51K92N83J260N54l49p95r42k78r81n33P74
1588a215R19L59J034M58M7k73q53j442o82j37M92O55L61R72J159J00o69o81q75
$$ plain form
1607 -271 -1126 -1634 -2002 -1156 -52 807 1119 1746 1606 1010 -31 -1253 -1499 -1430 -1632 -969 447 1384 1579
1626 1579 1534 1230 523 -630 -1755 -1591 -1286 -1090 -124 1003 1889 1948 1464 508 -365 -1269 -1869 -1624 -1131
1645 -1131 -84 680 1302 1847 1928 927 -106 -1028 -1628 -1863 -1332 -520 732 1206 1607 1932 1238 69
1663 69 -913 -1313 -1871 -1521 -627 176 922 1607 2034 1552 301 -824 -1067 -1400 -1766 -1071 73 942 1183
1682 1183 1477 1587 1001 -421 -1505 -1514 -1498 -1208 -436 648 1608 1572 1038 981 357 -1156 -1861 -1493 -1126 -665
1702 -665 -24 1240 1876 1538 952 319 -608 -1699 -1651 -962 -864 -114 942 1701 1339 978 564 -93 -1578
1721 -1578 -2218 -1187 -191 -227 215 1405 2059 1375 -65 -371 -422 -1663 -2164 -847 324 533 673 1520
1739 1520 1834 786 -507 -1006 -1071 -1312 -1301 -195 657 909 1290 1699 855 16 -709 -1405 -1737 -1504 -504
$$ packed form
1607b71q55n08l68Q46J104Q59L12O27j40n96j041j222k46O9k02O63J416R37J95
1626A579m5l04p07j153j125J64L05J96R66J127Q86N9m84r56q73r04o00K45M93
1645a131J047P64O22N45Q1j001j033r22o00k35N31Q12J252M74M01L25o94j169
1663F9r82m00n58L50Q94Q03P46O85M27m82j251j125k43l33l66O95J144Q69K41
1682A183K94J10n86j422j084rJ6K90P72J084R60l6n34n7o24j513p05L68L67M61
1702f65O41J264O36l38n86o33r27j091M8O89R8P50J056P59l62l61m14o57j485
1721a578o40J031R96l6M42J190O54o84j440l06n1j241n01J317J171K09J40Q47
1739A520L14j048j293m99o5k41J1J106Q52K52L81M09q44q39p25o96l32K33J000
$$ plain form
1758 -504 722 966 970 1894 1406 199 -754 -1254 -1073 -1380 -1243 83 1486 1217 870 1171 949 -388 -1969
1777 -1969 -1651 -787 -912 -984 711 1982 1538 375 594 493 -752 -1915 -1543 -329 -195 -80 1096 1765
1795 1765 1314 602 231 -794 -1254 -1548 -918 -486 88 1045 1828 1094 469 538 57 -1359 -2262 -1053 104
1814 104 296 103 1104 2240 1153 -426 -221 -333 -1443 -1928 -921 713 1030 280 1009 2100 1025
1831 1025 -854 -1128 -969 -1176 -1519 -517 871 1354 823 997 1044 206 -760 -1178 -1115 -1192 -707 393 1164
1850 1164 1043 1151 1295 158 -1021 -855 -708 -1384 -1150 113 1508 956 319 902 1496 -211 -1866 -1323
1868 -1323 -188 -881 -1195 132 2014 1589 123 299 906 -62 -1751 -1623 -181 171 -157 47 1459
1885 1459 1461 317 -62 -147 -754 -1215 -1045 -689 35 800 847 864 610 322 114 -884 -1489 -1004 -92 -424 -342
$$ packed form
1758e04J226K44MR24m88j207r53n00J81l07J37J326J403k69l47L01k22j337j581
1777a969L18Q64j25p2J695J271m44j163K19j01j245j163L72J214J34J15J176O69
1795A765m51p12l71j025m60k94O30M32N74R57P83p34o25O9m81j416r03J209J157
1814A04J92j93J001J136j087j579K05j12j110m85J007J634L17p50P29J091j075
1831A025j879k74J59k07l43J002J388M83n31J74M7q38r66m18O3p7M85J100P71
1850A164j21J08J44j137j179J66J47o76K34J263J395n52o37N83N94j707j655N43
1868a323J135o93l14J327J882m25j466J76O07r68j689J28J442L52l28K04J412
1885A459Kj144l79q5o07m61J70L56P24P65M7J7k54k88k08r98o05M85R12l32Q2
$$ plain form
1906 -342 948 1552 950 -408 -166 404 -919 -1917 -935 937 493 -427 408 1788 1105 -817 -795 436
1924 436 -258 -1675 -1022 821 1209 274 115 969 610 -389 -973 -813 -168 -493 -201 250 986 936 804 308
1944 308 -508 -531 -216 -873 -974 -72 853 513 -51 592 1256 469 -1128 -778 23 -494 -1119 -271 1136 1051
1964 1051 -39 -53 757 286 -1256 -1070 268 90 -767 -113 1111 1256 30 -331 355 -2 -1108 -959
1982 -959 -243 225 379 135 472 923 411 9 -337 -734 -567 -146 -290 -229 618 1041 566 -61 -217 551
2002 551 -80 -1696 -894 706 -23 -223 369 1177 832 -227 -709 269 -104 -1432 -764 598 427 11
2020 11 389 819 928 -447 -943 -208 -242 -947 -262 238 618 710 239 242 522 -72 -890 -618 -562 -243 573 408
2042 408 72 954 890 -8 -528 -409 62 6 -1204 -380 1024 696 18 321 796 437 -711 -1210 -114
$$ packed form
1906c42J290O04o02j358K42N70j323r98R82J872m44r20Q35J380o83j922K2J231
1924D36o94j417O53J843L88r35j59Q54l59r99n84J60O45l25K92M51P36n0j32m96
1944C08q16k3L15o57j01R02R25l40n64O43O64p87j597L50Q01n17o25Q48J407q5
1964A051j090j4Q10m71j542J86J338j78q57O54J224J45j226l61O86l57j106J49
1982i59P16M68J54k44L37M51n12m02l46l97J67M21j44O1Q47M23m75o27j56P68
2002E51o31j616Q02J600p29k00N92Q08l45j059m82R78l73j328O68J362j71m16
2020A1L78M30J09j375m96P35l4p05O85N00L80R2m71LK80n94q18K72N6L19Q16j65
2042D08l36Q82o4q98n20J19M71n6j210Q24J404l28o78L03M75l59j148m99J096
$$ plain form
2061 -114 161 -701 -415 825 748 73 152 325 211 -385 -1186 -252 125 -290 288 1168 837 335 199 -358
2081 -358 -287 -626 -942 -149 224 -142 489 727 147 512 150 -642 -605 -636 -223 -50 -71 132 1193 637 -332
2102 -332 20 392 -226 -807 -820 -102 493 -169 -138 817 739 18 -164 -394 -274 -356 -684 -76 467 92 43 552
2124 552 544 72 -126 -560 -410 -478 -309 -1 336 255 380 526 234 -134 -351 -641 -423 -331 -191 210 19 440
2146 440 704 258 -201 -239 -287 -529 -587 -448 290 534 -134 72 785 290 -313 -498 -425 -126 -331 -600 271
2167 271 662 213 218 431 130 23 -254 -425 -237 -113 -186 298 353 328 557 164 -115 -190 -471 -321 -269 -153
2189 -153 38 575 511 239 558 181 -151 -175 -490 -399 -37 -309 81 602 203 343 457 164 -185 -418 -296
2210 -296 -137 -248 -259 200 591 211 287 188 -65 -256 -420 -477 -181 55 -182 243 485 65 304 104 -199
$$ packed form
2061a14K75q62K86J240p7o75P9J73j14n96q01R34L77m15N78Q80l31n02j36n57
2081c58P1l39l16P93L73l66O31K38n80L65l62p92L7l1M13J73k1K03J061n56r69
2102c32L52L72o18n81j3P18N95o62L1R55p8p21j82k30J20q2l28O08N43l75m9N09
2124E52qm72j98m34J50o8J69L08L37q1J25J46k92l68k17k90K18R2J40M01j91M21
2146D40K64m46m59l8m8k42n8J39P38K44o68K06P13m95o03j85P3K99k05k69Q71
2167B71L91m49NK13l01j07k77j71J88J24p3M84N5k5K29l93k79p5k81J50N2J16
2189a53J91N37o4k72L19l77l32k4l15R1L62k72L90N21l99J40J14k93l49k33J22
2210b96J59j11j1M59L91l80P6r9k53j91j64n7K96K36k37M25K42m20K39k00l03
$$ plain form
2231 -199 -149 -449 -563 -308 -91 8 307 500 327 278 9 -357 -181 -303 -336 -164 115 269 361 346 313 309 -127
2254 -127 -164 -286 -290 -373 76 -24 375 490 184 312 85 41 -76 -383 -529 -129 246 133 180 515 361 251
2276 251 -214 -322 -131 -313 -363 -87 45 329 138 142 224 292 -105 -368 -383 -296 -282 -40 242 318 406 126 258
2299 258 20 -57 -218 -392 -438 -232 141 158 329 569 222 101 -155 -206 -217 -356 -302 40 219 36 36 377 253
2322 253 -51 -30 -254 -178 -441 -206 -65 220 413 260 203 176 -163 -374 -416 -146 -278 18 144 493 487 336
2344 336 196 -93 -166 -629 -506 -141 -166 -161 457 234 195 83 85 -219 -388 -303 -175 -217 -176 167 542 420 27
2367 27 -52 22 -202 -578 -487 10 155 19 269 354 244 -108 -237 -322 -418 -333 -480 -209 210 167 270 230 -56
2390 -56 -156 -280 -146 -280 -73 118 31 185 271 401 273 -245 -269 -296 -370 -526 -400 150 455 356 235 373
$$ packed form
2231a99N0l00j14K55K17R9K99J93j73m9k69l66J76j22l3J72K79J54R2j5l3mm36
2254a27l7j22mq3M49j00L99J15l06J28k27m4j17l07j46M00L75j13M7L35j54j10
2276B51m65j08J91j82n0K76J32K84j91MQ2O8l97k63j5Q7J4K42K82P6Q8k80J32
2299B58k38p7j61j74m6K06L73J7J71K40l47j21k56n1j1j39N4L42J79j83%L41j24
2322B53l04K1k24P6k63K35J41K85J93j53n7k7l39k11m2K70j32K96J26L49oj51
2344C36j40k89p3m63J23L65k5NO18k23l9j12Kl04j69Q5J28m2M1L43L75j22l93
2367B7p9P4k24l76R1M97J45j36K50Q5j10l52j29q5r6Q5j47K71M19m3J03m0k86
2390e6j00j24J34j34K07J91q7J54Q6J30j28n18k4k7p4j56J26N50L05r9j21J38
$$ plain form
2412 373 53 -245 -393 -150 141 -345 -136 377 359 221 90 -54 96 -304 -429 -320 108 -4 -34 489 304
2433 304 84 57 22 -191 -235 -269 -249 -140 106 280 420 221 -20 122 -34 -534 -381 -212 85 -233 18 576
2455 576 651 -2 -111 134 -64 -391 -608 104 188 -20 77 342 399 -61 -478 -102 -181 -460 -323 9 419 412
2477 412 273 209 316 -125 -305 -292 -557 -188 -114 85 258 435 503 311 -185 -433 -141 -145 -542 -135 360 421
2499 421 143 131 496 327 -321 -687 -175 100 -301 -297 159 585 234 -76 23 130 -179 -755 -234 102 153 17
2521 17 177 667 362 25 -388 25 -207 -418 -178 -209 31 302 234 266 354 228 -130 -539 -377 -103 9 -323
2543 -323 99 416 577 76 -86 -70 -153 -380 -500 212 237 -107 -156 467 457 140 -313 -120 125 -183 -464 -211
2565 -211 411 218 117 197 244 221 -265 -334 -103 -95 -54 32 178 291 545 348 -105 22 -121 -217 -356 -284 342
$$ packed form
2412C73l20k98j48K43K91m86K09N13j8j38j31j44J50m00j25J09M28j12l0N23j85
2433C04k20k7l5k13m4l4K0J09K46J74J40j99k41J42j56n00J53J69K97l18K51N58
2455E76P5o53j09K45j98l27k17P12Q4k08R7K65N7m60m17L76p9k79J37L32M10p
2477D12j39o4J07m41j80J3k65L69P4J99J73J77O8j92m96k48K92ml97M07M95O1
2499D21k78j2L65j69o48l66N12K75m01MM56M26l51l10R9J07l09n76N21L36N1j36
2521A7J60M90l05l37m13M13k32k11K40l1K40K71o8L2Q8j26l58m09J62K74J12l32
2543c23M22L17J61n01j62J6q3k27j20P12K5l44m9O23j0l17m53J93K45l08k81K53
2565b11O22j93j01Q0M7k3m86o9K31QM1Q6J46J13K54j97m53J27j43r6j39P2O26
$$ plain form
2588 342 354 20 201 490 283 -366 -431 -233 -45 -487 -674 397 450 147 -100 303 333 -214 -573 -135 95
2609 95 -217 -111 273 578 378 -86 -276 86 -98 -555 -407 -75 18 253 232 335 186 283 -159 -186 -190 -188 -145
2632 -145 -303 -167 444 391 27 161 311 -32 -338 -488 -3 305 -309 -94 686 629 -41 -176 7 -82 -108
2653 -108 -361 -167 258 138 76 483 578 227 -195 -442 -95 -307 -288 -34 195 131 357 9 -34 83 -204 -290
2675 -290 -369 -165 -30 263 26 249 485 128 -359 -104 -247 -189 -232 -248 22 607 271 82 469 121 -238
2696 -238 -274 -191 -271 -84 -144 408 479 230 100 88 54 -204 -281 -449 -74 330 -222 196 527 255 -57 27 -272
2719 -272 -101 -142 -477 142 97 245 314 78 124 203 -56 -559 -346 -68 -141 257 10 228 563 63 -173 197
2741 197 -212 -323 -111 -19 73 296 246 132 196 -213 -274 44 -369 -258 84 -60 171 352 93 280 245 -168
$$ packed form
2588C42J2l34J81K89k07o49o5J98J88m42j87J071N3l03k47M03L0n47l59M38K30
2609I5l12J06L84L05k00m64j90L62j84m57J48L32R3K35k1J03j49R7m42k7mKM3
2632a45j58J36O11n3l64J34J50l43l06j50M85L08o14K15P80n7o70j35J83q9k6
2653a08k53J94M25j20o2M07R5l51m22k47L47k12J9K54K29o4K26l48m3J17k87q6
2675b90p9K04J35K93k37K23K36l57m87K55j43N8m3j6K70N85l36j89L87l48l59
2696b38l6Q3q0J87o0N52P1k49j30j2l4k58p7j68L75M04n52M18L31k72l12Q4k99
2719b72J71m1l35O19m5J48O9k36M6P9k59n03K13K78p3L98k47K18L35n00k36L70
2741A97m09j11K12R2R2K23n0j14O4m09o1L18m13J11L42j44K31J81k59J87l5m13
$$ plain form
2763 -168 -336 -181 -173 59 107 -243 277 352 -13 159 103 -201 34 -244 -159 76 225 313 185 124 231 195 -150
2786 -150 -432 -138 -91 -251 60 -28 349 277 -139 -94 69 -162 -167 -72 -277 8 14 -101 134 157 -11 -89 53 -227
2810 -227 -140 -134 -147 309 88 57 410 57 -172 -282 -215 -144 77 81 94 352 90 21 79 192 -162 -216 -221 -208 98
2835 98 69 -73 294 88 258 117 -450 1 -79 -8 -71 268 258 -5 238 57 62 55 -358 -157 -253 173 84 69
2859 69 -76 355 136 -126 -5 -93 -247 19 -187 74 213 301 102 77 -52 -50 -133 -113 -232 -98 -34 144 147 174
2883 174 114 133 -212 -87 -40 -200 78 -32 116 28 247 56 222 -257 -234 79 -55 -84 -71 117 169 152 282
2906 282 -197 30 40 -331 -12 -75 118 307 -26 228 259 155 -133 -56 -110 -198 83 82 41 86 -71 143 163 -70
2930 -70 -62 -96 44 -332 158 63 167 12 130 50 124 -133 -20 -145 -384 -3 118 68 130 139 24 72 -18 -71 113
$$ packed form
2763a68j68J55QK32M8l50N20P5l65J72n6l04K35k78Q5K35J49Q8j28o1J07l6l45
2786a50k82K94M7j60L11q8L77p2m16M5J63k31nR5k05K85Oj15K35K3j68p8J42k80
2810b27Q7Oj3M56k21l1L53l53k29j10O7P1K21MJ3K58k62o9N8J13l54n4nJ3L06
2835I8k9j42L67k06J70j41n67M51q0P1o3L39j0k63K43j81Npm13K01r6M26q9j5
2859F9j45M31k19k62J21q8j54K66k06K61J39Q8j99k5j29Kq3K0j19J34O4J78LK7
2883A74o0J9l45J25M7j60K78j10J48q8K19j91J66m79K3L13j34k9J3J88N2j7J30
2906B82m79K27J0l71L19o3J93J89l33K54L1j04k88P7n4q8K81jm1M5j57K14K0k33
2930g0Ql4J40l76M90r5J04j55J18q0P4k57J13j25k39L81J21n0O2Rj15M8r0n3J84
$$ plain form
2955 113 -178 -285 138 59 -149 17 -37 -63 -116 11 -368 -7 100 91 139 115 95 149 -220 -133 -54 -110 -239 -13
2979 -13 112 -24 327 119 161 -53 -25 -150 -145 -264 -95 79 67 -31 124 254 -26 -322 5 -181 -323 -160
3001 -160 217 165 -1 189 108 187 -219 -129 -157 -110 -236 -40 -93 97 139 124 68 116 -110 -255 -371 -136 -273 -35
3025 -35 77 111 199 56 41 23 -142 -32 -297 -124 102 161 88 146 68 76 33 -196 -159 -159 210 -98 46 112 253
3050 253 93 65 40 13 -152 -263 -27 85 165 9 220 380 295 120 -144 20 -31 -415 -259 -194 24 162
3072 162 280 86 187 198 -350 -192 -177 16 -224 -166 75 118 252 -40 -147 -36 -203 -268 -301 -281 56 315
3094 315 135 315 169 154 -164 -76 -210 -186 -370 -183 231 270 150 175 211 -31 -24 -172 -303 51 -4 -119 220
3117 220 141 251 151 57 -19 -93 -336 -414 -193 114 205 191 270 69 244 -270 -256 -261 -189 -326 -228 45 285 317 257
$$ packed form
2955A13k91j07M23p9k08J66n4k6n3J27l79L61J07rM8k4k0N4l69Q7P9n6j29K26
2979a3J25j36L51k08M2k14K8j25Nj19J69J74j2r8J55J30k80k96L27j86j42J63
3001a60L77n2j66J90q1P9m06R0k8M7j26J96n3J90M2j5n6M8k26j45j16K35j37K38
3025c5J12L4Q8j43j5j8j65J10k65J73K26N9p3N8p8Qm3k29L7%L69l08J44O6J41
3050B53j60k8k5k7j65j11K36J12Q0j56K11J60q5j75k64J64n1l84J56O5K18J38
3072A62J18j94J01J1n48J58J5J93k40N8K41M3J34k92j07J11j67o5l3K0L37K59
3094C15j80J80j46j5l18Q8j34K4j84J87M14L9j20K5L6k42Pj48j31L54n5j15L39
3117B20p9J10j00r4p6p4k43p8K21L07R1j4P9k01J75n14J4nP2j37R8K73K40L2o0
$$ plain form
3142 257 -52 235 107 -264 -313 -164 -86 3 300 221 397 313 -107 -9 -215 -172 -364 -104 -109 308 246 79 352
3165 352 255 -63 -131 -214 -149 -25 -115 -2 399 436 287 133 2 -117 -219 -544 -155 -70 -140 99 243 344 43
3188 43 -98 -226 -16 -256 -363 -202 -6 197 373 98 132 192 -29 -143 -278 -217 -147 -150 159 310 132 90 345
3211 345 -15 -143 -214 -246 -1 -48 -254 17 130 251 101 89 -150 -254 -64 -192 -257 191 100 38 218 242 292
3234 292 -56 -272 -259 -234 -186 -169 126 343 199 65 104 16 -134 -146 -250 -101 -34 -209 244 338 282 181 -10
3257 -10 -96 -62 -74 -243 -154 4 190 108 118 335 333 96 -233 -345 2 -2 14 164 -35 237 141 73 -32 44 -61
3282 -61 -177 -146 -64 6 116 329 269 85 140 -44 24 1 -48 -159 132 184 189 -14 94 -2 -71 -71 -84 -112 -430 -64
$$ packed form
3142B57l09K87j28l71m9J49P8Q9K97p9J76q4m20R8k06M3j92K60nM17o2j67K73
3165C52r7l18o8q3O5J24r0J13M01L7j49j54j31j19j02l25L89Q5p0K39J44J01l01
3188D3j41j28K10k40j07J61J96K03J76k75L4O0k21j14j35O1P0lL09J51j78m2K55
3211C45l60j28p1l2K45m7k06K71J13J21j50j2k39j04J90j28o5M48r1o2J80K4N0
3234B92l48k16J3K5M8J7K95K17j44j34L9q8j50j2j04J49O7j75M53R4n6j01j91
3257a0q6L4j2j69Q9J58J86q2J0K17kk37l29j12L47mJ6J50j99K72r6o8j05P6j05
3282f1j16L1Q2P0J10K13o0j84N5j84O8k3m9j11K91N2Nk03J08r6o9%j3k8l18L66
$$ [...]
8191a18
##END NTUPLES=NMR FID
##END=
