##TITLE=1H_LR-751-KB-R1
 DMSO-d6
 8 sc, 
 26.07.2022
##JCAMPDX= 6.0         $$ Bruker NMR JCAMP-DX V2.0
##DATA TYPE= NMR FID
##DATA CLASS= NTUPLES
##ORIGIN= UXNMR, Bruker Analytische Messtechnik GmbH
##OWNER= root
$$ XWIN-NMR		Version 3.5
$$ Tue Jul 26 16:41:34 2022 Russian Standard Time (UT+4h)  she@DPX200
##.OBSERVE FREQUENCY= 200.1313499994
##.OBSERVE NUCLEUS= ^1H
##.DELAY= (6, 6)
##.ACQUISITION MODE= SIMULTANEOUS
##.ACQUISITION SCHEME= undefined
##.AVERAGES= 8
##.DIGITISER RES= 18
##SPECTROMETER/DATA SYSTEM= spect
##.PULSE SEQUENCE= zg30
##.SOLVENT NAME= DMSO
##.SHIFT REFERENCE= (INTERNAL, DMSO, 0, 15.7039)
##AUDIT TRAIL= $$ (NUMBER, WHEN, WHO, WHERE, WHAT)
$$ ##TITLE= Audit trail, XWIN-NMR		Version 3.5
$$ ##JCAMPDX= 5.01
$$ ##ORIGIN= Bruker BioSpin GmbH
$$ ##OWNER= she
$$ F:/spectra/data/she/nmr/H-F/1/audita.txt
$$ ##AUDIT TRAIL=  $$ (NUMBER, WHEN, WHO, WHERE, WHAT)
(   1,<2022-07-26 16:39:55.26 +0400>,<she>,<DPX200>,
      <created by zg, POWCHK disabled, PULCHK disabled
       configuration hash MD5:
       00 E9 B6 7A A2 85 ED C7 34 08 36 98 17 FE 4E 26
       data hash MD5: 16K
       24 D6 B9 D3 50 9A 2B E2 44 EC C4 F9 11 76 B1 64>)
$$ ##END=
$$ 
$$ hash MD5
$$ 13 D2 AB A7 20 13 56 12 8A 0A 5C EA 42 06 D0 3A
##$RELAX= 
##$RELAX= 
##$RELAX= 
##$RELAX= 
##$RELAX= 
##$RELAX= 
$$ Bruker specific parameters
$$ --------------------------
##$DU= <F:/spectra>
##$EXPNO= 1
##$NAME= <H-F>
##$PROCNO= 1
##$TYPE= <nmr>
##$USER= <she>
##$AMP= (0..31)
100 100 100 100 100 100 100 100 100 100 100 100 100 100 100 100 100 100 
100 100 100 100 100 100 100 100 100 100 100 100 100 100 
##$AQSEQ= 0
##$AQ_mod= 1
##$AUNM= <au_zg>
##$AUTOPOS= <>
##$BF1= 200.13
##$BF2= 200.13
##$BF3= 200.13
##$BF4= 200.13
##$BF5= 200.13
##$BF6= 200.13
##$BF7= 200.13
##$BF8= 200.13
##$BYTORDA= 1
##$CFDGTYP= 0
##$CFRGTYP= 5
##$CHEMSTR= <none>
##$CNST= (0..31)
1 1 145 1 1 1 1 1 1 1 1 1 1 1 1 1 1 1 1 1 1 1 1 1 1 1 1 1 1 1 1 1 
##$CPDPRG= <>
##$CPDPRG1= <>
##$CPDPRG2= <>
##$CPDPRG3= <>
##$CPDPRG4= <mlev>
##$CPDPRG5= <mlev>
##$CPDPRG6= <mlev>
##$CPDPRG7= <mlev>
##$CPDPRG8= <mlev>
##$CPDPRGB= <>
##$CPDPRGT= <>
##$D= (0..31)
0 1.2 0 0 0 0 0 0 0 0.06 0 0.03 0 0 0 0 0.0002 0 0 0 0 0 0 0 0 0 0 0 0 
0 0 0 
##$DATE= 1658839194
##$DBL= (0..7)
120 120 120 120 120 120 120 120 
##$DBP= (0..7)
150 150 150 150 150 150 150 150 
##$DBP07= 0
##$DBPNAM0= <>
##$DBPNAM1= <>
##$DBPNAM2= <>
##$DBPNAM3= <>
##$DBPNAM4= <>
##$DBPNAM5= <>
##$DBPNAM6= <>
##$DBPNAM7= <>
##$DBPOAL= (0..7)
0.5 0.5 0.5 0.5 0.5 0.5 0.5 0.5 
##$DBPOFFS= (0..7)
0 0 0 0 0 0 0 0 
##$DE= 6
##$DECBNUC= <off>
##$DECIM= 32
##$DECNUC= <off>
##$DECSTAT= 4
##$DIGMOD= 1
##$DIGTYP= 9
##$DL= (0..7)
0 120 120 120 120 120 120 120 
##$DP= (0..7)
150 150 150 150 150 150 150 150 
##$DP07= 0
##$DPNAME0= <>
##$DPNAME1= <>
##$DPNAME2= <>
##$DPNAME3= <>
##$DPNAME4= <>
##$DPNAME5= <>
##$DPNAME6= <>
##$DPNAME7= <>
##$DPOAL= (0..7)
0.5 0.5 0.5 0.5 0.5 0.5 0.5 0.5 
##$DPOFFS= (0..7)
0 0 0 0 0 0 0 0 
##$DQDMODE= 0
##$DR= 18
##$DS= 0
$$ [...]
##$SUBNAM2= <"">
##$SUBNAM3= <"">
##$SUBNAM4= <"">
##$SUBNAM5= <"">
##$SUBNAM6= <"">
##$SUBNAM7= <"">
##$SUBNAM8= <"">
##$SUBNAM9= <"">
##$SW= 18.0517283424941
##$SWIBOX= (0..15)
0 0 2 0 0 0 0 0 0 0 0 0 0 0 0 0 
##$SW_h= 3612.71676300578
##$TD= 16384
##$TD0= 1
##$TE= 0
##$TE2= 300
##$TE3= 300
##$TEG= 300
##$TL= (0..7)
0 120 120 120 120 120 120 120 
##$TP= (0..7)
150 150 150 150 150 150 150 150 
##$TP07= 0
##$TPNAME0= <>
##$TPNAME1= <>
##$TPNAME2= <>
##$TPNAME3= <>
##$TPNAME4= <>
##$TPNAME5= <>
##$TPNAME6= <>
##$TPNAME7= <>
##$TPOAL= (0..7)
0.5 0.5 0.5 0.5 0.5 0.5 0.5 0.5 
##$TPOFFS= (0..7)
0 0 0 0 0 0 0 0 
##$TUNHIN= 0
##$TUNHOUT= 0
##$TUNXOUT= 0
##$USERA1= <user>
##$USERA2= <user>
##$USERA3= <user>
##$USERA4= <user>
##$USERA5= <user>
##$V9= 5
##$VALIST= <valist>
##$VCLIST= <CCCCCCCCCCCCCCC>
##$VD= 0
##$VDLIST= <DDDDDDDDDDDDDDD>
##$VPLIST= <PPPPPPPPPPPPPPP>
##$VTLIST= <TTTTTTTTTTTTTTT>
##$WBST= 1024
##$WBSW= 4
##$XGAIN= (0..3)
0 0 0 0 
##$XL= 0
##$YL= 0
##$YMAX_a= 324463
##$YMIN_a= -319046
##$ZGOPTNS= <>
##$ZL1= 120
##$ZL2= 120
##$ZL3= 120
##$ZL4= 120
##$ABSF1= 10
##$ABSF2= 0
##$ABSG= 5
##$ABSL= 3
##$ALPHA= 0
##$AQORDER= 0
##$ASSFAC= 0
##$ASSFACI= 0
##$ASSFACX= 0
##$ASSWID= 0
##$AUNMP= <proc_1d>
##$AZFE= 0.1
##$AZFW= 0.1
##$BCFW= 1
##$BC_mod= 2
##$BYTORDP= 1
##$COROFFS= 0
##$CY= 11.3945322036743
##$DATMOD= 1
##$DC= 2
##$DFILT= <>
##$DTYPP= 0
##$F1P= 2.36226072786647
##$F2P= -0.459571619588291
##$FCOR= 0.5
##$FTSIZE= 0
##$FT_mod= 4
##$GAMMA= 1
##$GB= 0.15
##$INTBC= 1
##$INTSCL= 1
##$ISEN= 128
##$LB= 0.24
##$LEV0= 0
##$LPBIN= 0
##$MAXI= 10000
##$MC2= 0
##$MEAN= 0
##$ME_mod= 0
##$MI= 1.114404
##$NCOEF= 0
##$NC_proc= 0
##$NLEV= 6
##$NOISF1= 3.799351
##$NOISF2= 2.8
##$NSP= 1
##$NTH_PI= 0
##$NZP= 0
##$OFFSET= 15.70392
##$PC= 1
##$PHC0= -18036.8
##$PHC1= 9.80068
##$PH_mod= 1
##$PKNL= yes
##$PPARMOD= 0
##$PSCAL= 0
##$PSIGN= 0
##$REVERSE= no
##$SF= 200.130013532006
##$SI= 16384
##$SIGF1= 3
##$SIGF2= 2
##$SINO= 400
##$SIOLD= 16384
##$SREGLST= <1H.CDCl3>
##$SSB= 0
##$STSI= 0
##$STSR= 0
##$SW_p= 3612.71676300578
##$SYMM= 0
##$S_DEV= 0
##$TDeff= 0
##$TDoff= 0
##$TI= <>
##$TILT= no
##$TM1= 0
##$TM2= 0
##$TOPLEV= 0
##$USERP1= <user>
##$USERP2= <user>
##$USERP3= <user>
##$USERP4= <user>
##$USERP5= <user>
##$WDW= 1
##$XDIM= 8192
##$YMAX_p= 0
##$YMIN_p= 0
$$ End of Bruker specific parameters
$$ ---------------------------------
##NTUPLES= NMR FID
##VAR_NAME=  TIME,          FID/REAL,        FID/IMAG
##SYMBOL=    X,             R,               I
##VAR_TYPE=  INDEPENDENT,   DEPENDENT,       DEPENDENT
##VAR_FORM=  AFFN,          ASDF,            ASDF
##VAR_DIM=   8192,          8192,            8192
##UNITS=     SECONDS,       ARBITRARY UNITS, ARBITRARY UNITS
##FACTOR=    0.0002768,     1,               1
##FIRST=     0,             0,               0
##LAST=      2.2672688,     0,               0
##MIN=       0,             -319046,         0
##MAX=       2.2672688,     324463,          0
$$ Real data points
##PAGE= N=1
##DATA TABLE= (X++(R..R)), XYDATA
0@%%%%%%%%%%qJ6j6J6k4L2m0N0n8P2q8J12j36J60j88K20k56K96l44L94m52N16
$$ 0 0 0 0 0 0 0 0 0 0 0 -8 8 -8 8 -16 16 -24 26 -32 40 -48 64 -72 88 -100 120 -136 160 -184 210 -242 274
32B74n88O69p57Q56r64J083j213J353j507J678j866K069k293K537k801L091l406
$$ 274 -314 355 -402 454 -510 573 -640 713 -794 884 -982 1087 -1206 1331 -1470 1621 -1785
49a785L752m132M550n014N530o102O741p464Q284r230J0331j1627J3188j5109
$$ -1785 1967 -2165 2385 -2629 2901 -3201 3540 -3924 4360 -4870 5461 -6166 7022 -8087
63h087J7538k0727K5132l1681M2644o5885K08104j14949m8147R4090k04166o6390
$$ -8087 9451 -11276 13856 -17825 24819 -41066 167038 52089 3942 98032 -106134 -172524
75a72524m4115K29870j39788J10680J80760p8061N5069m7894k7496j27819q0984
$$ -172524 -216639 13231 -126557 -15877 164883 86822 141891 93997 66501 -61318 -142302
86a42302N1117j74374J26396N7428K2300J28254L6671J17373r1912J0005J528
$$ -142302 -91185 -265559 -139163 -81735 -59435 68819 105490 222863 130951 140956 142484
97A42484j92074M2254j07131l0766N6353J0423Q2378k9081J62106J5759j35299
$$ 142484 -49590 -7336 -114467 -145233 -88880 -78457 3921 -25160 136946 152705 17406
108A7406P4690m8536o9434j15939K4215N5503j01374J25162M5786L3497O2730
$$ 17406 92096 43560 -25874 -141813 -117598 -62095 -163469 -38307 7479 40976 103706
119A03706k3548N9404r3216r796l6794q8084O1445q0103M2449N6929N904O4756
$$ 103706 80158 139562 46346 36550 -244 -88328 -26883 -106986 -64537 -7608 -1704 63052
131F3052k7554P1392m7970m7355K9447j04970N958n477p427l112K6824J11851
$$ 63052 35498 106890 58920 11565 41012 -63958 -58000 -63477 -70904 -74016 -47192 64659
143F4659o9147K1866Q4506m4428l8906l4105M7481o4166m9433Q2125l1679J3324
$$ 64659 -4488 17378 101884 57456 18550 -15555 31926 -32240 -81673 452 -31227 -17903
155a7903L1423K6032P782l4658M4357m6523k5591J1791n4904J8727L599R831J085
$$ -17903 13520 39552 47334 12676 57033 10510 -15081 -3290 -58194 -39467 -35868 -26037 -24952
168b4952J7726N6856l9954J8170J6789l3468k462j7656L761l5357K1092L4158
$$ -24952 -7226 49630 9676 27846 44635 11167 8705 -8951 -5190 -40547 -19455 14703
180A4703n0507L7618L7951j3544k3855J2764L0248o7054n418K9822l4762m960
$$ 14703 -35804 1814 39765 26221 2366 15130 45378 -21676 -27094 2728 -32034 -36994
192c6994J9368K4020j8432J2027M1832k6904l853O634j4202j1971n821K689k0727
$$ -36994 -17626 6394 -12038 -11 41821 14917 11064 17698 3496 -8475 -14296 -11607 -32334
205c2334K0864K4123j9261J7579K1298m113j5606j708J498l1756L11N309k2396
$$ -32334 -11470 12653 -6608 10971 32269 28156 12550 10842 12340 -19416 -19105 -13796 -36192
218c6192J2956K4356J820p347K5661J6325l3275m62J0231k5380j6374J2937L634
$$ -36192 -23236 1120 2940 -4407 21254 37579 4304 3842 14073 -11307 -27681 -14744 -11110
231a1110j6394K4639K8700j3434K285J8850n592k5068n549k931k3272K821J0335
$$ -11110 -27504 -2865 25835 12401 14686 33536 27944 2876 -2673 -5604 -28876 -26055 -15720
244a5720p183J0488K6568P000r093Q907M064k1047j1684l292j2527l165J1590
$$ -15720 -22903 -12415 14153 21153 12060 20967 25031 3984 -7700 -10992 -23519 -26684 -15094
257a5094N134M339K1151J3257o652k040J989j5292j6142n979q754m408J1799J0419
$$ -15094 -9960 -5621 15530 28787 22135 20095 22084 6792 -9350 -15329 -24083 -28491 -16692 -6273
271f273J927J3979J6149j887o214n904j0296r765q013r331j597J4954R740K549
$$ -6273 -4346 9633 25782 23895 17681 11777 1481 -8284 -16297 -25628 -27225 -12271 -2531 18
285A8J5157J0307l244k522m590j7054j2769M522r278j0091J7822J5186k130P199
$$ 18 15175 25482 22238 19716 15126 -1928 -14697 -10175 -19453 -29544 -11722 3464 1334 8533
299H533J7357n679j2550M586j2158k1446M903P143j3645L276K8194L568p410J6230
$$ 8533 25890 20211 7661 12247 89 -21357 -16454 -9311 -22956 -19680 8514 12082 4672 20902
313B0902M019j7826l369K136k1045r222J8380k554j1193K0420J7934r464j14J2254
$$ 20902 24921 7095 3726 5862 -15183 -24405 -6025 -8579 -19772 648 18582 9118 9004 21258
327B1258j2227j4996N619p553j6610R315J4687p462J512K1463K971j0513L752
$$ 21258 9031 -5965 -346 -7899 -24509 -15194 -507 -7969 -6457 15006 17977 7464 11216
340A1216N55j4317n553L200q973l962J5113N952l635O821J0412l051q819j856
$$ 11216 11771 -2546 -8099 -4899 -13872 -17834 -2721 3231 -404 6417 16829 13778 4959 3103
354C103m519p603j451j314P0N257Q334O748j554K294K903k082j1247q162M222
$$ 3103 -1416 -9019 -10470 -11784 -11714 -6457 1877 8625 7071 9365 12268 10186 -1061 -9223 -5001
369e001m155m296O635N258N130M070P396o005m938O773j1885j1204M82L848k675
$$ -5001 -9156 -13452 -6817 -1559 3571 7641 15037 9032 4094 10867 -1018 -12222 -11740 -7892 -10567
384a0567o22J5196j59K436J1291o679p398j869K036j4152q460J4310m410J859
$$ -10567 -11189 4007 3848 6284 17575 10896 3498 1629 3665 -10487 -18947 -4637 -9047 -7188
398g188J1513M040Q14J006R559j8373r161J1158j3589q174L162J3080l65j554
$$ -7188 4325 8365 9179 10185 19744 1371 -7790 3368 -10221 -18395 -15233 -2153 -2518 -4072
412d072K0688o744j09N251j1582n106r256N760r169k492J6781m602J2304M357
$$ -4072 16616 9872 9763 15014 3432 -1674 -10930 -5170 -14339 -16831 -50 -4652 7652 12009
426A2009l3J686q003O106j9780m807N500j0091J0102l659J0534Q763J798Q104
$$ 12009 11976 13662 5659 11765 -8015 -12822 -7322 -17413 -7311 -10970 -436 8327 10125 18229
440A8229j6343J1025m373j9202K769p224Q963q129O043J6552q119J6670n289n92
$$ 18229 1886 12911 8538 -10664 -7895 -15119 -6156 -14285 -8242 8310 191 16861 11572 10980
454A0980L00j3974N479j7354N039p59o003K1157r488J0422N337k63N649k0423
$$ 10980 11280 -2694 2785 -14569 -9530 -10289 -16292 4865 -4623 5799 11136 10873 16522 -3901
468c901J1146j1012p406O763j6664J7418L98N468K011l650K6214k3230l452P185
$$ -3901 7245 -3767 -11173 -4410 -21074 -3656 -3258 2210 4221 571 26785 3555 103 7288
482G288j0824J260j7872J8455m271o578K2543j1183J3277n133J94N584k0015J2972
$$ 7288 -3536 -2276 -20148 -1693 -5964 -12542 10001 -1182 12095 6962 7156 12740 -7275 5697
496E697j6882J873Q107j5290J6489m645J4155k870r319K2816j8858L806q229p115
$$ 5697 -11185 -9312 -1205 -16495 -6 -4651 9504 6634 -2685 20131 1273 5079 -3150 -10265
510a0265J3963j8463R899n474J0783J3778k2748K0880j721l107n153j1040J9165
$$ -10265 3698 -14765 -4866 -10340 443 14221 -8527 12353 10632 7525 2372 -8668 10497
523A0497k5831M249J0493q762J1635q956K0290n618p821J5571j8966R503j1462
$$ 10497 -15334 -11085 -592 -9354 2281 -6675 13615 7997 176 15747 -3219 6284 -5178
536e178n619P100j0331J8897j6270Q507J9300j4032O639r730J3844q125k0038
$$ -5178 -10797 -3697 -14028 4869 -11401 -2894 16406 2374 9013 -717 13127 5002 -15036
549a5036J5975j1647Q435n485j378J8746r723J1676r087L621Q406k3921R281m232
$$ -15036 939 -10708 -2273 -7758 -9136 9610 -113 11563 2476 6097 14503 -9418 -137 -4369
563d369j18n654k861K5989j8548L693J3510m149J353j6370J4857p977j1543J1314
$$ -4369 -4487 -10141 -13002 12987 -5561 -1868 11642 7493 8846 -7524 7333 -644 -12187 -873
577h73j1133J1558k8J999K659n111J9965j7807o488R336n056j256j4977J7819
$$ -873 -12006 -448 -476 1523 4182 -929 19036 1229 -5259 4077 -979 -2235 -17212 607
591F07K858j1394J2095r30Q364j0923j580J0717j4839K51l167P289J09j1646J6299
$$ 607 3465 -7929 4166 3236 11600 677 -903 9814 -5025 -4774 -7941 -652 -543 -12189 4110
606D110J110j460j678o45O972j1151K358l720k573Q992o430Q12K715Q531k255
$$ 4110 5220 3760 2082 1437 8409 -2742 -384 -4104 -6677 2315 -4115 -3303 -588 7943 5688
621E688j1314J1945j501p744q89J047L295o400N136K496k755O678m361n88K931
$$ 5688 -5626 6319 4818 -2926 -3815 -2768 527 -5873 -737 1759 -996 5682 1321 733 3664
636C664l488n091R81Q444r585l483J3607J929r723J65J2358n475j1123O986J089
$$ 3664 176 -4915 -3934 4510 -5075 -8558 5049 6978 -2745 -2580 9778 4303 -6820 166 1255
651A255n638J047L977k778Q35Q115m401m964P126J85q901n81O109m007k923N207
$$ 1255 -4383 -3336 641 -2137 -1302 6813 2412 -2552 4574 4759 -4142 -4723 1386 -2621 -5544 -337
667c37K481k098J287M101k986j789n75j945J487k963k294L034N384j383n053Q211
$$ -337 2144 46 1333 5434 2448 659 84 -1861 -374 -3337 -5631 -2597 2787 1404 -3649 4562
683D562L046o584k418K940n32o460K549J015k047M888Q60j09p06L825k11p112
$$ 4562 7608 1024 -1394 1546 1014 -5446 -2897 -1882 -3929 959 1819 1710 1004 4829 4618 -2494
699b494L173j042l413L07L47J981j297M546K044l150K621j418L27k961l490J389
$$ -2494 679 -363 -3776 -3469 -3122 -1141 -2438 2108 4152 1002 3623 2205 2532 -429 -3919 -2530
715b530q74K746l104J624O803j960n35p94K441j681n243J685k417P42J303l32
$$ -2530 -3404 -658 -3762 -2138 4665 2705 2170 1376 3817 2136 -3107 -1422 -3839 -3097 -1794 -2126
731b126K835m00M168o39k774J638k674m49l002o57J457l70L260m91J510K538k91
$$ -2126 709 309 4477 3838 1064 2702 28 -421 -3423 -4080 -2623 -2993 267 -224 1286 3824 3533
748C533k97l618M6P0k775l3j492L755K103l31O05Q42K019k470k549l36j634L12
$$ 3533 3236 -382 -336 -266 -3041 -3074 -4566 -811 1292 961 1566 2408 4427 1957 -592 -928 -2562 -2250
766b250r05O47J292J618L600j403j161J743j160k564k423R27j137k14K869o76
$$ -2250 -3155 -2508 -1216 402 4002 2599 1438 3181 2021 -543 -2966 -2039 -3176 -3390 -521 -1197
782a197J872L193O26k777j214K073l493l348J278k65M89K302K181j296K433L639
$$ -1197 675 3868 4494 1717 503 2576 -917 -4265 -2987 -3252 -2763 -461 1720 424 2857 6496
798F496l947l723K250j378m564N11K854j909K172N368j645j324M138k78o348r11
$$ 6496 2549 -1174 1076 -302 -4866 -4355 -1501 -3410 -1238 4130 2485 1161 5299 5021 -1327 -2238
814b238K458m047k140L904Q49n97M686K608l821J165K835n381m466K298o30l282
$$ -2238 220 -3827 -5967 -2063 -1214 -1811 2875 5483 1662 2827 5662 281 -4185 -1887 -2517 -5799
830e799K504L286j414L307M620l067k542L568j762o651l9J714k327J25M408M25
$$ -5799 -3295 -9 -1423 1884 6504 3437 895 4463 2701 -3950 -3989 -2275 -4602 -4477 -69 356
846C56kM652R40m401P8J408m607l140J022K77n32K535K137J37K842J543k207j333
$$ 356 354 5006 5946 1545 1623 3031 -1576 -4716 -3694 -3417 -3949 -1414 723 860 3702 5245 3038 1705
864A705m73k006k479m05n40M71L821j84j82L915J758j978k796J467k214l456J060
$$ 1705 1232 -774 -3253 -3658 -4198 -3727 94 -90 -272 3643 5401 3423 627 2094 -120 -3576 -2516
881b516j257j147L247K872l70l88N228r90l928J229j865k372j558Q11n47k82N228
$$ -2516 -3773 -4920 -1673 1199 829 441 5669 4679 751 1980 115 -2257 -3815 -3004 -3551 -3833 1395
898A395o46N64L219m52r21j933j86l817j236L417m598N97N133J908j610j00O683
$$ 1395 749 1313 4532 4080 3159 1226 1040 -2777 -4013 -596 -5194 -4597 536 2444 834 734 7417
915G417m350l267J960l309j929p08K335j837k09P721j781q40K732M36j429m952
$$ 7417 3067 -200 1760 -1549 -3478 -4186 -1851 -3688 -3897 3824 2043 1203 3935 4371 2942 -2010
931b010K371k732k810L294j311J872P96L217J778l123K525k348j11j509n188L072
$$ -2010 361 -2371 -5181 -1887 -3198 -1326 -530 2687 4465 1342 3867 1519 1408 -101 -5289 -2217
947b217j36Q56j469K118P194n289N86K145j413k263l764L602m288l21N191k171
$$ -2217 -2353 -1497 -2966 -848 6346 1057 1643 3788 2375 112 -3652 -50 -4338 -4659 532 -1639
963a639K000P05L497r62m355M541m496j643P31j415Q03j569O129o27k690N329
$$ -1639 361 1066 4563 3601 -754 3787 -709 -2352 -1621 -3036 -2233 -3802 2327 1700 -990 4339
979D339j373Q5m412n70K790m173O73j442M675J935m755M947Q44o09l124j286M155
$$ 4339 2966 3051 -1361 -1931 859 -3314 -2641 -4083 592 2527 -2228 2719 3563 2954 -170 -1456 2699
996B699o972J135L022j852J541j03N290l588p30L600n055J048j735p39M32o23
$$ 2699 -4273 -3138 -116 -1968 -427 -530 4760 1172 442 4042 -1013 35 -1700 -2439 -2007 -2630
1012b630M926m000K049L942k569M30l884K542l85l662N30m88N754k607k795O870
$$ -2630 2296 -1704 345 4287 1718 2148 -1736 806 421 -3241 -2711 -3199 2555 -52 -2847 4023
1028D023K8k601l474M243m92q028M801J864k522j44L734L490n968L032J803m134
$$ 4023 4051 1450 -2024 2219 1727 -6301 -1500 364 -2158 -2302 1432 4922 -1046 1986 3789 -345
1044c45L49k397J71j013K189J345l376N505J802k694K20j037J694l953j752K64
$$ -345 4 -2393 -2222 -3235 -1046 299 -3077 2428 4230 1536 1756 719 2413 -1540 -3292 -3028
1060c028J022K506l954K632N595j492l217Q38M354o250m070N800k082l632K145
$$ -3028 -2006 500 -3454 -822 4773 3281 64 902 5256 -994 -5064 736 -1346 -4978 -2833
1075b833N676j093l017N283K23l074o93j265p41j007N74j337J030M449m58j491
$$ -2833 2843 1750 -1267 4016 4239 1165 472 -793 -1534 -2541 -1967 -3304 -2274 2175 1717 226
1091B26K179J748k663k507M15j228l40J11j318K398L078q57j263L603M85m641
$$ 226 2405 4153 1490 -1017 -602 -1830 -2170 -2059 -3377 -979 2099 1242 -21 3582 4067 -574
1107e74p70K986l052m425M211L030l369p8M992J721m164o6J826j473k228j987
$$ -574 -1344 1642 -1410 -5835 -1624 1406 -1963 -2041 2951 4672 508 442 2268 795 -1433 -3420
1123c420J795N04l37P75N20K674n89k52p7k284J788j732j905J98J826J106l412
$$ -3420 -1625 -1121 -1458 -683 -163 2511 1922 1670 1593 -691 1097 -635 -2540 -2342 -516 590 -2822
1140b822M173K705m122P49J196M61n485J325M072n235M22K231K285j337j901M594
$$ -2822 1351 4056 -66 683 1879 2340 -3145 -1820 2252 -2983 -2561 -330 1955 618 -1283 3311
1156C311j964o11n08k383K837k097K69r60J787K608l843K949M97j311O48j807
$$ 3311 1347 736 228 -2155 682 -1415 -1146 -2106 -319 2289 -1554 1395 1892 581 1229 -578
1172e78J112l138K050Q29k919L714r48P12J35j04J370m090K766j43l251J522l70
$$ -578 534 -2604 -554 275 -2644 1070 122 834 969 865 2235 -1855 911 768 -2483 -961 -1331
1189a331K775l398J063L617k175R32k300K216R7m012K250j687J898m98q52L280
$$ -1331 1444 -1954 -891 2726 551 1483 -817 1399 1496 -2516 -266 -1953 -55 -553 -1405 1875
1205A875k473K342M8j530P44k220K149k808L5J961k246K596m69J087K44r60K608
$$ 1875 -598 1744 1792 262 1006 -1214 935 -1873 -1838 123 -2123 473 4 1091 1335 375 2983
1222B983l783J27N93j167N56k535L524J53o50J657j001K253k000n78j57j440J522
$$ 2983 -800 -673 -80 -1247 -691 -3226 298 451 -199 1458 457 2710 710 132 -25 -1465 57
1239E7k479P75J055M7K402j057J198p28m66Q21l187N55o29m09J030p42K095L47
$$ 57 -2422 -1647 -592 -545 1857 800 1998 1270 804 1625 -1562 -1007 -1636 -2045 -1015 -1757 338 685
1257F85R46N19j762J320q11j231j297q07J435q98Q81R32P78J890j067L84j171
$$ 685 1631 2150 388 1708 897 -334 -1631 -2438 -1003 -1901 -1020 -88 690 2580 1513 1897 726
1274G26j05n69k363K86j21P01O39L73J696K42Q94j57j762L09r16j035j044K02
$$ 726 621 52 -2311 -2025 -2146 -1445 -806 -433 1263 1505 2399 2242 480 789 -127 -1162 -2206 -2004
1292b004J044o11J735R36j12J371k35q84j695M03m36k026M52Q63K61J009J042
$$ -2004 -960 -1571 164 1100 988 2359 2124 1240 -455 -52 -488 -2514 -2062 -1199 -938 71 1113
1309A113M38l99J337q79k092k8P1j024j195J197P43M92J230N52n82P96k6j602
$$ 1113 1551 1152 2489 1610 -482 -510 -439 -1463 -2658 -1461 -718 -226 1004 1556 974 1770 1744 142
1327A42j077K5j79q57Q96q1R68J406K62n41J31Q72j284j775M16k56r57N47Q64
$$ 142 -935 -910 -1089 -1946 -1050 -1131 -163 1243 1505 964 1095 1967 683 -1092 -676 -932 -1889 -1342 -478
1346d78n6P55J869r51m77P60p43j533m12J98l5k2O33j59P23J482l89r65N70K45
$$ -478 -534 221 2090 1139 662 1422 679 -854 -1266 -1068 -1103 -1125 -492 -651 72 1554 1165 200 770 1015
1366A015j539l43J79j333J153J172o34j34J949M14k298O09R51j581m59O20k75
$$ 1015 -524 -867 -688 -2021 -868 304 -330 -464 1485 1899 -399 210 1161 -420 -879 -259 -534
1383e34p97J404R12j699R27J416j095j008O85N95j716L79P01j044Q67N93o54m12
$$ -534 -1331 73 985 -714 213 1629 534 -474 211 806 -910 -531 170 -874 -7 586 -68 -480
1401d80J011K89j599J236o3j301J198K39q93o89K226n23k318J891M27j179l16
$$ -480 531 820 -779 457 394 -907 291 530 -363 -1052 1174 651 -1667 224 651 -528 -844
1418h44J146j7q75J939q07j378J245N03j304j134J719J55j468J244J47K81J56
$$ -844 302 285 -590 1349 542 -836 409 912 -392 -1526 193 348 -1120 124 271 552 708
1435G08o14O08n17J14q32l50J037j369J017R57m69n26Q46J437k948J83J584j211
$$ 708 94 702 185 299 -533 -883 154 -1215 -198 759 290 -236 610 2047 -901 -718 866 -345
1453c45q56K00J077p15O59J685j914N15J256q69j364k6J287j514o41J661K96O4
$$ -345 -1201 -1001 76 -639 20 1705 -209 306 1562 693 -671 -697 590 -924 -1565 96 392 456
1471D56k19Q52l67n81M22p23K11j018j74J211K9j019K86K250m55k228J714O18
$$ 456 237 1089 722 141 563 -160 51 -967 -1141 70 99 -920 -634 1616 1161 -1067 647 1265
1489A265j567q34R01L5r07J364p2m08N75R64o23j618J707k03j743M21J112l69
$$ 1265 -302 -1136 -235 -200 -1107 257 185 -223 352 1316 693 -925 782 579 -1164 -743 369 0
1507@j120J017J033q36r7J95L10o85p08J203m41R6j089J660R49k239L13R90P97
$$ 0 -1120 -103 930 94 -3 192 502 -183 -891 312 -129 -33 -1122 538 1487 -752 -439 551 1348
1526A348k280k13K529j536m32M24L54M1o72J504j878J75J696j255m48k30K284
$$ 1348 -932 -1145 1384 -152 -584 -160 194 235 -437 1067 -811 -636 1060 -195 -643 -873 1411
1543A411j423j733L288j276l23o96J472K59l261K864M76j126o42m7K965l261o6
$$ 1411 -12 -1745 1543 267 -56 -752 720 979 -2282 582 1058 -68 -710 -757 2208 -1053 -1119
1560a119J754k66O66k734K487K92k169J559j419J668j379M44J144k720L022p09
$$ -1119 635 369 1035 -1699 788 1080 -1089 470 -949 719 -660 -216 928 -1792 1230 521
1576E21q33L35m20K278l854J704J686k674J468o27K150k489n65M223l338M25p60
$$ 521 -312 23 -397 1881 -1973 -269 1417 -1257 211 -416 1734 -755 -1320 2903 -435 -10 -770
1593g70Q66J050m041L379r04J119o1j972M442l274J89J53q09J751l980L169n97
$$ -770 96 1146 -2895 484 -420 699 638 -1334 3108 -166 23 176 -633 1118 -2862 307 -290
1610b90j367L215k034K455k308J406Q91m231L726k442l06P65p87K829l961L894
$$ -290 -1657 1558 -476 1979 -329 1077 1968 -2263 1463 -979 -1285 -520 -1307 1522 -2439 1455
1626A455Q84k933K082j869K978l764j421L478k568K274k807K397K623l613K662
$$ 1455 2339 -594 1488 -381 2597 -1167 -2588 890 -1678 596 -2211 186 2809 -804 1858
1641A858j313R11j596k254M030m381J699Q65n23J871k461M594l102k29K520m087
$$ 1858 545 1456 -140 -2394 1636 -2745 -1046 -181 -704 1167 -1294 3300 198 -31 2489 -1598
1657a598J704j768J209n78k095N742l246P05J293k09J197m546L241r84j946J720
$$ -1598 106 -1662 -453 -1031 -3126 2616 -630 75 1368 1159 2356 -2190 1051 67 -1879 -159
1673a59k614L849j757L54K158j994K691l152J352M72l377K578k037J444o87k39
$$ -159 -2773 1076 -681 -327 1831 -163 2528 -624 728 1200 -2177 401 -1636 -192 -879 -1118
1689a118L367l238K583p42m66R52k674J945k094Q88J168k797K864r21J232k89
$$ -1118 2249 -989 1594 852 386 1338 -1336 609 -1485 -597 571 -2226 638 -283 949 660
1705F60j351K500k252Q47j057n63K003k795J987r8M63P61j823K597j980j05Q15
$$ 660 -691 1809 -443 404 -653 -1216 787 -2008 -21 -119 344 1105 -718 1879 -101 -206 609
1722F09j303N28j444K298m70j348K249j138R26q73M3P63j908J715j036k29P92
$$ 609 -694 -166 -1610 688 218 -1130 1119 -19 907 34 77 840 -1068 647 -389 -618 174
1739A74o18J247j506J137N89j491R67j019J000p72n65J337j278J120m53L05N49
$$ 174 -444 803 -703 434 1023 -468 499 -520 480 -292 -857 480 -798 322 -131 174 723
1756G23j274J479j199o1K14n03J092r77L46M12m2J34q31R31j64n66P40j056N20
$$ 723 -551 928 -271 -332 -118 -621 471 -506 -160 252 210 344 -487 444 280 -286 454 -602 -82
1775h2J84JK07p13J128m31m35L78m37L56r46M31J74J39M24m55O35l52J50J01p54
$$ -82 102 103 310 -403 725 294 -141 237 -200 156 -790 -359 -185 -46 378 -77 558 206 356 457 -297
1796b97K55m97PK48m54N54L73N14k06m14Q86p92l84l91J13K21m90L41RM27P81
$$ -297 -42 -539 -532 -284 -738 -184 189 703 497 83 969 177 -207 -598 -485 -264 -754 -413 -404 23 804
1817H04M0m19p3J10n41n42K22j69k9M4N43K03K38N32l11l89p9m48q8m24k64N48
$$ 804 844 425 352 462 -79 -621 -399 -568 -597 -553 -10 193 431 963 652 263 184 -264 -352 -776 -1040 -492
1839d92K27K68q6O53N71o18Q4l20m46k88O3o17J90O44L52RN3P22j05l39p10j66
$$ -492 -265 3 -83 570 1141 523 607 287 -159 -447 -384 -1001 -811 -167 185 194 247 969 864 525 -185 -351
1861c51j80j33o9k33J099L08J59n3J12R7l48l53n67l17L83J35m81K70Q31K67j37
$$ -351 -531 -664 -733 -966 133 441 600 547 659 756 408 55 -512 -829 -446 -311 -792 -522 309 576 439
1882D39J03K73o13k26K5p45k30O32L27o38O56O40p8k00J86l7m46n51J27l49L72
$$ 439 542 815 202 -24 1 -744 -974 -342 -15 -653 3 643 565 365 551 514 68 -483 -356 -705 -333
1903c33J82j86K46O04j6m1j72Q2k24L4n53m79N23K04J85j67J95K92Q2m1j91n85
$$ -333 -151 -337 -91 513 497 456 284 366 142 176 -377 -856 -333 -129 56 -111 84 376 458 417 226 -359
1925c59K49j50j98k23L96L69J43j83K49K57j78n97J37J3k36k82K09M25k60M00
$$ -359 -110 -260 -458 -681 -285 84 227 44 293 550 372 -225 -88 -75 -311 -593 -384 41 -219 181
1945A81L93j88O5l30M81q40k16J77k50K51j60P95p3k11N66o31K82j91l76o0o15
$$ 181 574 386 451 121 602 -238 -454 -277 -527 -276 -436 359 286 75 641 10 292 101 -275 -335 -950
1966i50J344q04j65R76j48N16o63J66J59o78N14j347P01K35n15R15k43O44k57
$$ -950 394 -410 -575 401 253 769 106 272 431 -247 267 -1080 -379 -144 -659 256 13 657 400
1985D00l46Q77j360O57n82l7L81j238J513m36O83j81n47J862j742K22j67m48O77
$$ 400 54 931 -429 228 -354 -391 -10 -1248 265 -171 512 331 -216 1646 -96 126 -41 -489 188
2004A88j389R30K18k35Q56r83J536q42j07J6j233J766j949P57L05m14J467j265
$$ 188 -1201 -271 -53 -288 568 -415 1121 279 172 188 -1045 721 -1228 -471 -166 -580 887 -378
2022c78J588n16j158J347j385J017j337k37J303j406J489p74J042M67j618J543
$$ -378 1210 694 -464 883 -502 515 -822 -1059 244 -1162 327 -447 595 1062 -556 987
2038I87r57P32j120q30J956k138J021j27J03J670j833J612n66k23K78j374J171
$$ 987 30 762 -358 -1188 768 -1370 -349 -476 -373 1297 -536 1076 510 287 565 -809 362
2055C62j644P09R07j563K253j539J022L18j185J905k901J808m87q62R52j528K835
$$ 362 -1282 -573 334 -1229 1024 -515 507 825 -360 1545 -1356 452 -35 -897 55 -1473 1362
2072A362j824O5J758j179J236k475J949k74k257J944j348J058o96J75K273k364
$$ 1362 -462 -397 1361 182 1418 -1057 892 618 -1639 305 -1043 15 -681 -506 1767 -597
2088e97J413k02n84Q44k091K080j865K74Q29j289J895j210J144k28p17J974k207
$$ -597 816 614 30 874 -1217 863 -1002 -728 101 -1188 707 -503 641 413 -304 1670 -537
2105e37M47l09L0Q33k353K259o92M40M90j447K409j590n0N94j118J413k055J145
$$ -537 -90 -399 -369 464 -1889 370 -322 118 608 -839 1570 -20 -70 524 -594 819 -1236 -91
2123i1R0r74J575q12J618j575OJ575k214J236j289P95K15j335J977j354R67M89
$$ -91 -1 -975 600 -212 1406 -169 -163 1412 -802 434 -855 -60 155 -1180 797 -557 410 899
2141H99j125J058j148J459j419j365K414j248N92j056Q70J221j965J630n03N1
$$ 899 -226 832 -316 1143 -276 -1641 773 -475 117 -939 -69 1152 -813 817 314 365
2157C65j51j239J819j382J52N64l45O36j459J974m92q57J091j128P78j194O90
$$ 365 214 -1025 794 -588 -436 128 -217 419 -1040 934 442 -415 676 -452 326 -868 -178
2174a78K78j237J642p08K21K13l07P50j483J255j19j039P05q52J208o62K8Q76
$$ -178 100 -1137 505 -203 18 231 -76 674 -809 446 327 -712 -7 -859 349 -313 -285 591
2192E91p64O10j017R54J17j071R02n46M20q48J88J475j419P19J5j5L50j198J295
$$ 591 -173 437 -580 374 491 -580 322 -224 196 -652 -464 1011 -408 311 326 311 661 -537 758
2211G58r07K38K9n27N47m12M73j95j98J100j021K82j20j67N90j158R50o17L15
$$ 758 -149 89 118 -409 138 -274 199 4 -194 906 -115 167 47 -120 470 -688 262 -355 -40
2230d0L94o45P78n83O9m8K37j38p44P84r0m55L97R1L58n04M42J87p99N68m20L09
$$ -40 354 -291 487 -96 -27 -75 162 24 -720 64 -26 -481 -84 7 365 -139 303 490 -309 259 -161 148
2252A48l14mM12m75J59J94j06K21m99P40p38L4K49m75M69k85L74M8k91J78p0J62
$$ 148 -166 -170 242 -233 -74 120 14 235 -264 476 -262 -228 21 -454 15 -270 104 152 -139 39 -31 131
2274A31l22J62K54n20K92j9K06o8q6L83ml82k2J8j86r0O2J65l74P22j77j62K37
$$ 131 -191 -29 225 -295 -3 -22 184 116 30 413 409 27 5 23 -163 -253 -191 -26 -400 322 145 -17 220
2297B20N8J66p47K36k22K31J20l98K54K31rJ02r8R2m21K98k01l03L09j19M04m31
$$ 220 278 444 -303 -67 -289 -58 62 -336 -82 149 140 242 144 236 -185 113 -88 -391 -82 -201 203 -228
2319b28q8M80p9J14j44M1n0k15J72k50l0J99kJ25j00K58n0O5q2l0l72J50o1p6
$$ -228 -316 164 85 199 55 96 46 -169 3 -247 -277 -78 -80 45 -55 203 153 218 136 106 -266 -116 -177 -253
2343b53L5r8m0K72N86l71j38J54j1l75K19pk50p5R2L86k23PO38l54q3j23l3O4
$$ -253 -218 -316 -356 -84 502 131 -7 147 136 -239 -20 -27 -277 -352 -260 126 -97 -90 548 194 111 -12 -45 19
2367A9n5j98M7o3K74k9QJ24K46k37L33m44O5P2k88j36J17J32J60p0R7p4r1J83
$$ 19 -36 -234 -187 -250 24 -5 3 127 373 136 469 25 90 162 -126 -262 -145 -13 147 77 174 100 9 192
2391A92j21j62j61K14M5k80J36K08k90M35k18J05j87K93l6m20K85k99J60j1OL33
$$ 192 71 -91 -252 -38 7 -273 -137 71 -219 216 -2 103 -84 209 173 -247 38 -261 -101 -112 -106 227
2413B27j84M2l8l16O85m94J51Q5m42K85q7L03m61J23K63j73L7J32l3j61m90O24
$$ 227 43 85 47 -269 416 -78 73 158 -284 1 -86 217 -244 -121 142 -31 6 138 105 -56 -546 78
2435G8j70J57l72J16L59l23K5L92k14O7k08J13P4n8K02m91J07l1L98p9n1L57l74
$$ 78 -92 65 -307 -191 168 -155 -130 262 48 115 -93 20 94 36 238 -253 -146 -177 221 142 91 448 74
2458G4j3R2l83K68o79Q26k21k50L34l2J30l05J04N37o63K54l66K29Q8p58P56o32
$$ 74 61 153 -230 38 -641 185 -36 -286 48 16 146 -159 -55 482 -181 73 -293 -64 24 -734 22 -610
2480f10O99k18N8N87o93L58j78k07J67m46O62l07l60M87k60O14l13J59q6m49Q64
$$ -610 89 -129 -71 516 -177 181 3 -204 -37 -483 179 -128 -488 -1 -261 353 40 199 113 -336 528
2501E28r26Q7K22k09N02o28N60J26n50M21k09P42q52k40N53l89K60l65J50M41
$$ 528 -398 -311 -89 -298 204 -424 136 262 -288 133 -76 666 -186 -426 127 -262 -2 -367 -217 224
2521B24p37J179n19J31l56m0M85r93Q22l30j92K67l72P75m32J00M96r86P75l41
$$ 224 -513 666 147 278 -78 -118 367 -626 196 -134 -326 -59 -431 344 -88 12 508 -478 297 -44
2541d4J16k76l14R71o90J50J55L6L88j013P78k19j15L4o73R82o45K57L19m08N84
$$ -44 72 -204 -518 453 -237 -87 68 104 492 -521 257 38 -77 -43 -716 266 -379 -122 197 -211 373
2562C73o48M46J06m61M20p20M52n86N27K93n01M35l67M14K15l03K85n33N08j26
$$ 373 -275 171 277 -184 236 -484 -32 -618 -91 202 -299 136 -231 183 398 95 380 -153 355 229
2582B29n41K59k95Q17m77m18J089o68K44p33O02K6m97N58l48N04o03J20O12r39
$$ 229 -312 -53 -348 469 -8 -426 663 -5 239 -494 108 134 -363 195 -153 351 -252 -132 480 -459
2602d59N32j2J26r1m15R14o19j41M57l99K36l34L44K0q21J232o04J56l36M49Q9
$$ -459 73 61 187 96 -319 595 -24 -165 292 -107 129 -205 139 159 -662 570 -34 122 -214 235 324
2623C24o88N36J21m43ol5Q93j198O00K53m43J50l48M67k12k68P97l63K17m60o9
$$ 324 -364 172 293 -150 -156 -191 702 -496 104 357 -86 64 -284 183 -29 -297 500 137 354 -106 -175
2644a75O91p91N06m37M28O7m09L59l87L43m44J02M74o64O57l59l08M78n60Q25
$$ -175 516 -275 231 -206 222 289 -120 239 -148 195 -249 -147 327 -337 320 -39 -347 131 -429 396
2664C96p01L15P0l81L39k00R4J07l80Q25p38J52M39k86L48r64R74j54n81L21k06
$$ 396 -305 10 80 -301 38 -162 -68 39 -341 484 -254 -102 337 51 399 -565 409 255 -326 -5 -211
2685b11M05n21K25O11q08M19l08K67j23m6L89q56P01m4N2j77k56R20p48J28J84
$$ -211 194 -327 -102 509 -299 120 -188 79 -44 -90 299 -557 144 100 152 -25 -281 639 -109 19 203
2706B03j11J72p19O79n2o27O41m23N34m36J83N78j135N60p0K85l31l13N92j21
$$ 203 92 264 -455 224 172 -455 186 -237 297 -139 44 622 -513 47 -23 262 -69 -382 210 89
2726H9j77J41l11L66m29N41m42K85K51n28M82l21j22K09m16M76m2j08J64k51O16
$$ 89 -88 53 -258 108 -321 220 -222 63 314 -214 268 -53 -175 34 -382 94 52 -56 108 -143 473
2747D73p37O10j58l65K86l37K52j68j9J6J73L49p17K87K70k91J10l41L38q8k49
$$ 473 -264 346 188 -177 109 -228 24 -144 -163 -147 26 375 -342 -55 215 -76 34 -307 31 -57 -306
2768c06L91k43K59ml18N59k50jJ36k37K02m43K98l91K56M2o0K06LK13l26j51J66
$$ -306 85 -158 101 97 -221 338 88 87 223 -14 188 -255 43 -348 -92 -50 -110 96 99 312 -14 -165 1
2791Al75K12k28J94K52j71L31l1r0Lr9j59o8L96l66k4L24k26K78j40J80K64n90
$$ 1 -374 -162 -390 -196 56 -115 216 185 95 98 -1 -160 -228 168 -198 -222 102 -124 154 14 194 458 -132
2814a32L92k29pk6m53L15l27K85J95j30Q7J70K99j99k64K50l73K13m35L92k23
$$ -132 260 31 24 -2 -455 -140 -467 -182 13 -117 -30 140 439 240 -24 226 -147 66 -369 23 -200
2835b00L8J36j75L59K60Kl33j19j11J48l16J8P5J90j42M51q8J79j76K40m27K24
$$ -200 -162 -26 -201 158 418 420 87 -32 -143 5 -311 -293 -218 -28 -170 281 193 372 196 436 9 233
2857B33o66M17l66K26k30L46K37N3R6l9r1J06l79N0l4j47k1r3K11r0L34J14k4
$$ 233 -433 -16 -382 -156 -386 -40 197 250 346 307 216 322 -57 -7 -41 -188 -209 -302 -91 -181 153 267 243
2880B43J39K8l08k09m1j03k26L83J21j00L04j14N7R8j83J91l94J57k43L6Q5j86
$$ 243 382 410 102 -107 -148 -251 -477 -94 27 -73 231 117 174 272 89 280 -114 43 -200 -164 -79 -265
2902b65M21m1m3K24l47L88k54Mk47j24L92l55J45RJ52J51L2%k36J71M2m86k2K40
$$ -265 156 115 72 296 -51 337 83 87 -160 -284 108 -247 -102 -93 59 210 242 242 6 177 219 -267 -289 -49
2926d9K2Q7j85M2K5K96K2k19J07j28k24j10M7J71q9k3L52j16J37J09Rl98J66M5
$$ -49 -27 60 -125 -83 -58 238 260 41 148 20 -204 -314 -267 -96 -185 -208 144 28 165 274 283 -115 51 96
2950I6m21L71l46L44M7j52J42R0n3j61k9M47m96J03k25J95j04L2J99j83R4K00
$$ 96 -325 46 -300 44 91 -61 81 171 118 -43 -72 375 -121 -18 -243 -48 -152 -120 79 -104 -10 190
2972A90k10j1J0lk05J27j18k6L60l24K10P3N9N7j88J66j55j93J45qL9r0L28j83
$$ 190 -20 -31 -21 -24 -229 -102 -220 -246 114 -210 0 73 132 189 1 167 12 -181 -36 -44 -5 -95 233 50
2996E0J23P4k13l2j10j38J75l09L31K50m44L72NJ45l35K60k13o2M7l72L06O1r9
$$ 50 173 247 34 2 -108 -246 -71 -380 -49 201 -243 129 134 279 -56 204 -9 -71 -24 -396 -90 -29 -128
3019a28J65k29M93m50N30l05j14L45k83m8j42N4K54j79J46M32p07M38k07J29n36
$$ -128 37 -192 301 -149 381 76 -38 307 24 -24 -166 -112 142 -37 109 541 -166 272 65 194 -342
3040c42J67J29l06L05j83L01o0n03R21l05k77J80p5K48o21M95j35k26K45p9M22
$$ -342 -175 -46 -352 -47 -230 71 11 -492 429 124 -153 27 -48 200 -421 74 -61 -287 -42 -121 301
3061C01j51R3L7n29O54k92j93l28P8P03o21K50J56j38K48l52M73m14k51K27l22
$$ 301 150 243 280 -249 405 113 -80 -408 -330 373 -248 2 158 20 268 -84 389 -25 -276 -49 -371
3082c71M68p75N54J16k3M34m93L67k62j35K23m20L32m8r0J41j36L47k3m1J44l79
$$ -371 97 -678 -124 -8 -31 403 -90 277 15 -120 103 -317 15 -33 -123 18 -118 229 206 165 309 -70
3104g0K49k85J44k96j60L82lK01l33J95N79o52k7J30J3j03n65Q79j40n19J51M68
$$ -70 179 -106 38 -258 -418 -36 -39 162 -171 24 603 -49 -76 54 67 -36 -601 278 138 -381 -230 238
3126B38J36p27M77k3j96N4j87L04m43O7N35p98O43j24K59k2k80N79p07L05j87
$$ 238 374 -353 124 101 -95 -41 -228 76 -367 -300 235 -563 80 -44 215 193 -87 492 -215 90 -97
3147i7l20N42n84O85j35n07L63O7K10m80J93M69o97K47L4J36j55j75O19m07m1
$$ -97 -417 125 -459 226 91 -416 -53 14 224 -256 -63 406 -291 -44 -10 126 -29 -204 415 8 -33
3168c3l8L1K64p45O18k12n36P46l92N17l04M6M48n69L91k81K92j68n29M22j72
$$ -33 -71 -40 224 -521 97 -115 -651 95 -297 220 -84 -38 410 -159 232 -49 243 75 -454 -32 -204
3189b04J54J30qJ99q55J131l93mk26j88N95n79KL02j85Q9n2K49J47m99P86o29
$$ -204 -50 80 72 271 -584 547 154 150 -76 -264 331 -248 -246 56 -129 -40 -92 157 304 -195 591 -38
3211c8k7j11O6j61n7M84m40K26L00l46L24o55N36j9m77M36q8J3m92L36K73k35
$$ -38 -65 -176 -110 -271 -328 156 -284 -58 242 -104 220 -435 101 82 -395 41 -47 -34 -526 -190 83 -152
3233a52JK60r8K8l63M91k71J13P5l44K73j68L40O7m39M40l67L53j24r8rO6J11
$$ -152 -151 109 11 39 -324 167 -104 9 84 -260 13 -155 185 252 -187 253 -114 239 115 17 8 74 185
3256A85k53j4L20l26K29j25l81K71J57P5j87L2n6j66Q3k26M89m82L92K71q7k47
$$ 185 -68 -82 238 -88 141 16 -365 -94 63 138 -49 -17 -73 -239 -156 -382 107 -375 17 288 201 -46
3278d6O6R8j21l58K78k13J4J15J68M11l30qk1j7k8J13k65K35k42K55j34K1K08
$$ -46 20 118 -3 -361 -83 -296 -282 -167 1 412 82 74 53 36 8 121 -144 91 -151 104 -30 -9 199
3301A99N6j61Q8lk72o5K44k38K46l32J56L46l92K74l19J78N5J76l49N5j33J54
$$ 199 255 94 182 179 -93 -158 86 -152 94 -238 -82 264 -128 146 -173 5 60 236 -113 -58 -191 -37
3323c7j8m7o7K49j0J75K1k4k51N3J9k94K2J40mO9j0k8J63L11o15L06q6l78J16
$$ -37 -55 -102 -169 80 70 245 266 242 -9 44 63 -231 -209 -69 -73 -4 -14 -42 121 432 -183 123 37 -341 -225
3348b25K06K27m78K54k5J76j57nO9j63J34Q8j13l24L63p4K5K9j3J76j17K0o7p8
$$ -225 -19 208 -270 -16 -41 135 -22 -27 42 -121 13 101 -12 -336 27 -47 -22 7 -6 170 53 73 6 -72
3372g2K31k10J19j05p4J01J09j54J33L28k74k29J19o3J7Rp5P3P1j18P4Q5O7p4
$$ -72 159 -51 68 -37 -111 -10 99 -55 78 406 132 -97 22 -41 -24 -15 -90 -17 54 -64 10 95 162 88
3396H8J25l9j44K8m3j5M8j14J16L8r7J74k96J12J27k73qj4J04j25K85j6P1j90
$$ 88 213 174 30 58 15 0 48 -66 50 88 -9 165 -131 -19 108 -165 -173 -187 -83 -208 77 61 132 -58
3420e8J43MJ65k5k30k98K40K20m3q1M0rk6L25l02Q3j57m7l7K04j82k33K18k4J67
$$ -58 85 89 254 229 -1 -299 -59 161 118 37 77 68 42 367 65 148 -9 -56 -93 111 -71 -304 -86 -110 57
3445E7J82r1o0mm5lj02k88J43Q8J1K08j68J28J19j7j50J38j52K21j94k73J51j25
$$ 57 239 148 88 84 39 36 -66 -354 -211 -123 -112 96 -72 56 175 158 8 146 -6 215 21 -252 -101 -226
3469b26J71n6R5J51o4L7j27M7J40l24J15j59K38J21j77J72j39j05K19q8o6m68
$$ -226 -55 -111 -16 135 71 108 -19 28 168 -156 -41 -200 38 159 -18 154 15 -90 129 41 -25 -493
3491d93L05J83k44K26m5J37n9K24k02kj47J25K61j72J7j45k50Q6J45j1K75l81
$$ -493 -188 -5 -249 -23 -68 69 10 234 32 30 -117 8 269 97 114 -31 -281 -195 -50 -61 214 -167
3513a67L28j77J15Jk77J9Q5K5r5q6L15l40M43J08l49J47l51K45J7L5j13K3Q1N5
$$ -167 161 -16 99 100 -177 -158 -73 -48 -143 -229 86 -254 189 297 -52 95 -256 -11 6 41 -72 -49 32 87
3537H7J29L2j73R6j30m6k29J96J60m20K77j45J57L02m19N45n13J20L42m14J72
$$ 87 216 248 75 171 41 -5 -234 -38 122 -298 -21 -166 -9 293 -126 419 -94 26 368 -46 126
3558A26k83J8Q6k1K48k32L68l48p8L28m71L61k13j57k8LK46p5P7M22o24K92J65
$$ 126 -157 -139 -53 -74 174 -58 310 -38 -116 212 -259 102 -111 -268 -296 -293 -47 -122 -45 377 -247 45 210
3581B10k02n1k09N39o19K36O0R2N5j27K23j22k14M62l12K22l39n7K45j33K22j42
$$ 210 8 -43 -252 287 -332 -96 -36 56 111 -16 207 85 -129 333 21 243 -96 -153 92 -41 181 39
3603C9q3n7j68N44M1k66k32l0K73m09L20r1J57pl97P23r8l02J16r7J28k90mQn4
$$ 39 -44 -101 -269 275 316 50 -182 -212 61 -348 -28 -119 38 31 -366 357 259 -43 73 -24 104 -186 -190 -182 -236
3628b36L61j63Q1j12K62J4l17J49k5k1K62n37O46n13J52K00k80J96k90L53l04
$$ -236 125 -38 43 -69 193 207 -110 39 14 -7 255 -282 364 -149 3 203 -77 119 -171 182 -122
3649a22l2J41k67J94n9K07J46n38L47K80k14K41m17J65j45K29n6m96J97K56k13
$$ -122 -154 -13 -280 -86 -145 62 208 -330 17 297 83 324 -93 72 -73 156 100 -396 -199 57 -156
3670a56L07j56L57k91j18J77k38K01m98L06J43k51L25j70J22j52L34M1l96J65
$$ -156 151 -5 352 61 -57 120 -118 83 -415 -109 34 -217 108 -62 60 -92 242 283 -113 52
3690E2k19K36n3k14M59j60NJ41j78P2j37R3k47j67L53j46p0k8K12J82R5j43l15
$$ 52 -167 69 16 -198 261 101 106 247 69 141 4 97 -150 -317 36 -110 -180 -208 4 186 281 138 -177
3713a77P33m23j16J06k71K61l90N27j16j40K17j30jJ40j35pl56R0J68l2q9J41
$$ -177 556 133 17 123 -148 113 -277 250 134 -6 211 81 80 220 85 78 -278 -188 -20 -52 -141 0
3735@o8RJ51J79l42J39nQ8j55m56L07J82j05j04K9K44j53J89k7k11J16k64L49
$$ 0 -68 -59 92 271 -71 68 63 151 -4 -460 -153 29 -76 -180 -151 93 -60 129 102 -109 7 -257 92
3758I2j67PJ91j60O5l8L20k11O9j88n4J71j93J12J00m28L81k5O5J74rr0j87L9
$$ 92 -75 -68 123 -37 28 -10 310 99 168 -20 -74 97 -96 16 116 -312 69 44 109 283 274 184 -3 36
3782C6o6l7j53r5M38j66K6J78K1Ok87J2J18j55K77l19K4p9M4K83j94k01N21K7
$$ 36 -30 -67 -220 -315 123 -43 -17 161 182 188 -99 -87 31 -124 153 -166 -142 -221 -177 106 -88 -289 232 259
3806B59l92J01O8j03j75J22J59q2P8o2J75j45j21L09k28K99l99Jj28M40l11K04
$$ 259 -133 -32 36 -67 -242 -120 39 -43 35 -27 148 3 -118 191 -37 262 -137 -136 -264 176 -135 69
3828F9p0J58J60j89j65K63m57J97J40k5K7K15o16J80J75Q6jj66K17k78n0n8M17
$$ 69 -1 157 317 128 -37 226 -231 -34 106 81 108 323 -293 -113 62 148 147 -19 198 -80 -130 -188 229
3851B29l60jJ93j80J9K93j43O1r0J3k2k10K56k56M69n0m7J49k44k08n0l3J36J72
$$ 229 -131 -132 61 -119 -100 193 50 111 21 34 12 -198 58 -198 271 221 174 323 79 -129 -179 -212 -76 96
3875I6r2p8k6l5K82n7k19J69o0J65oj75O8k23o4L5K65k73L26o0j88R3J78m3L9
$$ 96 4 -74 -100 -135 147 90 -129 40 -20 145 139 -36 32 -191 -255 -220 45 -228 98 38 -150 -57 121 78 117
3900A17n7o4P1j95RJ36J37j17k12L72l52O7K7j09L09m65M45k25K4R8K2j26L0O5
$$ 117 60 -4 67 -128 -119 17 154 37 -175 197 -155 -88 -61 -170 139 -326 119 -106 -82 16 38 -88 -58 7
3924GP2K94n20K84j62j14Q2Q1Q7k1N1J66k41k68J00L43l58J6K33l23L86k46J56
$$ 7 79 373 -147 137 -25 -139 -57 24 111 90 141 307 66 -202 -102 241 -117 -101 132 -191 195 -51 105
3947A05J25l05P9QP1j14j62K34l21J79J79j33K84q2j00Q9l46L95q3j30l28P8K82
$$ 105 230 -75 4 12 83 -31 -193 41 -280 -101 78 -55 229 147 47 136 -210 185 102 -28 -356 -278 4
3970Dr2K27k21J39M0k25K02K32l49j19j5R0R7j94n2J25J57j79K29j42q9n4K85
$$ 4 -88 139 -82 57 97 -128 74 306 -43 -162 -177 -87 10 -184 -236 -111 46 -133 96 -46 -135 -189 96
3993I6j06k7j47J44j40K30m7J2J40l97L67j98J00r9l97N21j16K10j15j09L83k90
$$ 96 -10 -37 -184 -40 -180 50 3 15 155 -242 125 -73 27 -72 -469 52 -64 146 31 -78 305 15
4015A5J25p9j32Qj65L63k21j27Q1R2J13j35J17q6n2L41k94R9n3pn3rK1M2K41p0
$$ 15 140 61 -71 -63 -228 135 -86 -213 -132 -40 73 -62 55 -31 -83 258 -36 63 10 3 -50 -59 -38 4 245 175
4041A75k68K66M2L2j21l5k39Q6J66j60J61j03k58J55M8J1J76k92J8k5J31p9o1
$$ 175 -93 173 215 247 126 91 -148 -62 104 -56 105 2 -256 -101 -53 -42 134 -158 -140 -165 -34 -113 -174
4064a74J39O6q3J16l82M58j30m9L2K9J26j74J96j60p0J31p2K15K5l25J15k43M17
$$ -174 -35 31 -52 64 -318 140 10 -39 -7 22 148 -26 170 10 -60 71 -1 214 239 -86 29 -214 203
4087B03r5j21k30P0K63k20K26k16J04J92k94K28j02r4P5j36J10O4J84k15o1k26
$$ 203 108 -13 -243 -173 90 -130 96 -120 -16 176 -118 110 8 -86 -11 -147 -37 27 211 -4 -65 -291
4109b91K51J06r6q9M3k98L62l08L27j51L97q6j11J11k40O3N5J76j82j10j49M0
$$ -291 -40 66 -30 -119 -76 -374 -12 -320 7 -144 253 167 56 167 -73 -10 45 221 39 -71 -220 -180
4131a80K1K17l7q4K02N4j13j10J02j12Rkk31K78j64KJ06J31jJ85k38q2k2j1k4
$$ -180 -159 58 21 -63 139 193 80 -30 72 -40 -31 -33 -264 14 -150 -148 -42 89 88 273 35 -47 -69 -80 -104
4156a04j44K08L7Q6J47k51N9m6K22k11O2k14J69l3j46K25j65j34L71L6q6k3l27
$$ -104 -248 -40 -3 83 230 -21 38 -8 214 3 65 -149 20 -13 -159 66 -99 -233 138 174 88 65 -262
4179b62j12M04r8j99N26l75k1K56l07J96P3J65k58j49K78j57J37k54K93N1k62
$$ -262 -374 30 -68 -267 259 -116 -137 119 -188 8 81 246 -12 -161 117 -40 97 -157 136 187 -75
4200g5J60N1q3o3J40l38K62j50k1J55J95l48k03L97j22K47m6j42K5n9j73N3j56
$$ -75 85 136 53 -10 130 -208 54 -96 -117 38 233 -115 -318 79 -43 204 158 16 41 -18 -191 -138 -294
4223b94K89J36j1Q4n5%l21K06k68M09o1O6Mm60K06K9J22k18K55k42p2J58k26N7
$$ -294 -5 131 120 204 149 149 -172 34 -234 175 114 180 184 -276 -70 -41 81 -137 118 -124 -196 -38 -264 -207
4247b07K07k34R1R0Q0L6j72K42k38J9m1q3L73l52R9K03M3O9m24M27k36J8Q5j61
$$ -207 0 -234 -143 -53 27 63 -109 133 -105 -86 -127 -210 163 -189 -90 113 156 225 -199 228 -8 10 95 -66
4271f6K13j24J12j00l9m9k46M81j28r4J00n0N9l94J64J26n7k3J21J38k24L6n5
$$ -66 147 23 135 35 -4 -53 -299 182 54 -40 60 10 69 -325 -161 -35 -92 -115 6 144 -80 -44 -99
4294i9OL7K39m33L13k95m4L64j34m4R2l14J42K34O1j64qj32J34K30l09P5k6K79
$$ -99 -93 -56 183 -250 63 -232 -276 88 -46 -90 2 -312 -170 64 125 -39 -47 -179 -45 185 -124 -49 -75 204
4318B04k07j15L79j72R3j77j29J86l36L46P1k20J78J16k8k4k14Nl79N23k03J27
$$ 204 -3 -118 261 89 182 5 -124 62 -274 72 143 -77 101 217 189 165 -49 -44 -423 100 -103 24
4340B4j02j60O0M5L0J06k23L14p3q3L8j46L4L2K96k18N8K45l59O0jJ04j65KK5
$$ 24 -78 -238 -178 -133 -103 3 -220 94 21 -62 -24 -170 -136 -104 192 -26 32 277 -82 -22 -23 81 -84 -82 -57
4365e7p6J54k52L96o9p9k25L21r7rm7J74r3K56l26o8j05K04OJ26j9k36K57q2o9
$$ -57 -133 21 -231 165 96 17 -208 113 16 7 -40 134 41 297 -29 -97 -202 2 8 134 115 -121 136 54 -15
4390a5J13L8l09J81J08qp7J41q4L2j60K8O1J02l64J03L54j02K4j72r7QQ7L69k00
$$ -15 98 136 -173 8 116 108 31 172 88 120 -40 -12 49 151 -213 -110 244 142 166 -6 -103 -95 -8 361 161
4415A61j75j2J21k58K11j30J23P1k74J08K66k57P6J79jj31j21p8Q9p1K67mo1K7
$$ 161 -14 -26 95 -163 48 -82 41 112 -162 -54 212 -45 31 210 209 78 -43 -121 -32 -103 164 160 99 126
4439A26J3m62M76Ml54R6J58k65L88l40K60lk56J31J5K85l67RN9J07l03M3P4q8
$$ 126 139 -323 153 157 -197 -101 57 -208 180 -160 100 97 -159 -28 -13 272 -95 -86 -27 80 -223 -180 -106 -194
4463a94O4J47J22n2l0j52J46p8j68mK14P5k69P2P3N3j44j05K16j41J18j6%Kk4
$$ -194 -130 17 139 87 57 -95 51 -27 -195 -199 15 90 -179 -107 -34 19 -125 -230 -14 -155 -37 -53 -53 -51 -75
4488g5P6r0J6R0J76%k03Q6j5k01K86m27M08l1j91P8J38j50o1L1J3o2J8O3j09Q6
$$ -75 1 -89 -73 17 193 193 -10 76 61 -140 146 -281 127 96 -95 -17 121 -29 -90 -59 -46 -108 -90 -27 -136 -50
4514e0K19Jk29K56o8j35P0L5o7k62K12n1N7K95m64K09J06j60k6K12k70N0r8J60
$$ -50 169 170 -59 197 129 -6 64 99 32 -230 -18 -69 -12 283 -181 28 134 -26 -52 160 -110 -60 -158 2
4538Bj76K53j78N5j31R7k5K19m8j9j01j1R5o9j49n3N00q9Q8o5q2j08J97k66n7
$$ 2 -174 79 -99 -44 -175 -78 -103 116 68 49 -52 -63 32 -37 -186 -239 261 172 260 195 113 5 202 -64 -121
4563a21L68l38K36n4m16M44j2J17l05J25k4j48L09k37l8R2j12K57l07J52J50l28
$$ -121 247 -91 145 91 -325 119 107 224 -81 44 20 -128 181 -56 -94 -2 -114 143 -164 -12 138 -190
4585a90L44p0K19l52J4J67k39n0J2q8K35j00K59j04J60l28J06j03p1qL02k9j35
$$ -190 154 84 303 -49 -35 132 -107 -157 -145 -233 2 -98 161 57 217 -111 -5 -108 -179 -187 115 86 -49
4608d9J6K41n2j33rr9o2K99m6k30N4L4J98q0J22k17K79j05k06j81J61K0k09M75
$$ -49 -33 208 156 23 14 -85 -147 152 106 -124 -70 -36 162 82 204 -13 266 161 -45 -226 -65 -45 -254 221
4632B21m47J53K8P8J61l54J81m0k29L50k24o5J22N7m2j79N00j25j92N8o9J45l4
$$ 221 -226 -73 -45 33 194 -160 21 -19 -248 102 -122 -187 -65 -8 -50 -229 271 146 -46 12 -57 88 54
4655E4j38J13l67M97k12M4J25qj55N5OJ73k07L2k83M11no0j5k1J22k49L54j31
$$ 54 -84 29 -338 159 -53 -9 116 108 -47 8 14 187 -20 12 -271 140 135 75 60 39 161 -88 266 135
4679A35r3mq7o9L00j87R5j81K58j86kJ21k32K46l26K16j4k50M69m15K41P5k56
$$ 135 42 38 -49 -118 182 -5 90 -91 167 -19 -21 100 -132 114 -212 4 -10 -260 209 -206 35 110 -146
4702a46J34k10N48j79k09K6K4j91J55j88K30M3J33J9k74O4k44J88j80J87J67k38
$$ -146 -12 -222 326 147 -62 -36 -12 -203 -48 -236 -6 37 170 189 -85 -21 -265 -77 -257 -70 97 -141
4724a41J08k07K76R0q3l8Q6nl64J24j29o9K58K50r8P1l51K13k71J96L49k40n7
$$ -141 -33 -240 36 126 43 5 91 86 -278 -154 -283 -352 -94 156 58 129 -222 -9 -280 -84 265 25 -32
4747c2n2q8J44k01L42l42K90L1j00J93k52R8j1N2j36J1k56K87l8K18j29J47l22
$$ -32 -84 -172 -28 -229 113 -229 61 92 -8 185 -67 31 20 72 -64 -53 -309 -22 -60 158 29 176 -146
4770a46J09J89%L2k12P4m6j04K72O7k70j18L14r7j26P3k87R3K01k20K81j15J86
$$ -146 -37 152 152 184 -28 46 0 -104 168 235 -35 -153 161 64 -62 11 -276 -183 18 -202 79 -36 150
4793A50rk79J59K53P3j95j88m8q4L53j42O8k72Q2K30j64mJ50j97J8J66Q5l57q
$$ 150 141 -138 21 274 347 152 -36 -84 -168 185 43 111 -161 -79 151 -13 -17 133 -64 -46 120 205 -152 -160
4817a60J55j36K68j60K66k42o6J73k0l38K37O1j8m9P3j5P3m0R4j89L3N3l25J89
$$ -160 -5 -141 127 -33 233 -9 -75 98 78 -260 -23 38 20 -29 44 29 102 62 156 -33 0 53 -272 -83
4841h3J73m42K54K94j22j11K40k53K00q8j28J12k4j3r5o1J37J53K55l38J41j52
$$ -83 90 -352 -98 196 74 -37 203 -50 150 62 -66 46 22 9 -86 -147 -10 143 398 60 201 49
4863D9j4m3J83m14J3J40k35M53l6M5m5J3j03K62m95L13N7k15j7J95Kk99P6J33
$$ 49 35 -8 175 -239 -226 -86 -321 132 96 141 96 109 6 268 -227 86 143 -72 -89 106 108 -191 -115 18
4887A8M94m20m1r0k33K30j27L90j07P3k07J29k2j86J71j98J1K77k41J48r4j9k96
$$ 18 512 92 51 -39 -272 -42 -169 221 114 187 -20 109 87 -99 72 -126 -115 162 -79 69 -25 -44 -340
4910c40M05j80L3J76L7k05j0L91k24k70J04j20K8K14j2O8P9m6q8P3k16K22k02
$$ -340 65 -115 -82 94 131 -74 -84 307 83 -187 -83 -203 -175 39 27 95 174 128 40 113 -103 119 -83
4933h3J61o7j24j12L17k02M6J37N7j19J86j65j03Q1J07j87J9KL2q9K99l41L04
$$ -83 78 11 -113 -225 92 -110 -64 73 130 11 197 32 -71 10 117 -70 -51 -49 -17 -106 193 -148 156
4956A56k81K2K29l84M28m49M39k06L10k63j59J11Ol1J9j2M4O7R4n6q7J31l4r7
$$ 156 -125 -103 126 -258 170 -279 160 -46 264 1 -158 -47 -41 -72 -53 -65 -21 46 140 84 -3 128 94 -3
4980cP8K1n8j9K0j96p9J50P6j17M50k58j73L15n3k7j22Qp0J98j56j11M0K28k43
$$ -3 75 96 38 19 39 -157 -236 -86 -10 -127 323 65 -108 207 154 127 5 13 -57 141 -15 -126 -86 142 -101
5005a01Q1K93J4m54K56j5J04j13j39K21k11J94k00M7k1N7m7JK39j57k3k3L15l21
$$ -101 -20 273 287 -167 89 74 178 65 -74 147 -64 130 -70 -23 -44 13 -34 -33 206 49 26 3 318 -3
5029cP7K5n1j65J07M4k14p0L60l20J90p4K45k36k6J83j01J63l40K47l6K17l58
$$ -3 74 99 48 -117 -10 34 -180 -250 110 -210 -20 -94 151 -85 -111 72 -29 134 -206 41 5 222 -136
5052a36j14K55j61J73j59J12K78k45J65q7k25J45k8k64M74j24J19r7k31K82m7
$$ -136 -250 5 -156 17 -142 -30 248 3 168 81 -144 1 -27 -291 183 59 178 81 -150 132 85
5073H5j42J31o7n4j3k7J86M9k32K83k54P5j4QJ15l38N30j41k35M2k04L78k61M8
$$ 85 -57 74 7 -47 -60 -87 99 148 -84 199 -55 20 6 14 129 -209 321 180 -55 -13 -217 161 -100 -52
5097e2J01n1J35l3j41RK5K2O1k64K79R3k0k06J69k08J46o6j18K80j39m4J23o6
$$ -52 49 -2 133 100 -41 -32 -7 15 76 -188 91 184 164 -42 127 -81 65 -1 -119 161 22 -22 101 35
5121C5o8n8J19J46k82O3J1L0R9j97K4J21J0Q6j11P3N0n4o9J0OO2m3m3p5n0L9J34
$$ 35 -33 -91 28 174 -108 -45 -34 -4 95 -102 -78 43 53 139 28 101 151 97 28 38 44 106 63 20 -55 -105 -66 68
5149F8k82J14J5J43j88K10j65j33J68K1km5M6R6o1n7K97l01L16m82J4J47j21J78
$$ 68 -214 -100 -85 58 -130 80 -85 -218 -50 -29 -31 -76 -30 66 5 -52 245 -56 260 -222 -208 -61 -182 -4
5173dj58K47q1p0O5k53L45K18n66L52l40L43K7k62J39J38Mj57J91n9j43K18j98
$$ -4 -162 85 4 -66 -1 -254 91 309 -257 95 -245 98 125 -137 2 140 144 -13 178 119 -24 194 -4
5196dp9j60J84J45j26J87J2k23J35No8J14k38J16Lj66L0L6P4j13K41j77lJ14m5
$$ -4 -83 -243 -59 86 -40 147 159 -64 71 76 8 122 -116 0 3 -163 -133 -97 -23 -136 105 -72 -75 39 -6
5221fj15j0K00l51K00P4J2R0n4K2J79l26K0M8K6jq0J34j17p5L66j96o3K11j16
$$ -6 -121 -131 69 -282 -82 -8 4 94 40 62 241 -85 -65 -17 9 8 -72 62 -55 -130 236 40 -23 188 72
5246G2R9k64L7j05J01m8J35J18l9o3P2j10K67j83k49N1j28L98k91p1K93p9k25
$$ 72 171 -93 -56 -161 -60 -108 27 145 106 43 115 5 272 89 -160 -109 -237 161 -130 -201 92 13 -212
5269b12K53k8J9j03N8O6P0j78j72l2J68Oj7K38l98K45%n7n1m0J69j22M3J59M0
$$ -212 41 13 32 -71 -13 53 123 -55 -227 -259 -91 -85 -102 136 -262 -17 -17 -74 -125 -165 4 -118 -75 84 124
5294A24K2k05J17j51k1O5J53k16K5j49J80l00L17p2K23k68N4M32k53Q7j87J2j61
$$ 124 146 -59 58 -93 -114 -49 104 -112 -87 -236 -56 -356 -39 -111 112 -156 -102 330 77 164 -23 -11 -172
5317a72K5J39l8K38j74j58J48M8M4j06K17ql25j8K66k36J92j03l05L63Q9j24Q1
$$ -172 -147 -8 -46 192 18 -140 8 56 100 -6 211 203 -122 -140 126 -110 82 -21 -326 37 126 2 83
5340H3k28K33R1m87M03q8m3O7k38K25l1M0o4J51m43J75K02j75J21l7k8o0J86R0
$$ 83 -145 88 179 -308 95 7 -36 31 -207 18 -13 27 -37 114 -329 -154 48 -127 -6 -43 -71 -131 55 145
5364A45N3j09k07q6K78J15l90J37p4M26k99j70K27j13K99j06j06j27n4J34l8j05
$$ 145 198 89 -118 -204 74 189 -201 -64 -138 288 -11 -181 46 -67 232 126 20 -107 -161 -27 -65 -170
5386a70L66l39K23l8J54l40J30J28j24K68k17o3L7l6n3p5K5j7L43j19J68m34R7
$$ -170 196 -143 80 42 196 -144 -14 114 -10 258 41 -22 15 -21 -74 -149 -124 -141 202 83 251 -183 -86
5409h6K69l39L16k37KK36o3L3N7j19j31j09P8k41O2L03M7j22n1M0Mn1L46k18j35
$$ -86 183 -156 160 -77 -75 161 98 131 188 69 -62 -171 -93 -334 -272 31 78 -44 -95 -55 -51 -102 244 26 -109
5434a09nj05K22k23Q9l3r8M40o1j50N1q8J76J54k73o6J84k13N2q8j81L31J29r8
$$ -109 -114 -219 3 -220 -131 -164 -262 178 117 -33 18 -70 106 260 -13 -79 105 -108 -56 -144 -325 6 135 37
5458C7o0m6K28L9l19R3J88k22r4J89J31j15P0%k18o9J79j49p8R8O6P3j81K57j77
$$ 37 -23 -69 159 198 -121 -28 160 -62 -156 33 164 49 119 119 -99 -168 11 -138 -216 -118 -52 21 -160 97 -80
5483h0J65j3J39j27k26J10K8J27LM8j86K89q5k17J26J08k81J22q2K05l04k61J80
$$ -80 85 72 211 84 -142 -32 -4 123 126 174 -12 277 192 -25 101 209 -72 50 -32 173 -131 -392 -212
5506b12K17%j16mO8k29M45j39m2J80k80p1J30k99M72K6j38j43J18K78j81j77K92
$$ -212 5 5 -111 -115 -47 -276 169 30 -12 168 -112 -183 -53 -352 120 146 8 -135 -17 261 80 -97 195
5529A95j26K66l91J15q3N0j1j59J8K33l22j91L41oJ70r9m7Q6L6N3j79N5N9j42
$$ 195 69 335 -56 59 -24 26 15 -144 -126 107 -215 -406 -65 -71 99 0 -47 39 75 128 -51 4 63 -79
5553g9J02j76J05N6J4r9K32p1j42k52K93J5k9j58J41r0K80m6J15j15J9j45j3K90
$$ -79 23 -153 -48 8 22 -77 155 84 -58 -310 -17 -2 -31 -189 -48 -138 142 96 211 96 115 -30 -43 247
5577B47j10j66J62%o2JJ09q7R9o29J23K10K50j97r5K97k37J66n38K77J33N6o7
$$ 247 137 -29 133 133 71 72 181 94 193 -436 -313 -103 147 -50 -145 152 -85 81 -457 -180 -47 9 -58
5600e8J86M3m4k33K14r8rJ12l87L64j78M5O3R3j28O2j11r1L18j70pK7N9j5L6Q8
$$ -58 128 171 127 -106 108 10 1 113 -274 90 -88 -43 20 113 -15 47 -64 -155 163 -7 -14 13 72 57 93 181
5626A81r8k00L69k78m3J64j12J0m8J07l25q5M37l7J79N6j90k1l8k72L97j59L0
$$ 181 83 -117 252 -26 -69 95 -17 -7 -55 52 -273 -358 79 42 221 277 87 66 28 -244 153 -6 24
5649B4O6N0l08J08j0l3k0J84n4N7r2O6j2j44q9J92P3K1P8Q7l38PJ51j78M3MQ7
$$ 24 90 140 -168 -60 -70 -103 -123 61 7 64 -28 38 26 -118 -207 -15 58 79 157 244 -94 -87 64 -114 -71 -67 20
5676B0PJ85k23J85k09O2N7k86L58j71j7l3Q6K30j03pj28K03l85K63k41L09j80
$$ 20 27 212 -11 174 -35 27 84 -202 156 -15 -32 -65 21 251 148 141 13 216 -169 94 -147 162 -18
5699a8rp3OM62n31L59k88L9j05P4n4K04M7j83J19j93K63R1l98J86J80l36K00J05
$$ -18 -27 -100 -94 368 -163 196 -92 -53 -158 -84 -138 66 113 -70 49 -144 119 210 -188 -2 178 -158 42 147
5723A47o1N0Mj6k70M12k43R5M1l7j46M7K85k01l64K34l63L86R1l28K19k14M63
$$ 147 86 136 140 124 -146 266 23 118 159 122 -24 23 308 107 -257 -23 -386 0 91 -237 -18 -232 231
5746B31l50J65J24l05o4L04r0J68k6m29J7L71n1n0K18j18j16j07J01k2P8J8N0
$$ 231 -119 46 170 -135 -199 105 15 183 157 -272 -255 116 65 15 233 115 -1 -108 -7 -29 49 67 117
5769A17q4r6M1p5J91M5l51J88m3L3K7q3N1J20Mn9j2q5R1o1k4l5K11j15o6L10k58
$$ 117 33 -63 -22 -97 94 139 -212 -24 -67 -34 -7 -90 -39 81 85 26 14 -71 20 -41 -65 -100 111 -4 -70 240 -18
5796a8J69k51J67mK09k14k17J58n6Qk4n1K00k38N4J85k24J73m7J42j27K12j96
$$ -18 151 -100 67 63 272 58 -159 -1 -57 -49 -73 -124 76 -162 -108 77 -147 26 -21 121 -6 206 10
5819A0p5J47j77M2k23K34M8k5J0O0K49j84j87OK9J4j63JK38k14J44K34k0k97O9
$$ 10 -65 82 -95 -53 -276 -42 6 -19 -9 51 300 116 -71 -65 -36 -22 -185 -184 54 -160 -16 218 198 -99 -30
5844c0j31J57l9m8K50l11r0K16L69m06N0Q7k51J78L6m6O9k11J00J18j06J71j46
$$ -30 -161 -4 -43 -91 159 -152 -242 -26 343 -63 -13 74 -177 1 37 -9 60 -151 -51 67 -39 132 -14
5867a4J36l34J99l1N3o%R6j50L79j34j46J20j92J71P3j71j90M4K91m3l00L49M9
$$ -14 122 -212 -13 -44 9 3 3 99 -51 328 194 48 168 -24 147 220 49 -141 -97 194 151 -149 200 249
5891B49m8j61n6M1L1j81N9J42J07k12j21K06j93J61mN4r5O3K12n70J44K40j17
$$ 249 201 40 -16 25 56 -125 -66 76 183 -29 -150 56 -137 24 20 74 -21 42 254 -316 -172 68 -49
5914d9j3P6j38K49r7L7j38RK00K32m60l1L10j4j48P5j83K02j95J29j85J22Q3k20
$$ -49 -62 14 -124 125 28 65 -73 -64 136 368 -92 -123 187 173 25 100 -83 119 -76 53 -132 -10 73 -147
5938a47LK7qJ32R7j47m1N3J81k47O4M3j24J96m2J15j47j19l3M2K1O7j07m8K62
$$ -147 -144 -117 -125 7 104 -43 -84 -31 150 -97 -33 10 -114 82 40 155 8 -111 -144 -102 -81 -14 -121 -169 93
5963I3k36O7K56M9k7j17j52k0m0j04M07R6l48L04N2n15K01J36J4j62k1J16Q5o6
$$ 93 -143 -76 180 229 202 85 -67 -87 -127 -231 176 272 -76 228 280 -235 -34 102 116 -46 -67 49 134 68
5987F8n1j26o6J54l01J78K61j89J11N7j15J56k11j1nK46j13r0q0j67K02j1J01
$$ 68 17 -109 -175 -21 -322 -144 117 -72 39 96 -19 137 -74 -85 -90 156 43 -47 -127 -294 -92 -103 -2
6010bK6k28M37k28j15Q3K5r3o8J94JJ92j10J3J13l68o3K39J84j02k52K98m83L34
$$ -2 24 -204 233 5 -110 -27 -2 -95 -163 31 32 224 114 127 240 -128 -191 48 232 130 -122 176 -307 27
6034B7o8j25R4J76lp4Q7j80K76m08K49L1k76L03N4l09L39j05q2J06l43L18J1p5
$$ 27 -41 -166 -72 104 101 27 114 -66 210 -198 51 82 -194 109 163 -146 193 88 6 112 -231 87 98 23
6058B3L00l29J89m97J82j37L92Qj49J03n2PrN4R5pj14j28n4K50n7m5o4p7L52m25
$$ 23 323 -6 183 -314 -132 -269 123 131 -18 85 33 40 31 85 180 173 59 -69 -123 127 70 25 -39 -116 236 -189
6084a89n4J63R3j6k57M20k09mJ65j84NK7j9J2m3RNK9o3J15j77R4R6J51l48K06
$$ -189 -243 -80 13 -3 -260 160 -49 -53 112 -72 -67 -40 -59 -47 -90 -81 -76 -47 -110 5 -172 -78 18 169 -179 27
6110B7j33m7J85k23K84R6j97K48k38l7R3r9j19J2KK61j69K23k4k62J65j66O9J56
$$ 27 -106 -153 32 -191 93 189 -8 240 2 -35 58 -41 -160 -148 -146 115 -54 169 145 -117 48 -118 -49 107
6134A07k01P2j5o0J39Ln7K4j13K82j10j32j2K17l8J05k0j66ql28L76Q5J82l76
$$ 107 -94 -22 -37 -97 42 45 -12 12 -101 181 71 -61 -73 144 106 211 191 25 17 -311 65 150 332 -44
6158d4J29k7m1P2q3n7Q9j06K56r4p8R8j44M2Q1j91Q9j08J96Ll2k5j01L28j08q9
$$ -44 85 58 17 89 6 -51 38 -68 188 94 16 114 -30 12 93 -98 -9 -117 79 82 50 25 -76 252 144 55
6184E5j3ql3l7l5J46m0J55k14j16jJ62J38j08j2l6L75j94k79j32L12j69NK3Lm4
$$ 55 42 34 1 -36 -71 75 35 190 -24 -140 -141 21 159 51 39 3 378 184 -95 -227 85 -84 -79 -56 -53 -97
6210i7L4L3J08m1Ok50N35m41lJ49k39L33j43j01J54J68p4k60j08J44J18p9oK2
$$ -97 -63 -30 78 37 43 -207 328 -113 -116 33 -206 127 -16 -117 37 205 131 -129 -237 -93 25 -54 -60 -38
6234c8p5L1M7N6J30r9J60l96J01J48J9N5j37K95l23K27j49j46K99l70L29k35k5
$$ -38 -113 -82 -35 21 151 52 212 -184 -83 65 84 139 2 297 -26 201 52 -94 205 -165 164 -71 -96
6257i6J32K19j91j03M8J37j19J09j15q8L8j14J37J38k98K68j19J24J45k42J76
$$ -96 36 255 64 -39 9 146 27 136 21 -67 -29 -143 -6 132 -166 102 -17 107 252 10 186
6278A86m0k1L6q8o9J86m9l11N10l85K29l7j10j08j8J91M3K22k81p3l9k90K17j66
$$ 186 146 125 161 73 4 190 141 -170 340 -45 184 147 37 -71 -89 102 145 367 86 13 -26 -316 -99 -265
6302b65k1M80K3k59p9NJ14N3N4m04R1PP5mK37j64J27mR2q5m0L3M2j62J48j66K
$$ -265 -286 194 217 -42 -121 -116 -2 51 105 -299 -208 -201 -126 -130 107 -57 70 66 158 73 33 66 108 -54 94 -72 -70
6329g0o5K20k48J80J99k10j47o9R8J26J37l02L22k68J85N3j82p6L4K60l88L63
$$ -70 -135 85 -163 17 216 6 -141 -210 -112 14 151 -151 171 -97 88 141 -41 -117 -83 177 -211 152
6351A52J2k04j56J55j2q6J34m8J79k54j09k8M32k65J28m9J83k10mj16j0J37O4
$$ 152 164 -40 -196 -41 -53 -139 -5 -53 126 -128 -237 -265 167 -98 30 -19 164 -46 -50 -166 -176 -39 25
6374B5j16j94M16o00N14LR3l5P1k17J12j46l5RL0j1J0K7J85J4r2J6j26R4q0j3
$$ 25 -91 -285 131 -469 45 48 141 106 177 -40 72 -74 -109 -100 -70 -81 -71 -44 141 155 63 79 -47 47 -33 -46
6400d6J6p6p1N0J12J14j53K85j83p1J71N1k85j32L88l06P1K9J77q1m9K26k00o7
$$ -46 -30 -106 -177 -127 -15 99 -54 231 48 -23 148 199 -86 -218 170 -136 -65 -36 141 60 11 237 37 -30
6424c0P8l5p8Q2j73J21J40n8J01j13K63q9j87J30m73M06j22o6K69k25m8k5J55
$$ -30 48 13 -65 17 -156 -35 105 47 148 35 298 209 22 152 -321 85 -37 -103 166 -59 -107 -132 23
6447B3q3m9R7m4N9m6P9j18l9K6N9J11m9J74J1n4O5l54J94L8j21J34j14p3J88k52
$$ 23 -60 -109 -12 -56 3 -43 36 -82 -121 -95 -36 75 26 200 211 157 222 -132 62 100 -21 113 -1 -74 114 -138
6473a38p8M74j21P1j30N0k77J21M1j12K70j18j55N2O2L4q5k87K18L6K13p0n6m3
$$ -138 -216 258 137 208 78 128 -149 -28 13 -99 171 53 -102 -50 12 46 -39 -326 -108 -72 141 71 15 -28
6497b8j14o9L1N71m03J48oj47l1K6K19k93K22l53J69L6Q8Mq4l49L56J64k2j21
$$ -28 -142 -211 -180 391 -12 136 130 -17 -48 -22 197 -96 126 -227 -58 -22 66 70 -14 -363 -7 157 135 14
6521A4k41M94j08k19N3m6j29L23k80J20N1M8l06J84K67k20o1J05J66J77l69Jj27
$$ 14 -227 267 159 -60 -7 -53 -182 141 -139 -19 32 80 -226 -42 225 5 -56 49 215 392 23 24 -103
6544a03k30M13J5j69N4Kj3K03q2m7J68j86k19J84j1J84n5M9j34N6j60P6p5K89
$$ -103 -333 80 95 -74 -20 -18 -31 172 90 43 211 25 -194 -10 -21 163 108 157 23 79 -81 -5 -80 209
6568B09l31K25r5j49r2L93o2l03M70m41J74K03r9J09l6j13J7j28J14m6j21J31
$$ 209 -122 103 8 -141 -233 160 98 -205 265 -176 -2 201 102 211 175 62 79 -49 65 19 -102 29
6590B9N9j3k37J2J14J70Jj87m2k28N5O6J47N6q3O3k63L48j8J11l51L98j7k89K92
$$ 29 88 75 -162 -150 -36 134 135 -52 -94 -322 -267 -201 -54 2 -81 -18 -281 67 49 160 -191 207 190 -99 193
6615A93k41J48p5j94p3K15OR1j55k04L39k39J13J21L2J84l32J01l54L06K00k75
$$ 193 -48 100 25 -169 -242 -27 -21 70 -85 -289 50 -189 -76 45 77 261 -71 30 -324 -18 182 -93
6637i3N4j2n9M0j53K65K4j00J76n4o0J8Nj69n9KL25L6k69J7k2k1J91l17p7L97
$$ -93 -39 -51 -110 -70 -223 42 66 -34 142 88 28 46 51 -118 -177 -175 150 186 -83 -66 -88 -109 82 -235 -312 85
6663H5mJ16n5k56j05J80J30J7o5k4o4kN8J55p5N6j69n5J60%P3k34N9P0J37l06
$$ 85 81 197 142 -114 -219 -39 91 108 43 19 -45 -47 11 166 91 147 -22 -77 83 83 156 -78 -19 51 188 -118
6689a18J61j35R8O5N5j36j25K60J50l67j13K30k79J86J68j63PK28p4n4j56k5K56
$$ -118 43 -92 6 71 126 -10 -135 125 275 -92 -205 25 -254 -68 100 -63 -56 172 98 44 -112 -137 119
6712A19Qm5m7J40k86K54j98J02J51j63k17J03L48l05J20JrK2q5o5j60K82j42m1
$$ 119 127 82 35 175 -111 143 -55 47 198 35 -182 -79 269 -36 84 85 76 98 13 -52 -212 70 -72 -113
6736a13J50j01k2K44Pk82O3J7o3J36L5p3k12J36R6J55l02J03L00m29O5J28l8K6
$$ -113 37 -64 -86 158 165 -117 -54 -37 -100 36 71 -2 -214 -78 18 173 -129 -26 274 -155 -90 38 0 26
6760B6j02J34k88L67P8j37j32J30Mr4n4J0Lk74J98OR8N1q0K83k15o4J48j53J44
$$ 26 -76 58 -230 137 215 78 -54 76 80 -14 -68 -58 -55 -329 -131 -125 -27 24 -56 227 12 -52 96 -57 87
6785H7j30k5j96L01j47Q5k12K50L4j54m8L14j02n7J88j76n2mL3M1M9N1k21N4K75
$$ 87 -43 -68 -264 37 -110 -25 -237 13 47 -107 -155 159 57 0 188 12 -40 -44 -11 30 79 130 -91 -37 238
6810B38J17l32l1k64K07l8M2J13j61J71k43K59j13j23KK8L03k51Q5j65J68M8j38
$$ 238 355 23 -8 -272 -65 -103 -61 52 -109 62 -181 78 -35 -158 -156 -128 175 -76 9 -156 12 60 -78
6833g8J84J04p7k65L00m18J84P0j94R7J16k08L16m7r2N2j80l6K66j48M2R0J2j04
$$ -78 106 210 133 -132 168 -250 -66 4 -190 -93 23 -185 131 84 -8 44 -136 -172 94 -54 -12 78 90 -14
6857a4k3N2r5J91Q3k73j31K2N3J99j72L39l89J19K31j34N4J60l01p8Q8K99k31
$$ -14 -37 15 -80 111 194 -79 -210 -188 -135 64 -108 231 -158 -39 192 58 112 272 -29 -107 -19 280 49
6880D9p3k1Q7j86L03j33J5j38J51k19L94j24j71J30K0k43J71o7O8j96K61k6j58
$$ 49 -24 -45 42 -144 159 26 41 -97 54 -165 229 105 -66 64 84 -159 12 -55 13 -183 78 52 -106
6903a06K9j16J04M8k57K84Q6m8M4n2J49k45R0Q3P1k39p3R8K31k9q0k20K7K25r5
$$ -106 -77 -193 -89 -41 -298 -14 72 24 68 16 165 -80 10 93 164 -75 -148 -50 181 152 72 -148 -121 104 9
6928Ij25k5RJ68k05o3J97K10q0l9J04k26L27k60J55j89J10J0j62J7J18j34j37
$$ 9 -116 -141 -132 36 -169 -232 -35 175 95 56 160 -66 261 1 156 -33 77 87 -75 -58 60 -74 -211
6951b11M0K36P9o6ok10j4K41l10J53K8p8K08L7n82M60k1k01l2L15r6K01m8k15
$$ -211 -171 65 144 78 72 -138 -152 89 -221 -68 -40 -118 90 127 -455 5 -16 -217 -249 66 -30 171 123 -92
6975i2r9J56J03l1j52J62n5O1k3l69J90l1L51l62J32j61K46K32k65n86O13N1m0
$$ -92 -191 -35 68 37 -115 47 -8 53 30 -339 -149 -180 171 -191 -59 -220 26 258 -7 -593 20 71 31
6998C1J10l19L08j76k6q1K2R5j02R1K50k76N3K08l6k34P0J44j24J55J3k24j27
$$ 31 141 -178 130 -46 -72 -153 -131 -36 -138 -47 203 -73 -20 188 152 -82 -12 132 8 163 176 -48 -175
7021a75K03J70l00j12L66j77p6N5J46P9r3k06R8J42j59j06Q1j49L71j92j6j65
$$ -175 28 198 -102 -214 152 -25 -101 -46 100 179 86 -120 -22 120 -39 -145 -64 -213 158 -34 -50 -215
7043b15K18j1m9lQ2j63K58j70P9N5n0k72N04k67k6J86k07O6J18n8j06M9j89J94
$$ -215 3 -8 -57 -60 22 -141 117 -53 26 81 31 -241 263 -4 -30 156 -51 15 133 75 -31 18 -171 23
7067B3O7j68mP5J36j67J29k76K50n4Qj00O3R5k89K52k25L69j01r2l5j22K47r4
$$ 23 90 -78 -82 -7 129 -38 91 -185 65 11 19 -81 -18 77 -212 40 -185 184 83 -9 -44 -166 81 -13
7091a3j48K73k0j15Q1%n4j09Q4J09k95J35K94k00n0K89k19j27k12L48K31k92k32
$$ -13 -161 112 92 -23 58 58 4 -105 -21 88 -207 -72 222 22 -28 261 42 -85 -297 51 282 -10 -242
7114b42J24J41n0K31j97J50K6l22J74K8L6j39K00j29J0n8j08K56l50J81k48L60
$$ -242 -118 23 -27 204 7 157 183 -139 35 63 99 -40 160 31 41 -17 -125 131 -219 -38 -286 74
7136G4m5j20Q8M1j46M26j66N8k71L1j23K54j55K0J86j46K14k24r6P1R8p7j67J11
$$ 74 29 -91 -3 38 -108 318 152 210 -61 -30 -153 101 -54 -34 152 6 220 -4 -100 -29 69 -8 -175 -64
7160f4M5p8Q4L5N7Q6j20k51K36j91J68q6L28k72N5M7Q4l17J44J29k40PK20m7j5
$$ -64 -19 -97 -13 22 79 165 45 -206 30 -161 7 -79 249 -23 32 79 163 -154 -10 119 -121 -114 106 59 44
7185D4K0O8J1j61J45j75K98k21j56J29j28J93Q5p6j85M2J36k37J35KN7K50k12
$$ 44 64 132 143 -18 127 -48 250 29 -127 2 -126 67 152 76 -109 -67 69 -168 -33 -31 26 276 64
7208F4j24J76l74K15k3kK33k99K22K0p2o5K03p2L7j34%l2J48L7r8k8K01q6r5p1
$$ 64 -60 116 -258 -43 -66 -68 165 -134 88 108 36 -29 174 102 139 5 5 -27 121 158 60 32 233 147 52 -19
7234a9R4k38P1K32k36n0J4K85Q4j67j38o6L76l01K2L30Q5l54j03K19l81M45j05
$$ -19 75 -163 -92 140 -96 -146 -132 153 237 70 -68 -134 242 -59 -37 293 378 24 -79 140 -241 204 99
7257I9q5J07%l6m7k7O9j26R5j97l5M91l24j7p3J75J86k31n5R4k6J5r2K8J5O3J58
$$ 99 14 121 121 85 38 11 80 -46 49 -148 -183 308 -16 -33 -106 69 255 24 -31 63 37 52 -40 -12 3 66 224
7284B24l28jp4L2J70l61N08k62L4J39j7j23j99L50o4k3k12n6L37J64q5r8L4k41
$$ 224 -104 -105 -179 -147 23 -338 170 -92 -58 81 64 -59 -258 92 28 5 -207 -263 74 238 153 55 89 -152
7308a52K69j06m4j63K91J29m05J38O8N3o8m6Q1m9q1K4j44J85N5P1n40M81P6j60
$$ -152 117 11 -33 -196 95 224 -181 -43 25 78 10 -36 45 -4 -85 -61 -205 -20 35 106 -434 47 123 -37
7332c7K06k96L95l26L4L1k5j65N1M22k35j12L82m87J39J22k46j10J67j07O4K05
$$ -37 169 -127 268 -58 -24 7 -18 -183 -132 290 55 -57 325 -162 -23 99 -147 -257 -90 -197 -133 72
7354G2j02J67j07j74J10M2k11K06J26l7q4J20J6j36J83p4k0j08K00k42n1J8L02
$$ 72 -30 137 30 -144 -34 8 -203 3 129 92 8 128 144 8 191 117 97 -11 189 -53 -104 -86 216
7377B16l44J9L20j73k46K20r2J26k08J82K17l90K43n0j77k23L07K66q7l11K07
$$ 216 -128 -109 211 38 -208 12 -80 46 -162 20 237 -153 90 40 -137 -360 -53 213 126 -185 22
7398B2l08M25o7j98j59K37R3O2q0m2P0k50K15q4j54K09J01N2k3j25l5J79k6o6
$$ 22 -286 139 72 -126 -285 -48 45 107 27 -15 55 -195 20 -64 -218 -9 92 144 121 -4 -39 140 114 48
7422D8q5M6J78j16l11K48K00k95l3j1J70R9j30P5l51K52m1Q6m6j14K49n5L9P9
$$ 48 -37 9 187 71 -240 8 208 -87 -120 -131 39 138 8 83 -268 -16 -57 29 -17 -131 118 63 102 181
7446A81j18R8o0J99n27M30j78J10r9k25K04j28Q7O8J51l28J57j46L27k55j69J59
$$ 181 63 161 101 300 -227 203 25 135 36 -189 15 -113 -26 42 193 -135 22 -124 203 -52 -221 -62
7468f2J41k75K75Q2k03R6j04J02J52q7j05k9O9j74n0K51P2J2j91L4P1J09j40K12
$$ -62 79 -196 79 161 -42 54 -50 52 204 117 12 -17 52 -122 -172 79 151 163 -28 6 77 186 46 258
7492B58j16l79K19J62k12Q9q2j70K78j8J68k87L7J19j20K2R2j46k8Q9P7j17q9
$$ 258 142 -237 -18 144 -68 21 -61 -231 47 29 197 -90 -53 66 -54 -32 60 -86 -114 -25 52 -65 -154
7515a54n1K77n5l02O5O1o4K30j04O1j0L39l63j95L92j36L13l01K19j06k81J29
$$ -154 -205 72 17 -285 -220 -159 -223 7 -97 -36 -46 293 -70 -265 127 -9 304 3 222 116 -165 -36
7537c6J00k0n6j94M02k32j5K28k72J30k53N57n62J66n2J17K41k43J08r7J39j95
$$ -36 64 44 -12 -206 196 -36 -51 177 -95 35 -218 339 -223 -57 -109 8 249 6 114 17 156 -39
7559c9j52J61L0L19m81K24j87P6K82k69K47l15j5o9J84j7j7j73K21j45O0j4P7
$$ -39 -191 -30 0 319 -162 62 -125 -49 233 -36 211 -104 -119 -188 -4 -21 -38 -211 10 -135 -75 -89 -12
7582a2j12o3J21J8l1J35j80L3J16N1j36j70K68P0L2K8k99L94l89R0nm2o3J61R3
$$ -12 -124 -187 -66 -48 -79 56 -124 -91 25 76 -60 -230 38 108 140 168 -131 263 -126 -36 -41 -83 -146 15 108
7607A08k00q9L26j99L1j6l6L22l82J92k3m5K64j00j7oj61k9J28j50J09K07l96
$$ 108 -92 -181 145 -54 -23 -39 -75 247 -135 57 34 -11 253 153 136 130 -31 -60 68 -82 27 234 -162
7630a62Q9K16k86K95q4j34P1J22q4k0J20l27L4O2L13r3l41k3J15J23n6q3K70j12
$$ -162 -73 143 -143 152 68 -66 5 127 43 23 143 -184 -150 -88 225 132 -209 -232 -117 6 -50 -133 137 25
7654B5Q8j06j34K76K7j52R7R7k10m1j31q3P5K40j65L8L04l33K1j15M6P5J08J78
$$ 25 113 7 -127 149 176 24 121 218 8 -33 -164 -247 -172 68 -97 -59 245 -88 -67 -182 -136 -61 47 225
7678B25r9j08N3K0N6j34j74J11K33Pk25L2P8j48K22k24o8J51n8K04l5m4pJ32k59
$$ 225 126 18 71 91 147 13 -161 -50 183 190 -35 -3 75 -73 149 -75 -143 8 -50 154 119 75 68 200 -59
7703e9km2M8q9l1Q5r3K10r0K01r1J4P4j51J78k33j82K66J86l42J85l00K76J28
$$ -59 -61 -103 -55 -144 -175 -90 -183 27 -63 138 47 61 135 -16 162 -71 -253 13 199 -143 42 -258 18 146
7727A46k94J82k2K16l82L38k68Q0k28L05O2n2j05K0J55k8j23P0j93J24Q1j60J82
$$ 146 -148 34 12 228 -154 184 -84 -4 -232 73 135 83 -22 -2 153 125 2 72 -121 3 84 -76 106
7750A06k07R6L9l38L26K1pj15P0j34K57J8k33q5K18l0k09J80j32J60J6k5M3J82
$$ 106 -101 -5 34 -304 22 43 36 -79 -9 -143 114 132 -101 -186 32 2 -207 -27 -159 1 17 -8 35 217
7774B17k86j13K24o6j98L19M8j64J57k5m5K56m49M3P1m2jJ17p2K32k05j95Q5K00
$$ 217 -69 -182 42 -24 -222 97 145 -19 138 113 68 324 -125 -82 -11 -53 -54 63 -9 223 18 -177 -92 108
7798A08k12J66q0J15j49K10n0l7Q2Jj15P2p8j31J83l8P1j42j63K13L20m43l5K06
$$ 108 -104 62 -18 97 -52 158 108 71 153 154 39 111 33 -98 85 47 118 -24 -187 26 346 -97 -132 74
7822G4j9k00R7j20M7QJ15j39J15j4J31l48j45O71k37r3K07j79j9j11J71kK50l98
$$ 74 55 -145 -48 -168 -121 -113 2 -137 -22 -36 95 -253 -398 273 36 -57 150 -29 -48 -159 12 10 260 -138
7846a38P8j9%J1J6j26J82R1J99k81J31l15j56K86l0k25J99J22k04Q4q8J89j0q4
$$ -138 -60 -79 -79 -68 -52 -178 4 95 294 13 144 -171 -327 -41 -71 -296 -97 25 -179 -95 -183 6 -4 -88
7870h8L20k61J89l80M00p7l25J23oK93p4j61l4M1J58m0k12K22K9k68K52M26p19
$$ -88 232 -29 160 -220 180 103 -222 -99 -105 188 114 -47 -81 -40 118 78 -134 88 117 -151 101 527 -192
7893a92J10O2M2R0J0k21R9k9K05J06l00j86j32L24n8n2L18l42L03k39N8L6K07
$$ -192 -82 -20 22 112 122 -99 0 -29 176 282 -18 -204 -336 -12 -70 -122 196 -146 157 -82 -24 12 219
7916B19l40q5L08O9n09J2M56M5j19k69J92mJ94l8J88l38J56k90K66l01K1Q0O3
$$ 219 -121 -206 102 171 -338 -326 130 175 56 -213 -21 -25 169 131 319 -19 137 -153 113 -188 -167 -87 -24
7939b4nJ7J18r5j37M1J91j4m04K06J0k1J62J87j52q2j50J11R4N3k00o8L24j77
$$ -24 -29 -12 106 11 -126 -85 106 92 -312 -106 -96 -117 45 232 80 -2 -152 -41 53 106 -94 -162 162 -15
7963a5j69K80k60K32j06K7R7j94k4p1J43k09K82J47j42P9j07j53Kj6R0Q1L4j52
$$ -15 -184 96 -164 68 -38 -11 86 -108 -132 -203 -60 -269 13 160 18 97 -10 -163 -161 -177 -87 -6 28 -124
7987a24M4qM6JK10J55l38J67j45j27J68k0J13k37P6j21K4M8l85N16j00J6J21k55
$$ -124 -80 -88 -42 -41 169 324 -14 153 8 -119 49 29 142 -95 -19 -140 -116 -68 -453 63 -37 -21 100 -155
8011a55J14j26K78J33k05j58K15%m7J40k57M8J83J53l58j5j8k14K60k12K32J07
$$ -155 -41 -167 111 244 39 -119 96 96 49 189 -68 -20 163 316 -42 -57 -75 -289 -29 -241 -9 98
8033I8l12K12J4M2n6J32k67L01q9j6L8n6k80M18k6k37Q2M4J05l15J77l2j59M8
$$ 98 -214 -2 12 54 -2 130 -137 164 75 59 97 41 -239 179 153 -84 -2 42 147 -168 9 -23 -182 -134
8057a34k54M86j54J09m8p4J08j60J29j58J50o8j71J71r3K12j53kp3J34K07k67
$$ -134 -388 98 -56 53 5 -69 39 -121 8 -150 0 -68 -239 -68 -161 51 -102 -104 -177 -43 164 -103
8079a03k24L14j1K23j20o0J0J12o1k0rj71M34m41J5J46P6j43J18r5J70m16L64
$$ -103 -327 -13 -24 199 79 19 29 141 80 60 51 -120 314 -127 -112 34 110 -33 85 -10 160 -256 108
8102A08l07K26K6l5nn3L6n0P3p0j16J83Ll24K41jj99M13k72J55QR2k06J42Ll5
$$ 108 -199 27 53 18 13 -40 -4 -54 19 -51 -167 16 19 -305 -64 -65 -264 149 -123 32 40 132 -74 68 71 36
8128C6j50KR5j93J66k41K75j10o3o4K84K67l10O9q9j69M18j09k77J58K16l61J63
$$ 36 -114 -112 -17 -210 -44 -285 -10 -120 -183 -247 37 304 -6 63 -26 -195 223 114 -163 -5 211 -150 13
8151A3J0o5K14j62n6j79K77j2J99j55j26J01L3j05p0L8O3J9m9N9j5j31M5j23L84
$$ 13 23 -42 172 10 -46 -225 52 40 239 84 -42 59 92 -13 -83 -45 18 37 -12 47 32 -99 -54 -177 207
8176B07k71K83l15jK07p3j17J9j07L45j26j46J22j35l25
$$ 207 -64 219 -96 -97 110 37 -80 -61 -168 177 51 -95 27 -108 -433
8191d33
$$ Imaginary data points
##PAGE= N=2
##DATA TABLE= (X++(I..I)), XYDATA
0@%%%%%%%%%%Nj3J6j6J6k4L2l2M0m8N6p2Q8j04J20j36J57j81K08k40K72l09L52
$$ 0 0 0 0 0 0 0 0 0 0 0 5 -8 8 -8 8 -16 16 -16 24 -24 32 -40 48 -56 64 -72 85 -96 112 -128 144 -165 187
33A87l98M48n03N63o29P03p83Q69r65J069j183J307j441J590j750J927k123K336
$$ 187 -211 237 -266 297 -332 371 -412 457 -508 561 -622 685 -756 834 -916 1011 -1112 1224
51A224k574K838l131L461l833M257m747N321o000O816p821R093j0757J3028j6324
$$ 1224 -1350 1488 -1643 1818 -2015 2242 -2505 2816 -3184 3632 -4189 4904 -5853 7175 -9149
66i149K1532l0936N2925j89937j63481K94554j51564M4494P6684K36939l216o1893
$$ -9149 12383 -18553 34372 -155565 -319046 -24492 -176056 -131562 -54878 182061 178845 116952
78A16952K07511j65793q4191l9796j21108m5104r7698J32114n6780P2196J77339
$$ 116952 324463 158670 74479 34683 -86425 -131529 -229227 -97113 -153893 -81697 95642
89I5642n9987R5153j8134r776p7431j15938O6221j55706M4640O6906l0299J56178
$$ 95642 35655 130808 112674 102898 25467 -90471 -24250 -179956 -135316 -68410 -98709 57469
101E7469K2233O2822j6767J8188K9092k21230K0960j706r8951k1082K7619J37059
$$ 57469 79702 142524 125757 143945 173037 -48193 -27233 -28939 -127890 -148972 -121353 15706
113A5706n9586O9173J04213o6725L5553p1843r854n6949o9485N0426o7860Q8388
$$ 15706 -43880 25293 129506 62781 98334 26491 16637 -40312 -109797 -59371 -127231 -38843
125c8843K0661L304J16538l2685L3441l6301j3232j3689j05916M9124n5358r245
$$ -38843 -18182 -14878 101660 68975 102416 66115 52883 39194 -66722 -17598 -72956 -82201
137h2201O6517j1665L5792R178P7184m9274o5265Q4894o7452o1640p930L6443
$$ -82201 -15684 -27349 8443 17621 94805 45531 -19734 65160 -2292 -63932 -71862 -35419
149c5419M025n6622J06464J5082k3071N1923o746j332m9807J2083j2791n7284
$$ -35419 -31394 -88016 18448 33530 10459 62382 55636 54304 4497 16580 3789 -53495
161e3495M0938k8374J2263L8170n734J5859n748L6728l6271l0748L1191m4557
$$ -53495 -12557 -40931 -28668 9502 3768 19627 13879 50607 14336 -16412 14779 -29778
173b9778m418J487P001K346O974N5606l7720Q671M9809l6101k7042j135K6220
$$ -29778 -34196 -32709 -25708 -23362 -16388 39218 1498 10169 59978 23877 -3165 -4300 21920
186B1920m6241k5409N8033j9988q092L1355J6628j2526j1901L3616k8219k9312
$$ 21920 -24321 -49730 8303 -11685 -19777 11578 28206 15680 3779 37395 9176 -20136
198b0136J4831j4402p180K373J2969j869J2602L3115k1027p7J9859j6992k0275
$$ -20136 -5305 -19707 -26887 -24514 -11545 -13414 -812 32303 11276 11199 31058 14066 -6209
211f209o775P186j7427j296K5549j0524J1076K8006m635j4751O190R093l7932
$$ -6209 -12984 -5798 -23225 -24521 1028 -9496 1580 29586 24951 10200 16390 25483 -12449
224a2449j5097J9658j6971j0374K2456J6865q183J5141K8355j9965j4646J2624
$$ -12449 -27546 -7888 -24859 -35233 -12777 4088 -4095 11046 39401 19436 4790 17414
236A7414j0492k6275m766J1309q377O621K4256j311M700J8749l333k2084n880
$$ 17414 6922 -19353 -24119 -12810 -21187 -14566 9690 8379 13079 31828 28495 6411 531
249E31R45k1789j1430Q734K175N338J9071J0899O48J0508L981j8141j3399j545
$$ 531 1476 -20313 -31743 -23009 -20834 -15496 3575 14474 15122 25630 29611 11470 -1929 -3474
263c474j1547j2040N423O624O232J6423J2627j121K298N010j3277j7834p292p823
$$ -3474 -15021 -27061 -21638 -15014 -8782 7641 20268 19147 21445 26455 13178 -4656 -11948 -19771
277a9771m267K314L697Q368J8162J1607l940L882J670j4128j1342o295j0446n697
$$ -19771 -24038 -21724 -18027 -9659 8503 20110 16170 20052 21722 7594 -3748 -10043 -20489 -26186
291b6186J2786O110k475J9393J7398q227m542O664j0938k1070M21l164j4229J0488
$$ -26186 -13400 -7290 -9765 9628 27026 18799 14257 20921 9983 -11087 -10666 -13830 -28059 -17571
305a7571J7615m721K709K5092K206j9820M390J842k2009p337Q421q479m271K4231
$$ -17571 44 -4677 -1968 23124 25330 5510 9900 11742 -10267 -17604 -9183 -17662 -21933 2298
319B298P935j1668J5022J5447j6547j2212P074j0193j7767Q152M115j0137J2053
$$ 2298 10233 -1435 13587 29034 12487 275 7349 -2844 -20611 -12459 -8344 -18481 -6428
332f428J9863n679m558J5488r48j9502k720K551j1721l348R574R41m34J5444P945
$$ -6428 13435 7756 3198 18686 17738 -1764 -4484 -1933 -13654 -17002 -7428 -6487 -6921 8523 16468
347A6468q420O40N120p893j2993k234Q87m037L225N692L257O384N777J731o810
$$ 16468 8048 8688 13808 5915 -7078 -9312 -8425 -12462 -9237 -3545 -288 6096 11873 13604 6794
362F794m318j82n706q433m534Q272M238k036R508O785J149p23m41o138j0817M603
$$ 6794 2476 2294 -3412 -11845 -16379 -8107 -3869 -5905 3603 10388 11537 10814 10373 4235 -6582 -1979
378a979n644r741Q038Q633K749p68J1416J720r154N578r035j1980J34K259l884
$$ -1979 -7623 -17364 -9326 -693 2056 1288 12704 14424 5270 10848 1813 -10167 -10033 -7774 -11658
393a1658o395J9351N019m250J1855p07m124n412J445j1448j4430J6980l468p103
$$ -11658 -18053 1298 6317 2067 13922 13215 9091 3679 5124 -6324 -20754 -3774 -7242 -14345
407a4345J1969J1957L798r377J2838m470j5930O161j1960m989J8N795N126m692
$$ -14345 -2376 9581 13379 4002 16840 12370 -3560 2601 -9359 -14348 -14330 -8535 -3409 -8101
421h101K0070n84j188O258j2276n7j0460L24o791q342J8957m524Q117O848j7J0878
$$ -8101 11969 11385 10197 16455 4179 4122 -6338 -6014 -12805 -21147 -2190 -6714 1403 8251 8234 19112
437A9112r957J273j4419k860P052k2045Q975M583O228N681l219K0006j0695P08
$$ 19112 9155 10428 -3991 -6851 201 -21844 -12869 -8286 -2058 3623 404 20410 9715 10423
451A0423N18j6403N594j4473M480j979j533J6894q665J8833j811o711J1285j4141
$$ 10423 10941 -5462 132 -14341 -9861 -11840 -13373 3521 -5144 13689 11878 5167 16452 2311
465B311L070j6797Q99O846j5170J7171p075J0448J2763r397P965j2102J4575j2256
$$ 2311 5381 -11416 -10517 -3671 -18841 -1670 -8745 1703 14466 5069 13034 932 15507 3251
479C251k1532J9617j1870K774m228R210J4250j7462K2058o436m997N342j5700
$$ 3251 -18281 1336 -10534 -7760 -11988 -2778 11472 -5990 16068 9632 4635 9977 -5723
492e723J0026j7891N441L240j0279K2066j3132J0528O537m014O904k0670J7298
$$ -5723 4303 -13588 -8147 -4907 -15186 6880 -6252 4276 10813 6799 13703 -6967 10331
505A0331r750j3328J0210j3589J9076q216L89J2283m893J8474k3666M893J0751
$$ 10331 581 -12747 -2537 -16126 2950 -5266 -4877 7406 2513 20987 -2679 2214 12965
518A2965j9559L694j2341J6135p710r456K7068j2439Q112j235K650N986k3147
$$ 12965 -6594 -2900 -15241 894 -6816 -16272 10796 -1643 6469 5234 7884 13870 -9277
531i277J6133j2474l759O959j3895J7866o522J0998J83r296K5646j9168l540m72
$$ -9277 6856 -5618 -9377 -2418 -16313 1553 -4969 6029 6212 -3084 22562 3394 -146 -618
545f18j445M953k5110J8402K895l775J0553r846J9497q209l445J623j1800J3472
$$ -618 -2063 2890 -22220 -3818 -923 -4698 5855 -3991 15506 7297 3852 5475 -6325 7147
559G147k0386K249J1119p852P359n913K1829p249j4626K1295j1615l015r974M768
$$ 7147 -13239 -10990 129 -7723 -364 -6277 15552 8303 -6323 14972 3357 342 -9632 -4864
573d864P641j8812J6803k267K529R539r098O833q980R561p414j7982J7905m687
$$ -4864 2777 -16035 768 -1499 1030 10569 1471 8304 -676 8885 1471 -16511 1394 -3293
587c293j282n019R731J3915j8428R645K245k900l599j0590J4058j0670l924P715
$$ -3293 -4575 -9594 137 14052 -4376 5269 7514 4614 1015 -9575 4483 -6187 -10111 -2396
601b396J444P160j2067J0942O762j1318P95l770O019p703l627O531m826J0079
$$ -2396 -952 6208 -5859 5083 11845 527 1322 -2448 3571 -4132 -7759 -1228 -6054 4025
615D025k429l363O476J639m50j3213P556M374j2166K389L137M172l735J481O483
$$ 4025 1596 -1767 4709 6348 5898 -7315 241 4615 -7551 -5162 -2025 2147 -1588 -107 6376
630F376o104L453j705m953L683l058k886J344P830m096o486J3721K014j2115r25
$$ 6376 272 3725 2020 -2933 750 -2308 -5194 -3850 3980 -116 -6602 7119 9133 -2982 -3907
645c907J0399l579j2797O826O007o181Q67N368j013k062O140l176p819O007J335
$$ -3907 6492 2913 -9884 -3058 2949 -3232 -2365 3003 1990 -72 6068 2892 -4927 1080 2415
660B415q169l74P946j453l787N636K937l310j237L269l399l822J227q31J286j3
$$ 2415 -5754 -6128 1818 365 -3422 2214 5151 1841 604 3873 474 -3348 -2121 -2952 -1666 -1679
676a679j497M406M089j221n870M569L788r184k600L634J542n099J759N078k272
$$ -1679 -3176 1230 5319 4098 -1772 2797 6585 -2599 -5199 -1565 -23 -5122 -3363 1715 -557
691e57L581J345k238r27L45M49p167J756K955l813K428J595K620l17O42K928n652
$$ -557 3024 4369 2131 1204 1549 1998 -5169 -3413 -458 -4271 -1843 -248 2372 2055 2697 5625 -27
708b7N09k76k269m67l280L811J560J161L21q17O520l037l975Q5j49j17n330K604
$$ -27 482 206 -2063 -2530 -5810 -1999 -439 722 1043 226 6746 3709 -266 -181 -330 -447 -5777 -3173
726c173J420j43M106r73J961j52J59l11n302J260j099j256M01p3L586O0K297P23
$$ -3173 -1753 -1896 2210 1237 3198 3046 3205 2894 -2408 -1148 -2247 -3503 -3102 -3175 411 471 2768 3491
744C491j956K359k569j784k400q13K258j516J315N46K871K938k698m9n02j56j852
$$ 3491 1535 3894 1325 -459 -2859 -3672 -1414 -2930 -1615 -1069 1802 4740 2042 1993 1491 1335 -517
761e17l488J324N4P83J339N35K116P08J575k025l070J151j595k333p48K095J897
$$ -517 -4005 -2681 -2627 -1844 -505 30 2146 2854 4429 2404 -666 485 -1110 -3443 -4191 -2096 -199
778a99k86K655L82k33J702j449l433k192K042j518k933L578J876Q36J940R87j240
$$ -199 -485 2170 2552 2319 4021 2572 -861 -3053 -1011 -2529 -5462 -1884 -8 828 2768 3755 2515
795B515n04J856m443m624K530R76l106J668M788j38J97L907k021l760J990m47
$$ 2515 2011 3867 -576 -5200 -2670 -1694 -4800 -3132 1656 1518 1715 5622 3601 -159 1831 1384
811A384o358j478N373j102j674N184K303j499K055J321n014j474K521m497m213
$$ 1384 -4974 -6452 -1079 -2181 -3855 1329 3632 2133 4188 5509 495 -979 1542 -2955 -7168
826g168L801K630j970K860M401j734O56K611m082m738K109j63n768J109M872j59
$$ -7168 -3367 -737 -2707 153 4554 2820 3476 6087 2005 -2733 -624 -787 -6555 -5446 -574 -733
842g33J7M738N38j956J677k73n980j402K550l152k085L622K631L2K055K342j330
$$ -733 -716 4022 4560 2604 4281 4008 -1972 -3374 -824 -3976 -6061 -2439 192 224 2279 4621 3291
859C291K8J87m031k172K03r62r63J241K075J322L507M41k508K110K69l619l792
$$ 3291 3319 3506 -525 -2697 -2494 -3456 -4419 -3178 -1103 219 3726 4167 1659 3769 4038 419 -3373
876c373J022ll026K804J802l08L234K480j321j970K395q45o156O41J76j680O71
$$ -3373 -2351 -2354 -5380 -2576 -774 -1082 2152 4632 3311 1341 3736 2891 -3265 -2624 -2448 -4128 -3457
893c457J805K105m93M448k1k743J849j511k931j850j18n73j231M905j173m36O344
$$ -3457 -1652 453 -40 4408 4387 1644 3493 1982 -949 -2799 -2917 -3490 -4721 184 -989 -1425 4919
910D919K15k580k179L582k263o901L275j181j507K226K702J336j896O087n76n258
$$ 4919 5134 2554 375 3957 1694 -5207 -1932 -3113 -4620 -2394 308 1644 -252 5835 5259 1
926AK053j023k029l857J388J711l044N366J012j58K168p5J096n107L56n66k924
$$ 1 2054 1031 -998 -4855 -3467 -1756 -4800 566 1578 1420 3588 3513 4609 -498 -142 -708 -3632
943c632J640l671L474L208q00J316j34N417m477m325L674k950j422k454L469O70
$$ -3632 -1992 -5663 -2189 1019 219 1535 1401 6818 2341 -1984 1690 -1260 -2682 -5136 -1667 -997
959i97k473P384j623o90J602m29k35n901K756q70l736M295r87K028l0K864J996
$$ -997 -3470 3914 2291 1601 3203 2774 2539 -3362 -606 -1476 -5212 -917 -1904 124 94 2958 4954
976D954o074L946o71l199j538j895M968k599j06K089J677L949o139K134K373m124
$$ 4954 -1120 2826 2155 -1044 -2582 -4477 491 -2108 -2214 -125 1552 5501 -638 1496 3869 -255
992b55j235k531M644k934j648O633k404J043N58J511j241m793M626l977j028K171
$$ -255 -1490 -4021 623 -2311 -3959 2674 270 1313 1871 3382 2141 -2652 1974 -2003 -3031 -860
1008h60k003K987o12L554j569k206N272m067j315j608M64K433l948J896J257L186
$$ -860 -2863 124 -488 3066 1497 -709 4563 496 -819 -2427 -1963 470 -3478 -1582 -325 2861
1024B861O22n863N847K38n005j857J920K761p496M034N289l840N92K635K579n864
$$ 2861 3483 -2380 3467 3705 -1300 -3157 -1237 1524 -5972 -1938 3351 -489 103 2738 5317 -547
1040e47j167M524n510m7O40k59J790P75K880l128K590K817n503n36q76P36j506
$$ -547 -1714 2810 -2700 -2747 -2107 -2366 -576 199 3079 -49 2541 5358 -145 -681 -1557 -821 -2327
1057b327k286L353J213K720k064m33N885l377l960l84L153l328n396P161J385
$$ -2327 -4613 -1260 -47 2673 609 176 6061 2684 -1276 -1660 1493 -1835 -7231 -70 1315
1072A315m422L241M702j038m828L533N97n405m14M69p8N11J118N22M48M268j091
$$ 1315 -3107 134 4836 3798 -1030 2503 3100 -2305 -2719 -2250 -2328 -1817 -699 -177 271 4539 3448
1089C448l342J409O04l534k344J425O41j51J359L12J919K219j585k511K249q6
$$ 3448 106 1515 2119 -1415 -3759 -2334 -1693 -1844 -485 -173 1746 3965 2380 -131 2118 2032
1105B032n061j013L824q55l602M384M410l586q54M030M60n147j318K803j737j576
$$ 2032 -3029 -4042 -218 -1073 -4675 -291 4119 533 -321 3709 4169 -978 -2296 507 -1230 -2806
1121b806m55K635K187j633J376N98P50m25k664N65k420J232J72k009J887J771
$$ -2806 -3261 -626 1561 -72 1304 1902 2652 2227 -437 128 -2292 -1060 -888 -2897 -1010 761
1137G61J589k528J086L731n297n48K038m85l245n64O443m149j299M563O68j146
$$ 761 2350 -178 908 4639 -658 -1206 832 347 -2898 -3462 2981 -1168 -2467 2096 2764 1618
1153A618k938K863n9l129J126k378K723J25j030Q87K49L498l718p4K641l570J462
$$ 1618 -1320 1543 1484 -1645 -519 -2897 -174 -49 -1079 -192 57 3555 -163 -237 2404 -1166 296
1170B96j759P99m50o64L953l704K374J096j972J599j735J413k794K05K440m035
$$ 296 -1463 -664 -1114 -1778 2175 -1529 845 1941 -31 1568 -167 1246 -1548 -1343 1097 -2938
1186b938K439P35J169r94j552M684k942r53k91o15K586m370K246R25p20K138k310
$$ -2938 -499 236 1405 411 -1141 3543 601 -352 -643 -1258 1328 -3042 -796 129 -591 1547 -763
1203g63L060j449p77J747l114J106j386J106p6j949M083j476Q77P48j318J236
$$ -763 2297 848 71 1818 -1296 -190 -1576 -470 -546 -2495 1588 112 989 1737 419 1655
1219A655k302J522j708j720K394j283J429r86J822K063k902J832j369N25q85k649
$$ 1655 -647 875 -833 -2553 -159 -1442 -13 -999 823 2886 -16 1816 447 972 87 -2562
1235b562J761j197J494j0l51K778j059J112m01j118M26k148Q37j970J31J750r00
$$ -2562 -801 -1998 -504 -514 -865 1913 854 1966 1565 447 873 -1275 -438 -2408 -2277 -527 -1427
1252a427K304l76J204O05j280J081k611J19l63j693N10k08K167L20j03J912n87
$$ -1427 877 501 1705 2310 1030 2111 -500 -381 -744 -2437 -1927 -2135 32 352 249 2161 1574
1269A574Q82j459j239l84j059L48j208Q24J656L50R36K43O38k48o03n48k453L10
$$ 1574 2456 997 -242 -626 -1685 -1337 -2545 -1721 -65 285 1221 1464 2102 1854 1251 703 -1750 -1440
1287a440J95j021L64P39K352k9L42Q14j491L44l09j861j085N59O45j230R73J843
$$ -1440 -1245 -2266 -1902 -1163 1189 1160 1502 2316 825 1169 860 -1001 -2086 -1527 -882 -2112 -1139 704
1305G04N32M08L56lj378k13m17k212K50Q63j59q6J673J138jJ82Q4j102j50m39
$$ 704 1236 1644 2000 1997 619 406 -11 -2223 -1973 -1110 -1269 -1355 318 1456 1455 1637 1721 619 469 30
1325C0j445j029R52Q32m00J180R18L44P01m93j234o88O07j219j433Q12P96m7O60
$$ 30 -1415 -2444 -1492 -660 -1060 120 1038 1382 2083 1590 356 -332 275 -944 -2377 -1565 -769 -816 -156
1344a56J369n7K64L36q95j243L31j36j409j08R55O17l78J311J59O0P60r50j138
$$ -156 1213 1156 1420 1756 861 -382 -51 -187 -1596 -1704 -749 -132 -510 801 960 1020 1780 830 -308
1363c08R9jr40j97R01j47L53J540p16n58J221N22k402l37J485j374q95J443L62
$$ -308 -209 -210 -1150 -1347 -446 -593 -240 1300 584 26 1247 1769 -633 -970 515 -859 -1754 -311 51
1382E1l63P26J452k253J94K034j640j355Q78Q42j311k10J719j208O42J014j285
$$ 51 -312 414 1866 -387 -193 1841 201 -1154 -276 566 -745 -955 764 -444 198 1212 -73
1399g3k50O70M77j884O77J065j387P38O56j152l29J199P77k859J531J347j936
$$ -73 -323 347 824 -1060 -383 682 -705 33 689 -463 -792 407 1184 -1675 -144 1203 -733
1416g33M51R20M0j347J142M82k459J450O72j225n16J174R75j619P67Q55p34L42
$$ -733 -282 638 678 -669 473 955 -1504 -54 618 -607 -1123 51 1026 -593 174 1029 295 637
1434F37j109N01n11j35N04r80J375m36J6J809j426m01K84R77j821j138K528q70
$$ 637 -472 29 -482 -617 -113 -1093 282 -154 -138 1671 245 -156 128 1105 -716 -1854 674 -196
1452a96q67Q82Q52m9l47J734j623p94J365j384j087J87J947q85r57K082K95n12
$$ -196 -1063 -181 671 622 275 2009 386 -408 957 -427 -1514 -1327 620 -265 -1222 860 1155 643
1470F43m57L86lq71J14m43j62J97k87J398K03p59L07J264n12k284R06J079j482
$$ 643 186 572 569 -302 -188 -631 -793 -596 -883 515 718 -41 266 1530 1018 -1266 -360 719 -763
1489g63o45J083P96o19K92N85q89P04K11o64j145J204L84j940O21J475k73j035
$$ -763 -1408 -325 471 -148 144 729 -160 544 755 91 -1054 150 534 -1406 -785 690 417 -618
1507f18M00J599j504k4M79k03k42r48J516m00k81m66Q81J472k579N4J877k45j487
$$ -618 -218 1381 -123 -147 332 129 -113 -1061 455 55 -226 -692 189 1661 -918 -864 1013 768 -719
1526g19r67K599n57j014R28j55J77r01J183n51j327K651j316q50L35J097K43k721
$$ -719 -1686 913 356 -658 270 115 292 -609 574 23 -1304 1347 31 -819 -484 613 856 -1865
1544a865K697Qj658Q17m1J161k765J295K318k777J78J8K543j888k139L409j081
$$ -1865 832 840 -818 -1 -42 1119 -1646 -351 1967 -810 -632 -614 1929 41 -2098 1311 230
1561B30J44j350R32J987l615J601j51L87L18j589K841k710J199J242k554J648
$$ 230 374 -976 -44 1943 -1672 -71 -222 165 483 -1106 1735 -975 224 1466 -1088 560
1577E60j196J642j664p90L766l602J129Q49K12j04k706L923j782j969J593n01
$$ 560 -636 1006 -658 -1448 2318 -1284 -155 694 906 802 -1904 2019 237 -1732 -139 -640
1593f40K287l951K092K068j960J377k736L195r11l048K443j543J864k060R75K266
$$ -640 1647 -2304 -212 1856 -104 1273 -1463 1732 821 -2227 216 -1327 537 -1523 -548 1718
1609A718l490L685j221k54J20j428K456m199J961J169l021L207j321K834k036
$$ 1718 -1772 1913 692 438 558 -870 1586 -2613 -652 517 -2504 703 -618 2216 180
1624A80j60L434n090J853o31J1J58l494N238j355k27Q01q80M160m845P92Q86k072
$$ 180 20 3454 -1636 217 -414 -403 -245 -3739 1499 144 -83 718 -162 3998 -847 -55 831 -1241
1642a241J411l497M182j729j146M362k592J959j500J214K72m288L765k388n51
$$ -1241 170 -3327 855 -874 -2020 2342 -250 1709 209 1423 1695 -2593 1172 -1216 -1767
1657a767J357r29K438k890M301o58k944L335k085O83l160O92K692l901L117q07
$$ -1767 -410 -1339 1099 -1791 2510 1852 -1092 2243 158 841 -2319 -1627 1065 -2836 281 -526
1673e26J323R35k478L343k600P68q43j775L144l856K076L39m64J979k119L501
$$ -526 797 1732 -746 2597 -3 765 -78 -1853 1291 -2565 -489 -150 -614 1365 -754 2747
1689B747k263p81K002l064J732k098R18O06j508L466k725J660Q45j379J115k653
$$ 2747 484 -297 1705 -1359 373 -1725 -807 -201 -1709 1757 -968 692 1537 158 1273 -1380
1705a380K246r23j176J185j433K578j633J48J755j462J392j941Q59J29k119K520
$$ -1380 866 -57 -1233 -48 -1481 1097 -536 -388 1367 -95 1297 -644 215 344 -1775 745
1721G45j571K92k03M11J810k579K297l97q37N97j235J478k051R79O99j685K059
$$ 745 -826 -534 -737 -326 1484 -1095 1202 805 -32 565 -670 808 -1243 -264 435 -1250 809
1738H09r26O85m55k89J400k282Q96K10j63L92j360J525m41J22L73r48J338j306
$$ 809 -117 568 113 -176 1224 -1058 -162 48 -115 277 -1083 442 1 123 496 -452 886 -420
1756d20M62K22j069Q07n16Q30m79l07J401j203P01p40j57Q88j142Q95q08O72P07
$$ -420 42 264 -805 2 -514 316 -163 -470 931 -272 429 -311 -468 420 -722 173 -635 37 744
1775G44q62N13m63L14M5r42M24j54L65k19j85R16o45Q44l33j75m7m06L55q91J95
$$ 744 -118 395 -68 246 291 -651 -227 -381 -16 -235 -420 496 -149 695 362 187 140 -266 89 -802 -607
1796f07M28l33P09j44L52L57j43j90o16M07l82p66M82l37P19K19M26j65J50L99
$$ -607 -179 -512 197 53 405 762 619 429 -187 220 -162 -928 -446 -783 -64 155 581 416 566 965
1816I65l47n96m08j0j46o25O70M95r3M22K88k5j4J97n88n75Lm5l48K3K50P06K25
$$ 965 618 22 -386 -396 -542 -1167 -497 -2 -95 327 615 590 576 773 185 -390 -387 -432 -780 -757 -507 199 424
1839D24K89o9lPp80l35J69m70K85J16O5J09P69N19k70l92M1j9r91k79J82n6J99
$$ 424 713 644 641 648 -132 -467 -298 -768 -483 -367 -302 -193 576 1095 825 433 474 455 -536 -815 -633 -689 -490
1862d90L93J75M94R3P8j73j42n32k99l69K57k85O04K84k22L43R19r3m97k86J09
$$ -490 -97 78 572 665 743 570 428 -104 -403 -772 -515 -800 -196 88 -134 209 1128 1035 538 252 361
1883C61o72l90J99J4k42O09P52o78N21O21n72p24n8L5j26n16L31O7O04L3J02L58
$$ 361 -311 -701 -502 -488 -730 -121 631 -47 474 1095 523 -201 -259 -224 -350 -866 -535 -468 136 169 271 629
1905F29L8k80M4m87k31k05J78r3j75M71M98k74J60K55o4k69k56j65k85J42L70
$$ 629 667 387 431 -56 -287 -492 -314 -407 -582 -111 387 113 273 528 464 195 -61 -226 -511 -369 1
1926Am07J01O26N87n17k23R2r7j04p79J38N76m67L50k43J051l64k25K36k90Kj18
$$ 1 -406 -305 321 908 391 168 260 163 59 -720 -582 -6 -473 -123 -366 685 321 96 332 42 44 -74
1948g4J10l63l67P41n17L52N63l31Q94p79K44m60n54P34p55J49j8Q24j64r92J587
$$ -74 36 -327 -694 47 -470 -118 445 114 1008 229 473 13 -541 193 -562 -413 -431 393 229 -763 824
1969H24k65j77q6o72N15p49J52J92j46P82o75Q14j77J1K26r59P00q82j83O97r38
$$ 824 559 382 296 -376 139 -610 -458 -266 -412 370 -305 509 332 343 569 -390 310 -572 -755 -58 -996
1990i96J489o70N63M63p27O73j484J601j031j239J543j001J395j432Q61R82j156
$$ -996 493 -177 386 849 122 795 -689 912 -119 -1358 185 -816 579 -853 8 990 -166
2007a66J183r51J72K56j060R33j368J073k67q66K064j112R09n37J01P34k152J369
$$ -166 1017 66 238 494 -566 367 -1001 72 -195 -1061 1003 -109 800 263 364 1098 -1054 315
2025C15j034j0L77p49K171j264L81N84m73J502k593Q74j5p87J007k287K390m15
$$ 315 -719 -729 -352 -1101 1070 -194 187 771 298 1800 -793 81 66 -721 286 -2001 389 -26
2043b6m12J295j211K042j803K23N68j889J571j622J051l02n82K242j636J486l74
$$ -26 -438 857 -354 1688 -115 108 676 -1213 358 -1264 -213 -515 -1097 1145 -491 995 621
2060F21m52J000k238J526j307R4J584k109J540p70J340kj865K757j540k44k39
$$ 621 169 1169 -1069 457 -850 -756 828 -1281 259 -511 829 827 -1038 1719 179 -65 -304
2077c04n91J912k950J888L40n52J057j720K471j474q6R84k107J610j939J132M89
$$ -304 -895 1017 -1933 -45 295 -257 800 -920 1551 77 -9 975 -1132 478 -1461 -329 160
2094A60j343K286j521J141J66r32J078k137K119j141j363J642j211J883j802R27
$$ 160 -1183 1103 -418 723 889 -43 1035 -1102 1017 -124 -1487 155 -1056 827 -975 -48
2110d8J465k013J687j599J060k30j628K112j607Q16m53m18K163k115J793m70j47
$$ -48 1417 -596 1091 -508 552 322 -1306 806 -801 15 -438 -856 1307 -808 985 515 368
2127C68L78k018K340j783k6M85o48J775j698J246K08r08J499j834Q02m31j76Q10
$$ 368 746 -1272 1068 -715 -741 -256 -904 871 -827 419 627 -281 1218 -616 186 -245 -421 389
2145C89k188K561n45m69L51m12K000k151L52O76j025M97r80J516o86p15J452n70
$$ 389 -1799 762 217 -252 99 -313 1687 -464 -112 564 -461 36 -944 572 -114 -829 623 53
2163E3M78o92M67R48k294J513o78n6L09q17J325j418J176J28r03J007n81O80j267
$$ 53 531 -161 306 1254 -1040 473 -205 -261 48 -769 556 -862 314 442 -461 546 -35 645 -622
2182f22J89J070j499P73m07Q27oq69J204n86O3k7l79J085j655Q97O9l27J77n55
$$ -622 -433 637 -862 -89 -496 331 325 -544 660 74 137 110 -269 816 -839 58 127 -200 -23 -578
2202e78J393q96m9Q05p53M95j084O56K10r93J004p56O35q9m8N09q32R83n33m16
$$ -578 815 -81 -130 675 -78 417 -667 -11 199 -794 210 -546 89 0 -48 461 -371 612 79 -337
2222c37N31o83P92p71K87M88m03M88p43P85j84m60N82n62M93p05J95Q40j052N30
$$ -337 194 -489 303 -468 -181 307 -96 392 -351 434 250 -210 372 -190 303 -402 -207 633 -419 111
2242A11J19Q2m16l07R25o84K70k04R2L25n07N38n50J68L80m18J66n01L10J30l78
$$ 111 230 312 -104 -411 514 -170 100 -104 -12 313 -194 344 -206 -38 342 -76 90 -411 -101 29 -349
2263c49K84o5M23m06J33L40k90K86n07p3K10l57O66n08j80O10M5j2m81L94P4l89
$$ -349 -65 -130 293 -113 20 360 70 356 -151 -224 -14 -371 295 -213 -393 217 262 250 -231 163 237 -152
2285a52p6j17L47r9K4Kr5N53j20p6p3m25K74j26j05J84j04L51j55l2K91k48L48
$$ -152 -228 -345 2 -97 -73 -71 -166 387 267 191 118 -307 -33 -159 -264 -80 -184 167 12 -20 271 23 371
2308C71k46q0l10j8K85k13N2P1K20J42k92M18k38rq2r2J00j53P1k39K05K41n0
$$ 371 125 45 -265 -283 2 -211 -159 -88 132 274 -18 400 162 153 71 -21 79 -74 -3 -242 -37 204 154
2331A54L6K16m56O3J52k13j95L98l33%M6K30o6P1J39j01k56P0M2j91M8j05J82
$$ 154 190 406 -50 13 165 -48 -243 155 -178 -178 -132 98 32 103 242 141 -115 -45 -3 -194 -146 -251 -69
2354f9j65r2M38K6Pj54L63k33l69J27J41j26n2J17j66L19J35k27J47K5k58K9K61
$$ -69 -234 -326 112 138 145 -9 354 121 -248 -121 20 -106 -158 -41 -207 112 247 20 167 192 -66 -37 224
2377B24m42O9p1R5j30J06M69N8m59J00L65n54K78j54j16o9J77o2k44L22Q2L4J39
$$ 224 -218 -149 -220 -125 -255 -149 320 378 -81 19 384 -170 108 -46 -162 -231 -54 -116 -360 -38 44 78 217
2400B17j83Q2r0j93K15j51Q5J73m21K52J12j35J45k58L47j88J60m83J58M73n35
$$ 217 34 116 26 -167 48 -103 -18 155 -266 -14 98 -37 108 -150 197 9 169 -314 -156 317 -218
2421b18K89j19J75J38m27M45k50O6J33k69J00k75L27k46j51J63N3N31l92m0L57
$$ -218 71 -48 127 265 -162 283 33 99 232 -37 63 -212 115 -131 -282 -119 -66 465 73 33 390
2442C90l57Q6k7l29J23j86M94k14q5J94r1L44l40J66J55l80K44l69J11m08K27
$$ 390 33 119 92 -237 -114 -300 194 -20 -105 89 -2 342 2 168 323 -57 187 -182 -71 -479 -252
2463b52O91o83L12J69n5j24p7N97p72q0J43l10M25m85L16L08J72Q2n73N71k59
$$ -252 439 -244 68 237 182 58 -19 578 -194 -274 -131 -441 -16 -501 -185 123 295 377 -196 375 116
2484A16k88K66k93M53p61L71L44k80L81k65J87R7m54N54n41L77k86o83R72l36
$$ 116 -172 94 -199 254 -507 -136 208 -72 309 44 231 328 -126 428 -113 264 -22 -705 267 -69
2504f9M23n23M38K09o36M60n23M33n11l73J083m07K7k09K75J20n58O86pn24J62
$$ -69 354 -169 269 478 -158 302 -221 212 -299 -672 411 4 31 -178 97 217 -341 345 338 -186 -24
2525b4l33O28p11r9O23m77Q47n23L00J18l79O45r78L69j06l09N26q11J343m90
$$ -24 -357 271 -440 -539 84 -393 454 -69 231 349 -30 615 -363 6 -100 -409 117 -694 649 159
2545A59m82P04k84L88j056M36O62r20M31j43L12j35m84J022o38J90k71j30M06
$$ 159 -323 381 97 485 -571 -135 527 -393 38 -105 207 72 -412 610 -28 162 -109 -239 167
2564A67q16Q13k95o1J89m80J002o06J49K45j95K17n11J94j37j36M46p44N77k0
$$ 167 -649 164 -131 -192 -3 -483 519 -87 62 307 112 329 -182 12 -125 -261 185 -559 18 -2
2584bM23j56r22J133k79l63JJ7Q43j295N99K45m75L62l43Q98p51n50J178n73M15
$$ -2 421 265 -657 476 197 -166 -165 -148 695 -600 -1 244 -231 131 -212 686 -65 -615 563 -10 405
2605D05q98O57K42q22P02o03M16j60p8O52r47O33k63k36K74L3M13p58M73N08q68
$$ 405 -493 164 406 -416 286 -317 99 -61 -139 513 -434 199 -64 -300 -26 7 420 -338 135 643 -225
2626b25J49n8N06l09m41Q87m13l53J37L57op92O17q6J0J7k35Q32p90N1qj03N64
$$ -225 -76 -134 372 63 -378 509 96 -257 -120 237 231 -561 56 -30 -20 -3 -238 594 -196 -145 -153 -256 308
2649C08m91L87m23j06M88o55N94q5LJ57n59R01o72K90Q3k50M96r18M77m9JP6l04
$$ 308 -183 204 -219 -325 163 -492 102 17 20 177 -382 519 -153 137 220 -30 466 -452 25 -24 -23 53 -251
2672b51N72n04j79N96j96K46q22O65M19j063O96k90K31l24n16J123o22K11J29
$$ -251 321 -183 -362 234 38 284 -538 127 546 -517 179 -111 120 -204 -720 403 -219 -8 121
2691A21k52J01m55R76o58o0N33l25Jj00K68k48m7M04m65K40o0J70J4m44N90m14
$$ 121 -131 -30 -485 491 -167 -227 306 -19 -18 -118 150 -98 -145 259 -206 34 -26 144 158 -286 304 -110
2713a10j40L72k85O17n28J2L90l78L38p40O87l19j80N36m26K73M4j24K39n99M39
$$ -110 -250 122 -163 454 -74 -62 328 -50 288 -452 235 -84 -264 272 -154 119 163 39 278 -321 118
2734A18j11k80K93m49P14o74O00j52k10M70l00J58k31m1K31n87N89o18N20m8j72
$$ 118 7 -273 20 -429 285 -389 211 59 -151 319 19 177 -54 -95 136 -451 138 -480 40 -8 -180
2755a80N31o29O19J30n87K95n03L60k42j52N08l93K70r9R0J94n33Q16q32N12k93
$$ -180 351 -278 341 471 -116 179 -324 36 -206 -358 150 -243 27 -72 18 212 -321 495 -337 175 -118
2776a18k67M02m00L82j78J00M35k34J70l21k25J71N5N6l54m4M40oQ6j09K01M9
$$ -118 -385 17 -383 -1 -179 -79 356 122 292 -29 -254 -83 -28 28 -326 -370 70 64 150 41 242 291
2798B91l95M10k23j46r9OK2l19M86Lp1M49k88O6j62p1K37p98O16j39J52r0n9L73
$$ 291 -104 306 83 -63 -162 -156 -134 -453 33 36 -35 414 126 192 30 -41 196 -602 14 -125 27 -63 -122 251
2822B51k9R5J4k46j60k9Q4l13J24J09j77J56L30J27Ll32K10j39j03j96k4R8l4
$$ 251 222 317 331 85 -75 -104 -20 -333 -209 -100 -277 -121 209 336 339 7 217 78 -25 -221 -245 -147 -181
2845a81Mp2L54j40M08R0l05q4l34p5K81m51N57j33J4L27J02J7K6k73J12m26J35
$$ -181 -177 -249 105 -35 373 463 158 74 -260 -335 -54 -505 52 -81 -67 260 362 379 405 132 244 -182 -47
2868d7k95J33q6J32J32r0K6K97R0n5j32l1k43j17K10j80J72k43N68q7J06k5R7
$$ -47 -342 -209 -295 -163 -31 -121 -95 202 292 237 105 74 -169 -286 -76 -256 -84 -327 241 154 260 235 332
2891C32l75N3j83J06j52P3P8j54J00M9J28L33j81m5o6o2k94o8J17j06P8J87j23
$$ 332 -43 10 -173 -67 -219 -146 -68 -222 -122 -73 55 388 207 162 96 34 -260 -328 -211 -317 -239 -52 -175
2914a75L58K3R0q6L2l09Q1Lj10r9K63k22K66j71L65P1k00J21m54N7j22j93K53
$$ -175 183 206 296 210 242 -67 14 17 -93 -192 71 -151 115 -56 309 380 180 301 -153 -96 -218 -411 -158
2937a58j18K01J4M30r5j94M77n61j43m3j7M33m16o1l2L94J59j30J26k04Q7j50
$$ -158 -276 -75 -61 369 274 80 557 -4 -147 -190 -207 226 -190 -251 -283 111 270 140 266 62 149 -1
2959ao5K06l83J7J01K62l38O0M87j86m2K58k88j27l63K00K53l84M22j44K47J26
$$ -1 -66 140 -243 -226 -125 137 -201 -141 346 160 118 376 88 -39 -402 -202 51 -333 89 -55 192 318
2981C18k43J34k76L62j88k86j37K35K03m1j47N0Q4L7k21K74l06k62N29m90L14
$$ 318 75 209 -67 295 107 -179 -316 -81 122 81 -66 -16 68 105 -116 158 -148 -410 119 -371 -57
3002e7j6K73j15m4P3O8M4L7m43K42Rl04R5J10J91ok6q9o0L00j02l45L11m36J26
$$ -57 -73 200 85 41 114 182 226 263 -180 62 71 -233 -138 -28 163 157 131 42 -18 282 180 -165 146 -290 -164
3027a64k15L63O6l1j6J46J46l86J69l3j79L0m36N82j75p0L61N0j13k47K85K62
$$ -164 -379 -16 50 19 3 149 295 -91 78 45 -134 -104 -540 42 -133 -203 158 208 95 -152 133 395
3049C95o82J56n6K19l04J98J30L5K63m39K94l76M48rn39K13n4j64Q4RN08k82k05
$$ 395 -287 -131 -187 32 -272 -74 56 91 354 -85 209 -167 281 272 -267 -54 -108 -272 -188 -179 329 47 -158
$$ [...]
8191g2
##END NTUPLES=NMR FID
##END=
