##TITLE=1H_LR-750-i-P3
 CDCl3
 8 sc, 
 6.3.2024
##JCAMPDX= 6.0         $$ Bruker NMR JCAMP-DX V2.0
##DATA TYPE= NMR FID
##DATA CLASS= NTUPLES
##ORIGIN= UXNMR, Bruker Analytische Messtechnik GmbH
##OWNER= root
$$ XWIN-NMR		Version 3.5
$$ Wed Mar  6 18:23:09 2024 Russian Standard Time (UT+4h)  she@DPX200
##.OBSERVE FREQUENCY= 200.1313
##.OBSERVE NUCLEUS= ^1H
##.DELAY= (6, 6)
##.ACQUISITION MODE= SIMULTANEOUS
##.ACQUISITION SCHEME= undefined
##.AVERAGES= 8
##.DIGITISER RES= 18
##SPECTROMETER/DATA SYSTEM= spect
##.PULSE SEQUENCE= zg30
##.SOLVENT NAME= CDCl3
##.SHIFT REFERENCE= (INTERNAL, CDCl3, 0, 15.7039)
##AUDIT TRAIL= $$ (NUMBER, WHEN, WHO, WHERE, WHAT)
$$ ##TITLE= Audit trail, XWIN-NMR		Version 3.5
$$ ##JCAMPDX= 5.01
$$ ##ORIGIN= Bruker BioSpin GmbH
$$ ##OWNER= she
$$ F:/spectra/data/she/nmr/H-F/1/audita.txt
$$ ##AUDIT TRAIL=  $$ (NUMBER, WHEN, WHO, WHERE, WHAT)
(   1,<2024-03-06 18:20:59.07 +0400>,<she>,<DPX200>,
      <created by zg, POWCHK disabled, PULCHK disabled
       configuration hash MD5:
       00 E9 B6 7A A2 85 ED C7 34 08 36 98 17 FE 4E 26
       data hash MD5: 16K
       CC BB 43 C6 D1 44 6F 3B 32 78 DE 63 F6 61 CB DA>)
$$ ##END=
$$ 
$$ hash MD5
$$ 08 4D 1D 16 A4 5C 1F 44 BD 48 83 FB FD 3F 7A 26
##$RELAX= 
##$RELAX= 
##$RELAX= 
##$RELAX= 
##$RELAX= 
##$RELAX= 
$$ Bruker specific parameters
$$ --------------------------
##$DU= <F:/spectra>
##$EXPNO= 1
##$NAME= <H-F>
##$PROCNO= 1
##$TYPE= <nmr>
##$USER= <she>
##$AMP= (0..31)
100 100 100 100 100 100 100 100 100 100 100 100 100 100 100 100 100 100 
100 100 100 100 100 100 100 100 100 100 100 100 100 100 
##$AQSEQ= 0
##$AQ_mod= 1
##$AUNM= <au_zg>
##$AUTOPOS= <>
##$BF1= 200.13
##$BF2= 200.13
##$BF3= 200.13
##$BF4= 200.13
##$BF5= 200.13
##$BF6= 200.13
##$BF7= 200.13
##$BF8= 200.13
##$BYTORDA= 1
##$CFDGTYP= 0
##$CFRGTYP= 5
##$CHEMSTR= <none>
##$CNST= (0..31)
1 1 145 1 1 1 1 1 1 1 1 1 1 1 1 1 1 1 1 1 1 1 1 1 1 1 1 1 1 1 1 1 
##$CPDPRG= <>
##$CPDPRG1= <>
##$CPDPRG2= <>
##$CPDPRG3= <>
##$CPDPRG4= <mlev>
##$CPDPRG5= <mlev>
##$CPDPRG6= <mlev>
##$CPDPRG7= <mlev>
##$CPDPRG8= <mlev>
##$CPDPRGB= <>
##$CPDPRGT= <>
##$D= (0..31)
0 1.2 0 0 0 0 0 0 0 0.06 0 0.03 0 0 0 0 0.0002 0 0 0 0 0 0 0 0 0 0 0 0 
0 0 0 
##$DATE= 1709734858
##$DBL= (0..7)
120 120 120 120 120 120 120 120 
##$DBP= (0..7)
150 150 150 150 150 150 150 150 
##$DBP07= 0
##$DBPNAM0= <>
##$DBPNAM1= <>
##$DBPNAM2= <>
##$DBPNAM3= <>
##$DBPNAM4= <>
##$DBPNAM5= <>
##$DBPNAM6= <>
##$DBPNAM7= <>
##$DBPOAL= (0..7)
0.5 0.5 0.5 0.5 0.5 0.5 0.5 0.5 
##$DBPOFFS= (0..7)
0 0 0 0 0 0 0 0 
##$DE= 6
##$DECBNUC= <off>
##$DECIM= 32
##$DECNUC= <off>
##$DECSTAT= 4
##$DIGMOD= 1
##$DIGTYP= 9
##$DL= (0..7)
0 120 120 120 120 120 120 120 
##$DP= (0..7)
150 150 150 150 150 150 150 150 
##$DP07= 0
##$DPNAME0= <>
##$DPNAME1= <>
##$DPNAME2= <>
##$DPNAME3= <>
##$DPNAME4= <>
##$DPNAME5= <>
##$DPNAME6= <>
##$DPNAME7= <>
##$DPOAL= (0..7)
0.5 0.5 0.5 0.5 0.5 0.5 0.5 0.5 
##$DPOFFS= (0..7)
0 0 0 0 0 0 0 0 
##$DQDMODE= 0
##$DR= 18
##$DS= 0
##$DSLIST= <SSSSSSSSSSSSSSS>
$$ [...]
##$SUBNAM2= <"">
##$SUBNAM3= <"">
##$SUBNAM4= <"">
##$SUBNAM5= <"">
##$SUBNAM6= <"">
##$SUBNAM7= <"">
##$SUBNAM8= <"">
##$SUBNAM9= <"">
##$SW= 18.0517328524113
##$SWIBOX= (0..15)
0 0 2 0 0 0 0 0 0 0 0 0 0 0 0 0 
##$SW_h= 3612.71676300578
##$TD= 16384
##$TD0= 1
##$TE= 0
##$TE2= 300
##$TE3= 300
##$TEG= 300
##$TL= (0..7)
0 120 120 120 120 120 120 120 
##$TP= (0..7)
150 150 150 150 150 150 150 150 
##$TP07= 0
##$TPNAME0= <>
##$TPNAME1= <>
##$TPNAME2= <>
##$TPNAME3= <>
##$TPNAME4= <>
##$TPNAME5= <>
##$TPNAME6= <>
##$TPNAME7= <>
##$TPOAL= (0..7)
0.5 0.5 0.5 0.5 0.5 0.5 0.5 0.5 
##$TPOFFS= (0..7)
0 0 0 0 0 0 0 0 
##$TUNHIN= 0
##$TUNHOUT= 0
##$TUNXOUT= 0
##$USERA1= <user>
##$USERA2= <user>
##$USERA3= <user>
##$USERA4= <user>
##$USERA5= <user>
##$V9= 5
##$VALIST= <valist>
##$VCLIST= <CCCCCCCCCCCCCCC>
##$VD= 0
##$VDLIST= <DDDDDDDDDDDDDDD>
##$VPLIST= <PPPPPPPPPPPPPPP>
##$VTLIST= <TTTTTTTTTTTTTTT>
##$WBST= 1024
##$WBSW= 4
##$XGAIN= (0..3)
0 0 0 0 
##$XL= 0
##$YL= 0
##$YMAX_a= 711493
##$YMIN_a= -814385
##$ZGOPTNS= <>
##$ZL1= 120
##$ZL2= 120
##$ZL3= 120
##$ZL4= 120
##$ABSF1= 10
##$ABSF2= 0
##$ABSG= 5
##$ABSL= 3
##$ALPHA= 0
##$AQORDER= 0
##$ASSFAC= 0
##$ASSFACI= 0
##$ASSFACX= 0
##$ASSWID= 0
##$AUNMP= <proc_1d>
##$AZFE= 0.1
##$AZFW= 0.1
##$BCFW= 1
##$BC_mod= 2
##$BYTORDP= 1
##$COROFFS= 0
##$CY= 11.3945322036743
##$DATMOD= 1
##$DC= 2
##$DFILT= <>
##$DTYPP= 0
##$F1P= 15.7292609196834
##$F2P= 12.9074282941183
##$FCOR= 0.5
##$FTSIZE= 0
##$FT_mod= 4
##$GAMMA= 1
##$GB= 0.15
##$INTBC= 1
##$INTSCL= 1
##$ISEN= 128
##$LB= 0.24
##$LEV0= 0
##$LPBIN= 0
##$MAXI= 10000
##$MC2= 0
##$MEAN= 0
##$ME_mod= 0
##$MI= 1.114404
##$NCOEF= 0
##$NC_proc= 0
##$NLEV= 6
##$NOISF1= 3.799351
##$NOISF2= 2.8
##$NSP= 1
##$NTH_PI= 0
##$NZP= 0
##$OFFSET= 15.70392
##$PC= 1
##$PHC0= -24939.73
##$PHC1= 6.987312
##$PH_mod= 1
##$PKNL= yes
##$PPARMOD= 0
##$PSCAL= 0
##$PSIGN= 0
##$REVERSE= no
##$SF= 200.130013532006
##$SI= 16384
##$SIGF1= 3
##$SIGF2= 2
##$SINO= 400
##$SIOLD= 16384
##$SREGLST= <1H.CDCl3>
##$SSB= 0
##$STSI= 0
##$STSR= 0
##$SW_p= 3612.71676300578
##$SYMM= 0
##$S_DEV= 0
##$TDeff= 0
##$TDoff= 0
##$TI= <>
##$TILT= no
##$TM1= 0
##$TM2= 0
##$TOPLEV= 0
##$USERP1= <user>
##$USERP2= <user>
##$USERP3= <user>
##$USERP4= <user>
##$USERP5= <user>
##$WDW= 1
##$XDIM= 8192
##$YMAX_p= 0
##$YMIN_p= 0
$$ End of Bruker specific parameters
$$ ---------------------------------
##NTUPLES= NMR FID
##VAR_NAME=  TIME,          FID/REAL,        FID/IMAG
##SYMBOL=    X,             R,               I
##VAR_TYPE=  INDEPENDENT,   DEPENDENT,       DEPENDENT
##VAR_FORM=  AFFN,          ASDF,            ASDF
##VAR_DIM=   8192,          8192,            8192
##UNITS=     SECONDS,       ARBITRARY UNITS, ARBITRARY UNITS
##FACTOR=    0.0002768,     1,               1
##FIRST=     0,             0,               0
##LAST=      2.2672688,     0,               0
##MIN=       0,             -814385,         0
##MAX=       2.2672688,     711493,          0
$$ Real data points
##PAGE= N=1
##DATA TABLE= (X++(R..R)), XYDATA
$$ [...]
2713E935J602j2711J169N394o489K563J3867m080j5686K688P416n120K325J0432
$$ 5935 7537 -5174 -4005 1389 -5100 -2537 11330 7250 -8436 -5748 1668 -3452 -1127 9305
2727I305o147j2301P116Q316p524l067P260k746l985Q465K229j1619k668Q179
$$ 9305 3158 -9143 -2027 6289 -1235 -4302 2958 212 -3773 4692 6921 -4698 -7366 813
2741H13K86q00O144l228j1642K748J0769k396m863M269q24o259M409P169o238
$$ 813 1099 299 6443 3215 -8427 -5679 5090 2694 -2169 2100 1276 -4983 -574 6595 357
2756C57o531N325L914k184J726K08p974j132Q759K580m561j58p77m431K557Q268
$$ 357 -6174 -849 3065 881 2607 2815 -5159 -6291 2468 5048 487 329 -448 -4879 -2322 5946
2772E946k314p670J271M549j062O1J792l949l810M696N086k107l011j121j868
$$ 5946 3632 -4038 -2767 1782 720 781 2573 -1376 -5186 -490 4596 2489 -522 -1643 -3511
2787c511J937N624p9n803j686K883P46J044J876k550m857J818N898r7l412j686
$$ -3511 -1574 4050 3971 -1832 -3518 -635 111 1155 3031 481 -4376 -2558 3340 3243 -169 -1855
2803a855l18P90L359K066l387l491n6K828K162J003k457m201J81M684J876j927
$$ -1855 -2173 -1383 1976 4042 655 -2836 -2892 -64 2098 3101 644 -3557 -3376 1308 3184 1257
2819A257k337j089J96K396L092j242m573j382K645L253P53k303l136o71K823K779
$$ 1257 -1080 -2169 -1973 423 3515 2273 -2300 -3682 -1037 2216 2969 666 -2470 -3141 -318 2461
2835B461l0k356k609k84K739L007k81l601k236J621L048J234j173k592j930J310
$$ 2461 2431 75 -2534 -2818 -79 2928 2647 -954 -3190 -1569 1479 2713 1540 -1052 -2982 -1672
2851a672L454J252k152l248o34K568L023L75k821k793J53K813K040j5k419l297
$$ -1672 1782 3034 882 -2366 -3000 -432 2591 2966 145 -2648 -2495 318 2358 2343 -76 -3373
2867c373Q50L855K041j861l010j189J172K883J357j665l094q58K242K702N55j518
$$ -3373 -2523 1332 3373 1512 -1498 -2687 -1515 1368 2725 1060 -2034 -2892 -650 2052 2607 1089
2883A089l985n83M045K893j531k484j235l00K168L123q97m038j271K304J736J103
$$ 1089 -2896 -3479 566 3459 1928 -556 -1791 -2091 77 3200 2303 -1735 -3006 -702 1034 2137
2899B137m97l270k406L126M102r68k426q32j685O69N066Q68m955k158L018J033
$$ 2137 1640 -1630 -4036 -910 3192 2224 -202 -1034 -2719 -2050 3016 3884 -1071 -3229 -211 822
2915H22j75J619j785m611K050N696n24l746o77m39j308M103M363m454m963K548
$$ 822 647 2266 481 -4130 -2080 3616 3092 -654 -1331 -1770 -3078 1025 5388 934 -4029 -1481
2931a481J925j023K322J042n336j499O970R89n253m10J914k904K260O682k966
$$ -1481 444 -579 1743 2785 -2551 -4050 2920 3909 -1344 -1754 160 -2744 -484 6198 3232
2946C232q423J577M507j274J266L850m831n837N654M336m996j185M265k587k130
$$ 3232 -5191 -3614 893 -381 885 4735 -96 -5933 -279 4057 -939 -2124 2141 -446 -2576
2961b576O974K42r846l53P763m33j941N048k691r904L044R429k776m188M899j105
$$ -2576 4398 4640 -5206 -5559 2204 1771 -170 4878 2187 -7717 -4673 4756 1980 -2208 2691 1586
2977A586o298M694N583p901m013R253J821n897L036J234j0074m93J2990Q74q398
$$ 1586 -4712 -18 5565 -2336 -6349 2904 4725 -1172 1864 3098 -6976 -7469 5521 6395 -2003
2992b003K767J782r138J254J1916k980q996O443M506q122l81O677o184n122J2238
$$ -2003 764 2546 -6592 -5338 6578 3598 -5398 1045 5551 -2571 -2952 3725 -2459 -7581 4657
3007D657N097j1319k301N453o720j958J4075K407j3332J6P747o712l804J1141
$$ 4657 9754 -1565 -3866 1587 -5133 -7091 6984 9391 -3941 -3925 3822 -2890 -6694 4447
3021D447j3j0073O148Q825j0518p063Q828l67n556J0767O706j5189p058J0637
$$ 4447 4434 -5639 509 9334 -1184 -8247 581 214 -5342 5425 12131 -3058 -10116 521
3035E21m79n778J0745N226j4539k758J2141l869j0164R267O704r383K088R430
$$ 521 42 -5736 5009 10235 -4304 -7062 5079 1210 -8954 313 7017 -2366 -278 9152
3049I152j0234j2057J1147Q124p209M388P143j3960r693J3461N657j0372N103
$$ 9152 -1082 -13139 -1992 6132 -1077 3311 10454 -3506 -13199 262 5919 -4453 650
3062F50R511j1282o752J1787j137j3141P682J3303p543n567P694o875j2568J2084
$$ 650 10161 -1121 -7873 3914 2777 -10364 -2682 10621 3078 -2489 5205 -1670 -14238 -2154
3076b154J3550r114m122Q255p739j1445J1943R659j1684j057J3632n711j2418
$$ -2154 11396 2282 -1840 6415 -1324 -12769 -826 8833 -2851 -3908 9724 4013 -8405
3089h405P412M060j1319M804J6549o407j2934N372O26j0147Q157J5306q595j1160
$$ -8405 -993 3067 -8252 -3448 13101 6694 -6240 -868 -242 -10389 -2232 13074 4479 -6681
3103f681Q945M05j2211N473J2518q376n468J3440m92j6414K235J0052n985P9J4104
$$ -6681 2264 2669 -9542 -4069 8449 73 -5395 8045 7553 -8861 -6626 3426 -2559 -2480 11624
3118A1624m096j6685L360Q253o818J222J3688n304j3381P713O323j2247r49J3570
$$ 11624 7528 -9157 -5797 2456 -4362 -3140 10548 5244 -8137 -424 5899 -6348 -7297 6273
3132F273k418p786R049K497j6124j574J4076o39m891Q538p05j5403J603J2416
$$ 6273 3855 -3931 5118 7615 -8509 -10083 3993 3354 -1537 7001 6296 -9107 -7504 4912
3146D912m392m908J0113M33j2057L480Q384j0047n265J3639L948j0189K403M422
$$ 4912 520 -4388 5725 6158 -5899 -2419 5965 -4082 -9347 4292 8240 -1949 454 4876
3160D876j1664l335J4576L341r380K838L177j0298j233J2295k157q651P210O084
$$ 4876 -6788 -10123 4453 7794 -1586 1252 4429 -5869 -7102 5193 3036 -5615 1595 7679
3174G679r927k278P868n018o281J0875P246j0737l505N539m412l715J0794L635
$$ 7679 -2248 -4526 3342 -1676 -7957 2918 10164 -573 -4078 1461 -2951 -6666 4128 7763
3188G763r887r11O393m989m029Q017O55p831M740Q192p798o823O321J076n066
$$ 7763 -2124 -3035 3358 -1631 -5660 2357 3012 -4819 -79 8113 315 -6508 -187 889 -4177
3203d177O043O851q908o755O589J657m072M670L529p579j793P284j561o501L802
$$ -4177 1866 8717 -191 -6946 -357 1300 -2772 1898 5427 -2152 -3945 3339 1778 -4723 -921
3218i21L804m596J362O487n199q095M836N784l548N82L942m812n698N748L965
$$ -921 2883 -1713 -351 6136 937 -7158 -2322 3462 -86 496 4438 -374 -6072 -324 3641
3233C641m817J18L555l016j949N030n56o507K037N743k054j779L030k408n566
$$ 3641 -1176 -1058 2497 -519 -2468 2562 2006 -4501 -2464 3279 1225 -554 2476 68 -5498
3248e498L648O417k710l418K149o66k595L104K804m118j866L840M57k239J433
$$ -5498 -1850 4567 1857 -1561 588 -78 -2673 431 3235 -883 -2749 1091 1548 -691 742
3263G42j07l676R55N328m14m206L47O64j642J882L543j981m131J477K189q65J23
$$ 742 635 -3041 -2086 3242 2828 -1378 -1031 -367 -2009 -127 3416 1435 -2696 -1219 970 105 228
3280B28O68j984j071L270J393k841j199R23n39J095K829p08m200j76K732O71n68
$$ 228 896 -1088 -2159 1111 2504 -337 -1536 -613 -1152 -57 2772 2064 -2136 -2312 420 1091 523
3297E23N92j156k173J745K669r34j867o11PJ110J946o8k683j121J193J741m6O5
$$ 523 1115 -41 -2214 -469 2200 1266 -601 -1212 -1205 -95 1851 1783 -900 -2021 -828 913 867 932
3315I32j019j930O24L001K03j763j222L8O73J223R18j522j745N2J997R22j27j423
$$ 932 -87 -2017 -1393 1608 1811 48 -1174 -1136 -463 760 1678 156 -1589 -1537 460 1382 1255 -168
3333a68j627J84K401J341r66j901p81Q11J375R18o25k004o30J459J656r4j399
$$ -168 -1795 -1611 790 2131 1165 -736 -1517 -706 669 1587 962 -1042 -1672 -213 1443 1349 -50
3350e0j164l04J433J715k56j722j117L05J406J171k02j753j028Q18J612N75q25
$$ -50 -1214 -1518 -85 1630 1374 -348 -1465 -1160 246 1417 1215 -538 -1566 -748 864 1439 614
3367F14j424j015J057J937N20j742j245O8Q30J512L51j422j821N20J973O14l83
$$ 614 -810 -1825 -768 1169 1689 -53 -1298 -1230 -400 1112 1463 41 -1780 -1260 713 1327 944
3384I44j370j208K94K513R51j642j246m38K77J489J038r99k383K40J829O03l47
$$ 944 -426 -1634 -1340 1173 2124 482 -764 -1202 -925 564 1602 603 -1780 -1540 289 892 545
3401E45p9j254r07J955J863j041j939L5k38Q46K114k15k779r59K132P85m23L16
$$ 545 466 -788 -1695 260 2123 1082 -857 -822 -1060 -214 1900 1685 -1094 -2053 79 864 441 757
3419G57p86k074J580K658q55k408K03P47n42K060J230k890k214K145J053n77J053
$$ 757 -29 -2103 -523 2135 1280 -1128 -925 -178 -720 1340 2570 -320 -2534 -389 664 87 1140
3436A140K43l512J22L690m4k964M45J452j626J005L186k489m103K063L192j249
$$ 1140 1383 -2129 -2007 1683 1639 -1325 -880 572 -1054 -49 3137 648 -3455 -1392 1800 551
3452E51J67J323l035k608L964K236l345j24K348k064j466M205m53m777J059M665
$$ 551 718 2041 -994 -3602 362 2598 -747 -871 1477 -587 -2053 2152 1699 -3078 -2019 2646
3468B646j372k091K304j136m901L440N171k826k769K503j079l175L572L318m907
$$ 2646 1274 -817 1487 351 -4550 -1110 4061 1235 -1534 969 -110 -3285 287 3605 -1302
3483a302j219N212p28m241K264J662m847P54P403j602n944J474J405l414J841
$$ -1302 -2521 2691 1963 -2278 -14 1648 -3199 -2445 4958 3356 -2588 -1114 291 -3123 -1282
3498a282O256k976n307L583J748n029J576M672l778k928O858P89q004M17N257
$$ -1282 4974 1998 -3309 274 2022 -3007 -1431 3241 -537 -3465 3393 4182 -3822 -3405 1852
3513A852l025r21P214q41q558R26N533l070j228O248j621o373L670L797o141j516
$$ 1852 -1173 -2094 5120 4279 -4279 -3353 2180 -890 -2118 4130 2509 -3864 -194 3603 -2538 -4054
3529d054O851r05m316N238J614q816j688Q750m27l902M941P14q757MQ196k545
$$ -4054 2797 1892 -2424 2814 4428 -4388 -6076 2674 2247 -1655 3286 4000 -4757 -4753 3443 898
3545H98m284N777J840o911J062N372o065l956Q879K993p155J498L767p822l209
$$ 898 -3386 2391 4231 -2680 -1618 3754 -2311 -6267 2612 5605 -1550 -52 3715 -4107 -7316
3560g316J0787K265p751J954M129o971k690Q297m84o416M741N573p319k783N920
$$ -7316 3471 5736 -2015 -61 4068 -2903 -5593 2704 2220 -4196 545 6118 -1201 -3984 1936
3575A936k790n228Q394N772q644l090N686l339m744Q412M488q321j242O442m045
$$ 1936 -854 -6082 2312 8084 -560 -3650 2036 -1303 -6047 2365 6853 -1468 -2710 3732 -313
3590c13n560O616K429o279K983P119o701o874N959J827n118N388O713q360o143
$$ -313 -5873 743 3172 -3107 -124 6995 294 -6580 -621 1206 -3912 1476 8189 -171 -6314
3605f314O551J573o262M476O615o774l870P098j651p737M307O471m523r18O640
$$ -6314 237 1810 -4452 24 6639 -135 -4005 3093 1442 -6295 -1988 4483 -40 -958 5682
3620E682m808q863N574O527n121P89O237n356p704O346M428o474N31P684l658
$$ 5682 874 -7989 -2415 4112 -1009 -220 6017 661 -7043 -697 3731 -2743 -2212 5472 1814
3635A814n793N579K46p433K343Q637k823m260M484j918q035M343Q522m202l788
$$ 1814 -3979 1600 1846 -5587 -3244 5393 2570 -1690 2794 876 -7159 -2816 5706 1504 -2284
3650b284N499j502o983L606N732n226k351P459K1o883J540K766n140P95Q397j250
$$ -2284 3215 1713 -5270 -1664 4068 -1158 -3509 3950 3971 -2912 -1372 1394 -3746 -2951 5446 4196
3666D196o855K027J854n373J550P890k903n943M451K283o247j79N600k030l263
$$ 4196 -2659 -632 1222 -4151 -2601 5289 2386 -3557 894 3177 -3070 -3249 2351 321 -2942
3681b942N691J727p145j037M730j979o40N690j48p343O76M576k695j417N331l87
$$ -2942 2749 4476 -2669 -3706 1024 -955 -1595 4095 3947 -3396 -2720 1856 -839 -2256 3075 2688
3697B688n446K207L663m277k831M895J106l221K620J849n638k209N552Q31k571
$$ 2688 -2758 -551 3112 -1165 -3996 899 2005 -1216 1404 3253 -2385 -4594 958 1789 -782
3712g82K356J093n317k64N138j183l339K696J866l307K57K882k545l588M292K760
$$ -782 1574 2667 -2650 -2914 2224 1041 -2298 398 2264 -1043 -786 2096 -449 -4037 255 3015
3728C015k988l69J460k654j778M424J801l302l16K189k189j151L423k87l609J228
$$ 3015 27 -342 1118 -1536 -3314 1110 2911 -391 -707 1482 -707 -1858 1565 1278 -2331 -1103
3744a103L560j758j979J872r35k070K535K892k158k319J611o46o76K103J127l075
$$ -1103 2457 699 -1280 592 -343 -2413 122 3014 856 -1463 148 -498 -1174 929 2056 -1019
3760a019p31K616k28j697J485L22k140O36K985j185k583R31P66o95R00J397j582
$$ -1019 -1750 866 638 -1059 426 748 -1392 -756 2229 1044 -1539 -608 158 -537 363 1760 178
3777A78j874J204J440r28N7P25j442o16K389M10k174m16J026o6p9J548q15j943
$$ 178 -1696 -492 948 20 77 802 -640 -1256 1133 1543 -631 -1047 -21 -87 -166 1382 567 -1376
3795a376J11J860L16o46k8o32q25J271J379j077j068L42L96j00Q12r2j417o22
$$ -1376 -1265 595 911 265 237 -395 -1220 51 1430 353 -715 -373 23 -77 735 643 -774 -1396
3813a396J402O89k84k73o98m75O53J473j47j170p14M37O96O91K32j463q19Q11
$$ -1396 6 695 411 138 -560 -1035 -382 1091 944 -226 -940 -503 193 884 1116 -347 -1166 -355
3831c55P99M84q67l32n67L48Q70N83j025n30j58P38L96L70q09r37L44R60M69k40
$$ -355 444 928 61 -271 -838 -490 380 963 -62 -592 -750 -12 384 754 -55 -992 -648 312 781 541
3851E41o45n70L7J045P55n87j019m85Q61O63Q6n33o28n19R35O77Kn95o82o4M95
$$ 541 -104 -674 -637 408 1163 576 -443 -928 -67 596 682 149 -479 -998 -63 614 616 21 -661 -725 -230
3872b30J086k88p71m83K64Q05J36n2o99n89K39J022M05l52j052j13J89J036K67
$$ -230 856 568 -203 -686 -422 383 519 467 -232 -821 -582 440 845 493 -559 -672 -483 553 820
3891H20q82p20L59O81p1M19n04r78L07R06L12m38k43n74J49N33R63q47r39Q2K24
$$ 820 -62 -782 -423 258 187 606 102 -876 -569 337 649 211 -32 -606 -457 76 1039 192 -747 -665 -441
3912d41N31R15m12j523P8J150N94p64M2j01p93M77J253l88j213k04P63j28J019
$$ -441 90 1005 593 -930 -852 298 892 128 170 69 -724 -247 1006 618 -595 -799 -36 -164 855
3931H55Mj544m82J384O16q37M23j24j368J91K280m02j884K36J235o61j52J185
$$ 855 859 -685 -1167 217 833 -4 419 295 -1073 -882 1398 996 -888 -652 583 -78 -230 955
3949I55j011j745J800J323j078j80L25j414o92K705Q06k091o44J538p30j005K214
$$ 955 -56 -1801 -1 1322 244 64 389 -1025 -1717 988 1794 -297 -941 597 -133 -1138 1076
3966A076r0k498P53K338q18j548Q73l08j588K078J767j760j704J516j07j344K168
$$ 1076 986 -1512 -759 1579 761 -787 86 -222 -1810 268 2035 275 -1429 87 -20 -1364 804
3983H04J392k962q75L039p07k265J344J418k155K55L018j263k956J003J437j590
$$ 804 2196 -766 -1641 1398 691 -1574 -230 1188 -967 -712 2306 1043 -1913 -910 527 -1063
3999a063J465K016k240k668K470J390k574Q64K669k430j667L170K08l816M37L425
$$ -1063 402 2418 178 -2490 -20 1370 -1204 -340 2329 -101 -1768 1402 1610 -2206 -1769 1656
4015A656j247r60K670j198m131J648L478j885n23K686j709l289K325K750l407
$$ 1656 409 -551 2119 921 -3210 -1562 1916 31 -492 2194 485 -2804 -479 2271 -1136
4030a136o73M008q44l107J963J374l992r7M929l19k920J476j6l527J038M593j357
$$ -1136 -1809 2199 1355 -1752 211 1585 -2407 -2504 2425 2106 -814 662 646 -2881 -1843 2750 1393
4047A393k975K940J34l941J028L834l119j626M454Q72m679L20K627k942q91N454
$$ 1393 -1582 1358 1492 -2449 -1421 2413 -706 -2332 2122 2994 -1685 -1365 1262 -1680 -2571 2883
4063B883L50m811L62K472k850n35N138q84m074K231K640m610j328M605o23l079
$$ 2883 3233 -1578 -1216 1256 -1594 -2129 3009 2125 -1949 282 2922 -1688 -3016 1589 966 -2113
4079b113L841K236n499j578L662m79k176M238J506n597n33L875j781k116L948
$$ -2113 1728 3964 -1535 -3113 549 70 -2106 2132 3638 -1959 -2492 1383 -398 -2514 1434
4094A434J300m382R74L639l746l073M408J808l447J735K731m671l050M890J066
$$ 1434 2734 -1648 -674 2965 -781 -3854 554 2362 -1085 650 3381 -1290 -4340 550 1616
4109A616l043K044K657m600j815M255l7l523K908K971l730j105L311k278l800
$$ 1616 -1427 617 3274 -1326 -3141 1114 1077 -2446 462 3433 -297 -1402 1909 -369 -4169
4124d169M065L890l694j001L026k552l513L784L398l901j14L249k460k954L480
$$ -4169 -104 3786 92 -909 2117 -435 -3948 -164 3234 -667 -781 2468 8 -2946 534
4139E34J070l720J654M000k494l797L136M6l730K869M399l124l024K465M0l338
$$ 534 1604 -2116 -462 3538 1044 -2753 383 429 -3301 -432 3967 843 -2181 284 324 -3014
4155c014K631L397l433j203L546p15l909K163K008k500J48M227j855m501J849
$$ -3014 -383 3014 -419 -1622 1924 1209 -2700 -537 1471 -1029 -881 3346 1491 -3010 -1161
4170a161J910j935M26M028k100l949K328J701k855M25L456j735k143K743N39l918
$$ -1161 749 -1186 -760 3268 1168 -2781 -453 1248 -1607 -1182 2274 539 -1604 1139 1678 -2240
4186b240M09L583j490j034K706l76m386R22L703j471j442K857o66l307J345K644
$$ -2240 -1831 1752 262 -772 1934 1558 -2828 -1906 1797 326 -1116 1741 1075 -2232 -887 1757
4202A757k515j045L101J00k670J679R13k991m13L707Lk284J296L11k967P17L032
$$ 1757 -758 -1803 1298 1398 -1272 407 1320 -1671 -2084 1623 1626 -658 638 949 -2018 -1301 1731
4219A731r26j922J376J075k278o4K002j104j617K395J160k319j27J312j399q45
$$ 1731 805 -1117 259 1334 -944 -1008 994 -110 -1727 668 1828 -491 -618 694 -705 -1550
4235a550K757P01k593k04J551j207m47J934K28k377P89J304p45j156J551k72j302
$$ -1550 1207 1908 -685 -889 662 -545 -992 942 1170 -1207 -418 886 141 -1015 536 264 -1038
4252a038J482J274j845j013J166O4o61J150Q40j844n63J257M64j198N84K34j261
$$ -1038 444 1718 -127 -1140 26 90 -571 579 1419 -425 -988 269 733 -465 119 353 -908
4269i08O28J337p51j180O64P10n66M13O13j083j079J230O47p05q9K65l67p89J649
$$ -908 -280 1057 306 -874 -210 500 -66 347 960 -123 -1202 28 675 -30 -119 146 -221 -1010 639
4288F39M2j241J54N66k68m6Q21o37q55N52J033l77n40K65m09m51P22R64j005n50
$$ 639 681 -560 -406 160 -108 -154 667 30 -825 -273 760 383 -157 108 -301 -752 -30 934 -71 -621
4308f21O22p2K6M51M0q74j52P99M37p65J00P1o60O13O15l54q69L58K80O7J20J65
$$ -621 1 -71 -45 406 446 -428 -580 219 656 -109 -9 62 -598 15 630 276 -593 -235 45 112 232 397
4330C97n17m57N16L36O3k45m80m3K25O19N1l81p26M86L78K77j08p38L4n3O61p
$$ 397 -120 -577 -61 275 338 93 -387 -430 -205 414 465 84 -642 -156 222 499 391 -347 -313 -366 295 288
4352B88l78j75j76L51K62L38m04p11M75L02j73L97l45m22J16P03J8m45j11j51
$$ 288 -90 -265 -441 -90 172 510 106 -605 -130 172 -1 396 51 -371 -255 448 466 21 -90 -241
4372b41j44J58P73j58l86m25J16N68j63J59n88J88Q0M17j77j28j35k24K08O37
$$ -241 -385 -227 546 388 2 -423 -307 261 98 257 -331 -143 -63 354 177 49 -86 -310 -102 535
4392E35j45l87m48M94K95l23J64j19l80KP02p5k24j98l12L04M61K07m65n86J10
$$ 535 390 3 -445 49 344 21 185 66 -314 -312 390 315 91 -107 -419 -115 346 553 88 -498 -388
4413c88K59N06J0L2r55j05R06N67o87l03J07l94L58M78k49q56P08Lm09P29N8q75
$$ -388 -129 377 387 419 -536 -641 265 832 145 -158 -51 -445 -87 391 142 -714 -6 -3 -412 317 375 -500
4435e00o9J090Ko32J31R7n49J8J092j26q10j58L55k32M12J90k26q82Q96Q67j101
$$ -500 -569 521 523 -109 22 119 -430 -412 680 554 -256 -414 -59 -291 121 311 85 -797 99 966 -135
4456a35k65O08n69l62J390N71j372o77J020k48l71J082nj374L16R61n11m46O78
$$ -135 -400 208 -361 -723 667 1238 -134 -811 209 -39 -410 672 667 -707 -391 570 59 -387 291
4475B91J0r85P97J176j621p88J064M45p70P22Q66j638o28J142L19r46O39N35j161
$$ 291 301 -684 113 1289 -332 -1120 -56 389 -381 341 1207 -431 -1059 83 402 -544 95 630 -531
4494e31p9J665o65j644J125R60j090M52R94j336j546J530J251j392r6J749j494
$$ -531 -610 1055 390 -1254 -129 831 -259 193 1187 -149 -1695 -165 1086 -306 -402 1347 -147
4511a47j318J843N14j925L75J881p71j101J356n04j892J173K128j284q45J538
$$ -147 -1465 378 892 -1033 -658 1223 452 -649 707 203 -1689 -516 1612 328 -517 1021
4527A021j022k001J836J985j766p60J663n37j704J364P93j906K84K392o15k254
$$ 1021 -1 -2002 -166 1819 53 -707 956 419 -1285 79 872 -1034 -750 1642 1027 -1227
4543a227J102M12j774Q56K636j224j939J543K80k230Q93K171j288j375K045M39
$$ -1227 -125 287 -1487 -631 2005 781 -1158 385 665 -1565 -672 1499 211 -1164 881 1320
4559A320k617L55K052j438k27K297j61k861L79J733j424j56K672p61k749R74J835
$$ 1320 -1297 -942 1110 -328 -555 1742 1581 -1280 -901 832 -592 -748 1924 1163 -1586 -612 1223
4576A223k188m87K794j61k305J460J268k706o55K836k72j404J617L17l062j38
$$ 1223 -965 -1452 1342 1181 -1124 336 1604 -1102 -1757 1079 807 -597 1020 1337 -1725 -1863
4592a863L214r81j601K611J08k719J80K535j982j227L031L89k330L75J510k435
$$ -1863 1351 370 -1231 1380 1488 -1231 -1051 1484 -498 -1725 1306 1695 -635 -260 1250 -1185
4608a185r33L068Q26k478R88R19k360p88L034O0k286J315J796k659q90K639r07
$$ -1185 -2118 950 1776 -702 286 1205 -1155 -1943 1091 1151 -1135 180 1976 -683 -1573 1066 159
4625A59j841K202J862k566j165J823r20j416K492J506k473n02J933j559j564K728
$$ 159 -1682 520 2382 -184 -1349 474 -446 -1862 630 2136 -337 -839 1094 -465 -2029 699
4641F99R22k658N98K352j889j964K038P52k047J313K321k244j912J892Nj366J358
$$ 699 1621 -1037 -439 1913 24 -1940 98 850 -1197 116 2437 193 -1719 173 178 -1188 170
4658A70K071k331j598K496k21k016J311J727j865n36K337j112k438J549J644j293
$$ 170 2241 -90 -1688 808 587 -1429 -118 1609 -256 -792 1545 433 -2005 -456 1188 -105
4674a05l2J799j557k074J789J560j973j1K191j308j762J901M28j967J25K509j140
$$ -105 -137 1662 105 -1969 -180 1380 -593 -604 1587 279 -1483 418 846 -1121 -996 1513 373
4691C73j127J384J56k612Q61K426j073j015J446l09k162J110J897j536p60J965
$$ 373 -754 630 786 -1826 -965 1461 388 -627 819 510 -1652 -542 1355 -181 -941 1024
4707A024m00j698P63J195j577k44K282l05j777M80N59j352K74K384q23j750R36
$$ 1024 624 -1074 -311 884 -693 -937 1345 1040 -737 -257 302 -1050 -776 1608 785 -965 -29
4724b9R38j607OJ549o14j183J268P26j729J38J120q46l31J446Q2j706P5J149n26
$$ -29 909 -698 -692 857 243 -940 328 1054 -675 -537 583 -263 -594 852 934 -772 -697 452 -74
4743g4l63J291k69j276L02J146n53j070J168p3r04O66P22q58p25J067M27j049
$$ -74 -437 854 585 -691 -389 757 204 -866 302 229 -675 -9 713 -145 -870 197 624 -425
4761d25O80J64j103j12J452m54n21M77L90p55j08R58m86q55N99Q68r77R3M99m31
$$ -425 255 419 -684 -796 656 202 -319 158 548 -207 -315 643 157 -698 -99 769 -208 -115 384 -47
4781d7q59J010N08n02j37M76p23r0O69K10q84l3O36j08j27P0k53n75N33P78m97
$$ -47 -906 104 612 110 -27 449 -274 -364 305 515 -369 -402 234 126 -1 69 -184 -759 -226 552 55
4802E5r7l52O8j51N16L87l42m49M42J03l72L37j11m89k3J124k62m83j82M72n99
$$ 55 -42 -394 -326 -477 39 426 84 -365 77 180 -192 145 34 -455 -478 646 384 -99 -281 191 -408
4823d08N73K56m30l43k2M58l6P4O1k47n1K43K2j03r7L84n39M1M40Q9m36m61Q25
$$ -408 165 421 -9 -352 -374 84 48 122 183 -64 -115 128 150 47 -50 334 -205 -164 276 365 -71 -532 293
4846B93j56J33k62J03l96kM27O4k83Q0j93R7L29K65n07l44M90O8k74J24L08o51
$$ 293 137 270 8 111 -285 -287 140 204 -79 1 -192 -95 234 499 -8 -352 138 206 -68 56 364 -287
4868b87J57J89M66l30l05j37N7J16L71j83l14j73J23M36M0N2q28J18P24k05J74
$$ -287 -130 59 525 195 -110 -247 -190 -74 297 114 -200 -373 -250 186 226 278 -550 -432 292 87 261
4889B61l85j42J47O1L21j24j76l17J98L98O4k01j86l27K65O60k44m98L69l48n6
$$ 261 -124 -266 -119 -58 263 139 -37 -354 -156 242 306 105 -81 -408 -143 517 273 -225 144 -204 -260
4910b60L89K29l56n31N43L29k64P8n9n52K19K81J95k66j07J41m24M16M66n31n13
$$ -260 129 358 2 -529 14 343 79 157 98 -454 -235 46 241 -25 -132 9 -415 1 467 -64 -577
4931e77O93j32k9L7O3l12k03M27K20l37j99L93m28OQ31j01p07N8K26L0J43L26
$$ -577 116 -16 -45 -8 55 -257 -460 -33 187 -150 -349 44 -384 -378 453 352 -355 -297 -71 -41 102 428
4953D28m57n91O58N61p94J27L39k27l91O85L75j183NN31k68K9N71J85r54K57P46
$$ 428 -29 -620 38 599 -195 -68 271 44 -347 338 713 -470 -465 66 -202 -173 398 583 -371 -114 632
4974F32p49k48O17O7p10M41P76r89n31P21L52m51L30N14j150m78J331k44p34R23
$$ 632 -117 -365 252 319 -391 50 826 -163 -694 27 379 -72 258 772 -378 -856 475 231 -503 420
4994D20j70n76L0Q48n09o01P88N14j144M1R72n60r86J055P19j246J9P14m34q12
$$ 420 250 -326 -296 552 43 -558 230 744 -400 -359 613 53 -933 122 841 -405 -386 328 -106 -918
5014i18J273N55j477L10Q93r11m58J435l68j281P31J425j073r60R69P3j222J175
$$ -918 355 910 -567 -257 636 -275 -733 702 334 -947 -216 1209 136 -824 145 218 -1004 171
5032A71J396j681o56J430p54r07Q92J029j426q0J547p50j455J133P65j365M11
$$ 171 1567 -114 -770 660 -94 -1001 -109 920 -506 -586 961 211 -1244 -111 654 -711 -300
5049c00J691r97j657J292L18j151P89J599j530j054J409R4j734Q08J623j230o01
$$ -300 1391 394 -1263 29 347 -804 -15 1584 54 -1000 409 503 -1231 -423 1200 -30 -631
5066f31J421k31k022Q05J572r19m67J429l72k103R80J634j490nJ408n99j544J006
$$ -631 790 559 -1463 -658 914 -5 -472 957 585 -1518 -538 1096 -394 -399 1009 410 -1134 -128
5084a28P61j612J58J855m32j566J003P20k081M18K102o04j019R86L90k174K93
$$ -128 633 -979 -821 1034 602 -964 39 759 -1322 -904 1198 594 -425 561 951 -1223 -930
5101i30K078j033r85J543K71j887N75J081j378m40K132nj872M06Q49j176k55K168
$$ -930 1148 115 -870 673 944 -943 -368 713 -665 -1105 1027 1022 -850 -444 405 -771 -1026 1142
5119A142L9k281J067R41j774j3J758o23j257J173R63j648p27J535l04r53J470
$$ 1142 1181 -1100 -33 908 -866 -879 879 256 -1001 172 1135 -513 -1240 295 -9 -962 508
5136E08R69k262r3J098j98j002J898L18k095P08J119j228j155J857M83j727R81
$$ 508 1477 -785 -878 220 22 -980 918 1236 -859 -151 968 -260 -1415 442 925 -802 179
5153A79J105j735j101J766L43j163R20Q86j618j285K395m7j636J051R80j449k48
$$ 179 1284 -451 -1552 214 557 -606 314 1200 -418 -1703 692 645 -991 60 1040 -409 -657
5170f57J459q02j349J299J416j282n39Q87m58j457J367J311j189o12J571j274
$$ -657 802 0 -1349 -50 1366 84 -455 432 -26 -1483 -116 1195 6 -606 965 -309
5186c09q36J315Q53j557P5J379j015q60J167J99j321P32J223n72j110O45M31j525
$$ -309 -1145 170 1023 -534 -459 920 -95 -955 212 411 -910 -178 1045 473 -637 8 439 -1086
5204a086P68J352j089o51R36J08j114O07J162j189l02J253j88j135L56O99j171
$$ -1086 -318 1034 -55 -706 230 338 -776 -169 993 -196 -498 755 567 -568 -212 487 -684
5221f84K08J477o71j202P09P06p80N4J026o77p64O06N93j104J20O12j94l92P80
$$ -684 -476 1001 330 -872 -163 543 -237 -183 843 166 -598 8 601 -503 -383 229 35 -357 423
5240D23J4q61j64J154m86n11J006k19r55K28R98m06o57Q57j20p64O28L78j138
$$ 423 437 -424 -588 566 80 -431 575 356 -599 -371 627 221 -436 421 301 -463 165 543 -595
5259e95j1R28J26p79K14L80r61K58P90j3p65L90M83r37J16P44k53o34O31L12l66
$$ -595 -606 322 448 -331 -117 263 -698 -440 350 337 -428 -38 445 -492 -376 368 115 -519 112 424 58
5280E8n2R8k72l34P53J4n11K2L68m25R9M09K63q62M0L13N3k46L85j37n71M29N14
$$ 58 6 104 -168 -502 251 265 -246 -224 144 -281 -182 227 490 -372 -332 -19 34 -212 173 36 -535 -106 408
5303D08k07k62o3L65k79K66J62n19m00O39j34k22K41J72m44m5N48l4k79K5J85
$$ 408 201 -61 -124 241 -38 228 390 -129 -529 110 -24 -246 -5 167 -277 -322 226 192 -87 -62 123
5324A23j11J62K10j07p37K16M26l37M14K3n22J9O7O20o03k33N70j52k82M7O41
$$ 123 12 174 384 277 -460 -244 182 -155 259 282 -240 -221 -154 466 -137 -370 200 48 -234 -187 454
5345D54n81k51M06p0K76k12M3j69K4J88r0q0L9k78J34K98K76l17k12R6Q8Q5k76
$$ 454 -127 -378 28 -42 234 22 65 -104 -80 108 18 -62 -23 -301 -167 131 407 90 -122 -26 62 147 -129
5368a29p7M6K41r1J46j19p7l8n7J60P3p4l05q1O99k58j86M28l03j38j76M22K75
$$ -129 -206 -160 81 -10 136 17 -60 -98 -155 5 78 4 -301 -382 317 59 -127 301 -2 -140 -316 106 381
5391C81n73J31O3L3J08K08n72J69R1o2L16k12l1j61n1L36m2l38O5m3K23PQ6m6
$$ 381 -192 -61 2 35 143 351 -221 -52 39 -23 293 81 50 -111 -162 174 132 -206 -141 -184 39 46 132 86
5415H6k63J92J91k69p9J17k9L2K58j21j38K31m1m53N44j01m56K21o2J19k69M14
$$ 86 -177 15 206 -63 -142 -25 -54 -22 236 115 -23 208 167 -286 258 157 -299 -78 -140 -21 -290 124
5437A24j64l5n8N5L24n98L20K23k28n7M41l45j76p2O65n65l7L08J29q57M41M61
$$ 124 -40 -75 -133 -78 246 -352 -32 191 -37 -94 347 2 -174 -246 419 -146 -183 125 254 -603 -162 299
5459B99l91J72J21k83j04N18Q0p24j88Q77k32m39N32Q1q65L28P74m88m15M59J25
$$ 299 -92 80 201 -82 -186 332 412 -312 -500 377 145 -294 238 319 -546 -218 556 68 -347 112 237
5480B37n68K59M56n05k61Q02j55n47M69l5n90J15Q92l38q86P83K4n96J23R65l41
$$ 237 -331 -72 384 -121 -382 420 265 -282 187 152 -438 -323 569 231 -655 128 152 -444 -321 644 303
5501C03q06N14M43o51j1M83n16j60Q12K1o77j40R20q39j43J170j49j153N36M55
$$ 303 -503 11 454 -197 -208 275 -241 -401 411 432 -245 -385 535 -304 -447 723 574 -579 -43 412
5521D12o44k53P23J32r18N47P09p49p03R60j2q15R18O03j219n37J086j14o58J006
$$ 412 -232 -485 238 370 -548 -1 708 -41 -744 216 204 -611 307 910 -309 -846 240 126 -532 474
5541D74L71j459l4J160m67r32J009M95r29J83Q01q27r66J052R71j411J17J428
$$ 474 845 -614 -648 512 45 -887 122 617 -312 -129 672 -155 -1121 -69 902 -509 -392 1036
5559A036j187p84J306R1j163O81Q18q79p80J574n80j199R86R29p18n81J170n96
$$ 1036 -151 -935 371 462 -701 -20 798 -81 -861 713 133 -1066 -80 849 131 -450 720 124
5577A24j208J070J554j822j71J219n41j064P05J040j377k55J842r30r60P83M35
$$ 124 -1084 -14 1540 -282 -453 766 225 -839 -134 906 -471 -726 1116 186 -774 9 444
5594D44j061L47J320p51j116P16K97r78O04J092o81r48J291J74j729P47J025r65
$$ 444 -617 -270 1050 299 -817 -101 196 -782 -178 914 233 -715 576 750 -979 -232 793 -172
5612a72m00J287o3j375L72Q66q15O4J433n94j580O94R63j193L3J338m55j188O80
$$ -172 -572 715 652 -723 -351 515 -300 -236 1197 603 -977 -283 680 -513 -480 858 403 -785 -105
5631a05P49j325m0J456m88p64J205p1j714K73J274m11m87J274l04j586L76J250
$$ -105 644 -681 -721 735 247 -517 688 617 -1097 -824 450 39 -448 826 522 -1064 -688 562
5649E62q06l47J352j64j403O50Q54j219j96J197K98j079M91N14j405j0J447l02
$$ 562 -244 -591 761 597 -806 -156 698 -521 -717 480 778 -301 190 704 -701 -711 736 434
5667D34q10N21N52j305r8J498m89j064R84O58j193j09R47n64q47J325O13j281
$$ 434 -376 145 697 -608 -706 792 303 -761 223 881 -312 -421 526 -38 -885 440 1053 -228
5685b28j74Q63p96m62J248L20j107J16R95p73j099J556K57j170J64J246j012n60
$$ -228 -402 461 -335 -797 451 771 -336 -220 775 2 -1097 459 716 -454 -290 956 -56 -616
5703f16Q78m5n16N07N96j058l94Q97Mr35P98O09q31l46J124n39r91Q00Q24r38
$$ -616 262 217 -299 208 804 -254 -648 249 253 -682 116 725 -106 -452 672 133 -858 -58 766 -172
5723a72j08J006n59q48O91N79q83L50L95m80o95Q93K72r83N06M85m10m12N79M8
$$ -172 -280 726 167 -681 10 589 -294 56 451 -29 -724 169 441 -542 -36 449 39 -373 206 254
5743B54r02L60Q75n51m46P77j30q83M25O82m22j34M34j71n85M58K74m74k77Q40
$$ 254 -648 -288 587 36 -410 367 237 -646 -221 461 39 -95 339 168 -417 41 315 -159 -436 404
5763D04j13r19P46K06o34J28O30j20o72J21P36o40n2O97o21pK86Oq6l03N51n11
$$ 404 291 -628 118 324 -310 -182 448 328 -344 -223 513 -127 -179 518 -103 -110 176 182 96 -207 344 -167
5785a67j28N18J4m88J01M38l14k83O76j91n24Q8K58p4J65p4o8J50j28K34l41K51
$$ -167 -295 223 237 -251 -150 288 -26 -309 367 176 -348 -260 -2 -76 89 15 -53 97 -31 203 -138 113
5807A13M9J13m56L41K11o76J85K84j27j99L52q7k05l5M76j69m00J18j9J43L5Q1
$$ 113 162 275 -181 160 371 -305 -120 164 37 -162 190 103 -102 -137 339 170 -230 -112 -131 12 47 128
5829A28k01k80K31M36k24j23K1j59m8K55J70k18k76J45J20j12J49k9r3M0L88j47
$$ 128 -73 -353 -122 314 90 -33 -12 -171 -219 36 206 -12 -288 -143 -23 -135 14 -15 -108 -68 320 173
5851A73m34N46j82m29J83N26m25k26M43j49L2P5P7l61j14K90j32K84l62L12l79
$$ 173 -261 285 103 -326 -143 383 -42 -268 175 26 58 133 210 -151 -265 25 -107 177 -185 127 -252
5872b52K14r7J94k90K07M8j28K53l8O0j64j39J44L1k86L18j65J56j48J05k4K4
$$ -252 -38 -135 59 -231 -24 24 -104 149 111 171 7 -132 12 43 -243 75 -90 66 -82 23 -1 23
5894B3k53K68KJ97j73j06j74M46l40K34k69J09K0n7L74j35m32J96J77P4j14J60
$$ 23 -230 38 40 237 64 -42 -216 230 -110 124 -145 -36 -16 -73 301 166 -266 -70 107 181 67 227
5916B27m32j68K51l5n7J82Lm4K4L88k86m22L15L3J98j07Q3j57k76M51k40N0k0
$$ 227 -205 -373 -122 -157 -214 -32 -29 -73 -49 339 53 -369 -54 -21 177 70 153 -4 -280 171 -69 -19 -39
5939c9K6p1j56J67K08k50J44K41k41o2L28k57n41K41K69J54l26M76m9n37M01n1
$$ -39 -13 -84 -240 -73 135 -115 29 270 29 -33 295 38 -503 -262 7 161 -165 311 262 -275 126 75
5961G5k15K03J43k86OM91k91l63K71J90k01q8Q7l0l27M79K18l59j80K86l11k78
$$ 75 -140 63 206 -80 -74 417 126 -237 34 224 23 -65 22 -8 -335 144 362 3 -177 109 -202 -480
5983d80L56N70p74N7O18m3n59J78K84n38L1Q79n09m06L18L45q11N50L84n07j86
$$ -480 -124 446 -328 -271 347 304 -255 -77 207 -331 -300 579 70 -336 -18 327 -484 66 450 -57 -243
6004b43L43K2n05R8P56o53k62P14K20p89K32L73k29l85P76l51o45K56N65l46k73
$$ -243 100 122 -383 -285 471 -182 -444 270 490 -299 -67 306 77 -308 468 117 -528 -272 293 -53 -326
6025c26R37n12o24M88M07p12L4N43M2o39P17L80j533L79J052m48l06L55J23q06
$$ -326 611 99 -525 -37 370 -342 -308 235 277 -362 355 735 -798 -419 633 185 -121 234 357 -449
6045d49M2R41n59n05Q47N8j070M90P46r50k4Q04L69j083J72N71q13l68J391Jj039
$$ -449 -407 534 -25 -530 317 375 -695 -205 541 -409 -433 371 740 -343 -171 400 -413 -781 610 611 -428
6066d28M93K91p57m2Q21l85m45Q80J8j000J40P73k83n11R43K27q99j57Q01n31
$$ -428 65 356 -401 -443 378 -7 -452 428 446 -554 -414 359 76 -435 508 735 -164 -321 480 -51
6086e1n39P44N07j173K88O49n55p86J303j17p79P29O16j005o86J140l6p29O20
$$ -51 -590 154 661 -512 -224 425 -130 -916 387 270 -509 220 836 -169 -855 285 249 -480 140
6105A40N86q41n22J026k23q42J033L83j240j3R32j12j208Q40P57j159K65Q44p22
$$ 140 726 -115 -637 389 166 -676 357 740 -500 -513 419 307 -901 -61 696 -463 -198 646 -76
6124g6r17R51P25j054K80R12o47r31P17K50p77M51J195j224n39R75j72j151R30
$$ -76 -993 -42 683 -371 -91 821 174 -757 -40 210 -567 -116 1079 -145 -684 291 119 -1032 -102
6143a02R87j019l38J115n32j204J004Q85p31n01P60p2j150Q22P70q47n14J204
$$ -102 885 -134 -472 643 111 -1093 -89 796 65 -436 324 252 -898 -76 694 -153 -667 537
6161E37j48j072O16K10p20K00J328q69p59P60L81j398P88J018o47q42J089r1j169
$$ 537 389 -683 -67 143 -577 -377 951 82 -677 83 464 -934 -146 872 225 -617 472 381 -788
6180g88N52J002r25k87J024J22j371M34P89q72k04J160l23j220P13Q91j078QO65
$$ -788 -236 766 -159 -446 578 700 -671 -237 552 -320 -524 636 313 -907 -194 697 -381 -373 292
6199B92J6p68O58N95j289q2J091l03m89P55L4j117K52O52j55n89P78L87j201K49
$$ 292 308 -460 198 793 -496 -578 513 210 -279 476 510 -607 -355 297 142 -447 331 718 -483 -234
6219b34P03m59o39J088L2r51n6R98o74k42Q20%n58L38J60o45L1O05M7r72O83J64
$$ -234 469 10 -629 459 491 -460 -516 482 -192 -434 386 386 -172 166 326 -319 -288 317 364 -608 75 239
6241B39n64K0M90J49o83M81L57n06k77M88l21q7L36L92r36K76M89n90q4N16L5
$$ 239 -325 -305 185 334 -349 132 489 -17 -294 194 -127 -214 122 514 -422 -146 343 -247 -331 185 220
6262B20m41j28R24o56k47O79k54pj51N59m15n67O16p2j01m3L9j80k53N19R2m48
$$ 220 -221 -349 575 -81 -328 351 97 90 -61 498 83 -484 132 60 -41 -84 -45 -225 -478 41 133 -315
6284c15K78M13n33J37M57l12o33M11J16j33J23J86k20l14M73nj18j01K26k11Q2
$$ -315 -37 376 -157 -20 437 125 -508 -97 19 -114 9 195 -25 -339 134 129 11 -90 136 -75 7
6305GP9J36m16j95N45J13k28J08R0o34K43J73K03k68M5nn8J37L25j87l96L16j25
$$ 7 86 222 -194 -389 156 269 41 149 239 -395 -152 21 224 -44 1 -4 -62 75 400 213 -183 133 8
6328HL37m46M14k22n35O78mk83O8J7N1l17M31k73j99K25J28l17j14L13m2q0J66
$$ 8 345 -101 313 91 -444 234 230 -53 15 32 83 -234 197 -76 -275 -50 78 -239 -353 -40 -82 -162 4
6351DJ00j97J06J52k15q1J24L75k49k03K54j34j92j00J05j70M41j66p8m7K45N3
$$ 4 104 -93 13 165 -50 -131 -7 368 119 -84 170 36 -156 -256 -151 -321 120 -46 -124 -171 74 127
6373A27j34N7M24n50J47Q0M0j32q5k7J49j30M2j24n7J97qj42o9L98j08k4l29L15
$$ 127 -7 50 474 -76 71 151 191 59 -26 -53 96 -34 8 -116 -173 24 16 -126 -195 203 95 71 -258 57
6397E7K4k4J48m05K27O3J67j0m02L70k73K01mk5k63K48k11K46j54K73j18m22K31
$$ 57 81 57 205 -200 27 90 257 247 -155 215 -58 143 139 114 -149 99 -112 134 -20 253 135 -287 -56
6420e6J93k35J27J91Q2n57K58J90k52j89K60L51m06J1J69j23qJ60m4l74J69K0
$$ -56 137 -98 29 220 302 -255 3 193 -59 -248 12 363 -43 -32 137 14 6 166 122 -252 -83 -63
6442f3kN0O8j96l2K62k9j48N9L2K51n62J95R3RJ23j5k03J2L84n3o24L89J94l83
$$ -63 -65 -15 53 -143 -175 87 58 -90 -31 1 252 -310 -115 -22 -13 110 95 -108 -96 288 235 -389 0 194 -189
6467a89J8K15j10j63L78k0k08j9L97m45j94M41K42l93k40M71k48rJ75O9o16L60
$$ -189 -171 44 -66 -229 149 129 -79 -98 299 -146 -340 101 343 -50 -290 181 -67 -76 99 168 -448 -88
6489h8L37k9k38L18k97q3K40P8l08j45K05J01j90Q7O25r67N4N77l0l09k6L48k56
$$ -88 249 220 -18 300 3 -80 160 238 -70 -215 -10 91 -99 -12 613 -354 -300 277 247 -62 -88 260 4
6512Dk28M65j34p07P66J97p0l59K46k41m40N32K93m23o9L77k9m97L80K79p07L05
$$ 4 -224 241 107 -600 166 363 293 -66 180 -61 -501 31 324 -99 -168 209 180 -317 63 342 -365 -60
6534f0M64k91n19P80j23o57L49M05l46l01O41l95l27L31L62m51j11L79K3o75P07
$$ -60 404 113 -406 374 251 -406 -57 348 2 -299 342 -53 -380 -49 313 -138 -249 130 153 -522 185
6555A85K98q47Q7Q42k20q89M64N31n97j00P23n4p43M28J92n25l4R02n38m35N81
$$ 185 483 -364 -277 565 345 -544 -80 451 -146 -246 477 423 -320 108 300 -225 -259 643 105 -330 251
6576B51q1o16J67N93m38j15P39j43q76K46P63p65nO09k27p38O65L47p42J85O46
$$ 251 170 -446 -279 314 -124 -239 500 357 -519 -273 490 -275 -280 329 102 -636 29 376 -366 -181 465
6597D65k26n05M18L43r58Q2J037l59o77O02J41p04J31N83j99n84Q87N8j028L28
$$ 465 239 -266 152 495 -463 -381 656 297 -380 222 363 -341 -210 373 174 -410 477 535 -493 -165
6617a65N66l74o38J079L9j177M21M81n59k60J095J8r19N42K72j039K6R79q0p03
$$ -165 401 27 -611 468 507 -670 -249 232 -327 -587 508 526 -393 149 421 -618 -592 387 307 -396
6637c96L60N90p63j79Q35l05n41N51N75j066n8P18n29k70P32K29p97l0N62l19
$$ -396 -36 554 -209 -388 447 142 -399 152 727 -339 -397 321 -208 -478 254 483 -314 -344 218 -101
6657a01m93R12O8o88O7N92p01j21Q00K7q34M16Q01r40m00O38L05n91K98N54p94
$$ -101 -594 318 386 -302 -235 357 -344 -465 335 362 -472 -56 745 -195 -595 43 348 -243 55 609 -185
6678a85l48R00j28o86M52O57p49j87O09m68m93P01L76o29j97Q53m26p05N24O20
$$ -185 -533 367 239 -447 5 662 -87 -274 335 -133 -626 75 451 -178 -375 478 52 -653 -129 491
6698D91p21J38Q10p10o60Q38O4n85R4O34m18m85O48k1n53O23L75l84m48P68l34
$$ 491 -230 -92 718 8 -652 186 250 -335 -241 393 -25 -510 138 117 -436 187 562 178 -270 498 164
6719A64p40O08M54o94j34N74q7o29K52N45p46J12N61p7l60K31K78o33K26Q02o37
$$ 164 -576 32 486 -208 -342 232 145 -484 -232 313 -433 -321 240 163 -197 34 312 -321 -95 707 70
6740G0p01P51k9m62L08J20j17l04M96j47m43L11M46l60k66L97O0n58N10L11o23
$$ 70 -631 120 91 -371 -63 57 -60 -364 132 -15 -458 -147 299 -61 -327 70 130 -428 82 393 -230
6761b30n0M08J01n54K05N07n79j31P22n06k78M08M5k92J64Q9o1K6%L45m47O8J94
$$ -230 -280 128 229 -325 -120 387 -192 -323 399 -107 -385 23 68 -224 -60 29 -32 -6 -6 339 -108 -40 154
6784A54N7m77L23J76o13K5M84J30l74Q8M3k23J59M16m76M5L40l5j97m16L32M0
$$ 154 211 -266 57 233 -380 -355 129 259 -115 -27 16 -207 -48 368 -108 -63 277 242 45 -371 -39 1
6806Ao4L51j65l95J54L42k73J22J71l2m46K64L15m62J01j55J32o9K02N0kl45J72
$$ 1 -63 288 123 -272 -118 224 -49 73 244 212 -234 30 345 -117 -16 -171 -39 -108 94 144 142 -203 -31
6829c1n0J01j61K46j30l4M68m55k18J48J76N0j50L31m27jK33q5p2j48N40k58j09
$$ -31 -81 20 -141 105 -25 -59 409 -46 -264 -116 60 110 -40 291 -136 -137 96 11 -61 -209 331 73 -36
6852c6j15K08k29Q8P4p5k8J94J77j97l5nL9p0n2k5J92j62P4J67l65N77l40J7k39
$$ -36 -151 57 -172 -84 -10 -85 -113 81 258 61 26 21 60 -10 -62 -87 105 -57 17 184 -181 396 56 73 -166
6877a66J98R2j24k1N0j23q3K50j78J08J25M4j06R2k09K3J04n3j19J01L0J72k30
$$ -166 32 124 0 -21 29 -94 -177 73 -105 3 128 172 66 158 -51 -28 76 23 -96 5 35 207 -23
6900b3J14M4j09P0J6k2l40K35J7J24k25oK03J71k14q1o5K56j29L0n5Q0qM9j54
$$ -23 91 135 26 96 112 90 -250 -15 2 126 -99 -105 98 269 55 -26 -91 165 36 66 11 91 83 132 -22
6925b2L5J44k33N7j56p5K61Oj52R6K18J5k66Q2M2n3j41J7l6J23K23J74k68k32
$$ -22 13 157 -76 -19 -175 -250 11 17 -135 -39 179 194 -72 10 52 -1 -142 -125 -161 -38 185 359 91 -141
6949a41J13j71P8J67Q0l28J65J51P8l92K24J49k20K4J57j15k77K86n0n7M6K60
$$ -141 -28 -199 -121 46 126 -202 -37 114 192 -200 24 173 -47 -23 134 19 -258 28 -22 -79 -33 227
6971B27m52K56J60n6l22P5K98j99k5J70N7m30L96K26k48j53J50k98j27L95O3k84
$$ 227 -225 31 191 135 -187 -112 186 -13 -38 132 189 -241 155 381 133 -20 130 -168 -295 100 163 -121
6993a21K58j21k27J88j3J19m18r3O21j99nK17k7l88K10J78l36q6M23q9l76K73
$$ -121 137 16 -211 -23 -36 83 -335 -428 193 -6 -11 206 179 -209 1 179 -157 -243 180 91 -285 -12
7015a2J15k40k29M74k6m12L01L35p36R2M73M0Kn6j9k20k2M55k57k33K38o7l67
$$ -12 103 -137 -366 108 82 -330 -29 306 -430 -338 135 175 177 121 102 -118 -140 315 58 -175 63 -4 -371
7038c71J85L61l13j96M88J63l73N0L08l68r9K58p1k66l1L21ol98L03K38k62o1
$$ -371 -186 175 -138 -334 154 317 -56 -6 302 -66 -165 93 22 -244 -275 46 40 -358 -55 183 -79 -140
7060a40O70o38j48P19k53m11J75L54o03j17K77K11o34M85K18k80j61O08n52l80
$$ -140 530 -108 -256 463 210 -201 -26 328 -275 -392 -115 96 -538 -53 165 -115 -276 332 -220 -600
7080f00N37L36m16j59N96m17k14N36J78m96n2L05j77k78L90K61m66J35M82m53
$$ -600 -63 273 -143 -302 294 -123 -337 199 377 -119 -171 134 -43 -321 69 330 -136 -1 481 28
7100B8n50N89K68m89P8L87l14k13N73l53n55P08Pn04n5O00N0n65M05J84l44p1
$$ 28 -522 67 335 -154 -76 311 -3 -216 357 4 -551 157 164 -340 -395 205 255 -310 95 279 -65 -136
7122a36O13m74m58L15M10l02K0J41K0m00J44L18o31K87M95l42m19N24j50k80K04
$$ -136 477 3 -455 -140 270 -32 -12 129 149 -251 -107 211 -420 -133 362 20 -399 125 -25 -305 -101
7143a01O15n37j57L65o5n49M65M10m49l08P47l64n53L89K14k22O2K60J0o20K62
$$ -101 514 -23 -180 185 120 -429 36 446 -3 -311 436 72 -481 -92 122 -100 -38 222 232 -388 -126
7164a26L63n30J88L40l99J20J80J13n63K11N28k15n94N61P8o60QP60l51k12J64
$$ -126 237 -293 -105 235 -164 -44 136 249 -314 -103 425 210 -384 177 255 -405 -397 363 12 -200 -36
7185c6J59l12J11L70m93k08N40K74p45K62L33k93j75J91L33n31P9M69m59L8J85
$$ -36 123 -189 -78 292 -201 -409 131 405 -340 -78 255 -38 -213 -22 311 -220 -141 328 -131 -93 92
7206I2Q9l63N5K32l88P2L89j48m9J15J61n87K6O01k43l67N66J48o53J94J71J1
$$ 92 181 -182 -127 105 -283 -211 178 30 -19 96 257 -330 -304 297 54 -313 253 401 -252 -58 113 124
7228A24j88J64L1j65O9K12j82n90R28m27q1L86M6l85M9Q1k1l15K29L09m35rK76
$$ 124 -64 100 131 -34 35 247 65 -525 403 -24 -105 281 327 -58 -9 72 51 -264 -35 274 -161 -170 106
7251A06q7k40K73K92k65M4J9l49K07j53L99m25p4M06l14J5K21J70m89J75L64l39
$$ 106 19 -221 52 344 79 123 142 -207 0 -153 246 -179 -253 153 -161 -146 75 245 -244 -69 295 -44
7273d4k40L54O8l15K02J65k28j04J22J65j81Q6r2k35P5L17j29oM4K38k47J92l
$$ -44 -284 70 138 -177 25 190 -38 -142 -20 145 -36 50 -42 -277 -202 115 -14 -20 24 262 15 207 204
7296B04l10l6R3J81k06J12j68J68j05m8L07l45K37J03p5j28K07j43j41QM75m02
$$ 204 -106 -142 -49 132 -74 38 -130 38 -67 -115 192 -153 84 187 112 -16 191 48 -93 -85 390 -12
7318a2j35P9J44n7l2Q7q2r5q1K32j05J92O2k12k12K77n9K2k52K18p4k5o3J86Q1
$$ -12 -147 -68 76 19 -13 74 -8 -103 -184 48 -57 135 197 -15 -227 50 -9 13 -239 -21 -95 -120 -183 3 84
7343H4l72L21K21l67J50P4k80J90n7j8M2M8J02j64l0k2L7j6n9R0k0J27l7k92J3
$$ 84 -288 33 254 -113 37 111 -169 21 -36 -54 -12 36 138 -26 -56 -78 -41 -57 -116 -26 -46 81 44 -248 -235
7368b35L78j22k30J29M22m40J81Q7j1j48r0L3l8L06k16m3O8j61K73J50m06J58
$$ -235 143 21 -209 -80 342 -98 83 170 159 11 -79 -46 -84 222 6 -37 31 -130 143 293 -113 45
7390D5j88L51m42L59M8k89J07J47l39L93j03l7p3j00J75l6n1K71m21J99K02k06
$$ 45 -143 208 -234 125 173 -116 -9 138 -201 192 89 52 -21 -121 54 18 -33 238 -183 16 218 12
7412A2r9P6QK17j18mm8Q1J24l34J55q5oj7j7O9N5j17j15j9Q2M3J62j63P3J16j74
$$ 12 -87 -11 -3 214 96 92 44 125 249 -85 70 -15 -21 -38 -55 14 69 -48 -163 -182 -100 -57 105 -58 15 131 -43
7439d3n4K50l19K62r5Qp4j18K63j45j12L28m9J86o06K92qL4n3J52j00LN4r7N8
$$ -43 -97 153 -166 96 1 9 -65 -183 80 -65 -177 151 102 288 -318 -26 -34 0 -53 99 -1 2 56 -41 17
7464A7O8K46k80m7j05M97o08N72l37l0J7K66j53o8j2R5l77p8M01oj21q2L43R0
$$ 17 85 331 51 4 -101 396 -212 360 23 -7 10 276 123 55 43 138 -239 -317 84 78 -43 -125 218 308
7488C08k45j01R7p5q0K64k66N5J37Lpj98n3J83k85K52q8n1K55j15p4j28L18r7
$$ 308 63 -38 59 -16 -96 168 -98 -43 94 97 90 -108 -161 22 -263 -11 -99 -150 105 -10 -84 -212 106 9
7512Ij30M51k86k2K5j3j58M9L23j88P5M3J45l28k4K5K67l92M29k04k65K92J31
$$ 9 -121 330 44 22 47 34 -124 -75 248 60 135 178 323 -5 -29 -4 263 -129 300 96 -169 123 254
7535B54k87j92K30o8Q6M6K23m65M6L29om06K45n9r1l8J91k75j52P51k05n11J93
$$ 254 -33 -225 5 -63 23 69 292 -173 -127 202 196 -210 35 -24 -115 -153 38 -237 -389 362 157 -354 -161
7558a61M46l17n34O85Q1n36K96K71L1m47M27j60l28J57N64n27k3K56j31j7p0L03
$$ -161 285 -32 -566 119 200 -336 -40 231 262 -185 242 82 -246 -89 475 -52 -75 181 50 33 -37 266
7580B66k03j11K24l65r6K74K81l28o2L86l72k13J43K61k18j8L38j58k17K46k1
$$ 266 63 -48 176 -189 -285 -11 270 -58 -120 266 -106 -319 -176 85 -133 -151 187 29 -188 58 37
7601C7m93J10N01k12j49M07k1k34J2M08m29k3K43M8k62K93j3j29j42J06P2l50
$$ 37 -456 -346 155 -57 -206 201 180 -54 -42 366 -63 -86 157 205 -57 236 223 94 -48 58 130 -220
7623b20M13j58l58K11K78o5k63K85J21m72rK40N4k48K48k1l12Q6L15j47l12Q32
$$ -220 193 35 -323 -112 166 101 -162 123 244 -228 -237 3 57 -191 57 36 -276 -190 125 -22 -334 498
7645D98k73m57K56J12j5q4K30J78q10K20M77l09l06O25l30l2J23K22n50J64L46
$$ 498 225 -232 24 136 121 37 267 445 -365 -145 332 23 -283 342 12 -20 103 325 -225 -61 285
7666B85l11l7L07J9k31q1L11q0mj34L8k37K10L6N6k10N64k97n31Q3J85K77j46
$$ 285 -26 -63 244 263 32 -49 262 182 178 44 82 -155 55 91 147 -63 501 204 -327 -244 -59 218 72
7689G2J61j7j73N3K53k79j26K17K1l66J74M01k92m93K88J12j72L39j31j43K45
$$ 72 233 216 43 96 349 70 -56 161 182 -184 -10 391 99 -394 -106 6 -166 173 42 -101 144
7710A44J39k31k9j81M04l51L69r6j03j45L87p4k43qR6j35j08K46Q0k44J52K62
$$ 144 283 52 23 -158 246 -105 264 168 65 -80 307 233 -10 -18 78 -57 -165 81 161 -83 69 331
7732C31n91J16K63j22k75J79J50k98L2L35j85k44L40Jrp4M5j3l24L42r9K1Q4L07
$$ 331 -260 -144 119 -3 -278 -99 51 -247 -215 120 -65 -309 31 32 23 -51 -6 -19 -343 -1 -100 -79 5 312
7756C12k50j36J14p5J0P8J2L1j7J3nk89J64K20j78Q8j3p8m0K6J55l09J32J72k4
$$ 312 62 -74 40 -35 -25 53 65 96 79 92 87 -202 -38 182 4 92 79 1 -39 -13 142 -167 -35 137 113
7781A13k59J40K37m35J28k5m2k51M03j8N0l23J94J8r1J17k9J31k24K71j53l9L08
$$ 113 -146 -6 231 -204 -76 -101 -143 -394 9 -9 41 -282 -88 -70 -161 -44 -73 58 -166 105 -48 -87 221
7804B21k99J56k78K67j60j30K78j31l3M9K48j00J54j66j28j36L07K11l42o2L18
$$ 221 -78 78 -200 67 -93 -223 55 -76 -109 -60 188 88 242 76 -52 -188 119 330 -12 -74 244
7825B44l40k53L22m9Q6qK7L7j83J47o5J39j6L3j36n7P3J42j41K53j68J4l98M66
$$ 244 -96 -349 -27 -76 10 2 29 66 -117 30 -35 104 88 121 -15 -72 1 143 2 255 87 101 -297 169
7849A69Mn1o0N5j12j76M2P8J79j86R3j45J02L9K36m84M00j87l3P1J49j36M9j00
$$ 169 173 122 62 117 5 -171 -129 -51 128 -58 35 -110 -8 31 267 -217 183 -4 -37 34 183 47 96 -4
7873dp2j47M64n5j89M6j72R3j7J82j21J04l45K26N5q6j03J17p3J66M2K2N1k8j34
$$ -4 -76 -223 241 186 -3 43 -129 -36 -53 129 8 112 -233 -7 48 -38 -141 -24 -97 69 111 133 184 156 22
7898B2J52k44j69L6J58o7K77j09j20K41k08L3J25o9J65j53J28k37j39J50j73L08
$$ 22 174 -70 -239 -203 -45 -112 165 56 -64 177 -31 2 127 58 223 70 198 -39 -178 -28 -201 107
7920A07pn2O5m70Q06k83l53L3K12K56l38J25j08n6K41k49pr7L85k84j59PL65J2
$$ 107 100 48 113 -357 449 166 -187 -154 58 314 -24 101 -7 -63 178 -71 -78 -175 210 -74 -233 -226 139 151
7944A51r2K1j51J15j14L87n53L65j12q5q8J73N7Qn5j95M02l43j33K63p2j69K17
$$ 151 59 80 -71 44 -70 317 -236 129 17 -68 -156 17 74 82 27 -168 234 -109 -242 21 -51 -220 -3
7967cR7l82N19n6l35P8O1L1j20J90oj40J9P6o3J9J36k27J59K2J45l69l5L91j47
$$ -3 94 -288 231 175 -160 -82 -21 10 -110 80 74 -66 -47 29 -34 -15 121 -106 53 75 220 -149 -184 207 60
7992F0l14P6J18Lj75M12q5j49K41j2k73J21oj6j4J12r8K2P3k36J12mRNR1j02K57
$$ 60 -254 -178 -60 -57 -232 180 95 -54 187 175 -98 23 17 1 -13 99 1 23 96 -140 -28 -32 -23 -18 73 -29 228
8019B28l39J20p0P8r4K1P7j35L16r5K8k18K75k43k50L38L40n61M09J4l8l62l7
$$ 228 -111 9 -61 17 -77 -56 21 -114 202 107 135 -83 192 -51 -301 37 377 -184 225 239 201 -161 -198
8042a98K93l1k02J97j2o4K81j75pj16J42k06J9K70N6m41kL18j35k54J44J15q9
$$ -198 95 64 -138 59 47 -17 264 89 82 -34 108 -98 -79 191 247 -194 -196 122 -13 -267 -123 -8 -97
8065i7N9K1m4J8K44l49J90j96K69R6j17k80L68m30N3N34j75k68j1J52j14M5K62
$$ -97 -38 -17 -61 -43 201 -148 42 -154 115 211 94 -186 182 -248 -195 339 164 -104 -115 37 -77 -32 230
8088B30j08k90J77q8j41M11q1J2l10K28J23k48J37L8q0j72K66k73J41J7K70m16
$$ 230 122 -168 9 -79 -220 191 110 122 -188 40 163 -85 52 90 10 -162 104 -169 -28 -11 259 -157
8110a57P0L26k59j64M64k42k17M43j54n1k23M07n6j66N8J28l41N5K14K76l52k07
$$ -157 -87 239 -20 -184 280 38 -179 264 110 59 -164 243 187 21 79 207 -134 -79 135 411 59 -148
8132a48L26k72j62P33l28k47j17M86n79J77L49R1n19P9M10n09K91K76l24q3K5
$$ -148 178 -94 -256 477 149 -98 -215 271 -308 -131 218 309 -210 -131 279 -230 61 337 13 -70 -45
8153d5N28n76l25M28M0l80M93J01n41R6L01k33k80M78j20p2q6K22Q4m93O38J41
$$ -45 483 -93 -418 10 50 -330 163 264 -277 -181 120 -113 -393 85 -35 -107 -193 29 113 -380 258 399
8175C99m90J7K03k76n1N56k37l81L73J14o00L12M55j18k97K00
$$ 399 -91 -74 129 -147 -198 358 121 -260 113 227 -373 -61 394 276 -21 179
8191A79
$$ Imaginary data points
##PAGE= N=2
##DATA TABLE= (X++(I..I)), XYDATA
0@%%%%%%JrJ6j6J6k4M0m8N6p2Q8j10J34j60J93k31K78l27L78m45N22o03O95p97
$$ 0 0 0 0 0 0 0 1 -8 8 -8 8 -16 24 -24 32 -40 48 -62 72 -88 105 -126 152 -175 203 -242 280 -323 372 -425
30d25R15j046J186j345J522j718J933k165K421k705L016l355L721m122M564n044
$$ -425 490 -556 630 -715 807 -911 1022 -1143 1278 -1427 1589 -1766 1955 -2167 2397 -2647
46b647N569o142O767p458Q219r053R975j1001J2148j3440J4901j6569J8498k0760
$$ -2647 2922 -3220 3547 -3911 4308 -4745 5230 -5771 6377 -7063 7838 -8731 9767 -10993
60a0993K3456k6725L0794l6026M3031n2943O8143r4641J53810n17652J49648Q58795
$$ -10993 12463 -14262 16532 -19494 23537 -29406 38737 -55904 97906 -419746 -270098 588697
72E88697n54214O3538L93939n73404o47703P07240L34352n62196J55699O77274
$$ 588697 34483 98021 491960 -81444 -729147 -21907 312445 -249751 -94052 583222
82E83222m31423m74553M11814p4635o70010M89842Q65216l67866n10439L09679
$$ 583222 151799 -322754 89060 14425 -655585 -165743 699473 331607 -178832 130847
92A30847k31630o05571N52695P89120m42579l88343M27881j41369n86166L53893
$$ 130847 -100783 -706354 -153659 635461 192882 -195461 232420 91051 -495115 -141222
102a41222M42574m44336l7659O78081j63766o85741J54174K19626l92016K53325
$$ -141222 301352 -142984 -180643 497438 333672 -352069 -197895 21731 -370285 -116960
112a16960P78809k80322p36903J84553K10733l91508K12089O39977k92549n00724
$$ -116960 661849 381527 -355376 -170823 39910 -351598 -139509 500468 207919 -292805
122b92805L70519J60277n41209K3785M72010j74939j42625N03405l9045p11244
$$ -292805 77714 237991 -303218 -279433 192577 17638 -124987 378418 339373 -371871
132c71871o748M54624j15687j3851M86088j50179o64200J17231M34728k29365
$$ -371871 -378619 76005 -39682 -53533 432555 282376 -381824 -264593 170135 -59230
142e9230j16769M21098m5607l98917K10174K30112m33258j55703M54915Q2271
$$ -59230 -175999 245099 199492 -199425 10749 240861 -192397 -348100 106815 189086
152A89086k05882K05221J1234n26170m6137N16023M0653k29582J91870J9784m17973
$$ 189086 -16796 188425 199659 -326511 -372648 143375 184028 -45554 146316 166100 -251873
163b51873L8844M05780j35364k71589K72219J66114k68312M412J66379k72327
$$ -251873 -213029 192751 57387 -214202 58017 224131 -44181 -39769 126610 -145717
173a45717j60866M06482J92364k68797l9380P2058k58312l7394M09749O0630l22585
$$ -145717 -306583 99899 292263 23466 -15914 56144 -202168 -239562 170187 230817 -91768
184i1768L3262J74270j78285o4843K36892o3345k37882J90926K42159j92855j58854
$$ -91768 -58506 115764 -62521 -127364 109528 46183 -191699 -773 241386 48531 -110323
195a10323R7710o7104p8045K69100J48470k71635j38083J38983k1593n2497J89426
$$ -110323 -12613 -79717 -157762 111338 259808 -11827 -149910 -10927 -32520 -85017 104409
206A04409L3075k45284L124K22277n2243j58656P2600L2623r8293J13275J70486
$$ 104409 137484 -107800 -104676 117601 65358 -93298 -20698 11925 -86368 26907 197393
217A97393j57440k02183Q1770R2917j8659Q9370M8113j93278r7368J71571P4589
$$ 197393 39953 -162230 -80460 12457 -6202 83168 131281 -61997 -159365 12206 86795
228H6795r8997O958L2421r2324K0750J61684l7334j83766R095J15298J0214J9611
$$ 86795 -12202 -5244 27177 -65147 -44397 117287 79953 -103813 -94718 20580 30794 50405
240E0405M0385j14874j22004J00479J35164l0806n2256r364o0076m750J27041
$$ 50405 90790 -24084 -146088 -45609 89555 58749 6493 -2871 -62947 -67697 59344
251E9344L8552j25042n5849O7700L5475J2279L1799n6605j08778L2728J28391
$$ 59344 97896 -27146 -82995 -15295 20180 32459 64258 7653 -101125 -68397 59994
262E9994K4881o2778m4790l7139j066Q9649O6339o8694r0551O584N0947M0660
$$ 59994 84875 22097 -22693 -59832 -60898 28751 95090 26396 -64155 -57571 -6624 34036
274C4036K6657l7044q8934j0206R1836N9499l0802n8465m2970r28O8793P0454
$$ 34036 60693 23649 -65285 -75491 16345 75844 45042 -13423 -56393 -57321 11472 81926
286H1926k9036r1172l5668M3659O3291L1233l1262p4885l2992N3568P4478J0964
$$ 81926 52890 -38282 -73950 -30291 33000 64233 32971 -41914 -74906 -21338 53140 64104
298F4104n4572o2464r765N8747O7227k586o9153n4949J4751O4041M8451j7069
$$ 64104 9532 -52932 -62697 -3950 63277 60691 -8462 -63411 -48660 15381 63832 46763
310D6763o8187m7349K7825P2632L6232l8799p0626k4684M4854O5073J7806m5912
$$ 46763 -21424 -68773 -40948 31684 67916 29117 -41509 -66193 -21339 43734 61540 15628
322A5628o3542j4046N4277O4895L237o2903n8716J0141O4741M8722j8274o3133
$$ 15628 -47914 -61960 -7683 57212 60449 -2454 -61170 -51029 13712 62434 44160 -18973
334a8973m3534J9462O6571M3408l1949p3140k9663M3760O6125K0439m4574o4817
$$ -18973 -62507 -43045 23526 66934 34985 -38155 -67818 -24058 42067 62506 17932 -46885
346d6885j3337N4172N8494J179n0154n3197p224N9125O6528j6059q0717l7474
$$ -46885 -60222 -6050 52444 53623 3469 -49728 -56952 2173 68701 52642 -28075 -65549
358f5549L5501N0369L0296q752o2069n2608L8314P9305J3546m5572m4665k0211
$$ -65549 -30048 20321 50617 41865 -20204 -72812 -34498 44807 58353 12781 -31884 -52095
370e2095L0253P2738J5384p6142n1735L0067M0312K7377K0970m7834r0345J4833
$$ -52095 -21842 50896 66280 -9862 -61597 -31530 8782 36159 57129 9295 -81050 -66217
382f6217J06561K9677n4939l2003j8609j4225N9574O8088n2790q3485K0257M9230
$$ -66217 40344 70021 15082 -16921 -35530 -49755 9819 77907 25117 -58368 -38111 11119
394A1119J0373K3547j2875r8256k1716J20064N6521o9733l4618m312n0306L1034
$$ 11119 21492 45039 32164 -66092 -87808 32256 88777 19044 -15574 -19886 -70192 -39158
406c9158J26326p311j29226r990P1327q582J40M4852n8319p7241Q9853R5383p2251
$$ -39158 87168 79857 -49369 -59359 11968 3386 3526 48378 -9941 -87182 2671 98054 25803
419B5803o3991K2060l7473o798J43145M6503j61496o7502R2804N121k5594R2269
$$ 25803 -38188 -16128 -53601 -60399 82746 129249 -32247 -99749 -6945 -1824 -27418 64851
431F4851L780j42591J1175J38079l6041j02428M7045K3603n2727Q8160R4626j48277
$$ 64851 68631 -73960 -62785 75294 39253 -63175 -16130 7473 -45254 42906 137532 -10745
443a0745j32571J04867O8354m1084Q2384N0486j85884q6906J74580M9552j21288
$$ -10745 -143316 -38449 29905 -11179 71205 121691 -64193 -151099 23481 73033 -48255
454d8255M3389Q3933j06509k2673J40523o1049j76257Q8572J51413n6436p993
$$ -48255 -4866 79067 -27442 -50115 90408 29359 -146898 -58326 93087 36651 28658
465B8658P4117j51508j57805J79345J64216j15110k7449R7477j23360j24800J76014
$$ 28658 102775 -48733 -206538 -27193 137023 21913 -5536 91941 -31419 -156219 19795
476A9795Q6163j80714Q339J89709n9171j27435Q6424k0575j73115J14920K45349
$$ 19795 105958 -74756 -66417 123292 64121 -63314 23110 2535 -170580 -55660 189689
487A89689q4004j54034O2620n1538j50186J65480K17080j52081j31156J50279
$$ 189689 105685 -48349 14271 -37267 -187453 -21973 195107 43026 -88130 62149
497F2149j6044j85685R3917J41577j50172k2808K44217k7244k55653J9973R3668
$$ 62149 46105 -139580 -45663 95914 -54258 -77066 167151 139907 -115746 -95773 -2105
508b105j06298Q1258K61919j01423k72796O6715R3718j40246O9674K37405j17268
$$ -2105 -108403 -27145 234774 133351 -139445 -72730 20988 -119258 -49584 187821 70553
519G0553j94833J66335P3386k50044j0810K25290m7924p6771K05303q791l25679
$$ 70553 -124280 42055 115441 -134603 -145413 79877 31953 -44818 160485 151694 -173985
530a73985j8537K29896k7111k5792K04678o1344l05504N4579K06138j25928o3508
$$ -173985 -192522 37374 10263 -15529 189149 127805 -177699 -123120 83018 -42910 -106418
541a06418K37560j433k21572R1791J18342k47284q8263K94148P8004j52856P8314
$$ -106418 131142 129709 -91863 -72 118270 -129014 -217277 76871 154875 2019 80333
552H0333K3022k90215l9784L09679L8685j48620J15641L3755k64528p192K42677
$$ 80333 103355 -186860 -226644 83035 121720 -26900 88741 122496 -142032 -149224 93453
563I3453q4504j55371K24862J26033k36101m4555J35433j63440j12377L09358
$$ 93453 8949 -146422 78440 204473 -31628 -76183 59250 -104190 -216567 92791
573I2791J53812k33084n4948R0240j77479p0607K95270P7081k25707M4855J42639
$$ 92791 246603 13519 -41429 48811 -128668 -199275 95995 173076 -52631 -7776 134863
584A34863j95224j11579K12736L080j71245J77636J96735k36714j78526J45423
$$ 134863 -60361 -171940 40796 43876 -127369 50267 247002 10288 -168238 -22815
594b2815j2665j04917K29969J70200k53819j47182J49801l9426j14889J95685
$$ -22815 -35480 -140397 89572 259772 5953 -141229 8572 -30854 -145743 49942
604D9942J18995k05442j8561J86897j24238k02835J53135J23646j22985P8056
$$ 49942 168937 -36505 -55066 131831 7593 -195242 -42107 81539 -41446 36610
614C6610J80858k01610k43768J51338J31673r4679Q9096J45656j96483j70042
$$ 36610 217468 15858 -227910 -76572 55101 -39578 49518 195174 -1309 -171351
624a71351J70192N3761j58711Q2667J65238j26431p5517J57346o7445k30417J10603
$$ -171351 -1159 52602 -106109 -23442 141796 15365 -60152 97194 29749 -200668 -90065
635i0065K18845p5193m8082J16964j20882k16510J39806J98182r7377m3096J23100
$$ -90065 128780 53587 5505 122469 1587 -214923 -75117 123065 25688 -17408 105692
646A05692q7005j53762J23483Q8206j57080P081J95127l7712j35582O8236m302
$$ 105692 18687 -135075 -11592 76614 -80466 -73385 121742 84030 -51552 16684 12382
657A2382j68800P4372K35604m3225j48575M7958r575j33230Q4756J76095q6692
$$ 12382 -156418 -82046 153558 110333 -38242 9716 141 -133089 -48333 127762 41070
668D1070j10866J07060K1770j29038L2142Q5000r9408j9177J78384R195j70940
$$ 41070 -69796 37264 59034 -70004 -37862 47138 -52270 -71447 106937 116132 -54808
679e4808p434O0567o9995L3237J71716l7140j74622K5269Q1502o6207M095J10033
$$ -54808 -62242 -1675 -71670 -38433 133283 96143 -78479 -53210 28292 -37915 -33820 76213
691G6213n0507r9695R1849O7396j18209m2318Q3562j4481k1821J10607R488j59732
$$ 76213 25706 -73989 17860 85256 -32953 -75271 8291 -6190 -28011 82596 92084 -67648
703f7648l1122J08335O292k0627P2089k0953j23224K4201J08266l6212o3013N0675
$$ -67648 -98770 9565 15857 -4770 67319 46366 -76858 -52657 55609 19397 -43616 7059
715G059J0886m8014N0475M9845r7522o4562Q4104N0779k7727K0376l090r5518
$$ 7059 17945 -30069 20406 70251 -27271 -91833 -7729 43050 15323 35699 32609 -62909
727f2909j2088J09128K5859o4629j761J2042m0341K1415O9171l8417p8146L4268
$$ -62909 -74997 34131 59990 -4639 -6400 5642 -34699 -13284 55887 17470 -60676 -26408
739b6408N9552j4399n985Q012n6494l2106P8406N6584m5727l8705K040j6032J3851
$$ -26408 33144 18745 12760 20772 -35722 -67828 10578 67162 21435 -17270 -15230 -31262 -17411
752a7411O2878j944p2258j2071M5856J1721m040P479l3111m0211M0597O2866j5290
$$ -17411 45467 43523 -28735 -40806 5050 16771 12731 20210 -12901 -53112 -12515 50351 35061
765C5061m8265j3879q5J4483M5610J4554n2849l9627K3541L4394J3432m93k9929
$$ 35061 -13204 -27083 -27168 -12685 32925 47479 -5370 -44997 -21456 12938 26370 25877 -4052
778d052l8146J6204N4208J1415l5372k7564n989J3081L6947K2624l3232m7490
$$ -4052 -42198 -25994 28214 39629 4257 -23307 -29296 -16215 20732 43356 10124 -37366
790c7366R53L9372K8661j458k9364l3401J870L9081K8784j3145l4752k3288R770
$$ -37366 -36413 2959 31620 30162 798 -32603 -30733 8348 37132 23987 -10765 -34053 -24283
803b4283L8022K6088k0711m3413j3689K7288L4197Q630k2510l3640j0738K7070
$$ -24283 13739 39827 19116 -24297 -37986 -10698 23499 32129 9619 -24021 -34759 -7689
815g689L8173N260l4637l6169M543L8359K7730j0653l5274k2836J0317L3597K4162
$$ -7689 30484 35744 1107 -35062 -30519 7840 35570 24917 -10357 -33193 -22876 10721 34883
828C4883j2512l9371k2603K1404M2360J4032k9211l6573n179K8681L0881N046
$$ 34883 22371 -17000 -39603 -18199 24161 38193 8982 -27591 -32770 -4089 26792 31838
840C1838k7061l3067l771L2045L4302l008l8742l0733J3176M0136J8689j8434
$$ 31838 4777 -28290 -32061 -16 34286 31278 -7464 -38197 -25021 15115 33804 15370
852A5370k9683j5301R749L2719K5067k0039m4493j0638L3253L1989K359k4515
$$ 15370 -14313 -29614 -19865 12854 37921 17882 -26611 -37249 -3996 27993 30352 5837
864E837l2622o281L3507L1906p206k8511k1767l320K7806L8465r144n1631j5936
$$ 5837 -26785 -33066 441 32347 25141 -3370 -25137 -28457 -651 37814 28670 -22961 -38897
877c8897L3673K4766J608m776k7310l1156K3919N4190K683l9332k2679l208J2620
$$ -38897 -5224 19542 21150 16374 -10936 -42092 -18173 36017 38700 -632 -23311 -26519 -13899
890a3899M0229J4723m5762l3497K5608K3570j157R429j1999m7786O985O9311J1814
$$ -13899 26330 41053 -4709 -38206 -12598 10972 9815 19244 7245 -40541 -33556 35755 47569
903D7569n4572j9560J0880n021K7164M7060k8928o5526Q515L9093N3Q141J1226
$$ 47569 -7003 -26563 -15683 -20704 6460 53520 24592 -40934 -32419 6674 6727 14868 26094
916B6094m5954k5352O2321L0240n7268k0816K9912j2407J553O4705n658r4859
$$ 26094 -19860 -45212 17109 47349 -9919 -30735 -823 -13230 -11677 53028 47370 -47489
928d7489j2804O9788J1292j1471K7441k6255o7388L2780O7175l2789l7090L5806
$$ -47489 -60293 9495 20787 9316 36757 10502 -56886 -24106 43069 10280 -26810 8996
940H996l027l1712N0943K6967r2518l5855R1167L1776m1760K0982Q31r0890m243
$$ 8996 5969 -25743 25200 52167 -40351 -76206 14961 46737 4977 25959 26790 -64100 -68343
953f8343J10131J3090o7857J5919J6642n8136J5275P1733m8175o5550P5583N2265
$$ -68343 41788 54878 -12979 2940 19582 -38554 -23279 48454 279 -65271 10312 62577
965F2577o5389o933L5377p4705l6775J28132N6848j00822k7001M2963n5526k1229
$$ 62577 -2812 -9745 25632 -49073 -85848 42284 99132 -1690 -28691 14272 -41254 -62483
977f2483J11776J7899j04013J5232P3617n9249m2890O8167j6213o7232Q9975Q6900
$$ -62483 49293 67192 -36821 -21589 52028 -7221 -50111 18056 1843 -65389 24586 111486
989A11486j07521p8852O4463p176m2371J10446O9149j32659o6604R0540o075o3208
$$ 111486 3965 -74887 -10424 -17600 -59971 50475 119624 -13035 -79639 10901 4826 -58382
1001e8382P8086M9500r6491M64J00113o1051j08157O8756O0123n4146M9983Q7802
$$ -58382 19704 69204 -27287 -26823 73290 12239 -95918 -27162 32961 -21185 28798 116600
1013A16600j20555j26068R7935P2864o2619M5123Q1482j11847r1600J08885K9973
$$ 116600 -3955 -130023 -32088 40776 -21843 23280 104762 -7085 -98685 10200 40173
1024D0173j05927M1670J04868o4735m3644Q5875m9974j38902P8513J39601n1125
$$ 40173 -65754 -24084 80784 16049 -27595 58280 8306 -130596 -52083 87518 36393
1035C6393l2055P0943q5021j34782J06508J28888q1910k9429R7981n5441j13724
$$ 36393 4338 75281 -9740 -144522 -38014 90874 8964 -20465 77516 22075 -91649
1046i1649P9874N8672j11148J4741J51079l0294j11945L9999l406j14593P0028
$$ -91649 -11775 46897 -64251 -49510 101569 71275 -40670 -671 -4077 -118670 -48642
1057d8642J76501m8951j17310M8969o142j14433O7554J43461p2752q0505J04731
$$ -48642 127859 78908 -38402 10567 4425 -110008 -42454 101007 28255 -52250 52481
1068E2481Q926j37287J9126Q9761o7742q302J53390j0669j68102J96O8417o1974
$$ 52481 61407 -75880 -56754 33007 -34735 -43037 110353 99684 -68418 -68222 195 -61779
1080f1779K9632J58876l9767j61241L7679O9731r2851J118J36886l0214r9444
$$ -61779 -32147 126729 86962 -74279 -36600 33131 -59720 -58602 78284 48070 -51374
1091e1374Q5553M4477j49148l3093J26592r84l7766J04631l74j78964j9286J31106
$$ -51374 34179 78656 -70492 -103585 23007 22023 -15743 88888 88514 -90450 -109736 21370
1103B1370j0428l3614J03798n184j49297J6520J08380o8836o1129J17359L5340
$$ 21370 10942 -22672 81126 75942 -73355 -56835 51545 -17291 -78420 38939 74279
1114G4279r5149K9010N2272j23580n7796J44361N6634p5153K7915K0552j30717
$$ 74279 -20870 8140 60412 -63168 -120964 23397 80031 4878 32793 53345 -77372
1125g7372k9070J45146J9661q6764M9736M5327j04100k1130R7727l8557q2716
$$ -77372 -106442 38704 58365 -28399 21337 66664 -37436 -58566 39161 604 -82112
1136h2112R9647Q2474r1954l8251M9687o5189n2689J31553P4964j03002l2976
$$ -82112 17535 100009 8055 -30196 19491 -45698 -98387 33166 108130 5128 -27848
1147b7848N0293n9017l8984J09950L1063r9743J6784Q3408o1209o4282O3163L687
$$ -27848 22445 -36572 -75556 34394 65457 -34286 -17502 65906 4697 -59585 3578 7265
1159G265o4911P0346R1279q5117q5358M8952P278l8376P7262O2890r5509n6301
$$ 7265 -57646 12700 103979 18862 -66496 -17544 -10266 -48642 28620 91510 -3999 -60300
1171f0300P0510K451n5954M7302M1045o6340q73Q1976l4431r0039L2963N0086
$$ -60300 10210 12661 -43293 4009 45054 -21286 -22159 59817 25386 -64653 -31690 18396
1183A8396l0356K5092O1476o6715q7890N2240N5859l3767J2480M2634n6097m6853
$$ 18396 -11960 13132 74608 7893 -79997 -27757 28102 -5665 6815 49449 -6648 -53501
1195e3501O6140K4534o7257K393N4682j9876j5259M7595k2805q0931K4762P5059
$$ -53501 12639 37173 -30084 -27691 26991 7115 -8144 39451 16646 -64285 -39523 35536
1207C5536j1191k1062K4535l2675n6140M6677O1909l7528l2477L2942l711k7936
$$ 35536 24345 3283 27818 -4857 -60997 -14320 47589 10061 -22416 10526 6815 -21121
1219b1121L2550J7034n6283j0916O0576J1729l1984L726q879m1162K3480O5182
$$ -21121 11429 28463 -27820 -38736 21840 33569 1585 5311 -3568 -44730 -21250 43932
1231D3932j1085m9176N015Q628j8328K2248L4598l3439l7459L2033K8259k0102
$$ 43932 32847 -16329 -11314 -2686 -21014 1234 35832 2393 -35066 -3033 25226 5124
1243E124p522M157k3508J92M7626R956m2019j5736J0698j696J6113L0184j9407
$$ 5124 -2398 1759 -21749 -21557 26069 36025 -5994 -21730 -11032 -12728 3385 33569 14162
1256A4162m4312R029L4081j744q430L463j6368j3084K9719K5115k3482k7264K963
$$ 14162 -30150 -21121 12960 11216 2786 6249 -10119 -23203 6516 31631 8149 -19115 -16152
1269a6152R718J2189J8748q819l5186o945K5814J5116k298m363j7054j5541J9421
$$ -16152 -6434 5755 24503 15684 -19502 -26447 -633 14483 12185 7822 -9232 -24773 -5352
1282e352L0269p109k7764p554R470J1231J3189N86k2765j7713J1871K3055Q257
$$ -5352 24917 17808 -9956 -17510 -8040 3191 16380 16966 -5799 -23512 -11641 11414 19671
1295A9671r934k0190j2126J3969K4682L213j8788j4845j30J0886J6333O904j7126
$$ 19671 9737 -10453 -22579 -8610 16072 19285 497 -14348 -14478 -3592 12741 19645 2519
1308B519k2500K206K3963J5140q843j9652j0864P559J7773J0365p610j8655j1690
$$ 2519 -19981 -17775 6188 21328 12485 -7167 -18031 -10472 7301 17666 10056 -8599 -20289
1321b0289J0083K2726Q789j5975k2400j782J8813J6698j767j4883j4454o09J5229
$$ -20289 -10206 12520 21309 5334 -17066 -18848 -35 16663 14896 13 -14441 -15050 179
1334A79J7491o30k0689j7457P596K2566J0308j1179j8501o635R625J5872Q310
$$ 179 17670 17040 -3649 -21106 -13510 9056 19364 8185 -10316 -16951 -7326 8546 16856
1347A6856q673j9567q830J4387K2797K599k0347j5946M152J4603J2126j29j5009
$$ 16856 8183 -11384 -20214 -5827 16970 19569 -778 -16724 -12572 2031 14157 14028 -981
1360i81j6118K953J9488J2785o299j9313j3203R885K3938O474j7197j4258n35
$$ -981 -17099 -14146 5342 18127 11828 -7485 -20688 -10803 13135 19609 2412 -11846 -12381
1373a2381O565J2885J2602j1396k6384j046K4539J1901q188j1518j1179j569J9662
$$ -12381 -5816 7069 19671 8275 -18109 -19155 5384 17285 9097 -2421 -13600 -15169 4493
1386D493J7111j2173k0435l583M292J1800J9517l975l2570q823K6947J1855r570
$$ 4493 21604 9431 -11004 -14587 -10295 1505 21022 17047 -15523 -24346 2601 14456 4886
1399D886j343l957j7032R189L0570m296l1105m293J2346N164J4248Q485k9424
$$ 4886 3543 -414 -17446 -8257 22313 18017 -13088 -17381 -5035 129 14377 22862 -6562
1412f562k4362K3002K1963p732J198K348k6976o040L9930Q735l7561o073K4121
$$ -6562 -30924 -7922 14041 6309 7507 9855 -17121 -23161 16769 25504 -12057 -18130 5991
1425E991l741j699K1039j5295m1174J4787M1173m361j2376N889k3084k3312L8366
$$ 5991 2250 551 21590 6295 -34879 -20092 21081 16720 4344 10233 -12851 -36163 2203
1438B203L2790l3281j8548K5590o328j9929K8761J0351m7694k295N4892K444l5922
$$ 2203 34993 1712 -16836 8754 2426 -17503 11258 21609 -26085 -28380 26512 28956 -6966
1451f966N213j521l3104K2793N7429j8271m4764J3830N350k7181K5728L9410l9393
$$ -6966 -1753 -3274 -36378 -13585 43844 25573 -19191 -5361 -11 -27192 -1464 37946 -1447
1464a447l0724M8507J3803m9465K499K8865l0021m366O5513O13p1574m457L3281
$$ -1447 -32171 16336 30139 -19326 -16827 12038 -17983 -22349 43164 43777 -27797 -32254 1027
1477A027j7910R188N6551k2260o5817K3691L7571l8304n392N1194j8866m0024
$$ 1027 -16883 -7695 48856 26596 -39221 -15530 22041 -16263 -21655 29539 10673 -29351
1489b9351M9852K4334p5374k1030O2582J542k0875M8401R90q7073p798P0350m471
$$ -29351 20501 44835 -30539 -51569 11013 12555 -8320 40081 41071 -46002 -53800 16550 12079
1502A2079k4745M5363j385o9997J5741N7413m3683l7375O5380K1551n2029J8033
$$ 12079 -12666 32697 31312 -38685 -22944 34469 -9214 -46589 18791 40342 -11687 6346
1514F346K9906p3486l3619Q8887L2973n1343J2595J7077p2755j6584Q6986P812
$$ 6346 36252 -37234 -70853 18034 51007 -336 12259 29336 -43419 -60003 26983 34795
1526C4795n8087L2577L4223o4174j4505N9946k8575n2229P2433N5768o9168k8677
$$ 34795 -23292 9285 43508 -20666 -35171 24775 -3800 -56029 16404 72172 3004 -25673
1538b5673L8514m2185l6217R2395M9485p8852k0907M4029m2272l4568P7043K3064
$$ -25673 12841 -29344 -65561 26834 76319 -2533 -23440 20589 -21683 -56251 20792 43856
1550D3856p0318J9912O3933n6666n5691N3829Q395m8419N8257O9022p8283o8353
$$ 43856 -26462 -6550 57383 717 -54974 -1145 7250 -41169 17088 86110 7827 -60526
1562f0526N0503P394l9791O2870N6251p9089m4242O2270r033n8678M9112N0163
$$ -60526 -10023 -2629 -42420 20450 76701 -2388 -46630 15640 6607 -52071 -2959 47204
1574D7204n6117l057O7232m4146q5115M7194N6321l5872J8172N9251o6489q3598
$$ 47204 -8913 -11970 55262 11116 -73999 -26805 29516 -6356 11816 71067 4578 -79020
1586g9020N7668M9599m5712J8560N9416n4992n5836O0262J2864p3438K4031P8165
$$ -79020 -21352 28247 -17465 1095 60511 5519 -50317 9945 22809 -50629 -26598 51567
1598E1567l0550l4406M7520k5558q6471M1010Q8937k7638k8924M2584l3575p5637
$$ 51567 21017 -13389 34131 8573 -77898 -36888 52049 24411 -4513 38071 4496 -71141
1610g1141M8109O7798m7177j9336O3700j6692o5453L2644K8810o1770N960Q9841
$$ -71141 -23032 44766 -2411 -21747 41953 25261 -40192 -7548 21262 -40508 -34548 55293
1622E5293p883o6950J5842O792n9442K5644R0791j9874o3541K7260R028n8005
$$ 55293 47410 -19540 -3698 3094 -56348 -30704 60087 40213 -23328 3932 12960 -45045
1634d5045J9295O5786l2367l7965N8391J3753p1749k445M3123k9012o051P5749
$$ -45045 -25750 40036 7669 -30296 28095 41848 -29901 -32346 10777 -18235 -24286 51463
1646E1463K181q3078m936L8399k5622K660O6356j1345o8531J8963L7776m2935
$$ 51463 53644 -29434 -34370 4029 -21593 -18933 47423 36078 -32453 -13490 24286 -18649
1658a8649j3637N3949o545l6684M1008K3599o8140k4605N4265O480j8122M0082
$$ -18649 -32286 21663 15118 -21566 19442 43041 -25099 -49704 4561 11041 -7081 33001
1670C3001N671p1016j1911N5303j337k3072L3593N320m9139P876M1725l0146l3471
$$ 33001 38672 -32344 -44255 11048 9711 -13361 20232 25552 -23587 -15711 26014 -4132 -37603
1683c7603M2226K2596l0330R484K0054m7695k7481N4465K7626l0421K340J0805
$$ -37603 4623 27219 -3111 6373 26427 -21268 -48749 5716 33342 2921 5261 16066
1695A6066l7997j0413M8162N229l6607J1836K3779k4989o330K7082j8667l2150
$$ 16066 -21931 -32344 15818 21047 -15560 -3724 20055 -4934 -11264 15818 -2849 -34999
1707c4999L4635L6327k7032j8229J3403j7109j6802M0418K5190l5105j6911J8888
$$ -34999 -364 35963 8931 -9298 4105 -13004 -29806 10612 35802 697 -16214 2674
1719B674n793j0144K4515K297l1106O800L1355j0640k1725R866j137j6483K3580
$$ 2674 -3119 -13263 11252 13549 -17557 -10757 20598 9958 -11767 -1901 -3038 -19521 4059
1732D059K8723k4427l0234J2247J1159o700J3449J1389k5222j4806K2953R668
$$ 4059 32782 8355 -21879 -9632 1527 -5173 8276 19665 -5557 -20363 2590 12258
1744A2258j4546lK748j1341P514K3484r133k7404L281J4501q37O456J0494j8478
$$ 12258 -2288 -2291 457 -10884 -3370 20114 10981 -16423 -13142 1359 522 6978 17472 -1006
1758a006k1617J4920K1408n639r039N54p321n34J7152M579j7869q142Q671M961
$$ -1006 -22623 -7703 13705 8066 -973 -419 -7740 -8274 8878 13457 -4412 -12554 -3883 1078
1772A078N172O569j1903j9133P353K1323J697r894l536n520l477J2637J2830r516
$$ 1078 6250 12819 916 -18217 -10864 10459 12156 2262 -1274 -6794 -10271 2366 15196 5680
1786E680j6046K41R255P534K990p340j2984o68J3501Q021l085p081q090l182J1622
$$ 5680 -10366 -10125 -870 6664 9654 2314 -10670 -11338 2163 10184 7099 18 -8072 -11254 368
1801C68J4229n077j6194n439Q306R088L462l381j0254o438O598J2173L634q691
$$ 368 14597 9520 -6674 -12113 -3807 5281 8743 5362 -4892 -11330 -4732 7441 11075 2384
1815B384j1754k255J1171J1493j685j1542p428K518Q738P437Nj0596j0167L406
$$ 2384 -9370 -11625 -454 11039 9354 -2188 -9616 -7098 1640 9077 9082 -1514 -11681 -8275
1829h275J3915P169q014j2671k659P370R523K675n739j0172m014P856J2226K172
$$ -8275 5640 12809 4795 -7876 -10535 -3165 6358 9033 3294 -6878 -10892 -3036 9190 11362
1843A1362j1329j1206J901J2228P942m279r161o159J697Q971Q895k918j3424p093
$$ 11362 33 -11173 -9272 2956 10898 6619 -2542 -8701 -7004 1967 10862 7944 -5480 -12573
1857a2573P316J2658L279q128j0362j854Q668Q665N49o684q770l247R316J3397
$$ -12573 -5257 7401 10680 2552 -7810 -9664 -996 7669 8218 1534 -7236 -10483 -1167 12230
1871A2230j772j4839p705O792R468M009j443r531q908N139J2678L760o689q845
$$ 12230 10458 -4381 -12086 -5294 4174 8183 6740 -2791 -11699 -6560 6118 9878 3189 -5656
1885e656m670N867J3992K590j4167q417N335N946M446N505o952j6989P06J7783
$$ -5656 -10326 -4459 9533 12123 -2044 -10461 -5126 820 5266 10771 3819 -13170 -12464 5319
1899E319O602q979n467l134k585R798J0960q851j3692L277P789K043N847j626
$$ 5319 11921 2942 -2525 -5659 -8244 1554 12514 3663 -10029 -6752 1037 3080 8927 7301
1913G301j8753n275K1102J0513j1204m470m83j0272L566K1015p03k0442j214J1874
$$ 7301 -11452 -16727 4375 14888 3684 -786 -1269 -11541 -7975 13040 12337 -8105 -9319 2555
1927B555j394N76O506j2722j2838J7570J7229j1991r509L472j0183l410K6400
$$ 2555 1161 1737 8243 -4479 -17317 253 17482 5491 -4018 -546 -10729 -14139 12261
1940A2261J0264k6324j0454J5600j718o114J5493L7k3012N607K4376q301j7786
$$ 12261 22525 -3799 -14253 1347 -371 -6485 9008 9045 -13967 -8360 16016 7715 -10071
1953a0071P092L13j0488K0201K1160k6203k3824J6549P234j0119J7317J3332k9620
$$ -10071 -2979 -2666 -13154 7047 28207 2004 -21820 -5271 1963 -8156 9161 22493 -7127
1966g127j4009K8106M395k3553P763J4493j5723J073K6809j4612l4503J3463K3873
$$ -7127 -21136 6970 11365 -12188 -4425 10068 -5655 -4582 22227 7615 -26888 -13425 10448
1979A0448r693N053J9187k6357l1685K7052K3935k1286m26K2612j8751k0080K7953
$$ 10448 755 5808 24995 -1362 -33047 -5995 17940 -3346 -3772 18840 89 -19991 7962
1992G962O930l6112L808L6518p903j5439J8613j0557l9776J8610M4030j2646j8630
$$ 7962 14892 -21220 -17412 19106 11203 -4236 14377 3820 -35956 -17346 26684 14038 -4592
2005d592J8376j1911l4133K3942L3942k6920j5276L4561k537l3481J3615J5651
$$ -4592 13784 1873 -32260 -8318 25624 -1296 -16572 17989 15452 -18029 -4414 11237
2017A1237l3287J144N1108j670m0474O290P599l0905J2689N1787j2461m0226J7286
$$ 11237 -22050 -20906 30202 28532 -11942 -5652 1947 -28958 -16269 35518 23057 -17169 117
2030A17J1377l4548O361L9258j8567k4012L8402J1378m9033n833L0586j5080n455
$$ 117 11494 -23054 -16693 22565 3998 -20014 18388 29766 -19267 -25100 5486 -9594 -15049
2043a5049M9463J769n8082l881L1217j7142l821M6535m017m8681J2797K9019l4638
$$ -15049 34414 36183 -21899 -25780 5437 -11705 -15526 31009 26992 -21689 -8892 20127 -14511
2056a4511j4775M3372K424k8803K6649J7572n4672j9508M7577P746j9301L0476
$$ -14511 -29286 14086 16510 -12293 14356 31928 -22744 -42252 5325 13071 -6230 24246
2068B4246P928n8206j1054M8195l448k4560L3357J3659m4733j281L4570k6621
$$ 24246 32174 -26032 -37086 11109 7661 -16899 16458 30117 -14616 -15897 18673 -7948
2080g948k9576M4959K5770l3395J598J9490m2228k5703N4943K5850l4579M553
$$ -7948 -37524 7435 33205 -190 1408 20898 -21330 -47033 7910 33760 -819 3734
2092C734J9652m0933j9647M7592Q017l6477J9592L2141l5024k1385K9949j1092
$$ 3734 23386 -17547 -37194 10398 18415 -18062 1530 33671 -1353 -22738 7211 -3881
2104c881l0589M0192L9259l7804k4184K2519j7849k4818M6355L2202m1541j4259
$$ -3881 -34470 5722 44981 7177 -17007 5512 -12337 -37155 9200 41402 -139 -14398
2116a4398L0051j8148k9099L3704J8919l4065P776L9232k5755l8940K2557J1886
$$ -14398 15653 -2495 -31594 2110 21029 -13036 -5260 33972 8217 -30723 -8166 3720
2128C720k3167K5202L7851l5788l8826K5158R688k4302K3306L1909l3022k3884
$$ 3720 -19447 5755 43606 7818 -31008 -5850 3838 -20464 2842 34751 1729 -22155
2140b2155L3088l3l6829J4279L0322j8770m734L1594j6519m4788J6310L1350j3754
$$ -22155 10933 10900 -25929 -11650 18672 -98 -4832 26762 10243 -34545 -18235 13115 -639
2153f39K716K7291k3935l8747K4373K5767k4404l57L0188j4781k5510K3414Q582
$$ -639 2077 29368 5433 -33314 -8941 16826 -7578 -7935 22253 7472 -18038 5376 13958
2166A3958l5723K389L7125m302j7259J5882o925l5336J2784L8343r720j6543J6981
$$ 13958 -21765 -19376 17749 13447 -3812 12070 5145 -30191 -17407 20936 11216 -5327 11654
2179A1654o101k8724J5069K7374k0996j4448K7760M199k5028N641J0940k2666
$$ 11654 5553 -23171 -8102 19272 -1724 -16172 11588 15787 -9241 -3600 7340 -15326
2191a5326k643L5395L833k6346J027N069j7872O331L1079p524k5556J1144J0906
$$ -15326 -17969 17426 21259 -5087 -4060 1009 -16863 -10532 20547 13023 -12533 -1389 9517
2204I517j8157K91J9731j1222j5238K2237J3259k4072r286J2694n260k535K2830
$$ 9517 -8640 -8349 11382 160 -15078 7159 20418 -3654 -12940 -246 -5506 -8041 14789
2217A4789K904k6644m189J4744l923j810J6091m690k0317Q858J7450j2644j1297
$$ 14789 17693 -8951 -13140 1604 -2319 -4129 11962 7272 -13045 -4187 13263 619 -10678
2230a0678J1568J481r106J2199J0265j9545j3095J4080P452l134N986l99j7076
$$ -10678 890 2371 -6735 5464 15729 -3816 -16911 -2831 4621 1487 7473 7074 -10002
2243a0002j338J7075R55r826L776J751q655N214J2986r881j5074Q277J1316l314
$$ -10002 -11340 5735 6690 -3136 640 2391 -6264 -1050 11936 2055 -13019 -4742 6574 3260
2257C260p84K484j0444o939J2701R829o341n324k51l698K755J0909j913j2532
$$ 3260 2476 4960 -5484 -12423 278 10107 3766 -1558 -1809 -5507 -2752 8157 6244 -6288
2271f288M47Q251J40n85K736o341q657P405J2021k535q709k200k82J673P607K744
$$ -6288 -5841 2410 2550 1965 4701 -1640 -10297 -2892 9129 6594 -2115 -4315 -4597 -2924 4683 7427
2287G427q261n545L264M070K870J416n372p547L539R862Q86o762k950n85L78N533
$$ 7427 -834 -6379 -3115 955 3825 5241 -131 -7678 -4139 5723 6609 -153 -3103 -3688 -3310 2223
2303B223N079m835q656m01O472N282k00n108n250N99O233M035j937m503l735L10
$$ 2223 7302 2467 -6189 -6590 -118 5164 4964 -144 -5394 -4795 1438 5473 3536 -967 -4702 -4392
2319d392O034N500l006q654k413N517N398Q69l490m820j772L108O227K123n388
$$ -4392 1642 7142 4136 -4518 -6931 -1414 3984 4853 1363 -3457 -5229 -2121 4106 6229 841
2334H41o460Q8O437M905j361n951l746J890N142L085j218n199m243J947O901L374
$$ 841 -5619 -5531 906 5811 4450 -1501 -5247 -3357 1785 4870 3652 -1547 -5790 -3843 3058 6432
2350F432m835o214r52N080M236J228l850n342q08M537N568K05n631n594J323P105
$$ 6432 1597 -4617 -5569 -489 3747 4975 1125 -4217 -5025 -488 5080 5285 -346 -5940 -4617 2488
2366B488L247l156n104k121J663M641L812k229p094k606N278N340N35l396n580
$$ 2488 5735 2579 -2525 -4646 -2983 1658 5470 3241 -3853 -6459 -1181 4159 4694 1298 -4282
2381d282j157N562N204j346m452k717r08L584N996l65q510l106N280M114L52k03
$$ -4282 -5439 123 5327 3981 -471 -3188 -4096 -512 5484 5119 -3391 -6497 -1217 2897 3249 3046
2397C046m522n198L587Q239N67n596k688j597J024O849L260p801n333N103L753
$$ 3046 -1476 -6674 -3087 5152 5719 123 -2565 -4162 -3138 3711 6971 -830 -6163 -1060 2693
2412B693j227J304j447p992M28J1575K655q632k966J136k065M663Q426m524j0194
$$ 2693 1466 2770 1323 -6669 -6241 5334 7989 -643 -3609 -2473 -4538 125 8551 4027 -6167
2427f167K422N852j929Q95L240p206m702J0762N796r960m674M502j934L75J1886
$$ -6167 -3745 2107 178 1073 4313 -2893 -7595 3167 8963 -997 -5671 -1169 -3103 -2728 9158
2442I158m83j5054k571R880j82j330P302l450j1845N785J0763p541p041P557Q98
$$ 9158 8675 -6379 -8950 930 748 -582 6720 3270 -8575 -2790 7973 432 -6609 948 1846
2457A846n872R537N128j6541p660J4126M806n680O235J318j6707j956J7189L77
$$ 1846 -4026 5511 10639 -5902 -13562 564 5370 -310 5925 7243 -9464 -11420 5769 6146
2471F146j1235O489N059j1196J485J2136r875j3136J3950J1464r731j238O355
$$ 6146 -5089 1400 6459 -4737 -3252 8884 -991 -14127 -177 11287 1556 318 6673
2484F673j4636r036K0816J0598j4710j397Q057j2214o360J8262K450j7339O285
$$ 6673 -7963 -16999 3817 14415 -295 -1692 6365 -5849 -12209 6053 8503 -8836 -2551
2497b551J5712j1281j0020J1031m237j3808J6466J8793j6135j2966R343m815j0154
$$ -2551 13161 1880 -8140 2891 -1346 -15154 1312 20105 3970 -8996 347 -4468 -14622
2510a4622J9334J4084j9884p987J5652n245j4608J3776R232j6660L384K1571j1736
$$ -14622 4712 18796 -1088 -9075 6577 1332 -13276 500 9732 -6928 -3544 18027 6291
2523F291k2645R974R138j0964J0301K0512j8222k2436J3612Q404j3655R723J8023
$$ 6291 -16354 -6380 2758 -8206 2095 22607 4385 -18051 -4439 3965 -9690 33 18056
2536A8056j6671j4075J9451Q47k3673O988K1060j0049n249J9355r031k9701R389
$$ 18056 1385 -12690 6761 7608 -16065 -9077 11983 1934 -3315 16040 7009 -22692 -13303
2549a3303K3302p919k251J7215j2182k5932J4002J8210j6362j779K2355p394j9861
$$ -13303 9999 2080 -171 17044 4862 -21070 -7068 11142 -5220 -6999 15356 7962 -11899
2562a1899J4151O609k5459J544L0786k355j7713J1003j589k7122O975L1023n565
$$ -11899 2252 8861 -16598 -15054 15732 13377 -4336 6667 5078 -22044 -15069 15954 10389
2575A0389j5943J3464m16k4874P280K2544j4036j0580K5190L920k6039J525J3025
$$ 10389 -5554 7910 7494 -17380 -10100 12444 -1592 -12172 13018 16938 -9101 -7576 5449
2588E449j7680l058L2713M256k8269J60J0151j7705%K9996j222k3676Q703J1647
$$ 5449 -12231 -15289 17424 21680 -6589 -6429 3722 -13983 -13983 16013 14791 -8885 -182 11465
2602A1465k1410m806K3126m884j4434K1612J0864k9834r762J9758l942p467K4677
$$ 11465 -9945 -14751 8375 3491 -10943 10669 21533 -8301 -18063 1695 -2247 -9714 14963
2615A4963P373l1400o432J9315o717q670K1688N122k3362M445J6421j7877j4115
$$ 14963 22336 -9064 -15496 3819 -2898 -11568 10120 15242 -8120 -3675 12746 -5131 -19246
2628a9246K2024P253j4595J1287J1842k6816j6071K4495Q980j2819J0573R977
$$ -19246 2778 10031 -4564 6723 18565 -8251 -24322 173 9153 -3666 6907 16884
2640A6884k4672j0051K2169J000j6017J2595J2936j6979l834J5193j1813j7657
$$ 16884 -7788 -17839 4330 5330 -10687 1908 14844 -2135 -5969 9224 -2589 -20246
2652b0246J9714J7412j4505l216J0822j6118j5668K2152J5803j6353k526J2623
$$ -20246 -532 16880 2375 -841 9981 -6137 -21805 347 16150 -203 -2729 9894
2664I894j2438j1988J7023N354j7005O159J7922j0916j2147R954k844j4424J4707
$$ 9894 -2544 -14532 2491 7845 -9160 -3001 14921 4005 -8142 1812 -1032 -15456 -749
2677g49K0252j4170j3638R746k901j2168J4057J4882j5156q308J3880j679j3452
$$ -749 19503 5333 -8305 1441 -1460 -13628 429 15311 155 -8153 5727 4048 -9404
2690i404P250P827j1404K349J6563o246j7050M935O620p956O672J5323j0893j7043
$$ -9404 -2154 5673 -5731 -3382 13181 6935 -10115 -5180 1440 -6516 156 15479 4586 -12457
2704a2457Q956Q081r194K374J1145q093q579J1376L737j3457o44J0201l365j376
$$ -12457 -3501 4580 -4614 -2240 8905 812 -7767 3609 7346 -6111 -6755 3446 81 -1295
2718a295J0664m150j6093L326J2546l223k471Q119n125j2510O633J1470p756n597
$$ -1295 9369 5219 -10874 -7548 4998 1775 -696 7423 2298 -10212 -3579 7891 135 -5462
2732e462P482O84n827N425K976j0534k569J0779K053m553K790j778r671K987J2207
$$ -5462 2020 2704 -3123 2302 5278 -5256 -7825 2954 5007 454 3244 1466 -8205 -5218 6989
2747F989k261p995K784J863n471K838O948n602o669O166N282l663j368N46m733
$$ 6989 4728 -3267 -483 1380 -4091 -1253 5695 93 -6576 -410 4872 1209 -159 387 -4346
2762d346j85Q776J985o735k039J852k136J852O498k483p965J592N915o97k215
$$ -4346 -4531 4245 6230 -505 -2544 -692 -2828 -976 5522 3039 -4926 -3334 2581 1884 -331
2777c31J153k101l023M920M770l746m459L84O51J921M229j059o480r99M178K192
$$ -331 822 -1279 -4302 618 5388 1642 -2817 -2433 -1782 139 4368 3309 -3171 -4170 8 2200
2793B200j080K97j998l460K333N940j117n208j138K006J571J920P81l797k954
$$ 2200 1120 1417 -581 -4041 -1708 4232 3115 -2093 -3231 -1225 346 2266 3047 -750 -3704
2808c704J917L466J232j182k600k915J730M607J112l713k580N16J669K070J282
$$ -3704 -1787 1679 2911 1729 -871 -3786 -2056 2551 3663 -50 -2630 -2114 -445 1625 2907
2823B907k325l644M4L735K750j171l084k159J041K986K149j562l044j597J141
$$ 2907 582 -3062 -3018 717 3467 2296 -788 -2947 -1906 1080 3229 1667 -1377 -2974 -1833
2838a833L118J766j682l790j081L053L348l15k469k328J1K144K685K54l597k338
$$ -1833 1285 3051 1369 -2421 -3502 -449 2899 2584 115 -2213 -2202 -58 2627 2881 -716 -3054
2854c054P53L501J881j176l236j926J900L076R95j652k687j612J939L649R14k966
$$ -3054 -2301 1200 3081 1905 -1331 -3257 -1357 1719 2714 1062 -1625 -3237 -1298 2351 3265 299
2870B99k858J65K635K051J74k565k695P02L257J501o29k683k300P30L883J840
$$ 299 -2559 -2394 241 2292 2466 -99 -2794 -2092 1165 2666 2037 -646 -2946 -2216 1667 3507
2886C507k723k917k69J521J943K083j712m418j33L660J929p53j383k623r68L964
$$ 3507 784 -2133 -2402 -881 1062 3145 1433 -2985 -3118 542 2471 1718 335 -2288 -3256 708
2902G08L483k340l626l71P72R78L187K04m893j886L758K372j373l32j043k793
$$ 708 4191 1851 -1775 -2146 -1374 -396 2791 2995 -1898 -3784 -26 2346 973 641 -402 -3195
2918c195J944N559j294n420rJ809n45L028L002n218m889L774L829j821j20J048
$$ -3195 -1251 4308 3014 -2406 -2415 -606 -1151 1877 4879 -339 -5228 -1454 2375 554 434 1482
2934A482l948j104O341J188n968j266L539m49N83M346k820q170K346P180j350
$$ 1482 -2466 -3570 2771 3959 -2009 -3275 264 -185 398 4744 1924 -6246 -3900 3280 1930
2949A930j322K137l192n622N582N781n409l194M549l68l100M824R26q587m55R505
$$ 1930 608 2745 -447 -6069 -487 5294 -115 -3309 1240 872 -2228 2596 3522 -5065 -5520 3985
2965C985L88m884K581j454q050L653J0237k789o809L702J210n795K678O642o565
$$ 3985 4373 -511 2070 616 -7434 -3781 6456 3667 -3142 560 1770 -4025 -1347 5295 -1270
2980a270n014R200K993p596j03L623o958l54J2564R11j1163j82M869o324O03J1164
$$ -1270 -6284 2916 5909 -1687 -1790 1833 -5125 -5479 7085 7996 -3167 -3349 1520 -4804 -4201 6963
2996F963k197j0583M576O395p534k747P920k660n332R819M923j2894m468Q621
$$ 6963 4766 -5817 -1241 5154 -2380 -5127 2793 133 -5199 4620 9543 -3351 -7819 802
3010H02j947k608J1112K030j4922j978J1102l552n488R480K503j1443K867R492
$$ 802 -1145 -3753 7359 9389 -5533 -7511 3591 39 -5449 4031 6534 -4909 -2042 7450
3024G450r178q059J0431M341o879N429N820j4293p648J3676M701q195N759N617
$$ 7450 -1728 -9787 644 4985 -1894 3535 9355 -4938 -12586 1090 5791 -2404 3355 8972
3038H972j3713m952J3291p3j1018P648R220r879l260R176o775j1024J2053J1152
$$ 8972 -4741 -9693 3598 3525 -7493 155 9375 -504 -3764 5412 -1363 -12387 -334 10818
3052A0818r028k601O429j0016r103J4818Q899j1525m18R536q768r066J1412L757
$$ 10818 1790 -811 5618 -4398 -13501 1317 10216 -1309 -1727 7809 -959 -10025 1387 5144
3066E144j2140N091J3836q370j0569P065j010r613J1015J3940j0512r973P746
$$ 5144 -6996 -1905 11931 3561 -7008 57 -953 -10566 449 14389 3877 -6096 1650
3079A650k479j0044J0978J1600j1758n500J2292l323j4014P291Q577q726R06J4638
$$ 1650 -829 -10873 105 11705 -53 -5553 6739 3416 -10598 -3307 5270 -3456 -2550 12088
3093A2088o475j6229N363P209o754M457J3679r098j4363Q091N965j0756L533J3330
$$ 12088 5613 -10616 -5253 1956 -4798 -341 13338 4240 -10123 -2032 3933 -6823 -3290 10040
3107A0040p378r460J1055J641j5697J443J4427l572m304J0254l075j7152L425
$$ 10040 2662 -6798 4257 5898 -9799 -8356 6071 2499 -1805 8449 5374 -11778 -8353
3120h353J3817m365k834J0535m076j4430O035R920r818l402J4271m88j1690N392
$$ -8353 5464 1099 -1735 8800 4724 -9706 -3671 6249 -3569 -6971 7300 6812 -4878 514
3134E14M392j3188j344J6184J373r527L941J338j3079J398J5190k484q533P323
$$ 514 4906 -8282 -9626 6558 7931 -1596 2345 3683 -9396 -7998 7192 4708 -3825 3498
3148C498K312j2246R81J0843o226p003J2775N067j2635j886O986o849l507J4504
$$ 3498 5810 -6436 -5455 5388 -838 -7841 4934 10001 -2634 -4520 2466 -4383 -7890 6614
3162F614L576j2594q49N499o434j835J1755J6j0761M905O926r249m665R492r39
$$ 6614 10190 -2404 -3253 2246 -4188 -6023 5732 5748 -5013 -108 6818 -2431 -7096 2396 1457
3177A457o935Q596O998j1807o201P805L68m277Q387L698j1011k677Q160k252n091
$$ 1457 -5478 3118 10116 -1691 -7892 -87 281 -3996 4391 8089 -2922 -5599 2561 309 -4782
3192d782P017K672p995J812P681o600p995P489M581n427K720N597q203p264Q048
$$ -4782 2235 4907 -3088 -1276 6405 -195 -8190 -701 3880 -1547 1173 6770 -1433 -8697 -649
3207f49M596m783J856L602o551l115P459N51p285K845N871m502j742N517l475
$$ -649 3947 -836 1020 4622 -1929 -5044 2415 2966 -4319 -1474 4397 -105 -1847 3670 195
3222A95p516N517P505l932l022L471l163m952N737N270n291k071L925j309k979
$$ 195 -7321 -1804 5701 1769 -1253 2218 -945 -5897 -160 5110 -181 -2252 1673 364 -2615
3237b615M024P19n838J438O639k082m137K085l65m189L672O161l146n594K410
$$ -2615 1409 2128 -3710 -2272 4367 2285 -1852 233 -132 -4321 -649 5512 2366 -3228 -818
3252h18J498k516K375K844m013k394L983J237k928K13J121k827P64N113j121n095
$$ -818 680 -1836 539 3383 -630 -3024 959 2196 -732 -519 602 -2225 -1461 3652 2531 -2564
3268b564K08K661p59P31K928k206m242J705L560j039j258N76r79q96L032J272
$$ -2564 -2356 305 -454 277 3205 999 -3243 -1538 2022 983 -275 301 -678 -1574 1458 2730
3284B730l505j408J958K55L04J714r47m083N79L631Q03j598m46o88q23J505K453
$$ 2730 -775 -2183 -225 30 334 2048 1101 -2982 -2403 1228 2031 433 -13 -701 -1524 -19 2434
3301B434j313k850M21J242N79R78m41k622o44K373J418n19r13p00r42P58K768
$$ 2434 1121 -1729 -1308 -66 513 1491 1050 -1572 -2216 157 1575 1056 143 -557 -1499 -741 2027
3318B027k25k544j077J254J305N50m82j033j630P02K080Q12j383j259n75P12J850
$$ 2027 1802 -742 -1819 -565 740 1290 808 -225 -1855 -1153 927 1739 356 -903 -1478 -766 1084
3335A084O55j796j491M34J112J425k14j096j609J51J828J566j087j666p81N85
$$ 1084 1739 -57 -1548 -1114 -2 1423 1209 113 -1496 -1345 483 2049 962 -704 -1485 -900
3351i00J707R64j257j554o89J415J215O39j014j647n70J619J655k16j523j422
$$ -900 807 1771 514 -1040 -1729 -314 901 1540 526 -1121 -1691 -72 1583 1367 -156 -1578
3367a578L64J193J686l11j860j303Q30J524P92k23j739j122Q65J999J18r65r86
$$ -1578 -1214 -21 1665 1354 -506 -1809 -979 545 1337 1114 -625 -1747 -882 1117 1235 270 -716
3384g16o93Q18K051M28k113j497P37J066R50J89j090j966O76K325J52j162m13
$$ -716 -1409 -591 1460 1888 -225 -1722 -985 81 1031 1220 130 -1836 -1160 1165 1317 155 -258
3401b58q29j88K103J293j369k656P67J018P56P85l11k829P9K616M60j383J84n08
$$ -258 -1087 -1275 828 2121 752 -1904 -1137 -119 637 1422 1111 -1718 -1639 977 1437 54 238 -270
3419b70j596J449K830j838k625R18J466k24Q60R38k985j855K768K077j199k04
$$ -270 -1866 -417 2413 575 -2050 -1132 334 110 970 1908 -1077 -2932 -164 1913 714 510
3435E10Q3k176n0L564Q2l624N07K219j136k41J996j503l910K522M109j575j876
$$ 510 593 -1583 -1633 1931 2013 -1611 -1104 1115 -21 -262 1734 231 -3679 -1157 2952 1377 -499
3452d99J305j768j979L515K579l499j344K618q33k079L633Q3m691J024N283j294
$$ -499 806 -962 -2941 574 3153 -346 -1690 928 95 -1984 1649 1732 -2959 -1935 3348 2054
3468B054l666J445N6l222K653N214k770m508K348P72k779K811L210m399k061M775
$$ 2054 -1612 -167 -111 -3333 -680 4534 1764 -2744 -396 376 -2403 408 3618 -781 -2842 1933
3484A933L57m949J724K708l617k8O412j463p250J323M098k454O31N355k939o174
$$ 1933 2290 -2659 -935 1773 -1844 -1872 4540 3077 -4173 -2850 1248 -1206 -575 4780 1841 -4333
3500d333L065L945m344k39N021k489l914N364J580p781k18P187j544k877N108
$$ -4333 -1268 2677 -1667 -1906 3115 626 -3288 2076 3656 -4125 -4343 2844 1300 -1577 3531
3515C531l86q350P63P607j922k849M704p95o438K406N395n070k639P041Q22n932
$$ 3531 3145 -5205 -4442 3165 1243 -1606 3098 2303 -4135 -1729 3666 -1404 -4043 2998 3820 -2112
3531b112K392K955p568j567R877O95o247K119K304p398n02R250r50o106L926L090
$$ -2112 280 3235 -4333 -5900 3977 4672 -1575 544 2848 -4550 -5052 4198 3248 -2858 1068 4158
3547D158p122m00O284l519m369P864L616q428j280N053m176l538R803L145r045
$$ 4158 -2964 -3364 2920 -599 -4968 2896 6512 -1916 -3196 1857 -2319 -5857 3946 7091 -1954
3562a954j021N531m561l016Q058J419p679K614O011o545m671O955K07n020N809
$$ -1954 -2975 2556 -2005 -5021 3037 4456 -3223 -609 5402 -1143 -5814 1141 1348 -3672 2137
3577B137N527r222m805O988j53m690O637M790q943l384P491j625o014N811M548
$$ 2137 7664 -1558 -6363 625 472 -4218 2419 7209 -1734 -5118 2373 748 -5266 545 5093
3592E093o470J64O477n241p339O637M724n369J945N841p280p526P904M608o300
$$ 5093 -1377 -1213 5264 23 -7316 -679 4045 -1324 621 6462 -818 -8344 -440 4168 -2132
3607b132J930O097n923n498O910J115p443L116P737m501l917N369k576p894N688
$$ -2132 -202 5895 -28 -5526 1384 2499 -4944 -1828 5909 1408 -2509 2860 284 -7610 -1922
3622a922Q509n102l380N571l416p589O176O597n929j977P073k333o906L978L186
$$ -1922 6587 1485 -1895 3676 260 -7329 -1153 5444 -485 -2462 4611 2278 -4628 -650 2536
3637B536o103J357Q526l028o790L215R24n895L197Q948l950o574M410P33o367
$$ 2536 -3567 -2210 6316 3288 -3502 -287 637 -5258 -2061 6887 2937 -3637 773 1506 -4861
3652d861K649P089m129m066O462N14p395P31M894l127p07P520j499q644J720M389
$$ -4861 -2212 4877 748 -3318 3144 3658 -3737 -3006 1888 -1239 -1946 5574 4075 -4569 -2849 1540
3668A540l171j94O843j833p446L149M367n306j170O213j039m349M235J777p204
$$ 1540 -1631 -1825 5018 3185 -4261 -1112 3255 -2051 -3221 2992 1953 -2396 1839 3616 -3588
3683c588q92O186J37k706M006j80p301M51O255j330l336M203Q03n865J495M832
$$ -3588 -4480 1706 1843 -863 3143 2963 -4338 -3887 2368 1038 -2298 1905 2708 -3157 -1662 3170
3699C170l713l259N175K028m348J109K086m616j771N822J437l608P08J523m190
$$ 3170 -543 -3802 1373 3401 -947 162 2248 -2368 -4139 1683 3120 -488 220 1743 -2447
3714b447p28N414q2m597K040L260l507j435L714j551l166L404L668l774j797K099
$$ -2447 -3175 2239 2157 -2440 -400 2860 -647 -2082 1632 81 -3085 319 3987 213 -1584 515
3730E15j505j627M068J920m239r99K664j030j528L042N10l511N35L817j916k831
$$ 515 -990 -2617 1451 3371 -868 -1867 797 -233 -1761 1281 1791 -1720 -1185 2632 716 -2115
3746b115J826O69k006J953K930l107k836J892J089r97J640J077k846j339L037
$$ -2115 -289 380 -1626 327 3257 150 -2686 -794 295 -702 938 2015 -831 -2170 867
3761H67L62k248P00R05j317Q2K387q91k753O70J854j48R0P28j655j888J618J914
$$ 867 1229 -1019 -319 586 -731 -649 1738 847 -1906 -1236 618 470 560 1288 -367 -2255 -637 1277
3779A277r02o87N24n39o60J827N81k322l53J544Q0l29P64o70j678O82K122k51
$$ 1277 375 -312 212 -327 -987 840 1421 -901 -1254 290 370 41 805 135 -1543 -861 1261 1010
3797A010r97l40l75n4J055J105j409j113M20J189r6K46o7j401l80K140N43j219
$$ 1010 13 -327 -702 -756 299 1404 -5 -1118 -698 491 395 641 574 -827 -1207 933 1476 257
3815B57o41J24l99Q12J123m38j597l27Q70L83L51m4r68n88J093R69m69q65j91
$$ 257 -384 -260 -659 153 1276 838 -759 -1086 -216 167 518 474 -494 -1082 11 980 511 -354 -545
3834e45N2P16L89Mo76r04O32O04N85r3q71r08N18J199J88j091k67j11K48Q73J73
$$ -545 -493 223 612 616 -60 -964 -332 272 857 764 -107 -1015 -497 702 890 -201 -468 -579 -331 542 715
3855G15o88o88r6Q95N41j93l84q08R7P44O73m54q64q3p4J015O26m64j028k38O48
$$ 715 27 -661 -757 138 679 486 102 -706 -609 135 808 354 -510 -593 -667 348 974 510 -518 -756 -108
3876a08P73M7m77q91kO95Q68k06o62o64j05Q24R39l99r02o73Q12N43K64j36n76
$$ -108 665 712 235 -656 -658 37 905 699 37 -627 -732 92 1031 632 -270 -943 -131 412 676 540 -36
3897c6j112O23J351Kr04j87o9K94P75J26j424m33Q06M04K8L61k15j392J30J164
$$ -36 -1148 -525 826 828 -76 -263 -332 -38 737 863 -561 -994 -188 216 244 605 390 -1002 -872 292
3917B92O27j293J12j25j80O95Q99r43j024O98P32k73K02j03j180k43J418R90j373
$$ 292 919 -374 -262 -387 -567 128 1027 84 -940 -242 490 217 419 316 -864 -1107 311 1301 -72
3936g2J43rq69l3K044Q0k140K14J364p08m05Q07n61j171J359J522j543p38Q17
$$ -72 71 62 -807 -840 1204 1284 -856 -642 722 14 -391 416 -145 -1316 43 1565 22 -716 101
3955A01o57m59K055R76k674n56J639J44j705J680O06k334L22K257n61j876Q21
$$ 101 -556 -1015 1040 2016 -658 -1214 425 569 -1136 544 1150 -1184 -862 1395 834 -1042 -221
3972b21N06j188J303J924k341k024J931P51j458J338J434k581j575L304P9k718
$$ -221 285 -903 400 2324 -17 -2041 -110 641 -817 521 1955 -626 -2201 1103 1182 -1536
3988a536J243J555j448m66K368q46l375J595K309j247k45J962k116k761K630K038
$$ -1536 -293 1262 -186 -652 1716 870 -2505 -910 1399 152 -93 1869 -247 -3008 -378 1660
4004A660k346J78K580j826k212K644Q44l541K86L889q92k546K031k0l775J708
$$ 1660 -686 -508 2072 246 -1966 678 1522 -2019 -1733 2156 1264 -1282 749 729 -3046 -1338
$$ [...]
8191A11
##END NTUPLES=NMR FID
##END=
