##TITLE=1H_LR-750-RM2
 CCl4
 8 sc, 
 8.07.2022
##JCAMPDX= 6.0         $$ Bruker NMR JCAMP-DX V2.0
##DATA TYPE= NMR FID
##DATA CLASS= NTUPLES
##ORIGIN= UXNMR, Bruker Analytische Messtechnik GmbH
##OWNER= root
$$ XWIN-NMR		Version 3.5
$$ Fri Jul  8 13:44:44 2022 Russian Standard Time (UT+4h)  she@DPX200
##.OBSERVE FREQUENCY= 200.1313499994
##.OBSERVE NUCLEUS= ^1H
##.DELAY= (6, 6)
##.ACQUISITION MODE= SIMULTANEOUS
##.ACQUISITION SCHEME= undefined
##.AVERAGES= 8
##.DIGITISER RES= 18
##SPECTROMETER/DATA SYSTEM= spect
##.PULSE SEQUENCE= zg30
##.SOLVENT NAME= DMSO
##.SHIFT REFERENCE= (INTERNAL, DMSO, 0, 15.7039)
##AUDIT TRAIL= $$ (NUMBER, WHEN, WHO, WHERE, WHAT)
$$ ##TITLE= Audit trail, XWIN-NMR		Version 3.5
$$ ##JCAMPDX= 5.01
$$ ##ORIGIN= Bruker BioSpin GmbH
$$ ##OWNER= she
$$ F:/spectra/data/she/nmr/H-F/1/audita.txt
$$ ##AUDIT TRAIL=  $$ (NUMBER, WHEN, WHO, WHERE, WHAT)
(   1,<2022-07-08 13:42:34.04 +0400>,<she>,<DPX200>,
      <created by zg, POWCHK disabled, PULCHK disabled
       configuration hash MD5:
       00 E9 B6 7A A2 85 ED C7 34 08 36 98 17 FE 4E 26
       data hash MD5: 16K
       28 AB C4 44 16 07 F3 AA B0 DA D0 BD D6 B2 7A 14>)
$$ ##END=
$$ 
$$ hash MD5
$$ D6 AE 71 C1 D1 20 D5 33 90 9F 8F 41 3E 91 2C E8
##$RELAX= 
##$RELAX= 
##$RELAX= 
##$RELAX= 
##$RELAX= 
##$RELAX= 
$$ Bruker specific parameters
$$ --------------------------
##$DU= <F:/spectra>
##$EXPNO= 1
##$NAME= <H-F>
##$PROCNO= 1
##$TYPE= <nmr>
##$USER= <she>
##$AMP= (0..31)
100 100 100 100 100 100 100 100 100 100 100 100 100 100 100 100 100 100 
100 100 100 100 100 100 100 100 100 100 100 100 100 100 
##$AQSEQ= 0
##$AQ_mod= 1
##$AUNM= <au_zg>
##$AUTOPOS= <>
##$BF1= 200.13
##$BF2= 200.13
##$BF3= 200.13
##$BF4= 200.13
##$BF5= 200.13
##$BF6= 200.13
##$BF7= 200.13
##$BF8= 200.13
##$BYTORDA= 1
##$CFDGTYP= 0
##$CFRGTYP= 5
##$CHEMSTR= <none>
##$CNST= (0..31)
1 1 145 1 1 1 1 1 1 1 1 1 1 1 1 1 1 1 1 1 1 1 1 1 1 1 1 1 1 1 1 1 
##$CPDPRG= <>
##$CPDPRG1= <>
##$CPDPRG2= <>
##$CPDPRG3= <>
##$CPDPRG4= <mlev>
##$CPDPRG5= <mlev>
##$CPDPRG6= <mlev>
##$CPDPRG7= <mlev>
##$CPDPRG8= <mlev>
##$CPDPRGB= <>
##$CPDPRGT= <>
##$D= (0..31)
0 1.2 0 0 0 0 0 0 0 0.06 0 0.03 0 0 0 0 0.0002 0 0 0 0 0 0 0 0 0 0 0 0 
0 0 0 
##$DATE= 1657273353
##$DBL= (0..7)
120 120 120 120 120 120 120 120 
##$DBP= (0..7)
150 150 150 150 150 150 150 150 
##$DBP07= 0
##$DBPNAM0= <>
##$DBPNAM1= <>
##$DBPNAM2= <>
##$DBPNAM3= <>
##$DBPNAM4= <>
##$DBPNAM5= <>
##$DBPNAM6= <>
##$DBPNAM7= <>
##$DBPOAL= (0..7)
0.5 0.5 0.5 0.5 0.5 0.5 0.5 0.5 
##$DBPOFFS= (0..7)
0 0 0 0 0 0 0 0 
##$DE= 6
##$DECBNUC= <off>
##$DECIM= 32
##$DECNUC= <off>
##$DECSTAT= 4
##$DIGMOD= 1
##$DIGTYP= 9
##$DL= (0..7)
0 120 120 120 120 120 120 120 
##$DP= (0..7)
150 150 150 150 150 150 150 150 
##$DP07= 0
##$DPNAME0= <>
##$DPNAME1= <>
##$DPNAME2= <>
##$DPNAME3= <>
##$DPNAME4= <>
##$DPNAME5= <>
##$DPNAME6= <>
##$DPNAME7= <>
##$DPOAL= (0..7)
0.5 0.5 0.5 0.5 0.5 0.5 0.5 0.5 
##$DPOFFS= (0..7)
0 0 0 0 0 0 0 0 
##$DQDMODE= 0
##$DR= 18
##$DS= 0
##$DSLIST= <SSSSSSSSSSSSSSS>
$$ [...]
##$SUBNAM2= <"">
##$SUBNAM3= <"">
##$SUBNAM4= <"">
##$SUBNAM5= <"">
##$SUBNAM6= <"">
##$SUBNAM7= <"">
##$SUBNAM8= <"">
##$SUBNAM9= <"">
##$SW= 18.0517283424941
##$SWIBOX= (0..15)
0 0 2 0 0 0 0 0 0 0 0 0 0 0 0 0 
##$SW_h= 3612.71676300578
##$TD= 16384
##$TD0= 1
##$TE= 0
##$TE2= 300
##$TE3= 300
##$TEG= 300
##$TL= (0..7)
0 120 120 120 120 120 120 120 
##$TP= (0..7)
150 150 150 150 150 150 150 150 
##$TP07= 0
##$TPNAME0= <>
##$TPNAME1= <>
##$TPNAME2= <>
##$TPNAME3= <>
##$TPNAME4= <>
##$TPNAME5= <>
##$TPNAME6= <>
##$TPNAME7= <>
##$TPOAL= (0..7)
0.5 0.5 0.5 0.5 0.5 0.5 0.5 0.5 
##$TPOFFS= (0..7)
0 0 0 0 0 0 0 0 
##$TUNHIN= 0
##$TUNHOUT= 0
##$TUNXOUT= 0
##$USERA1= <user>
##$USERA2= <user>
##$USERA3= <user>
##$USERA4= <user>
##$USERA5= <user>
##$V9= 5
##$VALIST= <valist>
##$VCLIST= <CCCCCCCCCCCCCCC>
##$VD= 0
##$VDLIST= <DDDDDDDDDDDDDDD>
##$VPLIST= <PPPPPPPPPPPPPPP>
##$VTLIST= <TTTTTTTTTTTTTTT>
##$WBST= 1024
##$WBSW= 4
##$XGAIN= (0..3)
0 0 0 0 
##$XL= 0
##$YL= 0
##$YMAX_a= 889714
##$YMIN_a= -694266
##$ZGOPTNS= <>
##$ZL1= 120
##$ZL2= 120
##$ZL3= 120
##$ZL4= 120
##$ABSF1= 10
##$ABSF2= 0
##$ABSG= 5
##$ABSL= 3
##$ALPHA= 0
##$AQORDER= 0
##$ASSFAC= 0
##$ASSFACI= 0
##$ASSFACX= 0
##$ASSWID= 0
##$AUNMP= <proc_1d>
##$AZFE= 0.1
##$AZFW= 0.1
##$BCFW= 1
##$BC_mod= 2
##$BYTORDP= 1
##$COROFFS= 0
##$CY= 11.3945322036743
##$DATMOD= 1
##$DC= 2
##$DFILT= <>
##$DTYPP= 0
##$F1P= 2.36226072786647
##$F2P= -0.459571619588291
##$FCOR= 0.5
##$FTSIZE= 0
##$FT_mod= 4
##$GAMMA= 1
##$GB= 0.15
##$INTBC= 1
##$INTSCL= 1
##$ISEN= 128
##$LB= 0.24
##$LEV0= 0
##$LPBIN= 0
##$MAXI= 10000
##$MC2= 0
##$MEAN= 0
##$ME_mod= 0
##$MI= 1.114404
##$NCOEF= 0
##$NC_proc= 0
##$NLEV= 6
##$NOISF1= 3.799351
##$NOISF2= 2.8
##$NSP= 1
##$NTH_PI= 0
##$NZP= 0
##$OFFSET= 15.70392
##$PC= 1
##$PHC0= -18054.17
##$PHC1= 4.200677
##$PH_mod= 1
##$PKNL= yes
##$PPARMOD= 0
##$PSCAL= 0
##$PSIGN= 0
##$REVERSE= no
##$SF= 200.130013532006
##$SI= 16384
##$SIGF1= 3
##$SIGF2= 2
##$SINO= 400
##$SIOLD= 16384
##$SREGLST= <1H.CDCl3>
##$SSB= 0
##$STSI= 0
##$STSR= 0
##$SW_p= 3612.71676300578
##$SYMM= 0
##$S_DEV= 0
##$TDeff= 0
##$TDoff= 0
##$TI= <>
##$TILT= no
##$TM1= 0
##$TM2= 0
##$TOPLEV= 0
##$USERP1= <user>
##$USERP2= <user>
##$USERP3= <user>
##$USERP4= <user>
##$USERP5= <user>
##$WDW= 1
##$XDIM= 8192
##$YMAX_p= 0
##$YMIN_p= 0
$$ End of Bruker specific parameters
$$ ---------------------------------
##NTUPLES= NMR FID
##VAR_NAME=  TIME,          FID/REAL,        FID/IMAG
##SYMBOL=    X,             R,               I
##VAR_TYPE=  INDEPENDENT,   DEPENDENT,       DEPENDENT
##VAR_FORM=  AFFN,          ASDF,            ASDF
##VAR_DIM=   8192,          8192,            8192
##UNITS=     SECONDS,       ARBITRARY UNITS, ARBITRARY UNITS
##FACTOR=    0.0002768,     1,               1
##FIRST=     0,             0,               0
##LAST=      2.2672688,     0,               0
##MIN=       0,             -694266,         0
##MAX=       2.2672688,     889714,          0
$$ Real data points
##PAGE= N=1
##DATA TABLE= (X++(R..R)), XYDATA
$$ [...]
2403a403J206l1O59k432L880j663j387L606m298K401r94Q96k166J582K295m855
2419b704M953k578P20r15M09P71l040M532m559M508j946j482M000l880K051l561
2435b721N897m722o75N256m543K805k998N027m777N81K281m447O478p257N170
2450A355q22R1j243j108P251j0741O368n64q51q22k67O104r397P381l511J246
2466D70K32l725O393n942M800n484N646p31n692P418m484L059o281P428j984m991
2482c868O532m003M395p013N849o80k785K378l568Q022r243M154J099o32j163
2497e26k765Q897q614L072l56K004j546l709P759o405L306l596M824n45n660O373
2513B513l074K736o427O589p79m815M604k037M234q306O862o87k636J491k709
$$ y = [-1403, -197, -228, 431, -2001, 1879, 216, -1171, 2435, -1863, 538, -456, 440, -1726, -144, 2151, -2704, 2249, -329, 391, -524, -115, 656, -2384, 2148, -2411, 2097, 151, -1331, 2669, -1211, 840, -2721, 3176, -1546, -2221, 3035, -1508, 1297, -1701, 3326, -1451, -870, 1411, -3036, 3442, -3815, 1355, 533, 624, -619, -1727, 5524, -5217, 1151, 587, -264, -1086, -1353, 4751, -4646, 2735, -776, 470, 702, -3023, 3370, -2572, 2228, -3256, 2390, 1659, -4033, 3385, -1099, 1960, -4321, 3107, 1123, -3868, 2664, -1339, 3056, -3957, 1892, 1212, -1573, 805, -2763, 5259, -3984, 170, 1269, 637, -526, -3291, 5606, -3008, 64, -292, 1712, 166, -3543, 4216, -2189, 1117, -2479, 2345, 1800, -3860, 2513, -561, 2175, -4252, 2337, 1558, -3257, 1347, -690, 3544, -4762, 2100, 1413, -1223, 268, -2441]
2528b441O992q228M333r96K323k206l589R412q280K875k391N578l917l768R651
2543E348p556L957m915O119k713l276N597n577P509r153O839o16l147K387l851
2558c048R180j2783Q076q6k224J484l774R992j2783Q096k750N08J127o132J1253
2573F136j0427P101n060M068J133r226J1732r392O905o885N559J926q856J1278
2587E992j0154R187r207M001L663q387Q893q753J1581j1038L801M732q593P656
2601C374r054J2511j1886M861M077q450R744j1297J2172r623M052Q59n530J0750
2615F560j4611J3792p737K746p41k500R537j6276J5112p859K142k42j939Q502
2629F486j4550J4018r395M848j175l950J0126j3311J2076r373P427l223m446J1340
$$ y = [-2441, 4551, -3677, 656, -340, 1983, -223, -3812, 5600, -2680, 195, -2196, 3382, -535, -4303, 5348, -2208, 1749, -3166, 2953, 240, -3036, 2561, -3016, 4493, -4660, 2179, 1563, -1584, 803, -3048, 6132, -6651, 1425, 1339, -885, 599, -3175, 6817, -5966, 2130, -620, -112, 1015, -5117, 6136, -4291, 2810, -2250, 1818, 2951, -6275, 5457, -3935, 2970, -3915, 1644, 3570, -5286, 5992, -4162, 5025, -4182, -181, 3482, -4905, 3988, -4765, 6816, -4222, -421, 4311, -4282, 3374, -5680, 6831, -5055, -194, 3883, -4567, 5177, -6120, 6052, -3571, 481, 1340, -4190, 6560, -8051, 5741, -1996, 750, 9, -2491, 7046, -9230, 5882, -1977, 165, -77, -2016, 6486, -8064, 5954, -3441, 1407, 232, -3718, 6408, -6903, 5173, -4200, 3227, 4, -4442, 6898]
2643F898j2744J0087q685Q226m001m449J0883j1381J0164j0464Q994k387n537
2656d396Q671q284R879j2625R803j025o047O491n312R244j3235J0157j955m512
2670c146N619o529R509j0331P195k628L68K400q024J1592r309L874k332L763K
2685B023q115J2415q357K581k652L890n33o307R291o460M510m817L464J702n760
2700c125M695l944O300p765L654L174m559K224k703O041p331L057J391j959J708
2715H58l974O550m732J458o63J230O27n257O710l352L60j168L138p65m194N594
2731B420l695K040k399K296P0j889K170k655M025m191J478J477j070l93j148M730
2747C266n339J950R45q69Lj124L474l860K314j120L51Q38k645K840j823J952k462
$$ y = [6898, -5846, 4241, -4444, 3782, -219, -4668, 6215, -5166, 4998, -5466, 3528, 1141, -4396, 4275, -4009, 5870, -6755, 3048, 2023, -4024, 2467, -2845, 6399, -6836, 3321, 1366, -3146, 2473, -4056, 5453, -4878, 2317, -311, 57, 2457, -5567, 6025, -3284, 590, -1742, 2021, 2023, -6092, 6323, -2034, 547, -2105, 1785, 1252, -5055, 4236, -2224, 2286, -2531, 933, 2635, -3125, 1570, -2374, 3926, -3839, -185, 2989, -1570, 654, -2049, 3992, -3339, -282, 1109, -850, 858, -3116, 3434, -1298, 160, -503, 727, 1354, -3903, 2807, -545, -185, -1353, 1785, 1020, -3174, 2420, -1275, 765, -1634, 662, 732, -1157, 1013, -1642, 2383, -1808, -330, 1147, 77, -316, -1464, 3266, -2073, -123, 822, -47, -44, -1168, 2306, -1554, 760, -360, -9, 829, -1816, 1024, -799, 1153, -1309]
2764a309K095L46k914L354k159R71j900K327l58j788K838k310K093j945R92m31
2780i8n61J204k188L183k179M78Q04m82P6j500K758k700R08O26p27J013q63J315
2798A067j840J632j154n55J424j583J391o30J155j055J69P89j982J436p00L48
2814h8k38M08N81q58J271j630Q20j04p45M67k17M37n57J123n53m47O53j88k55
2833a20l21Q05q22K86R04j261P67J30o09k79R71l84o48J281o52r9K75Q8q33R5
2853d26J325j644O16P15r72j46Q82m17n93J125n86m56J160l73l72M17J46r61M30
2872a30N22j216R08n0O7p1N13o97k41J080j103K54K87j77n7M58kq21J122j257
2892f11J20Q42n22L44L2P72j771R69J75j312J156m33j29l82J662j204K20J341
$$ y = [-1309, 786, 1132, -1782, 1572, -587, 384, -1516, 811, 453, -1335, 1503, -807, 1286, -659, 333, -98, -659, 545, -1643, 1540, -639, -161, 643, 161, 237, -1263, 1495, -1205, -297, 329, -398, 615, -248, 1067, -773, 859, -295, -850, 574, -1009, 382, -248, 907, -148, 21, 810, -1172, 264, -436, -88, -326, 82, 663, -195, 1076, -554, 266, 162, -583, -116, -333, 104, -453, 670, 117, -330, 323, 135, -120, -441, 364, -458, -172, 732, -529, 238, 368, -241, -520, 451, 67, -581, 700, 48, -51, 224, 312, -521, -426, 899, -745, -129, 586, -386, -532, 350, -67, -660, 465, -121, -577, 583, 210, -162, 255, 401, -560, -130, 392, -824, 84, 34, 101, 30, 543, -154, -395, 685, -418, -164, 123, -54, -111, 347, 345, -476, 646, -611, -491, 351, -171, 173, 205, 977, -794, 175, 350, -962, 194, -239, -368, -750, 912, -292, -72, 1269]
2910A269j800O93j10K7r07J229J37j663K382j225n41M36N22j086k18K072j972
2927g55J388k40j44j53j39J68j212J884j407J82J396r13l2j89J412k628J601j1
2945B08q06Q29o91J286j812J647j090K80P04j752J860j213R95j604K114n82j611
2962a238K639k150J355j499J876j240k21J565k395K771k695J379m1j28N25j639
2978a136L674m569K867m34q48M75r20L202m490L749j809L32O68k189L162m018
2994b284M060l573K479P40l590M170l289K895l966L677o07l162N233m469L679
3009A993l873L368j492j952M289n261N381m903L856q36j633L018n167O811o767
3024c168L875l76j365K868n099P463p108M007j046p72K740n997P720o114L810
$$ y = [1269, -531, 162, 52, 79, -828, 401, 538, -1125, 1257, 32, -509, -73, 449, -637, -855, 1217, -755, 633, 393, 249, 96, -43, 125, -1087, 797, -610, -428, 968, 55, 23, -166, 1246, -1382, 219, 208, -598, 231, -460, 826, -986, 661, -429, -149, 555, -1197, 663, -550, 445, -1159, 955, 373, -1238, 1401, -749, 606, -893, 983, -257, -478, 1087, -1308, 1463, -1232, 147, 106, -22, 503, -1136, 2538, -2031, 836, 402, -446, 29, -891, 2311, -2179, 1570, -239, 93, 761, -1428, 1734, -2284, 1776, -1797, 682, 1422, -2168, 2002, -1287, 1608, -2358, 1319, 712, -2450, 2783, -1686, 1993, -1880, 1488, -4, -1956, 2333, -2928, 2453, -2450, 1406, 570, -1063, 1955, -3212, 3599, -3168, 707, 331, -1034, 1834, -3265, 4198, -2910, 1097, 51, -721, 2019, -3978, 3742, -2372, 1438]
3039A438k096O56K747p067Q165o031L389k613J233K700o660Q137o518M825l673
3054a368P17L154n680O193o647O969m460p05M898n277M429o061Q194n880o16M954
3070B814m734M396o293P631m966J59K765m083N744p582O498l141Q21K61k510O876
3086D656q868N660j683J040j065k630P627q343M950k101K525j060m121P226n857
3101b044L319l758M600r50m688O956n109L547m726M194M1m150M801l702M501n200
3117b368K520J167k287J777l323O852p028J920K349j622p5k791P123o489K026
3132b49R14k16L40l196N484m818K366j795J404J834m526L938j782J954m327K778
3148A03K109m929L229j004L026m920K660J482l236J476j531M054m490J593J460
$$ y = [1438, -658, -2, 2745, -4322, 3843, -2188, 1201, -1412, -179, 2521, -4139, 3998, -2520, 2305, -1368, -651, 2503, -3177, 3016, -3631, 3338, -1122, -1827, 3071, -2206, 2223, -3838, 4356, -1524, -2140, 2814, -1920, 2476, -3817, 3814, -1152, -993, 1772, -2311, 3433, -4149, 2349, -792, 29, 290, -2220, 4656, -4212, 1448, -235, 805, -260, -2890, 4737, -3606, 1344, -757, 1768, 708, -3413, 3813, -2044, 1275, -2483, 2117, 1167, -3521, 3435, -1674, 1873, -2853, 1341, 1382, -2768, 2033, -1669, 2832, -2368, 152, 1319, -968, 809, -2514, 4338, -2690, -770, 1579, -43, -118, -2909, 4214, -2275, -249, 665, 449, 789, -2407, 3077, -1741, 625, -1170, 234, 2068, -2458, 1480, -302, 1652, -2675, 103, 2212, -2717, 512, -492, 2534, -2386, 274, 1756, -1480, -4, -1535, 2519, -1971, -378, 1082]
3163A082m80n24k165N223m521P40K18J249l80k797N222l497J532k401K412L46
3179A259l708L362j488K664m444L300J285l972J870r68L042n176L449R12k069
3194f82J710k059L753m501K128n70l09J681l809N250l437J364j350J335P62m553
3210c287N582l443J714j631J829O11l575M342l764K734k370J148J448k748K676
3225A266k815M060l953J018J930k903K513k624L985l734J279J064k089K449l349
3240a903L356k269R43Q2j037K815m115L322j589M04j67k48J945l639L719k231
3256f12O17Q6o11J420k320K766k279J821n73j181K000k065J663j919J814r38n02
3273h13K106j979J692j501J080j030j87J359k140K473j868J217q7m15L83j208
$$ y = [1082, 602, 78, -2087, 3136, -1385, -645, -427, 822, 442, -2355, 2867, -630, 902, -1499, 913, 1259, -2449, 913, -575, 2089, -2355, 945, 2230, -1742, 128, -840, 2202, -2974, 475, 1387, -682, 1028, -1031, 2722, -1779, 349, -221, -530, 1151, -2658, 2592, -845, 519, -831, 504, 1266, -3287, 2295, -1148, 566, -1065, 764, 1375, -2200, 2142, -1622, 1112, -1258, -110, 1338, -1410, 1266, -1549, 2511, -1442, -424, 1506, -1397, 1116, -1508, 2477, -1257, 22, 1086, -1003, 1446, -1903, 1453, -816, 127, 209, -828, 1987, -2128, 1194, -395, 9, -158, -406, 1539, -2100, 1619, -612, 5, 91, -520, 900, -1420, 1346, -933, 888, 315, -866, 1134, -931, 732, -1187, 627, -311, -813, 1293, -686, 1006, -495, 585, -445, -632, 727, -1413, 1060, -808, 409, 322, -93, 290, -918]
3289i18J703j852J227R8q20J236o74Q92j814J467q14k76R01q95R10m44R28q74
3307a9P1N11j575J032k92O9P4M66O9r48J512j184J42N6p9j25J76M79o39O66m34
3328B8l91K57k00J93j88O35n03O8M69l67j43N78l55k58L94j39l87P17k56J8j9
3349A51k29j56L08L15p77N73P9l02J75K36m73k66N63m33J78L84k45j69K88j04
3369I6p73R68j72m35N82J2k96J89K38p92J18N94r33L33N39j65m04Q27l16n31O21
3390C00n81j71N06P6m35N17J92p18O05j41k71j92L82k21j49O51n39K54J2N4n44
3411d13L82J28n13P98k34j09L57l18J9l97P83j279P86k9k41P39n14M75n80N39
3431C79n85n0Q27j360J154n48O10n16K12M84j449J807j667P92j11K64m43o19K400
$$ y = [-918, 785, -1067, 160, 258, -562, 674, 0, 892, -922, 545, -269, -545, 356, -539, 371, -73, 855, -19, 52, 563, -1012, 20, -272, -203, -129, 337, 406, -542, 970, -214, -72, -16, -95, -220, -44, 435, -204, 462, 28, -363, -106, -306, -113, -301, 334, -169, -101, 368, 1, -142, 436, 81, -177, 217, 78, -309, 408, 152, 170, 151, -78, -234, 74, 389, -388, 185, 264, -38, 137, 373, -100, -366, 197, -236, -58, 326, 81, -88, 200, 96, -677, 291, 119, -316, 266, 278, -18, 171, 409, -383, -265, 329, -604, -271, 268, 103, -301, 526, 210, -321, 300, -281, -452, 54, 130, -305, 212, 404, -314, 291, 150, -121, -313, 69, -152, -301, 350, -189, 65, 77, 131, -413, -31, 97, -416, 382, 148, 39, 396, 78, 97, -300, 483, -796, -10, -39, -280, 459, -55, 420, -160, 379, -206, -256, 571, -789, 365, -183, 427, -89, 123, 607, -842, 965, -702, 90, -21, 243, -200, -819, 1581]
3450A581k267J190o28r3M9n46J349j897K214j268K07Q20j025Q06j477K228k189
3467i46Q97Q02j865J912j397J603k161J344M36j430J753k161K609k305J043J20
3483B54o85J526k955L066k106R62M9q27J942k706L150k692J524j49j099K131k842
3500a457K364j784J908j318o30K926l711K551j567J544j580J40K142l306L112
3515A334k273J666q33l32J065j768K749k877J642N2r51P25q97K601l849K628k07
3532D75j073J086j244K371l411K573q08n27J176j882K694k484J676q93L73M86
3548E88j809K424k064J528j509J136O35k088K003j759J955j972Q53J194j969J245
3564C91r30K058k785J332Q92j862J175n88J445k155J599m41m48J068k159K061
$$ y = [1581, -686, 504, -124, -217, -168, -714, 635, -1262, 952, -316, -109, 711, -314, 492, -985, 1243, -946, -49, 753, -1112, 800, -597, 1006, -1155, 189, 625, -805, 948, -1213, 1396, -909, 134, 254, -431, 1095, -1860, 1206, -900, 62, 111, -716, 1226, -1480, 1670, -1022, 502, 353, -746, 1385, -1457, 907, -877, 1031, -287, -917, 2009, -1702, 849, -718, 826, -754, -614, 1528, -1778, 1334, -939, 727, -106, -438, 627, -1141, 1608, -1269, 373, 425, -526, 199, -698, 1903, -1946, 682, 475, -598, 488, -756, 1615, -1796, 777, -31, -558, 618, -1264, 1430, -1054, 622, -271, 102, 588, -1221, 1203, -861, 667, -842, 294, 929, -1159, 844, -915, 1040, -932, -79, 1115, -854, 391, -539, 1519, -1266, 66, 958, -904, 271, -317, 1128, -1027, 572, 131, -317, 751, -1408, 653]
3580F53j050P76j197J508N66k593J875l19J64j892J809M54k037K011o11Q89j753
3597g47J119o5j029J160j675K616k301J159%j03P03k362L111k616J174n01N25
3614A68O09k239K973k078J323j523J068N81k866L167j771J459k083J692N32k664
3630a652K860k538K744k530J421L62j697K626l589L861k649P77K42n16J813l963
3646b428M708l115R94j62l78J618l545M442l392J911o77n22K005l250L738l503
3662a556K428j131o99K785l539L400l389L097k072k61K566l484L661l235K557
3677A128j565j09J910l331M052m055L301j841L0J644k517L160l767L198j944R
3693f97J716k535L082l143L190k415Q58R00k610L028k967K887k218J269K62j799
$$ y = [653, -397, 379, -818, 690, 1256, -1337, 538, 219, 383, -1509, 300, 754, -1283, 728, 117, 1006, -747, 372, 307, -722, 438, -1237, 1379, -922, 237, 237, 134, 837, -1525, 1586, -1030, 144, -357, 168, 777, -1462, 1511, -567, 756, -767, 301, 882, -1984, 1183, -588, 871, -1212, 480, 1012, -1652, 1208, -1330, 1414, -1116, 305, 667, -1030, 1596, -1993, 1868, -781, -4, 238, -278, 1535, -2428, 2280, -835, 159, -3, -381, 1237, -2308, 2134, -1258, 653, -24, -546, 1459, -1791, 1947, -1556, 872, -259, -958, 1827, -1712, 1688, -1701, 1396, -676, -937, 1629, -1855, 1806, -1429, 1128, -437, -546, 1364, -1967, 2085, -1970, 1331, -510, -480, 1164, -1353, 1807, -1960, 1238, -706, -697, 1019, -1516, 1566, -1577, 1613, -802, 56, 956, -1654, 1374, -1593, 1294, -924, 345, 607, -1192]
3709a192K798l329K554j507Q87j69q96K349l255L041j546J44R7n87J671k466K588
3726A182j913Q86K74q66J350j952J778j547J268m03r10J908j684J342j270J266
3742G09p74o26J528j663J593j348J103m24k79R19j385J574j503P16j37k01K39
3759D1l29J009j654J197j08m37L18j13N56j040Q94o08K45L01q98R83n60K08m10
3778d05Q02k38n23O69k99n7k06N21k23k28M25p40O22k89K70q3n6K83n39Q99r11
3799c06R2L33l23J1J79M74m78L77l40j09J04k04L83o34M00j80K31K59m95L82j17
3820C9P8l47M23k90j23M12l79L52k1j24j01k2L83m81M24k48j45L51K29l09l74
3841b73O12m20n3J76l81j3K69L89n41K71K21j32l5m33L48j33M87k99j13L03k36
$$ y = [-1192, 1606, -1723, 831, -676, 211, 42, -854, 1495, -1760, 1281, -265, -121, -24, -611, 1060, -1406, 1182, -731, 155, 429, -437, 913, -1039, 739, -808, 460, 57, -853, 1055, -629, 713, -557, 709, -65, -691, 837, -826, 767, -581, 522, 98, -181, 738, -647, 927, -576, 140, 3, -198, 41, -288, 721, -933, 264, 156, -281, 37, -76, 480, -560, 334, -274, -29, 272, -626, 357, -203, 5, -405, 397, 159, -364, 305, 6, -51, -257, 264, 41, -187, 238, -502, 120, -169, 101, 18, -38, 245, -294, 605, -306, -214, 119, -204, -193, -14, 460, -18, 359, 19, -90, 14, -190, 193, -441, -41, -221, 10, 269, -226, 156, 39, 117, -230, 193, -97, -220, 192, -187, 165, 144, 20, -81, -103, 280, -201, 223, -25, -170, 181, 410, 101, -273, 339, -81, -134, 42, -339, -352, -83, 306, -235, 36, 257, 125, 90, -343, 5, -128, 359, 60, -53, 250, 14]
3862A4Q7O1k69J88j56K70j47J16j85J19J87m16J98r6Oq1K99M9m69M85k57k2l3
3885e2K75n33N3M40k72M6J05J7k25M15rp93P82n06P6L83J04l92L35K13r24M04
3907e8P8J30k66K12j44n29Q58k72j01O4J52p9m42P58p61M45M0l50J50lN37p93
3929c74O69m04j29K56n75Q09p42O90k61J88k6l41P02q43L26j61K30k21J73O64
3949F30j097Q61n02K61k02l05L60o00J130j076N08N17o47Q9l11O94j252J055k0
3968I3o22P85j76L53q35P94m51m22P44p63O39k79N67o30J45M24r01R66p43L3J4
3989b65O38j87o26J180p48J45m10L76J80o31N82m69O84p47P07k38k93M39o26Q20
4009E11q49P42m11k9L68o54N15l55M74o22M16M12j292J019j17o3o23R80l13p95
$$ y = [14, 101, 162, -107, 81, -75, 195, 48, 164, -21, 98, 285, -131, 67, -29, -23, -104, 195, 244, -225, 260, 3, -19, -52, 223, -310, -257, 183, -89, -43, 62, 79, -146, 269, 260, -533, 249, -257, -181, 202, 306, -86, 249, 462, -462, -58, 20, 150, -116, 96, -48, -577, 281, 9, -92, -28, 124, 45, -397, 361, -400, 45, 85, -265, -115, -118, 419, -374, 295, -109, -238, 18, -557, 252, -490, 200, -61, 127, 101, -240, 462, -381, -55, -216, 14, -207, -34, 630, -467, 394, -108, 153, -49, -354, 6, -594, 536, -540, -32, 485, -162, -73, -384, 310, -942, 113, 93, -529, 256, 80, 433, -402, 392, -59, -481, 263, -500, 139, -140, 427, -203, -58, 366, -535, 431, -312, -279, -265, 373, 186, -440, 740, -8, 137, -273, 103, 283, -348, 234, -235, 449, -298, 409, 171, -122, 317, -309, 511, -338, 404, -7, -36, 332, -322, 193, -162, 312, -310, 106, 518, -774, 245, 128, 65, -558, 422, 109, -686]
4029f86J152o27J36m29O85l49j45Q47j406J353n74q0O9K34L13j550J982j199O0
4048b14J38M73L5j338K129j634K90j87J63N86j323J530r76Q78j117M13R89j672
4066h37J376j280J625j438K74J135j416J258j688J834j216l29J078p03J229k426
4082a524K723j319k83R25q81J402k547K635j253J26L82j202J933k210J764j416
4098g45J377m74j534K966k684J601j275J543p97j370L172k869J898j578J442m18
4114B55j408K494k242J976k435J741L22j388J507j905K621l075J770K87j156J482
4130H46k305K918k461R30j8l38J575k899L336k370J115l37j61J024k746L243k095
4147g43J197n33L8J007k180K101k024J682o02l48J581k182K052k016K096j577
$$ y = [-686, 466, -161, -25, -454, 231, -118, -263, 584, -822, 531, -43, -123, -54, 180, 493, -1057, 925, -274, -214, -76, 397, 432, -906, 1223, -411, -121, -308, -145, 441, -882, 648, -328, 550, -567, -154, 835, -837, 539, -741, 884, -554, -280, 855, -561, 697, -991, 843, -373, -702, 376, -327, 902, -1524, 1199, -120, -403, 522, -359, 1043, -1504, 1131, -122, 4, 386, -816, 1117, -1093, 671, -745, 632, 158, -1376, 1590, -1094, 507, -768, 775, -22, -1392, 1780, -1089, 809, -769, 673, 255, -1153, 1341, -901, 1075, -1360, 381, 703, -685, 822, -1083, 1538, -1537, 233, 520, -636, 846, -1459, 1459, -1002, -72, -90, -428, 1147, -1752, 1584, -786, 329, -8, -169, 855, -1891, 1352, -743, 454, -79, -41, 966, -1214, 887, -1137, 545, -57, -405, 1176, -1006, 1046, -970, 1126, -451]
4163d51j93J378j596J513j601K161j385R9P12j268J627k174J789j190N29M06o42
4180b86J497k037J501r38M61m91j36J505k046J737j052N55j55o32J064j200J091
4197D38j219J340m93l26N18n55O44j525J604o63j26P67p06R32j243J081p65R0
4215b07K70m84J421j351N98k23K09k41l56P79q31N19j34L95m29J20J98o99Q18
4234C72r15N63j47K78K59l05O11j303J040m31l44J00j24P82q29R38n57J9l2l78
4254d03P30p70N48n67Q30j69l98P55r15M93k90K90m68L4N23n56P86n76M09k13
4274G3l97M39n80Q21p70M66MJ1K38n86N67q98O62M05n24M33k48K19n39N90n06
4295a20k31M85n06N24l74L58j28M5J51n81N61n16K78O0j56K77l45M53n13J54J58
$$ y = [-451, -644, 734, -862, 651, -950, 1211, -174, -75, 637, -631, 996, -1178, 611, -579, -50, 356, -286, 1211, -826, 675, -263, 198, -293, -429, 1076, -970, 767, -285, 270, 115, -517, 547, -653, 438, -781, 559, 66, -260, 258, -297, 347, -1178, 426, -237, -363, 404, -302, 630, -613, 468, -297, -207, 63, -421, 1000, -351, 247, 24, 233, -8, -364, 415, -416, 103, -31, 364, -65, 55, 253, -446, 372, -543, 20, -127, 151, 410, 105, 716, -587, 453, 22, -322, -222, -346, 436, -393, 545, -12, 7, -25, -403, 327, -443, 105, -462, 368, 199, -199, 556, -359, 134, -156, 134, -334, -300, 223, -333, 453, -123, 286, 73, -324, 115, -465, 356, -414, 52, 56, 67, 305, -281, 286, -612, 50, 455, -69, 364, 116, 335, -204, 386, -120, -351, 134, -372, 152, -222, 136, 8, 53, 204, -377, 184, -332, -54, 6, -150, 127, -218, 235, -278, -124, 34]
4316C4j05J50l3M6l45M91k20k78M81n08M93j75m6j58L08J3l54K74l27J05J64K83
4338B93j25k04L57n29L71p2l46m8K76J19k16L21n6j24J01J1k2o25P99n23K79J46
4360A83j1J7%j52m69K53J95l08L27J84j90K74r8l29j02M28n57L43l75L70r4M27
4382C16j44n0o6k33Q4N6J66j14J72j74l5K18k67j85M91n34M3L01O8k90K78n7m00
4405c56N09j86j22K1L49k35k29O15l12j7k06K68l99M08J01n48N78k5n10J15M05
4426B24O9n76N65l88N7J24m7o2q1L80n18L26Q9q0K10k29L43n60J95l10R6L15k08
4449f6J38l13N12l49M43k75k69j0j75P05k98l1J28j20j94k22O87o40J81j4L99
4470B17l60M5O42o51N06n54R7m1J74j21l68Q19n01K3J94l33J7m9P55j019M96M26
$$ y = [34, -71, 79, 46, 92, -253, 238, 18, -260, 221, -287, 206, 31, -15, -173, 135, 148, -206, 68, -259, -154, 10, 293, 168, -36, 321, -208, 163, 91, -255, -303, -27, 92, -124, 197, 141, 17, 118, 129, 107, -518, 281, -242, 37, 183, 172, 189, 189, 37, -432, -179, 16, -292, 35, 219, 29, 303, 205, -124, -226, 202, -355, -12, -387, -17, -111, 316, 172, 122, 56, -177, -93, -37, 129, 15, 187, 13, -22, 196, -71, -256, 235, -299, -256, 45, 113, -177, 101, 44, -356, 153, -33, -155, -134, 215, -20, -249, 366, 54, 37, -169, 99, -300, 108, 209, -339, 239, 214, -296, -181, 224, 293, -283, 282, -106, -49, 75, 28, -34, -115, 265, -253, 73, 162, 82, 292, 63, 406, -154, 41, -269, -173, 142, -66, 72, -241, 271, -78, 365, 90, -179, -189, -364, 341, 43, 12, 140, 20, -174, -396, 291, -349, -168, -182, 217, -143, -98, 544, -107, 399, -155, -58, -99, 75, -46, -414, 405, -96, -73, 121, -212, -195, -244, 511, -508, -12, 414]
4492D14m14J04j97M64q53P13j24n52Q04p00P44l68K22n79K24M71r78Q95n68O58
4512C80m73K1M40p89Q17n48P53q12k34Q87o41N13r04J187o41k68P40q45P86q45
4532d76Q20n29Q2M04o06J198j500P87j2k02J46o22J731k001J123l08NJ84p03J564
4552A085j908J001l65j68L67o60J157j263J227j105P65M28j409J300j207J475
4568G20j166N98L67j312J314r29J135j217O28J89q77J105j220J161r10N40L82
4585E08q89O62j032J481j308O04J93p37J227j318J193j139P64r4m90J028j411
4602g58J339n89L55k99j96P21j481J473j040O64l86R3N12j063J158q48N11m42
4620b76J42M57o98Q74j029J018n05j91M63n41Q44j121J034o70K01L79o27O07j120
$$ y = [414, 0, 104, -93, 371, -482, 231, 107, -445, 359, -341, 403, 35, 257, -322, -98, 373, -605, 290, -278, 380, -93, -72, 368, -421, 396, -152, 601, -211, -445, 442, -199, 314, -590, 597, -44, -312, 428, -417, 369, -476, 344, -185, -103, 301, -305, 893, -607, 180, 168, -34, 112, -510, 1221, -780, 343, 35, 40, 224, -479, 1085, -823, 178, -187, -355, 12, -648, 509, -754, 473, -632, 133, 561, -848, 452, -755, 720, -446, 152, 519, -793, 521, -408, 727, -490, 138, 327, -550, 555, -665, 496, -414, 126, 508, -381, 281, -751, 730, -578, 26, 219, -518, 709, -609, 584, -555, 209, 115, -375, 653, -758, 581, -8, 347, 48, -148, 573, -908, 565, -475, 189, -197, -104, 408, -655, 503, -345, 166, -276, -134, 323, -375, 499, -530, 488, -17, -208, 255, -286, 558, -563, 471, -199, 2, 381, -246, 361, -759]
4639g59J339q67L73k51J04M59r70J060o48L95l73Q1M32p77Q52q37P76o27L35M7
4659A44j26N78j094J255r55j15N21k61L36q77J294p92R3m6J8K66p66J157j159
4678e29P06k97P4N92q93O78q63R08p12J54N11q36J063n65O34r76L77K47q98P96
4698A71o66R42n85K32K17o79R72j529J544p00r0L37m35R69j279J133o72L7R5j30
4718a16Q07j346R61o78N68k72m14J004r88R12q91P26j55l80O47o81O69o15N05
4737B63k67q9P08r95Q48o76N17k63k61N59p11Q84j103J059j87n59L54m91Q38j077
4757f49Q19km50N18p99J100o35M05m40J65J16n00P44o08N44m34K34jo93J018q57
4778d05N18k81Q8J69l21P22p08L52k42n7N81o17L05l41P02n81K71K10o22K42r7
$$ y = [-759, 580, -287, 86, -165, -61, 398, -572, 488, -160, 235, -138, -57, 375, -402, 450, -387, 389, -238, 97, 144, 18, 596, -498, 757, -198, -313, 208, -53, 283, -594, 700, -92, 1, -45, -27, 239, -527, 630, -529, 177, -120, -46, 546, -347, 331, -532, 376, -336, -182, 329, -507, 556, -9, 625, -351, 26, 273, -625, 171, -495, 447, -138, 94, 311, -368, 604, -925, 619, -81, -171, 166, -269, 700, -579, 554, -118, -81, 14, -116, 691, -655, 306, -372, 196, -76, -490, 514, -474, 438, -453, 273, 118, -262, 385, -296, 373, -242, 263, -4, -93, 615, -380, 468, -208, 309, 46, -215, 344, -367, 517, -586, 473, 286, -273, 81, -410, 428, -649, 170, 168, -282, 236, -563, 537, -98, 307, -133, 32, 148, -352, 392, -216, 328, -106, 128, 127, -566, 452, -405, 113, -168, -80, 89, -232, 490, -218, 134, -108, -165, 416, -201, 104, -237, 465, -116, 155, 365, -257, -15, -112]
4799a12K26l98K56M20p03O46l91k9K42k03J67k66K78j90Q8J56l27MK0J91k73L07
4821A09j70J3K47l35K82j93l7k4J27k41M1M11k33P4j19M19l95k15L68q8r8m08
4843d65O08J1j38K2j13L05m18P5J81J81l49K7J91j68L5J27j93JJ64J0k16K12j62
4866g2O1j36J1q2K34J32l67J65K8k1q7K13j86J34J69l56J23P0r2r4L5J98k80J5
4890a85L55l46J77MK37l77J46P2j91J32QQ3j97J85q9P0o5j07L08j99L7k36J19
4913e9J06o0P7q6J28j50r6K72k23q9M64j28j32l5K22m13J71p4J40K3K4J51l28
4936i5M49n87K70k28O8k01M42R2l48L55j53M2o0k4J22m19N04l10K6J58j99R8k64
4959b62O83o18J44K07o9Ll58O00p70N82j36k45K21p9J90m08M80j12l01L26k57
$$ y = [-112, 114, -284, -28, 392, -311, 335, -56, -85, 157, -46, 121, -145, 133, -57, 31, 187, -140, -136, -116, 75, -198, 109, -61, -48, 199, -136, 146, -47, -84, -108, 19, -222, -181, 230, -3, 71, -48, 371, -24, -239, 129, 41, -57, -465, 143, 154, 16, 38, -75, 230, -188, -113, 68, 249, -100, -73, 118, -50, -15, 112, -81, -80, 84, 94, -122, 90, -72, -11, -147, -136, -218, 16, 148, -219, -54, -26, -47, -134, 79, -107, 27, 196, -160, -37, 33, -59, -153, -118, 80, -200, -185, 170, -176, 1, 5, 242, -135, 11, 83, -108, 24, 32, 115, -82, 103, 14, 84, 19, -88, 220, 21, 58, -178, -59, 47, -13, 64, -22, 106, -44, -140, 132, -91, -180, 284, 156, 24, -11, 211, -202, -31, -105, 35, 58, 82, 233, -95, 354, -233, 37, -191, -123, -324, 118, 210, -138, 217, 64, 106, 46, 22, 144, -275, 229, -81, -55, 103, -96, 2, -262, 421, -197, -53, 154, 85, 88, -270, 330, -440, 142, 6, -239, -18, -97, 93, -315, 165, 53, -248, 78, -179]
4980a79K47n33N31K9q0k26L9O93q40N07r0k42L05k32J67l07L96j60n19P35m93
5001b52L77l72N08m43K64L9o66Q92m80J44j62L65J49n01N30p87K96K48j82L9m09
5022d03O34n75P67n35J77N9k74K47n00L80l13L65K76j88K09m87O62p22M9K37k45
5043a80N05n81M24k75N4O7n4L24p07N95j41j73K68Q1J01p29N74k70M0K7NJ93p47
5066e99P27k34M13m17k02O75o04K76j46L20n93R2N58o12M06k57N74o01K03P6m
5087E1J94q08J017l64j20j65L09L00j000R39k95j79j44L98L70q33Q93q64N99o46
5107c48M10L90n20L01l76N51q31M29J79m14M57o36R79r86L19J66n7J90o99J242
5127G46j088L33r0P7L05j039J125l94J52n02L73O74j159Q56m68K64l86P9Q37j040
$$ y = [-179, 68, -465, 66, 95, 15, -211, -172, 521, -319, 188, 98, -144, 161, -71, 96, -211, 185, 25, -494, 241, -252, 125, -247, 261, -182, 82, 121, -545, 347, -133, 11, -151, 214, 363, -138, 392, -395, -99, 149, -33, 6, -403, 231, -344, 423, -112, 65, 124, -150, 97, -403, -23, -336, 29, 305, 117, 326, -161, 501, -221, -172, 65, -180, 325, -256, 168, -107, -53, 14, -40, 284, -423, 172, 31, -142, 126, 207, 308, -421, 153, -117, -77, -50, -45, 148, -599, 128, -106, 307, -110, -312, 363, -241, 35, -111, 209, -384, -292, 266, -346, 60, -197, 377, -224, -21, 55, 51, 245, -563, 454, 90, -30, -195, 114, 414, -586, 353, 58, -121, -265, 133, 503, -330, 563, -301, 298, -348, 62, 452, -68, 233, -143, 408, -423, 6, 185, -229, 228, -408, 571, -415, -96, 70, 13, 203, -496, 746, -342, -9, -99, -22, 283, -756, 369, -25, 127, -375, -2, 672, -487, 369, -99, 165, -221, -142, 695, -345]
5147c45P91q37J014r09m6N56n08O30j038J206q77j6O21l92O91j436J599p81n0
5166a27L24m02J086j593J231n05J42m36k03J360j555J050o49M60m34n3R18j206
5184e92J052o97L30j73m15P86l75L79q09R43m19m07Q09o56P17r13O04P9r32J088
5204C99o70O89q70N48K8j19Q2o46R23o48K23J70j19M06q67R93q57L15j58j46Q70
5225E46p40Q30p91L12l06j11L89p61O48k1K58n01j12Q52r43N72m93N43l59R9M26
5246C37m14K68l54L97m48L94J21k49J4l89O00j88k66J20m5J84k28K07m65K74J84
5267E4J34K02o16L48j54j7k6j15K12j1K14k28l4P2j60M79m65L0k6O6m3K72j5j73
5291@K39m96K05p4O3J2j1l6l06P63k46l69J49K0L25m67K64N5n1j84r7K19o6l4
$$ y = [-345, 446, -391, 623, -286, -332, 224, -284, 346, -692, 514, -363, -379, 242, -150, 541, -895, 704, -77, -127, 197, -205, 881, -712, 519, 14, 156, -280, -483, 877, -678, 372, -277, 183, -251, -304, 614, -592, 460, -237, 93, -80, -495, 291, -84, 295, -514, 429, 10, -397, 412, -244, 473, -440, 164, 243, -689, 399, -271, 418, -452, 96, 124, 5, 87, -559, 364, -284, -61, 109, -10, 396, -471, 522, -335, -20, -178, -324, 546, -194, 636, -155, 157, -149, -260, 129, -632, 16, -5, 253, -248, -360, 492, -451, 121, -372, 171, -188, -89, 337, -77, 191, -163, 234, -214, 180, 301, 52, 66, -323, 277, 89, -177, -57, -102, 82, -146, 61, -404, -130, 54, 188, 390, -226, 122, -32, -49, -75, -190, 22, 11, 225, -3, -37, 35, -125, 354, -111, -81, -107, -41, -84, 188, 173, 0, 239, -257, -52, -126, -63, -51, -62, -98, -404, 359, 113, -256, -107, -87, 238, -229, 35, 90, 39, -145, -242, -23, -89, -123]
5315a23m9O63m89l34N49j98p2k21O28n38Q0K96l77J23j33K09j22Pk8l7L48l47
5337a65L49k19m9J29K8K9n19M62K32k84J08k89K47l1j21J20k32K92j93K49j79
5358c6P2KP1l38K92J36k61R2J78p1k09J24O5l3j21r2k2P2j61L0K59J6j81K52j28
5383Hm01K56J88J90l14J96j28O4j14q4J67j53P8K7JK04l59L1J78J18j83r2N84
5406D62p57M70k56L3R7J10j77k62M90k09l7J72j64j09J83j50K86j22j36K10j73
5427c9Q5K17m74K29j53M49m77K69j32J1kJ21j26j90K56J76l59L29j52j68J54p8
5449e4n1j01L75j75K4J4P9p1J40J02m85K80j50j62K04o4K65l81L05M5k16L4r4
5472a37R1J37k12O1j06L00pL4j03l0j63J11O3j5K50k91K40l62J97l4N8P9k71Q3
$$ y = [-123, -172, 491, 2, -332, 217, 19, -53, -274, 354, -184, -104, 192, -185, -62, -195, 14, -108, -101, -129, -166, 182, -165, 184, -35, -84, 45, 73, 102, -417, 45, 277, -7, 101, -188, 59, 28, -93, 27, -205, 87, -106, 143, -36, 36, 38, 109, -229, 63, 199, -62, 30, 208, 137, -72, 52, 117, 84, -37, -129, -151, -79, -240, -210, 49, 65, -116, 136, 8, -393, -137, 51, 241, -73, 123, -5, 59, -55, -139, 28, -125, -47, -20, -19, 185, -174, -143, 35, 153, -30, -122, 462, -295, 175, -81, -48, 49, 159, -18, -280, 210, 1, -36, 136, -28, -137, 46, -104, 182, 60, -76, 134, -39, 46, 263, -211, 18, -135, 314, -163, 106, -26, -15, -17, 104, -22, -212, 44, 220, -139, 190, 38, -130, 24, -54, -105, -206, 169, -6, 18, 32, 111, 40, 180, 282, -203, 77, -73, -235, -31, -95, 170, -211, 94, 139, -77, -43, -137, -46, 91, -121, -60, -166, 134, 127, 161, 58, 28, -135, -24, 39, 24, 274, -17, 223, -139, 58, 24, 82, 161, -110, -27]
5496b7K8J33j89J15O6k17N1J67j32k25N4K10k07P7J47J5l70L77J9k52K07j32K99
5519B14j71j50J96m2J10j71qL5j58J44K4J9j63oK6J54j29K22m9l09L76k42R1j37
5543a24J48K0n80P07k04J57l32J48N0k95N14m54O94n13J27M8l96N73n65O94o62
5564b45J23K91m49M18n18R44o05j82M44j34J44r10R43l11L8M0n1N22r98Q50o61
5585c07N82k49l36P83r67P81n42P33o37l43R76r15M84m24P48m93k5N36n76N81
5605C90o63N55m40K00L82r13J098r42M97k17j91M00m20P05r75Q91n40J22q3k60
5625d04R11q08O81l99kRl82Q38p70N44k36nJ24m48Q09q12O81l85J39l2l20P35
5647D68n91L02m47K53L12o28M78m68O93p02K48K54o17M90k04N40o00K09P7k40
$$ y = [-27, 1, 134, -55, 60, 126, -91, -40, 127, -5, -230, -176, 34, -173, -96, 51, 66, -304, 73, 92, -160, 47, -85, 214, 43, -107, 89, 47, 157, -14, -22, 13, -145, -1, 23, 42, -121, -127, -101, 53, -76, 146, 97, -212, 164, -78, 13, -124, 24, 44, -536, 171, -33, 124, -208, -60, -10, -305, 209, -245, 449, -64, 63, 111, -285, 288, -277, 417, -245, -122, 169, -280, 138, -380, 564, -41, -223, 221, 87, 231, -679, 264, -47, -9, 31, -20, 502, -496, 354, -307, 275, 26, -310, 473, -494, 287, -255, 478, -159, -502, 474, -441, 43, -381, 367, -126, -151, 385, -191, 390, -273, 282, -158, 42, 424, -489, 609, -333, 164, -53, -244, 156, -264, 441, -534, 357, -183, -61, -144, -404, 507, -301, 380, -19, -21, -12, -394, 444, -326, 218, -18, -23, 101, -347, 462, -350, 331, -54, 85, 53, -267, 468, -123, 179, -268, -15, 297, -331, 147, -321, 372, -330, -82, 172, -445, 45, -159, 381, -219, -10, 67, -173]
5667a73J53l32Q94q51L50j76K03K62n86N07m88J70n3R7Q9m91P90o93L29k22L34
5688A13K46o46M19n36N89l09K6J86j55L42l87K42p4M0n6j14J03r4J62k16K36J27
5710B44j94K4m01M81m2r2R7J22o1m83N98k83J9J39k76J36j08K54l81M46j49j94
5732a04K64k75K31k73Q2j11J18k59L37J9j89K30j29j43L01j94L58j99K76l14K22
5753B48k48mJ67l19M64m65K77j17o7K30l03L80k96L9p4N9J47m46O57n80K80k7
5775BJ68j79JQ7l27M6L6N7R6J12O8m28M42k42k13M87k42J74m70M02j02j83K21
5798A3J11K12l99L63l78J28j54J78J39k63l8o6L62r3j91J73j33J80m28K01K00
5819A17k66K93k01j2l5J6N6k33M84k81J9o6J82M5O4m1j90J56p7p8j52L72j31l82
$$ y = [-173, -20, -352, 542, -309, 41, -135, 68, 330, -256, 251, -237, -67, -120, -23, 66, -425, 365, -328, 1, -221, 113, 359, -287, 132, -404, 185, -124, -98, 88, -67, 275, -112, 130, 56, 96, 40, -74, 29, -65, 97, -119, 117, 244, 50, 74, -327, 154, 112, 20, 117, 239, 178, -305, 293, 10, 29, 168, -108, 28, -80, 174, -207, 239, 90, -104, 160, -115, 116, -157, -75, -186, -68, -327, 10, 29, -160, 70, -59, -202, 99, -95, 263, 64, 340, 26, 248, 0, -4, 163, -156, 308, -157, 120, 3, -64, 166, -137, 243, -53, -14, -88, -29, 118, -328, 329, -251, 29, 2, 170, -9, -8, 79, -248, -202, -166, -109, -13, 99, 167, -261, 181, -61, -274, 213, -29, 145, -325, 77, -25, -208, 13, 124, 336, -63, 300, -78, 50, -104, 74, 213, -50, -88, -154, 208, 115, -76, 97, -36, 144, -284, -83, 117, -149, 144, -57, -69, -104, -88, -32, -265, 219, -62, -43, -109, 73, 118, 182, 141, -49, 107, 30, -48, -200, 172, 41, -341]
5843c41L68k09L6L07l30N1K29J93l28j04J45j62K57k89J83m9J87k56J7K39l72
5864b28J92M4N6O7k12P6j20K72o2k32L37j23Q4l42K52r2p0J85r9J25r8K18l32
5887a02L6N8J74l25j76N72k74M0kJ32J03j70O3j39M00l20N8j97kO1j68J49K21
5910A92r6k59J96j19Q5q2K75j56j86J20k6K4J89k89L4Q8l3j74J99J8j81N02k04
5933A17k35L9J31K14l26K00M3o7l14J81P6p2J10Q5k97n9K25q2o4P6K53l29J72
5956G7j78p1j78K68j35J75j65K76r7k16K38J19R1k48J05j51P6M9k41L65j36q2
5978e9J80n8o2k08J10n8R5k6K8K59l14n2R8J51K8k81J53j09J54j1J17k07O9J4
6002A1j1Q1k86M33l09p2L57k05L82n77J21L6l7K6k20K98j55K31j08j72J79o8J26
$$ y = [-341, 27, -182, -146, 161, -169, -118, 111, 304, -24, -128, 17, -145, 112, -177, 6, -43, 144, -112, -95, 144, -228, -36, 8, 64, 131, -81, -5, -125, 147, 85, -147, 190, 67, 151, -191, 61, -31, -101, 84, -15, 110, 12, 230, -102, -66, -8, 166, -159, -335, 237, -37, 3, 1, 133, 236, 66, 129, -10, 390, 70, 128, -69, -71, -10, -178, -29, 192, 96, -163, 33, -86, -1, -83, 192, 36, -150, -30, -56, -32, 157, -132, -98, -10, -43, -217, -18, 0, -181, 321, 117, -118, -79, 52, 266, -60, 140, 183, 116, -198, -17, 59, -13, 97, 182, -115, -174, 51, -31, -95, -19, 234, -95, 77, -101, -172, -350, -82, -217, -42, -207, 69, -28, -244, -6, 113, 204, -44, 61, -90, -14, 35, -206, 159, 23, -59, 121, 63, 1, -207, -97, -155, -60, -86, -58, 201, -113, -165, -67, 84, 112, -169, -16, -125, 29, 18, 135, -72, -3, 11, 0, 81, -205, 228, -81, -153, 204, -1, 381, -196, -75, -39, -76, -50, -270, 28, -127, 104, -4, -176, 3, -65, 61]
6025F1j76K93l50L33k55j05L60k55K36k54K27K7j64K48l58K90k75p2L39o9k9l18
6047b66L75m5j48Q0j39K55p9J14k77K01k16L20M4m08L49n44L13J68j89K27l20
6068a85L76j52K00k99m0J41l64O92n05K02j99J32L15o05O73n22K88l84lM94m49
6089a94N22n86N01k98M3L04m89M60j90J16m52L40J71m18L19k39J91k44J16Q1k32
6110a78M85l82J67j30J13q8j23L30m17K81k18PK01j24J34m04O17m13N2J09l25
6131c06K52K26k44nN1k1j25J07r2K91j35j33j31J46J86k58K03j57L62k25o6J90
6153A16k39M02l97L00l51j2J76j63K28k31L99n39M18n9k44K05k96P05m45K70j36
6174A07k40J64k84K24Q3J66j68L8l2K0r8L4N5l41K71L5J33j16j77L15k21j34L49
$$ y = [61, -115, 178, -172, 161, -94, -199, 161, -94, 142, -112, 115, 142, -22, 226, -132, 158, -117, -189, 150, 81, 52, -266, 109, 64, -84, -4, -143, 112, 33, 147, -130, 71, -145, 175, 219, -189, 160, -384, -71, 97, -92, 135, -185, 191, 39, 239, -60, -100, 41, -323, 369, -136, 66, -133, -1, 314, -291, 382, -140, 148, -236, -239, 255, -194, 328, -258, 243, -55, -12, 292, -197, 263, 73, 189, -263, 77, 248, -170, 149, -90, 101, -143, -27, 54, -178, 307, -75, 92, -38, 75, -13, -136, 194, -223, 58, -160, -153, 48, -76, 58, -346, 271, -142, -90, 19, -306, -54, 172, -72, -77, -26, -47, -172, -65, -157, 134, -1, -134, -265, -119, 67, -191, 12, -145, 217, -8, -74, 116, -123, 279, -118, 182, -169, -181, -5, -168, 60, -171, 228, -311, 107, 48, -196, 9, -287, 418, -27, 243, 107, -133, 31, -253, -29, 54, 220, 52, 90, 58, 78, -20, 14, 69, -272, -1, 34, 167, 51, -126, 189, -32, -166, 183]
6197A83j16l0k71M89n92L17Q7k84K87j01L94n70K20n3M0R8k18N42m34K62m10M8
6219a12J76j94K29m8l3j48KK12J9p6l54L01Pj12K65l73K19k15M50k09j33K51j83
6242e9M16m57K83m18Q2M02o20N23m01M86j36r8J41l13K43l43L49j23n9P5l7M26
6264C62m94K65l72K02N5l21L20j55J78k63M10l25k7J5L8L38l90K79n6o4J03j66
6286f8R4j29O4K09m8k43L8J55k77NK82j16K48n32L16J01M7K5j42K4m12O89o23
6309b93M01ml23K42k0L9k58J51j04J3K69j43J42k51J48Q7j91j30M0j04L9L51j40
6332c9k02N59l21j33q1J31K88m07j1K18m1j14L63o6m8j67J88j30J02Kj33K26m8
6355A36J13k54L7j27j9J56J75k37o4j32L03j77O8K9j72J67N2o4k7K13k86P1Q2
$$ y = [183, 67, 37, -234, 255, -337, -20, 67, -217, 70, -31, 363, -207, 13, -40, 0, 98, -120, 422, -12, 250, -160, -112, 64, -130, 99, 51, 18, -130, -128, 84, 103, 27, -327, -26, -19, -131, 134, -239, -20, -235, 215, 6, -127, 124, -59, 357, -100, 183, -235, -153, 249, -371, 152, -249, 237, 101, 3, 144, -169, 74, -269, 80, -43, -102, -27, -64, 362, -132, 133, -239, -37, 18, -303, 17, -138, 40, -223, 187, -138, -165, -150, -112, 226, -164, 115, 59, -5, 98, -68, 26, -103, -39, 170, 122, -121, -83, 72, -205, -200, 82, -34, 214, -318, -2, 99, 146, 171, 29, 53, -359, 330, -293, 108, 104, -219, 23, 3, 42, -216, -65, -169, -156, 113, -30, 112, -139, 9, 96, -95, -225, -185, -289, -250, 101, -39, -241, 318, -3, -136, -217, -86, 202, -205, -216, 2, -39, -153, 210, 144, 96, -71, 117, -13, 89, 91, -42, 184, 136, 249, -5, 32, -95, -114, 42, 217, -20, -84, -216, 87, -90, -22, 7, -165, 2, 54, -10, -37, 176, -110, -39, 43]
6378D3j83n1J05J05j26L01j69Kp0k36J72J28n9M8J5N5N1r1q7J5K08N6l61K37L5
6403A43l05K35k48K34j26M3K92k95Q7o4k05O92n99j35J12kJ62O3j64O3K72p0j53
6426C2p3J27j23L2k2j17P1q7K5J35o9L4J89Lj67n9J58k94K39m6Q1j8O6K7k11J
6452f6J10p5M2j27J88J27j51j47K00j84K75j73J74l1l10L71n9j00P4P9k40j35
6474a58L58l77K08J4J05o0r6R2l47L15n4K07k94k1K6M8R0j00m6J87j12r2R4J95
6498A82k31K81j31l08M00l15K04l27K71J90k2j39j54L05k88P9r1L1L6m8J37n3
6520IJ3r6J20R2j26j19M11k64j15K0M7J1J74r2J6j7k07J24j25L8k06N17l25J17
6544A7J00m13O22n23K92J05k90P2m9K0J3L68n24J95J43k28o6M1L33k56J41j36
$$ y = [43, -140, -191, -86, 19, -107, 194, 25, 27, -43, -279, -107, 21, -38, 10, 25, 80, 131, 40, -47, -32, 176, 232, -129, 108, 143, -162, 73, -175, 59, -67, -24, 268, -27, 60, -4, -209, 483, -116, -251, -139, -141, 21, 84, -80, -17, 255, 185, 32, -41, 86, -37, -5, -27, -144, -73, -160, -135, 0, -69, -35, 154, 157, -10, -69, 89, -205, 34, -12, 69, 51, 117, 144, -67, -66, 44, -31, 11, -116, 72, 199, 48, -99, 101, -83, 192, 19, 193, 162, -148, 223, 164, 64, 138, 217, -23, -158, 200, -177, 31, 45, 150, 90, -6, 86, -261, 54, 0, 207, -87, -108, -82, -34, 56, -44, -90, 97, -15, -107, -13, 182, -49, 232, 101, -207, 193, -122, 82, -245, 26, 216, 194, 55, -99, 206, -82, -3, -94, -63, -27, -75, 62, 9, 22, -74, 46, 138, 12, -107, 304, 40, -75, -55, -8, 3, 177, 85, 101, 84, -123, 1, -124, -86, -292, 225, -100, 17, 117, -296, 326, -197, 95, 200, -90, -18, -67, -47, -34, 334, -190, 5, 148, -80, -146, -105, 228, -28, 113, -23]
6566b3j65L21j58j59m0j02M64l35L08j41J41j48K36k00k0j29k0K46k38J87j86
6587a61K6K61k16R0N3J74l00k6N13o39M29o21M80j53M2K67k95N7l8j01l0J77p
6610a8n9J95k20J39k7O0k02l5J06P5N5l36L57l60O11j94l32M45k62P2k48K56j39
6633f1MJ05l79M88j76j2Kj02P7k88M24l24K05j28J30J44k82J48j96L14q1k14R5
6656a07J44J73j67n0K03j26J31k71K57l84Q9K79j77j5j49l1k34N14k00K27Q4k31
6678d1J2j91J8J1J04%j54K57j22K64j97j04J29k11L84j28j1J46l29K62k25J24
6700bk07J62j8J68j67J0J67l29M40l31o6K39k31K38j05K96m38L00j16l4L09o53
6722c68N55q8k42K76k01K07k91L21J02m88K25K03p1l36K08p9N3j4j31N2k32M76
$$ y = [-23, -188, 133, -25, -184, -224, -326, 138, -197, 111, -30, 111, -37, 199, -1, -21, -150, -170, 76, -162, 25, -161, -135, 126, -90, 0, 53, 227, -73, -99, 414, -225, 204, -417, 63, -90, -48, 219, -76, -19, -57, -158, -188, -11, -18, -77, 118, -102, 37, 10, 70, -132, -167, -61, 14, 69, -267, 90, -270, 341, 147, -185, 260, -2, 70, -178, 78, -61, -57, 48, -331, 157, -19, -31, -29, -131, -54, -342, 82, -242, -37, -165, -35, 109, -173, -25, -221, 93, 12, -202, -107, 37, 210, 43, -7, 196, 70, 201, -70, 187, -197, -108, 171, -6, -21, -170, -201, -435, 79, -121, 106, 190, -41, -29, -220, -202, -191, -87, -87, -241, 16, -106, 158, -39, -143, -14, -225, 159, 31, 20, 166, -163, 99, -126, -2, -209, -47, -65, 103, -64, -54, 113, -216, 224, -107, -173, 66, -165, 73, -32, 264, -174, 126, 10, -24, 285, -368, 187, 99, -143, 133, -68, 139, -152, 169, 271, -217, 8, 211, 140, -196, 12, -67, -14, -28, -159, -107, -339, 137]
6744A37j32j5j9L89k48l19M03k79J59L4p8J94n6j82M9o0P8K6q8j50J29J08l8l07
6768b65J18N1R7L0L3o9J25k27J99P7j86j48N9K6J18j18O2J59j26MK7k14J14J16
6792F2k84K72j98L9L30l23J95p4k7p3J41p4O5Oq3j83P1J65m4K29k46Q7j4J0j6
6817C3n5q9J63j49J16O4j06M4k20J30N8l22L67J36j02J77l38R5M6p7J7J21j48
6840c9J04J01n38K18L9J65n6K51q3j26q1L6Q2k51L04j03j84L28j39j15l5qO7K4
6864c9j5o1Q0J0O7k30K98Ol23M46j57j21l3J62j05J35k08K7k0J38k25O4J1jj20
6889b14J34K41j15l3P1k09Q8J17J32j2k12P6o5j48K47Nq2n4J52k7r2k09K45N0
6913H6j92p8J43j12K47k1R3l24J75j6k4k6J23K5j44J31q6J13j60J97J15k68M6
$$ y = [137, 5, -10, -29, 360, 112, -207, 196, -83, 76, 110, 32, 226, 170, -12, 37, -23, 55, 81, -7, -157, -28, 80, 42, -265, -147, -96, 1, 31, 64, -5, 120, -107, 92, 169, -17, -165, -106, -80, 38, -80, -18, 141, 15, 19, 46, -168, -54, 62, -222, 50, -148, -109, 221, -102, 93, 19, -8, -81, 60, -14, 51, 57, -26, -209, -138, 27, -17, 212, -34, 53, 39, 49, 33, -22, -111, 52, -97, 19, 83, -23, 21, -199, -69, -11, -333, 34, 170, 68, 245, -93, 2, 48, -29, -12, 109, -39, 65, 166, -372, -154, -115, 50, -6, 245, 162, 36, -45, -9, 73, -178, 126, 23, -161, 167, 28, -87, -122, -130, -63, -39, -54, -115, -35, -25, 42, -188, 110, 116, -207, 239, 82, -39, -72, 90, -15, 120, -88, -61, -81, 57, -168, -104, -93, -94, -214, -80, 161, 46, 13, 84, -125, -37, 80, 212, 200, -12, 64, -1, -149, 98, 103, 21, -33, 119, 92, 0, -209, 36, 86, -106, -184, -41, -153, 94, 73, 166, -158, 17, 1, -23, -49, 74, 99, -45, 86, 0, 113, -47, 150, 265, -3, 43]
6936D3j63K8rn0K60J03l50K13k20k6r7L08j08K54p5k12J03M8m1n0L1l0J59O9k79
6961i1K34k32R3M0p8l0J50O7l02K62j86J78J27k48O7q9J81L7k50m8K9J36r8j5
6985f6K20k35O2m2j21M77m30j3L45k30J57j12k34J28o8J34j7J48p4j4J0l3j04
7008a12J62k84M17j42N2j98n0L07k05M5j62K10l7Nj12K7j90J59n5J24J99l44L40
7031A56m8n0p2qN7Jm0l9J21P7j47J39l32q4J67K98j12k3l0j38R1j72K35J72l98
7056a79J19q5N0k2J72j19K46k84J39j55K81j16rj34L9j27M12r8j41J6n7K20k73
7079a05J20L3r4K17l09M43o14M05j92L02R2l39L16l21J13j76O6J04k99N44l67
7100f1r0J17j34J81J23K1k66K10j81j03L81m79L06r5K11k67O4j6nL26m25M8R4
$$ y = [43, -120, -92, -101, -151, 109, 212, -138, 75, -145, -171, -268, 40, -68, 186, 111, -101, 2, 50, 9, -41, -10, -40, 119, 188, -91, 143, -89, 4, 44, -34, -64, 86, 153, -149, 113, -73, 105, 232, -16, 51, -38, 143, 180, -70, -118, -89, 47, -51, -66, 154, -81, -19, -61, -182, 295, -135, -148, 197, -33, 124, 12, -222, -94, -162, -28, -45, 103, 29, 15, 25, -8, -112, 50, -234, 183, 41, 93, -105, -155, 152, -53, -8, -170, 40, 3, 8, -104, -77, -267, -108, -163, -39, 160, -184, 156, 108, 58, -14, -22, 35, 36, -4, -43, 78, 155, 8, 147, -185, -269, -102, 196, 84, 61, 31, -107, -16, -188, 47, 219, -179, -60, -145, -95, -117, 55, -64, 182, -102, 37, -118, 163, 47, 38, -96, -57, -184, 228, 130, -11, 5, -52, 168, -105, 15, 48, -46, 171, -138, 305, -309, 96, -96, 206, 298, -41, 275, -46, 67, -109, -43, 61, -238, 306, -61, -151, -34, -168, 13, 136, 157, -109, 101, -80, -183, 198, -281, 25, -70, 141, -126, -62, -78, -83, 243, -182, -134, -40]
7123d0j38K80J19m0l18L81k09J58m4k4o0j86K43k61K19j88O3l3M7K01j80Pn1m8
7147a02K3RJ17j75O4j41L12M2k35J10L5L1Nj05J5j9J17k03M46n30J56J27k35J91
7171E5l39K72j56n7L38j33K28m10K99k11P3K91l03K67n76O35k59Rm1J39k6k5R
7194G9M9NJ4j15j6n9L08k29J77k67NJ72p2n1L3N6M9k37p9K56R2l49L32o3k38N6
7220i2K10l19l9L05q0q9J13j80Po1L43j3j67k52K81N0Kk2j2j19M1L49l99K8p2
7245a87O6k5j3OK89l38J47QN9n7N4R2q1J27j96L22j19k13k3o8J5l7m4K13M5k02
7271a60J70J17m00M73l21K96j38r0K38l17P8l6J03j05J57j3j06n4J45J22k12j02
7293a55Q4l1M9LJ31k39K10M3j75J26j21Q3q2K01j88m7L88l05J44O3k69L30m16
$$ y = [-40, -178, 102, 221, 181, -137, 244, 35, 193, 149, 125, 65, -121, 122, -139, 80, -108, -45, -78, -31, 170, -10, -3, -54, -102, -79, -70, 47, -128, -64, -205, 107, 149, -86, 24, 59, 90, 95, -10, 5, -14, 103, -100, 346, -184, -28, 99, -136, 55, -284, -12, -168, -225, 113, -20, 208, -202, 97, -114, -41, 250, -53, 214, -362, 273, 14, 23, -18, 121, 95, 70, 79, 128, 133, 147, 32, 16, -43, 265, 36, 213, -54, -49, 123, 51, 0, 33, 89, 138, -99, -178, 78, 170, -179, 153, 90, -148, -92, 118, -201, -240, 65, -15, -104, 9, -171, -164, -225, 118, 105, -62, -314, -33, 17, 19, -3, -15, -134, -93, 256, -143, -115, -187, -121, -146, -159, -153, 136, -202, -55, -47, 12, -45, 9, 101, 20, 147, -49, 273, 154, -59, -82, -150, -135, -172, -216, -3, 42, -160, 10, 127, -273, 200, -121, 175, 37, -53, 185, -132, -54, -90, 13, -92, 65, 52, -54, -108, 37, 159, -53, -155, -71, -102, -53, -50, 81, -158, 52, 95, -80, 46, -75, 8, -74, 127, -61, -108, 280, -25, 119, 182, -87, 243, -173]
7316a73K81j65K37j98j7r5Q3L86m52O2PO9q6p9m3m9J51j2Q9J63r8J8k7J40k12
7341b0j3K3J05k06J7k4J76j54K11j47K8r4R5m2J79r1L1o8m3J01j11J09j8j09N7
7366hJ14q4J5k5mJk73K29r9J44J56k02O0o2J31j19J42j88L7J11q3M9K2j87J75
7391E2n5r0p9K03r4j49K94M5l37K49J44O2j47l14K38j7k43M15j64r3J29j44P4
7414b1L4P4l62M84j66o0j24J09RJ1K1K5J0k35K84j41J51l45K60O1k12J68k4j88
7438a77K59j93J39Mj73K19q0K2j9L35k89K9k43J63j92J40NJ40j06m1P1J05j03
7461A5kj51j5L42j01j00N4M7j06QMM9j34J56j01r3J07O3j4j24o1J68k56L45k15
7486a15K54k24n4K86j51J28k80r8J47J30Pq1J00Q3m97K77J73n5p1o4K02j2J86
$$ y = [-173, 108, -57, 180, -18, -35, -130, -47, 339, -113, -51, -44, 25, -61, -140, -183, -232, -81, -93, -4, 159, 61, 79, 52, 192, -20, -33, -10, 95, -111, -94, -118, 58, -96, 115, -32, -4, -98, -3, -45, 134, 43, 74, 6, -37, 64, -47, 62, 44, -65, -8, 106, 22, 37, 12, 8, 9, -264, -35, -134, 10, 166, -36, 24, -38, 93, -26, 116, -72, -35, 76, -7, 42, 64, -123, 52, -3, -93, -172, 31, -63, -212, 82, 127, -210, 39, 183, 245, 98, -216, 22, 5, -238, 177, 13, -80, 49, -95, -21, 13, 87, -275, 209, 43, -17, -141, -32, -23, -12, 9, 34, 44, -191, 93, -48, 103, -242, 18, 79, -133, 35, 11, -177, 82, -111, 28, 32, -141, 78, -2, 20, 1, 336, 47, 76, -167, -4, -196, -56, -51, 89, -17, -58, 13, 118, 15, 13, -138, -153, 189, 88, -12, 42, 89, -17, -9, -5, 44, -90, 66, -35, -128, -21, 42, 28, -96, -157, 11, -245, 100, -115, 139, -85, -139, 147, -4, 124, -156, -254, -107, 23, 30, -51, 49, 132, -365, -88, 85, 30, -41, -105, 97, 85, 271]
7509B71l90J65j19j04J81p6R3j21J19J42k40J25j0P7j93K6rJ00%Rk72J82k6K41
7533A71l91M95k26j27olJ5k40O17k85p9J04j35KL5K41j69K23k51J16l31O9N9L1
7557f5R8j84K09J14j11p1j95J67j64K47Q9j63J06j98K24l26J08k8J30K89l45J54
7579H5o2j8k51KL72j99q0KJ57j48J07jl2R9j27N2J65j15rn6ok24L28k21K86n3
7605E3k62K28j6k8O7j15l4J34k1Mq5L0j01J52k48K72N8k6k54K14p8O5j72J87J59
7630A83l7j76L7N7L3j45J57j40j45R8O7nj29P5j24R6KR7j54oL00k03J8l4Q8q0
7656g0j49K44j72K79j39J21j65N6l4j66J37ql2QJ16J70j49J86m29MR3K67k87J00
7680a9l8J08J27m68J24J63l46L36JR5l66K40J15n0J20j67l8L3J08m7J20k6k04
$$ y = [271, -119, 46, -73, -177, 4, -72, 21, -100, 19, 161, -79, 46, 36, 113, -80, -54, -63, 37, 37, 46, -226, -44, -70, 171, -220, 275, 49, -78, -84, -87, -72, -312, 305, 20, -59, 45, -90, -88, -53, 188, 19, 242, -9, 107, -224, -155, -96, -65, 33, -151, 58, 172, 61, -10, -205, -38, -202, 45, 134, -29, 77, -121, 103, -223, -115, -143, -13, 276, -69, 85, 23, 5, -246, -244, 128, -71, -151, -149, 8, -140, -33, -34, -66, 33, -94, -42, 123, 8, -1, -57, -63, -287, 41, -180, 106, 53, -209, 19, 3, -25, 42, -73, -107, 27, 6, 10, -75, -45, -146, 6, -242, 30, 88, 62, -192, 22, -56, 9, -163, 24, 183, 146, -30, 7, 64, 97, -48, 109, -31, -176, -78, -11, -16, -145, -70, -194, -98, -96, 1, -153, -159, 141, -62, -44, -78, 10, -70, -219, 25, -147, 132, -7, 114, -51, 5, -29, -195, -58, -66, -98, -90, 26, 196, 47, 233, -196, -192, -99, 168, -119, -19, -57, 51, 178, -290, -166, -3, -349, -13, -12, 83, -283, -43, 72, 22, 142, -25, -63, -30, 78, 31, 151, 125, -79]
7703g9J18j86K64J50j76k27L46k17j51K91k12j17L32k09M81l87L6l96L97k10j62
7724c14N31j57J01j67j71N9M0P6o9K37q5l35J77j26K18j96K94k36R3j13j38K71
7746a0o6K19j23n1J4K7N3J22L2j61J30k13m4j05j7K59r6P8j06N7L6k07J0Q7J81
7771A06r0j41J36k85K86j87K11J69j39k01p7J89O0l4J39n5j26K42jj50j8j6J00
7794A18j03j13K50l34K39O7j11J3j87J73k7j50J25j81J24j25K53j09K44m13M03
7815A56o9r8j71K71l7q9O8N1M6j60K24k61n0J88K9j01k71O4L95l29N3J70m4m9
7839a4m4J47p5k68K87n1nR2l0k25J84k7p4J78l55J75J63r0n2j62K51RK61l48p
7864h0O2K13k80j75J44J28j88J64o6K54N6k31j03J58k38K24j2j37K52k67J72J6
$$ y = [-79, 39, -147, 117, 267, 91, -136, 210, -7, -158, 133, -79, -196, 136, -73, 408, 21, 57, -339, 58, -152, -314, 217, 60, 161, -6, -177, -118, -78, -2, -71, 166, 81, -254, -77, -203, 15, -181, 113, -123, -30, -143, -281, -10, -76, 143, 20, -31, -17, 10, 63, 185, 217, 56, 186, -27, -71, -176, -193, 66, -30, 48, -58, -1, 35, -172, -162, -75, 106, 16, -125, 11, -274, 12, -175, 36, 205, 66, -135, -212, -23, 37, 3, 142, 87, -39, 203, 202, 52, 34, 18, 118, 15, -98, 152, -182, 57, 124, 13, 26, -161, 12, -15, -165, -40, -221, -97, -222, 31, -78, 166, -247, 156, 87, -11, -182, 89, 52, -37, 31, 82, 128, -32, 192, -69, -119, 69, 98, -3, -274, -210, 185, -144, -91, 79, 35, -14, -58, 89, 14, -254, 33, -18, -23, 69, 39, -186, -2, -29, -103, 75, -280, -105, 58, -32, -84, -246, 5, 14, 275, -73, -80, -18, 195, -85, -260, -116, 12, -176, -12, -78, 176, 232, 1, -102, 56, -182, 42, 30, -107, 145, -122, 50, 66]
7886F6k00J09o2K8J33M7k06j0O8p1J7L2J84K11m30j14L72m00K80k60P2Q8J46p3
7910B7m8j28R4K54k40K73j62k36K06p5r3M8J64j97J06R7l0p5Q9j88J3J71j16J69
7934A23n2j57J25J2k86N47k01k82o0J71J25j3j16J48q6j83M64l38J27j63J42j28
7956h1N9j6J8j06Q2Q5N3K3k82K67j39n2K00j34N5l31J85P9Q9Jo7J60j48N1q8L96
7982C59n01J27Jj15N1P3l4q5J30J61j14r0J22mr6K8R8j27Q3k79K15J59j41n6Q9
8007E4J33j95J6j35K16q6m2K73j78m4N3r3M4J02Lj90K10k88J56P4k28O1N8L5L1
8032D0j13p5P8J54K6j51K88j94k5j6K1Q4j90o1J05K89l61N6k39K82j0j35J49j81
8056a79L43j74LQ1j3Rm3l1m2K52j57l6j67O3L95l50J77r5mo8P3r3J22o0J93p8
$$ y = [66, -134, -25, -87, -59, 74, 121, -85, -95, -27, -98, -81, -49, 135, 346, -84, -198, 174, -226, 54, -206, -134, -46, 100, 27, -21, -149, -55, 199, -41, 232, 70, -166, 40, -35, -128, -80, 84, -113, -7, 90, 60, -15, 74, -114, -101, 70, -46, 123, 71, -86, 39, 51, -235, 312, 111, -171, -231, -60, 65, 52, -64, 84, -2, -185, 279, -59, 68, -95, 47, -81, -22, -38, -20, -126, -44, 41, 94, 117, -165, 102, -37, -89, 111, -23, 32, -299, -114, -35, 54, 55, -12, 148, 0, 51, -37, 359, -142, -15, -14, -129, -78, -5, -39, -124, 6, 167, 53, -37, 85, 81, -15, 13, 111, -16, 67, -212, 3, 162, 21, -35, 54, 187, -8, 8, -127, 89, 3, -39, 234, 56, 12, 65, -28, 16, 118, 121, -69, 141, -147, 9, 83, -145, -84, -26, 9, 40, -73, -148, -70, 84, 110, -41, 247, 53, 28, 12, 33, 117, -73, -134, -29, 260, -101, -45, -284, -2, -12, -147, 2, -179, 164, -10, -7, 74, 61, 70, 27, -4, -46, 206, 49, 13, -154, -91, 304, -46, 131, 36, 32, -36, 37, -56, 66, 6, 199, 121]
8082A21j17O9Q4Q8r2j23J30j59R6m08J57k4J82K94l28j3l00J50K99j21Ljp2K13
8106A28L5j22k13M28k57L61m31pJ04j84J81p6J75M6k68l7L12j01o7J58j82K4j35
8129a28J85L05m11%j09N2L91m15J03k55L79j27J16j60jL4l15L68k86N21k90j80
8151b23L35j01q3k14K83P9j56r4J07K12k96L24JQ1j24j71K77k95J15K4k31L8J18
8174FJ22l12K03j02M8K44l69K29k02K09P8k35M46n54K84k38K02
$$ y = [121, 4, 73, 157, 245, 153, 30, 160, 1, 97, -311, -154, -178, 4, 298, -30, -43, -343, -193, 106, -15, -12, -13, -85, 128, 163, 41, -172, 256, -1, 360, -71, -78, 26, -158, 23, -53, 122, 168, -100, -137, 175, 74, 7, 165, -17, 7, -128, 57, 362, -49, -49, -158, -106, 285, -130, -27, -282, 97, -30, 86, -74, -75, -41, -356, 12, -274, 247, -43, -223, 112, 11, -72, -286, -3, 76, -80, -174, -67, 145, -151, 173, 174, 255, 131, -40, 237, -58, 57, 81, -150, -112, 6, 128, -184, 19, -83, -35, 209, -160, 69, -133, 76, 154, -81, 365, -189, 95, -143, 59]
8191E9
$$ Imaginary data points
##PAGE= N=2
##DATA TABLE= (X++(I..I)), XYDATA
0@%%%%%%Qj6J6k4L2m8O4q0J04j28J60j92K32k80L36m00M72n60O61p71Q95j036
28e55J193j367J561j778K015k279K572k892L245l632M057m522N026n579O183o839
44c591P557q340R195j0129J1152j2275J3508j4869J6376j8054J9930k2041K4438
57A2857k7184L0367l4104L8561m3984N0736n9398P0946q7149J11629j53193K41713
69A51797p17157J02121P52191o90452M86700j71111R75625j037626L17773r5659
79G4202l81845K78008o64631Q93276k24717K30488j41265K86568J46280j124841
89f28477P86380l72297j8204j02382M28882L10183n48014N81794m27571J90231
99B00525m93063n6462M72511m25298L13377n7884O22289n62864j49816M91302
$$ y = [0, 0, 0, 0, 0, 0, 0, 8, -8, 8, -16, 16, -32, 32, -48, 56, -72, 88, -104, 128, -152, 184, -216, 256, -304, 357, -414, 481, -555, 638, -729, 832, -946, 1069, -1210, 1362, -1530, 1715, -1917, 2140, -2382, 2644, -2935, 3248, -3591, 3966, -4374, 4821, -5308, 5844, -6431, 7077, -7792, 8584, -9470, 10460, -11581, 12857, -14327, 16040, -18064, 20497, -23487, 27249, -32149, 38797, -48352, 63277, -89916, 151797, -565360, -463239, 288952, -401500, 85200, -85911, 889714, -147912, 169861, 74202, -307643, -29635, -694266, 199010, -25707, 204781, 63516, 350084, 496364, -628477, 157903, -214394, -232598, -334980, 93902, 404085, -143929, 437865, 10294, 200525, -292538, -349000, 123511, -301787, 11590, -46294, 575995, 13131, -136685, 354617]
109C54617n78698K6104j37628M88493k40983Q1694L10109k59713K61599n51483
119b45889K30708l9687j52297N8176J20451M08096n69908L90960K2291l08680
129h5779n5725l906K28419l83749M03460k649N942J7936j73674J97455l12510
140a64780O7694p2685K50130p2696r3378L59406k32296J8008j80174J42423j09466
151h7814r0828K14261o4036K13590k09140J24712J489j64353m9817L635J75769
162F7468k52897K52758P4476j08419L2227l5935o902j80971J31061n8800O1452
173b4482P1904k3639R8955o3027k6968j29798J19331j02112p2637K06990k3490
184C1027J0489n251Q7426j23966n3337K0161n9525P9660n4301J03435L7302l104
$$ y = [354617, -224081, -197977, -335605, 152888, -88095, -6401, 303708, 43995, 305594, -245889, -15181, -54868, -207165, -148989, -28538, 379558, -190350, 200610, 222901, -85779, -141504, -145410, 83009, -300740, 102720, 100071, 106013, 123949, -49725, 147730, -164780, -97086, -169771, 80359, 7663, -85715, 273691, 41395, 59403, -120771, 21652, -87814, -178642, 35619, -28417, 185173, -23967, 100745, 102234, -62119, -111936, -108301, 67468, -185429, 67329, 141805, 33386, 65613, 29678, 22776, -158195, -27134, -85934, -24482, 47422, 23783, 122738, 59711, 32743, -97055, 22276, -79836, -152473, 54517, 31027, 41516, 36265, 123691, -275, -53612, -33451, -92976, -13316, -67617, 35818, 73120, 70016]
196G0016l6056k9603L7028j58809P2891J5548r498O3596K6832K5004o9126N6378
208F4201j16085L163K5904p2480J08673K337L3048l2396P5019o8777j08743J15618
220B9482r6474J2074L0287P1132k2147J648N9147j29121P6931q1972k0584N3918
232a5679M377K5452j7103J13231j21688K4975P209q4071L8584j8261N3892m1651
244c0733J00939l7465l7394O4099j03358K5656k3370K1335j3322N9799K4369p0044
256a9489R7139o8898l6370J650P248j6863K572Q1113o2454O1482J171o5247J1752
269e194l898k1435k8219Q4705k8956N396O0506m8916r853j231j2646m7018M7161
282i598J3882l7833P4267p93l5619M232L900m3011r78L1293l7257M3386M0026
$$ y = [70016, 33960, 4357, 41385, -117424, -44533, -28985, -38483, 25113, 51945, 76949, 7823, 64201, -51884, -48721, -22817, -95297, 13376, 15713, 48761, 16365, 91384, 22607, -86136, 29482, -66992, -54918, -24631, 46501, 24354, 26002, 85149, -43972, 32959, -49013, -69597, -15679, -11302, 14150, -2953, 110278, -11410, 13565, 20774, -63297, -24713, -42974, 10918, -30733, 70206, 32741, -4653, 59446, -43912, -18256, -41626, -20291, -33613, 26186, 50555, -19489, 77650, 8752, -27618, -25968, -18720, -35583, -33011, 48102, -14352, 47130, 48301, -16946, -5194, -9092, -30527, -58746, 25959, -2997, 2399, 62905, 13989, 4136, 2905, -9741, -56759, -9598, 4284, -33549, 40718, 39925, 4306, 8538, 12438, -30573, -31551, -258, -37515, 5871, 45897]
295D5897l6782j888K4535l2309l8868L2715j5796n452N1375n383j6203L0146q778
308B3209n1429J8715N389l6521L3244L0958j9063J0059J9493l5248r891J5031
320C946l8306K365M8883j2884j2609M3098q151l7051J5247j6669k4504L3607O625
333C597k1301L8362K3145m6179K143J3761m0573r33K7703j5130J0229M4880k8108
346A1596j1920K9795l9855k4639L0031j814k0713M2279J5052k6845K4024j5909
358A1082l5077J7098L645l9674L1167M7093l9515J9641J8236l7617m516J1304
370B867l3165p913O2850k6681n073M9741k2423k8522J2409n447m6563M6167K579
383H26k7111O0515l393l8844J4519K8314p4308N215N0501l7760J8262K1065M965
$$ y = [45897, 9115, 7227, 31762, -547, -39415, -6700, -22496, -27948, 23427, 18044, 1841, 31987, 23209, -28220, -9505, -4116, -40637, -7393, 23565, 4502, 14561, 34054, -1194, -11085, 3946, -34360, -31995, 16888, 4004, -8605, 34493, 26342, -10709, 4538, -12131, -36635, -3028, 3597, -17704, 20658, 43803, -2376, -233, 13528, -27045, -27978, -275, -15405, -5176, 39704, 11596, -324, 29471, -10384, -35023, -4992, -6806, -27519, 14760, 29812, 2967, 26991, 11082, -23995, -6897, -3252, -42926, -11759, 35334, -4181, 15460, 33696, -3921, -8437, 2867, -30298, -38211, 24639, -2042, -7115, 42626, 20203, -8319, 4090, -1357, -47920, -1753, 826, -26285, 34230, 30837, -8007, 6512, 34826, -39482, -34267, 16234, -21526, -3264, 17801, 22766]
396B2766k0541K4857l3008k9607M9795m4999J2989K8443R005k2901K8356L421
408B8576o7697N3564l1425o442J2575J9554R078k0250L8957n1686L7384m2283
420b0095j9846N4598k2316r51n097Q9477r1408l337N6357o4683J7481k5877N5580
433A9883l2719L6367j0371k5240P4070j09621L8306J339R281l5411K3049R0364
445G9297j27335Q2805j6812k1358k0893p587O4388q8843Q9825m2753N3836k6666
457A7904o1866J04802j09588M7481n5363Q9296j3096o8800J24003r1139P2338
468E5972j15906N7479K2028p2614O1721n7394J67674j82077P0557O7871j20331
479d5020M5081p0560J51019j70913J04533L5347p2905R4092j34994J40857j41390
$$ y = [22766, 2225, 27082, -5926, -35533, 14262, -30737, -17748, 10695, 19700, -3201, 25155, 28576, -39121, 14443, -16982, -23424, -10849, 8705, 17783, -2467, 36490, -15196, 22188, -20095, -39941, 14657, -7659, -8610, -13707, 75770, -15638, -18975, 37382, -27301, -9820, -35697, 19883, -12836, 23531, 13160, -12080, 61990, -47631, -9325, -7986, 1295, -34116, -11067, 79297, -48038, 34767, 17955, -3403, -24296, -31883, 32505, -56338, 33487, -9266, 44570, 17904, -43962, 60840, -48748, -1267, -56630, 32666, 19570, -49230, 74773, -16366, 55972, -59934, -2455, 19573, -53041, 8680, -48714, 118960, -63117, 7440, 75311, -45020, 61, -70499, 80520, -90393, 14140, 49487, -23418, 70674, -64320, 76537, -64853]
490f4853P1471l8236N157J10387j96496K22505j14047J8337m5506K3823O7653
501F0195k01191K17122j12138Q9600p3364O290J20040j97659J25323j10516J56088
512G9790j41264P220J81574j89840J17371j06659J33902j41998J5554J01354j47393
523i0389J84519j71509J44316m4268l8205K0691n5198J47528k55811K17099j6865
534D1908q0872N7720j0391Q8453k44495K18990q1381m0297P0966o6806J46930
545A00725j60299J14896q7096O7370l0926j21242K16974j61906Q1096m4377R2538
556F7753n0467r1125J69294j75028J09483r0015P4727J6716o8352Q8818q0333
567b8529J25763k02796J27367K1950j31978J03351k0918Q0721j68392J65220l7498
$$ y = [-64853, 6618, -31618, -26461, 83926, -112570, 109935, -4112, 14225, -31281, -7458, 60195, -140996, 76126, -36012, 53588, -19776, -13486, 106554, -91105, 34218, -76298, 79790, -61474, -54254, 127320, -62520, 54851, -51808, 82094, -59904, -44350, 57004, -90389, 94130, -77379, 66937, 22669, -15536, 5155, -50043, 97485, -158326, 58773, 41908, -38964, 18756, 8365, 96818, -147677, 71313, -10068, -50365, 20601, -46205, 100725, -59574, 55322, -31774, 35596, 4670, -116572, 100402, -61504, 19592, -24785, 67753, 17286, -73839, 95455, -79573, 29910, -60105, 14622, 31338, -37014, 51804, -28529, 97234, -105562, 21805, 43755, -88223, 15128, -5790, 74931, -93461, 71759, 34261]
578C4261r2388Q5923p2103Q1757r5132R5191o5729O1991R624j25850J62077j03135
590b3513Q117k4571Q9830o0049n2847J53817j21397M0368k8261N2985n4532r581
602b9634O6536q1853R5911r2975O4852k158m2928K5937j1746M9937j14968J13433
614D0344l0063l2348K8698j7385M9224q8118Q6875o0394L7810L36o3557R8773
626E0195p7832L3468l2827P0269n4249k8846J14035j17575N4287k7277L9788m8488
638b5052K704P6027j04311R8078o9920M4825j9009l0615M6818n8448Q7263j11539
650f3179R8267q511n2731N3205n2714P2917j16851R1189k2650j8314M8320o1454
662c2506J02179j12572O3762k7159l675J3625n7101J20020j13420P5290k1375
$$ y = [34261, -58127, 27796, -44307, 37450, -57682, 37509, -28220, 33771, 43395, -82455, 79622, -23513, -15396, -39967, 49863, -10186, -63033, 90784, -30613, 9755, -18506, 34479, -20053, -29634, 36902, -44951, 50960, -42015, 22837, 20679, -22249, 3688, -8058, 41879, -73089, 40344, 10281, -22067, 6631, -10754, 38470, -49648, 37227, -23167, 14643, 14979, -48578, 50195, -27637, 5831, -26996, 43273, -10976, -39822, 74213, -43362, 10925, -16352, 23436, -25052, -22348, 53679, -50632, 47446, -22474, 22351, 3342, -27273, 19545, -38903, 48360, -63179, 35088, 26577, -26154, 27051, -25663, 47254, -69597, 21592, -1058, -19372, 28948, -32506, 69673, -42899, 20863, -6296, -9971, 3654, -53447, 66573, -46847, 28443, 7068]
673G068J281N798o1945R6215j04915P8684m4993L3255K8985q1586R2280p3791
685b3664N0390p5121M8658K6518p8806R2377n7654O2799o9816K8297J4401n9752
697d1373O2514p0224R1935n6833J2903L5172m3237L2308o8333P7213o5474J9927
709a3502L1065l2746N2407n9523O0487n1591Q921k567k2290O1118p4921O7090
721B3948q814j056j4272p307L6458p9583N8955k5181J7429J0500j6554L8611m2010
734h876L2940n5218L1038J909l8019N1316j6438K4765l0571L4237k5055k4947
746b2919L5656m4742L0913q722K2960o840M139J1879l8070L1459l7795O059J2514
759c509J670K274J176L3878m3064J2842k739j7744M691m361J6099m590K4394j5678
$$ y = [7068, 8349, 14147, -47798, 48417, -56498, 22186, -22807, 10448, 39433, -42153, 50127, -23664, 26726, -48395, 263, 26781, -52025, 40352, -17302, 45497, -24319, 3978, 18379, -41373, 21141, -49083, 42852, -13981, -1078, 34094, -9143, 23165, -45168, 32045, -33429, -13502, 17563, -15183, 37224, -22299, 38188, -13403, -4482, -7049, -29339, 31779, -43142, 23948, 15134, 14078, -194, -7501, 28957, -50626, 8329, -16852, 577, 11077, -5477, 33134, -8876, 24064, -31154, -116, 1793, -36226, 15090, -1348, 23417, -7154, 27083, 2028, -22919, 12737, -32005, -1092, -9814, 13146, 6306, 10445, 22324, -15746, 15713, -22082, -16023, -3509, -1839, 435, 1611, 35489, -7575, 5267, 2528, -15216, -10525, -14886, 1213, -3377, 21017, 5339]
773E339L03J0518k6415j589M38Q091r007J9716O298r879J3722j6051r576l11K409
788e994j0390J0337J9980j0268P413J725j0289q102j938o443J09J9863m199J435
802C239J5434n145j6807k658K80j1225P791P696Q61J4695M350j3665n144L430
816C132j6486o486J4772K241M300J3750k34q435J645j2380j5974J0994K210o615
830a3566J8650J6310j1930j190L825k0593m666M438r927Q832K5353n180p269J9714
844B2801j2921k3226M711k175j1100J8383J3735j0140J8770M170k5532k700N323
857I9k0391j871K7535o434O205J6907j0889p240m33j3388j6592K3671j316p329
871a1466K8383R37q591k758k049k1511O440N014j6783L1989M282p777N284L866
$$ y = [5339, 5642, 16160, -10255, -11844, -11406, -3315, -12322, 7394, 13692, 3813, 17535, 1484, -8092, -8403, -5994, -16384, -6047, 13933, 3665, 11078, 12803, 2514, -5588, -7526, -13969, -13860, 6003, 1804, 3239, 18673, 13528, -3279, -5937, -5657, -16882, -9091, -1395, -534, 14161, 18511, 4846, -298, 3132, -13354, -19840, -5068, -2827, 1473, 15223, 14989, 6554, 8199, -4181, -20155, -9161, -6951, -13566, 5084, 21394, 9464, 8274, 12099, -8494, -13160, -8722, -18649, -9817, 15536, 10356, 3087, 22801, 9880, -13346, -8635, -10810, -21910, -3527, 10208, 68, 18838, 23008, -2524, -5224, 99, -20292, -22163, 5372, -1062, 5143, 22050, 11161, 3921, 3488, -9900, -26492, -2821, -4137, -11466, 16917, 17854, 9263, 6505, 4456, -17055, -10615, -5601, -22384, 9605, 13887, 6110, 11394, 15260]
885A5260k0416j2955K1184k8370J7510K1945j3622Q968J0688p738l5585L0580
897G449j7834j8143L7092r865R260L343J2567l4707Q824J2722m9773L5601L482
910A8M096n481K4484m041l5699L6957m6284J4235L837o1J3649k917L1795m6131
924a1543L1306k6015j3214J6451k4009L6984k1042M0532k6588R690P548m6067
936b5967L6091m5637L4020o611J2626Q855r464L9454p1768M1426k3409j3715J4555
949i544m193L8733m3523O1728m0617j621J2257m4688L1025l1565N0542l9467L8063
962A7130J6862m7280M3946n2860K8394m0353L0044N216k2738O1719m7128M1863
974C4815m8795K1413r060l6774M9670m1430N8082m0926L9394o684l4539L7962
$$ y = [15260, -5156, -18111, 3073, -25297, -7787, 14158, 536, 9504, 20192, 12454, -23131, 7449, -10385, -28528, 8564, -1301, 7959, 11302, 23869, -10838, -2014, 10708, -39065, -3464, 18, 4114, -1367, 23117, 19076, -16623, 20334, -25950, -11715, -7878, -7939, 5710, 2793, 34588, -11543, 19763, -6252, -19466, -3015, -27024, 9960, -11082, 29450, 2862, 12552, 20100, -25967, 10124, -35513, -1493, -8104, 4522, 13377, 3913, 43367, -28401, 13025, -10384, -24099, -9544, -13737, 24996, -18527, 43201, 2584, 963, 13220, -31468, -443, -32008, 18534, -20933, 17130, 33992, -13288, 30658, -22202, 6192, -34161, -4117, 1099, -21639, 40080, -7048, 34815, -13980, 7433, -1627, -38401, 11269, -30161, 27921, -13005, 26389, 19705, -14834, 23128]
986B3128n9589M4869l8886L7725j1270P239L9544o8528N9732m9683J2928j9784
998b2575J0991K3902m2364P6204n4914K6834j3831o038n678k6876N6398n6660
1010c4607N7633j9581J1198M619l2979L2695n3561M1268l5663L5890J580j4435
1022e943M1487m4305L1191m7158L0006k6810M704L3051l8335O0265m2314K4214
1034B0053k1802L825j6502j8948O3735p0607N3950L340M149k5679J439L5721q8138
1047e5464O5196k6504J7397K256L43L1099m8957M8942p3871M8697j3780l2040
1059c6686N0801j9384M1236o6616P5702m2714k9869M0458m4929N1816o3213P5432
1071C2034k6766K689J1199m6268P6060j04530N6497q055J1162m547j7883Q8762
$$ y = [23128, -36461, 8408, -30478, 7247, -4023, 3216, 42760, -25768, 33964, -15719, -2791, -22575, -11584, 12318, -30046, 46158, -8756, 18078, 4247, -1791, -7469, -34345, 22053, -34607, 23026, 3445, 14643, 19262, -13717, 18978, -34583, 6685, -28978, 6912, 8492, -5943, 35544, -8761, 22430, -24728, 5278, -21532, -16828, 16223, -22112, 38153, -4161, 20053, -1749, 2076, -14426, -33374, 30361, -40246, 13704, 17044, 21193, -4486, -3047, 32674, -55464, 9732, -16772, 625, 2881, 3224, 34323, -14634, 34308, -39563, 9134, -4646, -36686, 14115, -5269, 35967, -30649, 45053, 2339, -27530, 12928, -32001, 19815, -43398, 32034, 5268, 7957, 19156, -27112, 48948, -55582, 915, -7140, 4022, -525, -18408, 70354]
1083G0354j12745O8441l8549Q635J364l7670P9997p2364P7769p0505M6402P160
1095B8289p8239P1500n1968N8641q0120Q3546p96o9262Q5700p3441N4290p5304
1107d7164N6647m643l4218O8078p2033Q9985p9090K4256J946k0250K8258o8628
1119e6856J14680q2915L3052J2138k3611K8916p6789Q7092p0551L8870o960n103
1131h037N4506q1099P2415n7531L1819l2673k101N5781p9130Q3705m6426L2720
1143B3949k4808j0589L7989p2756O7995n4380N1380j5713j2779M7152n7303M8159
1155B8296o6419N4125k4606k0213N2963m1280N3016n8409M9393k5355k0705L1028
1167A1834m5772N8063n1316M5370j2294l576J9494m7410N1471n6213L3712j3047
$$ y = [70354, -42391, 26050, -12499, -3864, -2500, -40170, 39827, -32537, 45232, -25273, 21129, 28289, -49950, 21550, -30418, 28223, -51897, 31649, 30853, -38409, 47291, -26150, 28140, -47164, 9483, 4840, -29378, 38700, -33333, 56652, -22438, 1818, 3764, -16486, 11772, -56856, 57824, -25091, 7961, 20099, -3512, 25404, -51385, 35707, -34844, 4026, -2934, -8037, 46469, -34630, 37785, -19746, 12073, -20600, -22701, 33080, -46050, 37655, -8771, 23949, -859, -11448, 26541, -46215, 21780, -32600, 18780, 3067, -9712, 37440, -19863, 28296, -38123, 16002, -8604, -28817, 24146, -17134, 35882, -22527, 26866, 1511, -19194, 11834, -33938, 24125, -27191, 18179, 5885, 2309, 21803, -25607, 25864, -30349, 3363, -9684]
1179i684O529J9094l2400N3168n3724K9352j9127j015Q302k5456M8799m0144L5561
1192A9255j9219N499O081l2058K9385l2111L5873k6746J5665J8822k6709K0630
1204A4367k5345K3719l1385J3150P831j3284K5804k1420K4491j9923O927r836
1216d904p177J8531k6034K8138r319Q733j568k447K616k1264K1714k1283J0430
1229c834K569K891R184j0955J2645j9117J2633j4825m021J5418p796Q215k620
1242C87J6772j8746L303J896j4041P853q066J2545m569J2443o044k586J1543k0404
1256g714M398l874O339o761Q191Q189j0942J5204j1984j604m385K338k639l860
1270i104J5988r578J0754l243k095j535m648J521r231J3964o085L727O138j723
$$ y = [-9684, -3155, 15939, -16461, 36707, -17017, 12335, -6792, -7807, 495, -24961, 23838, -16306, 19255, 36, 5535, 11616, -20442, 8943, -23168, 12705, -14041, 1624, 20446, -6263, 14367, -10978, 12741, -18644, -5494, 2337, -10947, 14857, -6563, 17928, -1995, 4932, -4904, -12081, 6450, -19584, 8554, -765, 7968, 6400, 3953, 6569, -14695, 7019, -14264, -3834, -1265, 1626, 10810, -145, 12500, -6617, 6016, -8809, -12830, 2588, -5208, 3007, 387, 17159, -1587, 1716, 3612, -10429, -2576, -10642, 1903, -2666, 9777, 3733, 1147, 12690, -7714, -3316, -7190, -851, -7612, 579, 8768, -2174, 13030, 1046, -558, -4943, -2605, -5244, -9104, 6884, -2694, 8060, 4817, 2722, 1187, -3461, -1940, -11171, 2793, -3292, 435, 6573, 4850]
1284D850m21q227O575r184L489m38l99R000l068K637n337N289n720n324M593j562
1300c247L438r90N668k593L95N56p439K862r27m23j85N901J164m724M531k853
1316A134l843L29O94j722L310M360n177L812K146o678j277J700j212q49N154j285
1332E96N03N269n775k971L604l025n081P239J234m053Q555j799n708L710j958
1347C40q193N842M878r112P811P420q602r34N960q658m640J1920r831N0J4638
1362H889n830n786R054j343j4946J0291K56j0736J1864L386o742K901R373j4539
1376c908q13J0806j4365L333P957j987k635Q526l112q905J1583j1536j612Q282
1390A614k751o34L890N464j1428Q900m680q923J1631o033o97M084Q200j2608M997
$$ y = [4850, 4429, -3798, 2777, -6407, -2918, -3356, -3755, 5245, 2177, 4814, -523, 4766, -954, -6278, -1685, -3247, 191, -799, 4869, 2276, 2671, 3227, -4212, -1350, -2277, -2700, -2885, 3016, 4180, -544, 3987, 1134, -2709, -2380, -1686, -3408, -98, 4262, -915, 2897, 5043, -1635, -2912, -1212, -2424, -3273, 1881, 596, 1099, 6368, 593, -2378, 1226, -1799, -6880, 359, 1593, -2460, 6095, 4296, -1412, 2298, 340, -7853, -2011, 2867, -6245, 1566, 8986, 384, -550, 5410, -3248, -7888, 4032, -5799, -5749, 8889, 3059, -2727, 6327, 4984, -9962, 329, 585, -10151, 1713, 5099, -1643, 1258, 10631, -3908, -4721, 6085, -8280, -4947, 3010, 1023, -1612, 6914, 3802, -5103, 6480, -5056, -6668, 1614, -1137, -1771, 2119, 7583, -3845, 5055, 375, -8548, 3083, -2950, -3647, 437, 8637, -3971, 1026]
1405A026Q737k1108J2447K63o551J483J1123n707q326K0433j9089P68P941o108
1419b668l440O691R648k1669K0863l475j5761J1626r12m049o387K0919j4417K275
1433g56R748j2801O151o740O095j0055J1718j560p014J6175j3613O285o353M406
1447A686p013J564P432j0940J7332j3283Q203j690o081K091m066R047j7339K0826
1461G769n579m755Q407m279J313j3888K0226j8850P047Q603j0834J1580q166J0652
1475I246k0157J7256o595j1098J8590j3461J4640j6589J9062j2586k808J3048
1487H548k1158K1439k0391K1569j4960M582J0779k1873K4164k6802K5191k0857
1499i769R129J0112k2291K8540k8102K6794k7350J7121J057k2379L6088l5033
$$ y = [1026, 9763, -11345, 1102, 1365, -5186, -3703, 7420, 1713, -6613, 13820, -5269, -4501, 3440, -2668, -6108, 583, 10231, -11438, 9425, 5950, -9811, 1815, 903, -3146, -9533, 11386, -3031, -756, 8992, -3809, 2342, -4398, 1697, -8358, 3360, 1800, -5214, 10961, -2652, 3633, -2720, 1686, -5327, -3763, 3669, -7271, 10061, -3222, 4981, 3291, -2790, -699, -4765, 4282, -13057, 7769, 2190, -2565, 5842, 1563, 2876, -11012, 9214, -9636, -2589, 6014, -4820, 6760, -1406, 9246, -10911, 6345, -250, -11348, 7242, -6219, 8421, -8168, 10894, -1692, -4500, 8548, -12610, 8829, -11562, 10007, -4953, -371, 10408, -11465, 12699, -14103, 11088, -9769, -640, 9472, -12819, 15721, -12381, 14413, -12937, 4184, 5241, -17138, 18950, -16083]
1511a6083L2040k7347J9086m437j8036L3418m2346M3042l1430J8137l621q707
1523f284K5124m6197N1684m2682K3756n585p794K8342m4198N0132m4666L0226
1535A1858j7570n082K9898m6063N1594m2643L5861k4194K322K3420m9713N6240
1547B5928m9911L7756j9403K700K0363l9036N1190n8645M8127k5124n530K4741
1559A3156k9257M1697n5602N7717l3785l129K4455l5654M2139m9360M9579l2724
1571a0768J1867J3537l8597N3311n3449L8002k5384J5781K704k8928N3334n7137
1583b5727M3091k6061J0632L081k3334M3776n1212M7327l4597J5962Q254l0314
1595a9122L7437l7025M0048m0995K7250L223k9400L7217l7373L7425l5625K2207
$$ y = [-16083, 15957, -11390, 7696, 3259, -14777, 18641, -23705, 19337, -12093, 6044, 2423, -6284, 18840, -27357, 24327, -18355, 5401, -184, -7978, 20364, -23834, 26298, -18368, 11858, -5712, -10794, 19104, -26959, 24635, -18008, 17853, -6341, -4019, 19401, -30312, 25928, -23983, 13773, -5630, -2930, 17433, -21603, 29587, -29058, 19069, -6055, -11585, 13156, -16101, 25596, -30006, 27711, -6074, -9203, 15252, -20402, 21737, -27623, 21956, -10768, 1099, 14636, -23961, 29350, -24099, 13903, -11481, 4300, 7004, -21924, 31410, -25727, 17364, -8697, 1935, 5016, -18318, 25458, -25754, 21573, -13024, 2938, 11192, -19122, 18315, -18710, 21338, -19657, 7593, 10816, -18584, 18633, -18740, 18685, -16940, 5267]
1607E267q04j5362L0306m2323M3351k9391R135j886k354J8735l8615M5686l0080
1620h335J1500k051o508J6671k9768L3726k8299K1308p711q587K3547k6176J8469
1633G786k0039K4449j8331m004K5947k4788J5765j5019K0435j7359j351J3968
1645G459j6592J9463k2532K0039m947l859J56m370K0451l1859J8601J293j526
1658A777n072J0J7995k6460J5766p814O834m054o277J7109j3799R560j4175J6783
1672H183o717j1952J5438n846N631j5657K2078r729p576R946p957J0961j8697
1685a1894J6852m086J048k014m876J9109k4500R547q59P282j0746j018K2321k4550
1699h384J2870p504P041o719l854J2229j3581J8017j8339J3884l58r772N695o299
$$ y = [5267, 4463, -10899, 19407, -22916, 20435, -8956, 179, -1707, -4061, 14674, -23941, 21745, -8335, 3165, 1114, -5394, 11277, -18491, 15235, -13064, 8244, 533, -8054, 15493, -10683, 7786, -12253, 12196, -6135, -10139, 15808, -8980, 6785, -8234, 12201, -5158, -6509, 7459, -9133, 10330, -12202, 7837, 2890, -969, -813, -5183, 15268, -16591, 2010, 3303, 1777, -3295, -3285, 14710, -11750, 4016, -3798, 3036, -1018, -7295, 9814, -3985, 5575, -8600, 8183, 1466, -10486, 4952, -894, 4737, -10920, 11158, 1429, -6147, 3799, -4158, 6803, -11894, 4958, 872, 1920, -94, -4970, 14139, -10361, -814, -1673, 5609, -5137, -6155, 16166, -8384, 4486, -3018, 4023, -2696, -6550, 5679, -7902, 10115, -8224, 5660, 5302, -4470, 1225, -5074]
1713e074J4017k4386K0980j592q771J0255p426J0670j9868J7730r668j028Q169
1726D008j1440J7401j5156J0475q247N912p30j4084K1396j6120Q765m212N547
1739C515k45r449J5136j6990J2617q981L120N233q256R871j0822J3588j3785M780
1753f68M842j0718J0653q033R164j0223Q271n66q354J1033j0897R147o518M680
1767A813j474j983P276j2810J1624o120J068M67l6L792q507J0281p854K320p1
1782b14j976M336n283P136n925M886k434k504L941n442M416l671M202j691N67
1797C44L250n031K875l136J785k632J046K616j657L018j725J046k179M35o15k722
1813c282L806j799J441J502N10j755J24J268m689J107J513j358J138K279j7k214
$$ y = [-5074, 8943, -15443, 5537, 3945, -4826, 5429, -1997, 8673, -11195, 6535, -3133, -4161, 4008, -7432, 9969, -5187, 5288, -2959, 2953, 2223, -11861, 9535, -6585, 2180, -2032, 3515, 3270, -6179, 8957, -8033, 4584, -4397, -1277, 3956, -4300, 5571, -5251, 8337, -5448, -668, 4174, -6544, 4109, -3924, 5240, -4983, 3288, 2722, -5632, 5401, -5496, 3651, -2867, 1813, 339, -1644, 5632, -7178, 4446, -1674, -606, -139, -175, 3617, -4890, 5391, -2463, -143, -214, -2190, 2146, -3137, 3999, -1926, 2960, 526, -1978, 1963, -3479, 937, -2734, 1468, -223, 344, 3594, -1437, 1438, -1698, 87, -2545, -1499, 1117, -540, 2478, 753, 1799, -380, 55, -560, -3282, 524, -1275, 166, 1668, 2178, 423, 547, 1815, -2874, -1767, -254, -1612, -474, 1805, 1788, -426]
1829d26L092k305k992K479q15j338K458J479k098K526K08l604R73K09j466j01
1845a721K709r18J74K763k928k08J029k423m62K682j638j96M416l338n98L091
1861B434l305j468K987o01l410N813j69m484L901O81n673J946L924o758L545N407
1877D770o813J425M780m820l792O979k871l713P035j666k846L665J437p201L272
1892c59K868p515M846K457l205R19L936l736k409M759n769J279K280j291Q21K239
1908B120P23m202M789n115j447M252l773J414J911L591o838N831m49p344O677
1923B140n367J334K79M900m595K092P517j3801P008p25k878k958O004K676j0735
1938g109J5435q125k39O41j688N19n150J1403j2649J1182j358n068O844p259O182
$$ y = [-426, 2666, 361, -2631, -152, -967, -2305, 153, 1632, -466, 2060, 2268, -1336, -363, -154, -1620, -1721, 988, 70, 244, 3007, 79, -129, 900, -1523, -1985, 697, -941, -1137, 3279, -59, -657, 2434, -871, -2339, 648, 47, -3363, 2450, 2281, -2203, 1698, 2379, -3294, -1348, 2576, -4182, -637, 4770, -2043, -618, 4162, -658, -4450, 2529, -342, -4055, 2980, 1314, -1532, 2133, 3570, -3631, -359, 2509, -5006, -160, 2297, -908, 11, 3947, 211, -2198, 2561, -3208, -1929, 351, -940, -119, 2120, 2843, -1359, 3430, -1685, -3132, 1120, -2653, -1239, 672, 4263, -2575, 3256, 2807, -4537, 2140, -3227, -1893, -1614, 3286, -1309, 783, 8300, -5501, 1507, 782, -2096, -5054, 950, 3626, -7109, 8326, 201, -38, 603, -1085, -566, -5716, 5687, -6962, 4220, 2862, -2206, 4638, -2621, 3561]
1953C561j2335J3793q272j410J1467r971R378j2137J2745r156j590O368r044J4916
1967H313j7400J5859n306j815K421p935J5309k2092J7622o413J608L784r671J7255
1981A1539k0555J4889j2134P037K274j3629K2285j7583J3228j3782J1707k173
1993C103j7048K4221j8025J4000j4546J5066m71j6515K0125j8820J8165k0909
2005a1654J3229L776j1522J4762j8395K5588k5086P432N324q278R518j9154L1536
2018A7076k2673N706L215l771P298k4397L0285k0025P995j606R40J2344k6082
2031a3695K4090j5487Q866j1313L245J7486k5758J9811j0290J4319j7985J181
2043e530J7172k2408J3733j2013K0779j4355k654J4206j1180Q380k1262K5016
$$ y = [3561, -8774, 5019, -3253, -4663, 6804, -3167, 6211, -5926, 6819, -2337, -3927, 2441, -6603, 8313, -9087, 6772, 1466, -349, 2072, -5863, 9446, -12646, 4976, -1437, 171, 3955, -5716, 11539, -9016, 5873, -6261, 776, 3050, -10579, 11706, -5877, 7351, -6431, 5276, 3103, -13945, 10276, -7749, 6251, -8295, 6771, 6300, -10215, 9910, -8910, 9255, -11654, 1575, 5351, -6171, 8591, -9804, 15784, -9302, -1870, 3454, -4824, 4694, -14460, 17076, -5597, 109, 3324, -447, 6851, -17546, 12739, -7286, 709, -897, 43, 12387, -13695, 10395, -5092, 3774, -7539, -4294, 13192, -12566, 7245, -3045, 11274, -6711, -5530, 11642, -10766, 2967, -9046, 11733, -2622, -5276, 8930, -2250, 6130, -15132, 9884]
2055I884j0307o856R501j466R182k3535K2714p302n476J009n39J3246k1092J5323
2069D286l288M500q551l887J9254k0481O104m83J1485j2259l583J8874j5333K895
2083d67o043J4131r134n447J1720m754O723j7318J6142j017r939J118N300Q743
2097I758k2881J7702J406o227m842L704J0930k0649J3073k633N857o950l252J5035
2111A0031j3718L887q161J6918j0720p393J8125q723K590j2104J9980j1460p994
2124h742J2090n201Q466j7823J9133m370n546J194l092J5444k5968J6598P46j657
2138A272k968k064J8102k5520J3720m598M362k995q242K0753j7257J0933j1853
2151f355J2392k378j6685K1445j2200P976j4570J8455k933j6078J9975j3588J0797
$$ y = [9884, -423, -7279, 2222, 756, 9938, -13597, 9117, 1815, -3661, -2652, -3191, 10055, -11037, 4286, 998, 5498, -3053, -6940, 12314, -8167, -2063, -2546, 8939, -3320, -6903, 11971, -3362, -467, -6510, 7621, -1513, -6960, 4760, 6, 6729, -10589, 5553, 4536, -5403, -4285, 1015, 9758, -13123, 4579, 5985, -242, -5084, -1380, 9550, -11099, 1974, -659, 5198, -1752, -5004, 10031, -3687, 200, -7961, 8957, -1763, -9156, 8969, 246, 2836, -9268, 10712, -748, -8742, 3348, -1853, 6613, -11210, 7923, 3553, -1993, -799, -3891, 11553, -14415, 2183, 2929, 1272, -1696, -3760, 14342, -11178, 2542, -2056, 2306, -689, -8931, 11822, -5435, 5498, -6355, 6037, 3659, -13026, 8419, -3781, 4195, -10375, 8080, 5147, -10931, 9044, -4544, 6253]
2164F253j6394J4081l80j0594J4143j5198J9851j9376P760L138n990O324j4543
2177a0925K5364k2150P049L958m393N385j5569K3555j9082Q226j161j873Q902
2190G286j7892J9177j3606Q681p280J974J0553j9756J8365j1334Q107q107K112
2203a720Q863j6306J6775j3889J1919p079j253P707j0337J1517j5067J5876q213
2216a207l057R666q493Q056j2331J4646r889L8O867r087R837j0114J0012q030
2230c086M025J164p394J1911j1484P040l769L063j189l905R956j1622Q329l810
2244g71J104o9k615N473p624Q144n908K847J185l975M872n047M794n458M406r06
2260D52k624N170m488L354l265L289k603j251L748m846M483k296J858q33N31M95
$$ y = [6253, -10141, 3940, 3560, -7034, 7109, -8089, 11762, -7614, 146, 3284, -2706, 3618, -10925, 14439, -7711, -662, 3296, -1097, 4288, -11281, 12274, -6808, 1418, 257, -1616, 7286, -10606, 8571, -5035, 3646, -3634, -1660, 8893, -10863, 7502, -3832, 4275, -3832, -1720, 7143, -9163, 7612, -6277, 5642, -1437, -2690, 5017, -5320, 6197, -8870, 7006, -1207, -4264, 5402, -3091, 4965, -7366, 7280, -2609, -2571, 4296, -4791, 5046, -5068, 4944, -3086, 939, 2103, -5291, 6620, -4864, 2176, -1593, 1470, 281, -3624, 6332, -5290, 3039, -771, 333, 264, -2351, 3122, -4502, 3642, -2266, 581, 1766, -2209, 2663, -2384, 2410, -3048, 1358, 452, -2172, 2998, -1490, 1864, -1401, 1888, -715, -1966, 1782, -3064, 1419, -877, 981, 148, 679, 1174]
2276A174l226L951l970J823P2O3O11p09K812l953K404j089j053L52o4J230j349
2293i21K479j249K11K3j320Q87j208R55j087J974m1j168J851j025k04j262J094
2310a1p96O0J174n96R90l9j37r07M92l65j200J811n57Q3M41Q58j285k51J353k317
2330a199N77J109q09k87J655l95j508J769o13j212R25K11j331R98J370j989L72
2347c57J667j856j66J001j28r73J642n33p89J299q70m51M08L17r44Q37Q04j372
2365d64R65j91o95M80R3r37O04J254k151J508P70j853P54K70q88p11K309j852
2383g35l36L046k106m62J164N32l333K544O15l442L671n77j068K49K312k997r61
2400a884M508m367Q04J312M82j667R51J850m214M438l225J1J824j379N62j258
$$ y = [1174, -2052, 1899, -2071, -248, -176, -113, 498, -211, 2601, -1352, 1052, -37, -1090, -738, -802, 428, -921, 1558, 309, 520, 543, -777, 110, -1098, -143, -1230, 744, 703, -465, 1386, 361, 157, -1105, -11, -807, -747, 427, -169, 821, 782, 645, -262, 230, -135, -1335, 476, -81, 2, 443, 1301, 16, -235, 1118, -1199, -622, 487, -322, -609, 1046, 651, -857, 912, 299, -913, 12, 223, -1108, -110, 1260, -729, -357, 1310, -546, -712, 289, 161, -812, 830, 297, -492, 807, -63, -514, -106, 211, -733, 104, 908, -464, 501, 310, -385, 95, 188, -749, -145, 1109, -1042, 466, 1236, -617, 137, 407, -481, -1192, 1117, -735, -1071, 1975, -131, -593, 571, 1103, -2230, 314, 929, -2513, 1158, 581, -487, -238, 2074, -923, -1884, 2624, -1743, -939, 373, 855, -812, 139, 1989, -2225, 2213, -1012, -1001, 823, -556, 6, -1252]
2416a252M479n247K235J473l404K176j857K878l494L651j588p41L341n669N413
2431B394l506O51n17J050J628n777Q148m756M59K06K64J188n279O854n729M508
2447A786k070j307N051n540L434m020O662o331m25O836o583L775l709O604o322
2462b159Q53M145n898N754o378O281l249K67R03j849O160j0309P956k101j087
2477g11m04K65N711j0415Q273k593M20j265j152O067p833N251l787M898l024l290
2493c589P936n879K861m923P415l842l772O630l664K847n969P213l021k032K642
2508H53j890M986q744O622j069p75j255oO146r345N854j010J339l651M20O135
2524D610q054M812l759N336l681j742N611m252K912o493Q850m315k768M480j599
$$ y = [-1252, 3227, -2020, 215, 1688, -1716, 460, -1397, 1481, -2013, 1638, 50, -691, 2650, -3019, 2394, -1112, -461, -978, 72, 1700, -4077, 4071, -685, -226, -20, 244, 1432, -3847, 3007, -2722, 1786, -284, -1591, 3460, -2080, 1354, -2666, 3996, -2335, -2760, 4076, -2507, 1268, -2441, 4163, -2159, -1306, 2839, -3059, 2695, -3683, 2598, -651, -384, 519, -1330, 4830, -5479, 2477, 376, -711, -1115, -850, 4861, -5554, 2719, 126, 546, -719, -1871, 4196, -3637, 1614, -2173, 2725, -299, -3589, 4347, -1532, 1329, -3594, 3821, -21, -3793, 2837, -827, 2020, -3949, 3264, 243, -1789, 853, -1037, 3949, -4795, 1827, 758, -17, -1272, -1278, 4868, -4477, 1377, 367, 1706, -1945, -1525, 4610, -3444, 1368, -2391, 2945, -736, -2478, 3133, -1119, 1793, -4700, 4150, -165, -2933, 1547, -52]
2539e2L315r294J0539m409j878K285j509M388q778Q661m658K892j847k298Q165
2554E522r888O227m493N990n154j973J0061r711N674n355P598o175j729P990q676
2569d092P790q623R110l637l111N930o714Q661j2196J0089k682k576M122n278
2583c207R992j3246R645l522r75L301p695J2777j2423P935l353J917J223r164
2597f795J4472j3178P264l595K887J201q566J4687j3895Q862n253J871K748q556
2611e846J1800j1904J1362q676K523N586j0223J0019r911J1902j1615M533O077
2624E627j1477J0869j0001J1360j1367M882L900r154J0669j1870J2558r364L189
2637a79K854o439R512j3263J4097r003J509K618m263Q066j3197J3911q771K634
$$ y = [-52, 3263, -6031, 4508, 99, -1779, 506, -1003, 3385, -5393, 3268, -1390, 1502, -345, -2643, 5522, -4366, 1861, -2632, 3358, -1796, -3769, 6292, -3419, 2255, -3100, 4498, -1677, -3406, 4584, -4092, 3698, -4925, 4185, 548, -2563, 3367, -3347, 5314, -6882, 3207, 525, -2051, 2071, -3207, 6785, -6461, 3184, -338, -1313, 1988, -5707, 7070, -5353, 2582, -771, 1146, 2369, -6795, 7677, -5501, 1763, -1832, 1055, 2256, -6310, 8377, -5518, 3344, -1909, -38, 2710, -5846, 5954, -5950, 5412, -3264, -741, 4845, -5378, 4641, -5270, 6632, -4983, -450, 5627, -5850, 5019, -4982, 6378, -4989, -107, 3793, -5361, 5308, -6562, 5996, -3368, -179, 2675, -3764, 5748, -7515, 6582, -2421, -912, 1706, -2557, 5509, -7688, 6223, -2548, 86]
2651H6P99l943R692j3828J1653o447L546k602k409J1011j4094R925m947M413m556
2666a701j620R963j3210J0034o000N113k839k819P761q865Q288r333P887j561
2680A098m835O465m311O142j0892R867j721n518N294l252N468r409Q868k447j804
2695i87K302m072P424q515M594j276J554n69m206R140p755K562q97K550k186l142
2711c479P118n514L235l375L488k16l637L846k582L612n760M452N65l605K345
2726D93o17K503n894N341j232j653J324j284L261m180L051j858J535o00k404M322
2742B108k971J124j679L499k343j868M629l309J403j475K268j723m64K205k719
2757a315K772k863J906j99k33J94j326L073m277K920k39j041L44q1J979l206K909
$$ y = [86, 885, -3058, 6634, -7194, 4459, -1988, 1558, -1044, -3453, 7558, -6536, 3389, -1558, 2855, -1701, -3321, 6642, -6568, 3466, -2534, 2579, -260, -3079, 4682, -4183, 4105, -5228, 2659, 1098, -3737, 2728, -1583, 4559, -6333, 3534, 1813, -3705, 1589, -1663, 3805, -5604, 3264, 817, -987, 1315, -2757, 4667, -3848, 746, -530, 1024, 455, -3751, 5389, -2366, 196, -701, 1849, -337, -3479, 3639, -1875, 1360, -2015, 1473, 1257, -2380, 1466, -1116, 2496, -3264, 1188, 1753, -1852, 493, -124, 2379, -3515, 1826, 594, -1059, 265, -1019, 2242, -1938, 1113, -745, 790, 190, -2214, 2108, -863, 261, -1418, 2081, -262, -2130, 2499, -810, 593, -882, 1386, -337, -801, 1404, -1315, 1457, -1406, 500, 301, 68, 262, -1064, 2009, -2268, 652, 413, -628, -284, -365, 1614, -1592, 1317]
2774A317j140k86N73j479J866j956J965j921J958j67k001K767k033P04j322J523
2790C68j61j193K583k317J691j131N90p73k67J164k029K332j238O76J35m64N94
2807E60j358J392j612Q06N29q87J089n62J104j960J410n06p46J130j072Q81l03
2824a05N27n55L57L80j224P37l18k07M39M70l97o30J394j358L48N47p69j40P47
2843B43K01j014Q36K37r93P41O1q95JJ313j049l53J706j076l27P34j08p70M80
2862c2L02q55J169k48p72M72L71p13j55J284j395P63L19m22k04J77j89m65R82
2881C89n48l53J100o65K75j45O7q27Q64j11j020J753p28J26j49N98r11j63J269
2900H21j904J053J85l32l1R03j51j503J889j584J41O06l00j4P8J367k107J558
$$ y = [1317, 177, -109, 464, -1015, 851, -1105, 860, -1061, 897, 730, -1271, 1496, -537, 167, -1155, 368, 207, -986, 1597, -720, 971, -160, 430, -343, -610, 554, -1475, 857, -381, 295, 430, -34, 560, -798, 594, -1018, -212, 317, -570, 519, -43, 1061, -899, 511, 5, -741, 389, -683, 198, -105, 422, -133, 224, 604, -620, 117, -201, -408, 31, 501, 104, -526, 868, -490, -142, 405, -364, -504, 243, 444, -570, 266, 503, -490, 251, 312, -583, -582, 731, -318, -671, 1035, -41, -368, 366, 258, -512, -32, 270, -585, 584, 336, -436, 36, 407, -306, -461, 823, -572, 191, 510, 88, -116, 61, -128, -593, 389, -159, -512, 588, -77, 198, 53, 120, -707, 157, 46, -974, 779, 51, 177, 28, 626, -285, -448, 821, -1083, -30, 155, -177, -208, 695, 544, -959, 930, -654, -513, 93, -207, -221, -143, 1224, -883, 675]
2918F75K01j977R44K10K13j373K298j301j99J160j219N64o20P32j103J054K49
2935E08j281J826r36j85L7O71j091m33K142k323J486n09O06p90o2R55j592J852
2953H81j870J421j17n88M44p47J800k942K628j060l77R38o76J082k377K815k131
2970h76J220k23j229K466k304J949k230K671j845j223L140l127K403j915K919
2985A796k776N66K317l681L429l746L269j722N06J047k600M669n610L773j263
3000b6n64O14j160M277o385N745k637k02N29j453L816o251O377l907J658N66k698
3017a701M691n641M867m448L427o11l170N849n732M942m751M087j197l155N472
3032B929o018N832n555M251k30l240M363m941O344p493N156k09l600M499m581
$$ y = [675, 876, -1101, -157, 53, 266, -1107, 1191, -110, -309, 851, -368, 196, -424, 308, -795, 259, 508, -773, 1053, 117, -68, -31, 640, -451, -884, 1258, -1065, 421, -88, 518, -272, -334, 621, -971, 881, -989, 432, 315, -273, 171, -576, 1224, -1718, 910, -150, -527, 411, -265, 817, -1560, 1255, -876, 344, 121, -1108, 1358, -946, 1003, -1227, 1444, -401, -1624, 1516, -1611, 792, -1123, 1796, -980, -414, 1903, -1778, 1651, -2095, 1174, -548, -42, 1005, -1595, 3074, -2536, 1237, -26, -590, 24, -1136, 3141, -3244, 2501, -136, -338, 191, -1262, 2554, -3697, 2680, -1227, 431, 997, -1701, 2990, -2651, 2216, -2232, 1195, 584, -2586, 3263, -2469, 2473, -2278, 1809, 612, -2543, 2929, -3089, 2743, -2812, 1439, 1209, -2031, 2332, -2609, 3735, -3758, 1398, 1189, -2411, 2088, -2493]
3047b493O644p758N309p08k868M177o061P727o767M094j553l56L590p631Q785
3062D131n869K395k077J888K190p892R422n953K661k122J585K445p099P761n913
3077b447M392l472K56M521o083N294n015N955n078n55N088n006M005n378P281
3092C758m223j556M184l811M086o530O912k582j519K328k013M639q036O473j652
3107D58j251R24j662N117p258N289j989R83l51l080O165n512L174k558L531j682
3123B98l843O834m333J203k583N156k327l450N449l068J805l793M241j118k342
3138a871L108k414M030n399K884P57j184o35j215N504n870K297J053O0j834j108
3154a837N012n381J995o94K203j134k182M719l080R25k955L968j280k869M031
$$ y = [-2493, 4151, -3607, 1702, 994, -1874, 2303, -3758, 3969, -2798, 1296, -257, -613, 2977, -4654, 4131, -1738, 657, -1420, 468, 2658, -5234, 4188, -1765, 896, -1226, 359, 2804, -4295, 3466, -2447, 1945, -1527, -1271, 3250, -2833, 2461, -2554, 3401, -1677, -2232, 2856, -2150, 1855, -3523, 3758, -465, -2021, 2163, -1648, 2438, -4092, 2820, 238, -1281, 1047, -966, 3673, -4363, 2110, 458, -793, 131, -1531, 3586, -3672, 1617, -372, 611, 260, -2820, 3345, -2167, 1007, -1551, 1980, 298, -3545, 3289, -1044, 159, -2424, 2732, 405, -3045, 2404, -664, 1141, -2652, 1589, 471, -1871, 1237, -1177, 2853, -2546, 338, 1095, -89, -724, -1939, 3565, -2305, -8, 1045, 1105, -729, -1837, 3175, -2206, -211, -905, 1298, 164, -2018, 2701, -379, 546, -2409, 1559, 279, -2590, 1441]
3169A441j368J470l811M002j148k046J885j783L349m803L742k18J59r04j493M692
3185C166n480K057K10J094j741p75M998n230K332j293J434j153j597L835l580
3200a723L520l578L128k31k479K245k151L240n224M445ok362K165j825L354m855
3216b337K872k67j156J845k802M259m057K102o14N04J72l159N297m198K026j113
3232f26J130M00k942M305l709K601j732M52J291k561K765k746K864k808J094J639
3248A417l157K957k134K582k831J426N15k235K714k584K088j377J062J0j266K201
3264A388l089K571j318K81K01p20J825k532K800j925L11M11q67R98j326K009j646
3281f28Q70M30j199J281j581J132j155J043k87m11J601j589J238o72J86o98J33
$$ y = [1441, 73, 1543, -2268, 1734, 586, -1460, 425, -1358, 1991, -2812, 930, 712, 871, -33, -1526, 3166, -2314, -257, -47, 1047, -694, -1469, 3529, -1701, 631, -662, 772, -381, -1978, 1857, -1723, 1797, -1781, 1347, 1116, -1363, 882, -1269, 1971, -3253, 1192, 1186, -1176, 989, -836, 2518, -2337, 535, 268, -888, 957, -1845, 2414, -1643, 459, -155, 349, 521, -2638, 2659, -1539, 487, -626, 504, 904, -2038, 2267, -1442, 1159, -573, -121, 1170, -1391, 1374, -1372, 1492, -1316, -222, 1417, -1740, 1217, -917, 1665, -1166, 260, 775, -1460, 1254, -1330, 758, -619, 443, 453, -813, 1388, -1701, 870, -448, -167, 34, -686, 1139, -1393, 1407, -518, -207, 204, -663, 335, -991, 1018, -628, 242, 672, -527, 754, -827, 305, -850, 193, -94, -505, 1096, -493, 745, 73, 259, -439, -306]
3298c06O44j430J791q10L19J41l17K32o44R18j386O20M52m55L96N5M03j361J172
3317D34m30q98J028l31J42r0N52p17L79L55r17O15j09j22m5O33l04m49Q89p48
3337a33rP8J9rP3J05l66L97O7m76L88r0j21M5L04p69L86K84o88L94J69k04j82
3360c38O10K6m68P59p70J17J06j27l59O11j3l12M39k23l24L29J01l85j27O82n12
3381a78J35L07k29j34m5J52o56Q59j84k96K73J61j19j87N47o78K67K36m35M1L40
3402A77J26o31P61n06j73L03m66J80kM23m48P52k61j31M81p78K02l57N22n23K39
3423a10P68j109R40m78K38l88k35O73j265J597j098M79M60n51N06p21J001j597
3441h90J318l80q76J167o98Q88j161J644j284m81J155j224J013p42J418j389L11
$$ y = [-306, 338, -1092, 699, -111, 208, 349, 32, 264, -380, 538, -848, -228, 224, -231, 165, 220, 623, -738, 434, 4, -894, 134, -197, -55, -145, 407, -310, 69, 424, -493, 122, 13, -109, -154, 479, 175, -274, 615, -133, -142, -64, -45, -54, 19, 124, -242, 155, 222, -254, 134, 44, -77, -32, 272, -497, -111, 173, -515, -121, 48, -156, -338, 272, 298, -170, 589, -181, -64, 42, -85, -444, 167, 154, -158, 281, 58, -266, 63, 164, -221, -348, 334, -178, -43, 264, 35, -99, -144, 8, -648, 211, 27, -269, 4, 165, 46, -141, 406, -272, -5, 231, -204, -163, 177, 303, -328, 433, -73, -246, 57, -409, -229, -231, 192, -256, 496, 235, 104, 585, -193, 9, -348, 174, -349, -110, 658, -451, 489, 11, 249, -139, -374, 299, -966, 631, -467, 12, 472, -79, 427, -294, 707, -890, 428, 48, -828, 339, -359, 529, -632, 1012, -272, -753, 402, -822, 191, -551, 867, -522, -211]
3458b11J106k055K238j805J072p96K91N12j399K682k760J617n42L70q1j358K389
3475A270k609J991j031N66M76j743K527k507J916j665P58O53j968K934k478K079
3491A169j984R08M01j260K063k671K821k240N63O26r24J753k907L422k662L92
3507e30J188j162J237k228L391k741M43J253j782K066k397K357k252J761l55j056
3523h07K695l078J902j405K057j819o02K781l457K224j020J373j265l17K260k665
3539a143K184k075J529o55n44J480j646K009k439K097m45q16Q97j267K162k709
3555a381J828l81q4K90j126K486k696J174k81N14p30q04K993k653J050m25R87
3572G61p50p61J859j898J558j668R14L95o75N64p05J792k745J120R00j007l10
$$ y = [-211, 895, -1160, 1078, -727, 345, -451, -160, 352, -1047, 1635, -1125, 492, -50, 320, 239, -1119, 1270, -1339, 652, -379, 187, 663, -1080, 1447, -1060, 856, -809, -51, 602, -1366, 1568, -910, 1169, -815, 93, 494, -766, 1297, -1374, 1447, -793, -230, 396, -528, 1225, -1682, 1740, -922, -530, 658, -504, 733, -1495, 1896, -845, -402, 851, -931, 1135, -1262, 1095, -1157, 604, 249, -807, 1888, -1190, 712, -693, 1364, -455, -1057, 1724, -1733, 491, -529, 844, -421, -738, 1522, -1143, 1041, -1034, 495, -160, -704, 776, -870, 1139, -1300, 797, 352, -464, 433, -834, 1328, -1381, 447, 66, -18, 272, -854, 1632, -1064, 110, -171, 343, -387, -1191, 1802, -851, 199, -226, 761, 11, -750, 1109, -789, 769, -899, 15, 410, -265, 299, -406, 1386, -1359, -239, 661, -346, -656]
3589f56K10K231l106J834J66q80j86m10J892k294J620q23R89k43j315K167j732
3606e36J305k190J911j67j521K221j423J620k482J914m84r94J004j271K812l512
3622a793K366k44k35J02j485L288m064K770j096J96P75j704K969l369K789k194
3638i29J002J053k632K796k602K968l095J992O91l228L327k681K803l231K534
3653G68j72k222L331l446L587l366K096k3j384K612l805L987k977J298l6r73K185
3670A460l824M536l387J851l94j180K550l723L979l245K129r28o35K580l654L806
3686A921l231K250j303k55K073l551M213l417K210r97M9R39l149M324l694K526
3702I08j177J09R85k123K644l006K723j578P1J580k380K339k510K849k173P11
$$ y = [-656, -446, 1785, -1321, 513, 679, -201, -387, -797, 1095, -1199, 421, -402, 587, 344, -971, 1196, -536, 769, -1421, 490, 323, -1198, 1023, -400, 1220, -1262, 652, 168, -826, 178, -1093, 1719, -1793, 573, 329, 94, 196, -1289, 1999, -2065, 705, -391, -195, 580, -1124, 1845, -1524, 1265, -929, 73, 1126, -1506, 1290, -1312, 1656, -1439, 553, 1244, -1984, 1343, -1338, 1465, -1766, 768, 596, -1626, 1705, -1741, 1846, -1520, 576, 553, -831, 1781, -2024, 1963, -1014, 284, 248, -725, 1460, -2364, 2172, -1215, 636, 242, -938, 1612, -2111, 1868, -1377, 752, -176, -811, 1769, -1885, 1921, -1310, 940, -363, -618, 1455, -2096, 2117, -1300, 910, -87, -38, 901, -2248, 2076, -1618, 908, -269, -160, 825, -1298, 1346, -1660, 1063, -515, -444, 1136, -1244, 1095, -1415, 1434, -739, -28]
3718b8J059k158K107k256K565k203J198P14k064K507k380J736j227K60K43o78
3734f05J726k291K125j116J22L06o63R32j754K173j126K14K66m06Q74j493J419
3751G03j301P92j90p09J477j268P72l68O70j174J99J140j506J048n04N07p89N31
3769C0M94j018P70p06M25J19l96L65N8M28r99J023l01l25Q0q4J02m95N68k62p5
3790a99L19k73L56k29J6k21L90l2n69R37n73j44J37M24m28j17L94o15L73k4J52
3811G4l73K19L98m47N11m79j53O15n72K03j37L10l87L09k08K25j9l3K7m73O99
3832C09o53K91N80p77K89J25j90J22j08J63n90M49J68l34K50Ql9j15K03m48J14
3853a83J88k2J2L4J51k05L08l20l72L41Pp9j8L68k92J44nl79M98k78L7j90N66
$$ y = [-28, 1031, -1127, 980, -1276, 1289, -914, 284, 998, -1066, 1441, -939, 797, -430, -170, 73, -605, 1121, -1170, 955, -161, -39, 267, -396, 536, -1218, 955, -171, 43, 309, -97, 777, -716, 703, -598, 194, 4, -705, 772, -496, 276, -92, 578, -596, -397, 743, -763, 285, -219, 288, -501, 30, 524, -494, 276, -430, -5, 114, -282, 83, 141, 569, -430, 593, 292, -33, 47, -37, 65, -430, 138, -124, -199, 120, -153, 203, -26, -10, -231, 159, 127, -442, 495, -78, -222, -85, 339, -89, -206, 188, -427, -54, -78, 74, -299, -80, 318, -129, 382, -97, -250, 365, -207, -4, -141, 169, -218, 91, -117, 108, 89, 56, 83, -390, 309, -344, -53, 527, -250, 39, 164, -26, 96, -12, 151, -439, 10, 178, -156, 94, 102, 63, -52, 151, -297, -183, 5, -17, -5, 29, 180, -25, 283, -37, -409, -68, -61, -140, -158, 210, -82, 62, 57, -322, 176, -102, -65, -255, 311]
3876C11n14K44J91m52L56j90l4m7L53k93k09Q28o34q1L66j46m4k31N48r84P76
3897A14R8m92M73k05J85m80Q02q48J43N87n66L37r9L28o95M67Q5n47P27l82L3
3918F5k51N11j36p26O11m16M39o5K45m17O9N91r31O81m92N07n06J78K77m01P64
3939E97j029N62l57k26P22n46K11l54R18o02J06L25q49P12m78K77k52L92K05p02
3959c68J115j054L59k32L70o71J69J137j220P75l07L4m88K07M82j198J271m33
3977e2JM28k24L29q41R86j245O69q5k75Q15n55M96q60P34j14k87P8k98R77j224
3998e47O56K14k74J43o41R05q48N51k02Q9L0p5M88q40Q18r26O19j32r7J70j31
4019c0N42r78P69o7l71k09L84Q27j703J190j74m08L98j34K28q63J131p36M58J44
$$ y = [311, -203, 41, 232, -220, 136, -54, -88, -135, 218, -75, -284, 544, -90, -171, 195, 49, 5, -226, 322, -662, 114, 212, -280, 193, -12, 173, -307, 495, -353, -210, 377, -189, 148, 49, 377, -318, 149, 234, -313, 414, 32, 65, -186, 325, 189, -537, 74, -342, 97, 32, 277, -140, -71, 520, -411, 270, -222, 285, -221, -43, 234, -167, 597, -432, 130, -227, -453, 269, -277, -66, -420, 498, -104, 2, 327, -522, 190, -288, -11, -263, 129, 334, -368, 747, -307, 52, -180, 190, -481, -312, 825, -395, 380, 73, 107, -381, -174, 308, -890, 381, -52, -51, 377, 153, 482, -359, 627, -618, 51, -34, -309, 506, -49, 447, -413, 321, 207, -80, -2, -300, 677, -547, 109, 323, 49, 192, -449, 456, -392, 159, -43, 46, 76, 1, 489, -351, 467, -459, 160, 28, -69, 101, -30, 512, -466, 303, 236, -135, -344, 40, 867, -836, 354, 180, -228, 170, 36, 264, -599, 532, -204, 254, 398]
4039C98j028Q62n05P64j202J150j09j196J520o46O57j636J241R7j216J273q14
4056c90J177j496J282k78n91Q49j566K045j905P31J37L6N19j447K043j756R52
4073C42p32M77N80j953K196j212J038j507P37J309k811K402j545J228j119N65
4089eR74k047K146k093J583q94l13J238j429J944k815L032j285r15J310q34J570
4106A167k903K992j410k50Q62j206J968k761K850j612L37L26j280K239k784K049
4122E84j160J199l16j480K784k941K313j652R62p5j375K571k408K338k246J194
4138B92J87j658K090k049K307k567J712K66j543J931k089K363k346J244p3o75
4154f08J327j993K776k028Q36m12j66R86k305K734j871O84l45N09P82k046K124
$$ y = [398, -630, 232, -273, 491, -711, 439, 330, -866, 654, 8, 665, -971, 270, 367, -849, 424, -390, 787, -709, 573, 295, -296, 553, -1013, 1032, -873, -142, -5, 31, 550, -897, 1146, -610, 342, -390, 87, 667, -1286, 910, -302, 736, -771, -34, 1275, -1536, 866, -679, 549, -570, -5, 969, -1078, 1068, -1025, 558, -336, -649, 589, -840, 1104, -1711, 1321, 36, -879, 431, -403, 1167, -1736, 1256, -154, -404, 458, -748, 1220, -1541, 1309, -303, 34, 360, -920, 1319, -1465, 584, -576, 623, 307, -1173, 1611, -1330, 983, -669, 293, 218, -1157, 1414, -994, 1344, -902, 292, 479, -1179, 911, -1138, 1169, -1398, 314, 580, -963, 968, -1121, 1242, -1104, 140, 67, -608, 719, -1274, 1502, -526, 310, -102, -268, 718, -1587, 1147, -724, -40, -385, 124, 906, -1140, 984]
4171I84j824J085p54J41Q02j177J771j708J749j493j74J227j061R80j565K076
4187A059j354J16O27j017J281j581J290p66M46n5m38J113j544J431j026M71k89
4204b36J34O38j215J243o27L09m68k0M75n42O35p61J214o66n41Q08n11M65j145
4223h11J602q32j8L08k55L97q79R29q14L73j48q2M91o62P86n72N78q17J06Q74
4243E54j123P01l23P00n07K96K64j050R54p18N44n58L47J81n15J042j004O39m85
4262f1k20L39k89O32j027J113n36L53j86l95M31q60J149r32M83K44l57O43q48
4281c24K98k67K96j79j93R46p77N18j47k6k18M0J21n01P58n94K76J48j88K34n98
4302c77P05r21P73k6m89P02k85O1l42J69j87R6L84n79N74m00M24k30o1K12m62
$$ y = [984, -840, 245, -509, -368, 434, -743, 1028, -680, 1069, -424, -598, 629, -432, 548, -1017, 1059, -295, -179, 448, -569, 712, -869, 421, -345, 101, 46, -392, 721, -823, 608, -418, 53, -236, -102, 536, -679, 564, -63, 246, -222, -242, 233, -309, 326, -435, 779, 113, -428, 380, -131, 334, -811, 791, -41, -59, 249, -6, 391, -488, 441, -373, 0, -148, -230, 261, -401, 385, -187, 391, -426, -320, 554, -569, 132, -191, 509, 2, 298, 562, -488, 466, -252, 292, -266, 81, 262, -253, 789, -215, 424, -61, -281, 58, -231, 401, -626, 487, -49, 304, 118, -277, 154, -706, 443, -489, -6, 238, -119, 524, -324, -26, -293, 3, -176, -369, 577, -200, 318, 171, 145, -73, -33, 88, -413, 345, -249, 27, 175, -13, 221, -377, 328, -593, 180, 154, -335, 367, 82, 143, -199, -30, -217, -121, 263, -316, 258, -142, 282, 52, -9, 203, -259]
4323b59P54p61J14Q5M64k80l05O45o37K57q7k60M26k70K39l11K77o2j38L36k56
4344b9r7J16j05k7K20J69m77L22J06k22l3J92j11l89Q70o65P4J70j58k44L75j4
4366D3m69N71l7K2j00m4J5r8K89l10p2N26k0l03J91k42N7J17l33OK83j08L08l25
4390c3O3K06k10ll86M95n14M09J60q7m6rQ3l03o2J24j06K13P4Q6l61N69l27l27
4414b92J46Q0R3j41J91k87J18L54m57K33j0m3l43L73O0m15M09Q5k20l8M01k58
4436C9k96M40k51L15j80o3n1J63k9k72L88j64J49k08Q3j10O6L90o99L34k06K80
$$ y = [-259, 495, -266, -152, -67, 397, 117, -188, 457, -180, 77, -10, -270, 156, -114, 125, -186, 91, 29, -109, 227, -29, -126, -10, -115, -142, 78, 247, -230, 92, 198, -24, -57, 135, 24, -365, 505, -160, -86, 84, -74, -318, 57, 43, -426, 145, 108, 130, 30, -14, 1, -97, 192, -118, -190, 336, 316, 13, 204, -38, 19, 136, -197, -191, 92, -16, 292, -33, 30, 236, 26, 23, -363, 132, -382, 27, 187, 100, 54, 45, 128, -175, -237, -113, -219, -6, 68, 154, -207, 362, 35, -292, -146, -66, 27, -114, 77, -210, -92, 262, -195, 38, 28, -15, -358, 15, 75, -340, 69, 154, -66, -104, 297, 39, -257, 183, -68, 247, 67, 4, -47, 116, 87, -185, 203, 39, 188, -20, 63, -47, 19, 409, -290, 44, -162, 118]
$$ [...]
8191C5
##END NTUPLES=NMR FID
##END=
