##TITLE=1H_LR-750-RM1
 CCl4
 8 sc, 
 7.07.2022
##JCAMPDX= 6.0         $$ Bruker NMR JCAMP-DX V2.0
##DATA TYPE= NMR FID
##DATA CLASS= NTUPLES
##ORIGIN= UXNMR, Bruker Analytische Messtechnik GmbH
##OWNER= root
$$ XWIN-NMR		Version 3.5
$$ Thu Jul  7 14:07:48 2022 Russian Standard Time (UT+4h)  she@DPX200
##.OBSERVE FREQUENCY= 200.1313499994
##.OBSERVE NUCLEUS= ^1H
##.DELAY= (6, 6)
##.ACQUISITION MODE= SIMULTANEOUS
##.ACQUISITION SCHEME= undefined
##.AVERAGES= 8
##.DIGITISER RES= 18
##SPECTROMETER/DATA SYSTEM= spect
##.PULSE SEQUENCE= zg30
##.SOLVENT NAME= DMSO
##.SHIFT REFERENCE= (INTERNAL, DMSO, 0, 15.7039)
##AUDIT TRAIL= $$ (NUMBER, WHEN, WHO, WHERE, WHAT)
$$ ##TITLE= Audit trail, XWIN-NMR		Version 3.5
$$ ##JCAMPDX= 5.01
$$ ##ORIGIN= Bruker BioSpin GmbH
$$ ##OWNER= she
$$ F:/spectra/data/she/nmr/H-F/1/audita.txt
$$ ##AUDIT TRAIL=  $$ (NUMBER, WHEN, WHO, WHERE, WHAT)
(   1,<2022-07-07 14:06:34.35 +0400>,<she>,<DPX200>,
      <created by zg, POWCHK disabled, PULCHK disabled
       configuration hash MD5:
       00 E9 B6 7A A2 85 ED C7 34 08 36 98 17 FE 4E 26
       data hash MD5: 16K
       95 D7 D9 0E 04 47 CD 82 CD 7B 3C 74 DC 4E F5 A2>)
$$ ##END=
$$ 
$$ hash MD5
$$ 69 1A 6B C0 CF 4A 5E E3 C9 5B 4F C1 1A 71 81 27
##$RELAX= 
##$RELAX= 
##$RELAX= 
##$RELAX= 
##$RELAX= 
##$RELAX= 
$$ Bruker specific parameters
$$ --------------------------
##$DU= <F:/spectra>
##$EXPNO= 1
##$NAME= <H-F>
##$PROCNO= 1
##$TYPE= <nmr>
##$USER= <she>
##$AMP= (0..31)
100 100 100 100 100 100 100 100 100 100 100 100 100 100 100 100 100 100 
100 100 100 100 100 100 100 100 100 100 100 100 100 100 
##$AQSEQ= 0
##$AQ_mod= 1
##$AUNM= <au_zg>
##$AUTOPOS= <>
##$BF1= 200.13
##$BF2= 200.13
##$BF3= 200.13
##$BF4= 200.13
##$BF5= 200.13
##$BF6= 200.13
##$BF7= 200.13
##$BF8= 200.13
##$BYTORDA= 1
##$CFDGTYP= 0
##$CFRGTYP= 5
##$CHEMSTR= <none>
##$CNST= (0..31)
1 1 145 1 1 1 1 1 1 1 1 1 1 1 1 1 1 1 1 1 1 1 1 1 1 1 1 1 1 1 1 1 
##$CPDPRG= <>
##$CPDPRG1= <>
##$CPDPRG2= <>
##$CPDPRG3= <>
##$CPDPRG4= <mlev>
##$CPDPRG5= <mlev>
##$CPDPRG6= <mlev>
##$CPDPRG7= <mlev>
##$CPDPRG8= <mlev>
##$CPDPRGB= <>
##$CPDPRGT= <>
##$D= (0..31)
0 1.2 0 0 0 0 0 0 0 0.06 0 0.03 0 0 0 0 0.0002 0 0 0 0 0 0 0 0 0 0 0 0 
0 0 0 
##$DATE= 1657188393
##$DBL= (0..7)
120 120 120 120 120 120 120 120 
##$DBP= (0..7)
150 150 150 150 150 150 150 150 
##$DBP07= 0
##$DBPNAM0= <>
##$DBPNAM1= <>
##$DBPNAM2= <>
##$DBPNAM3= <>
##$DBPNAM4= <>
##$DBPNAM5= <>
##$DBPNAM6= <>
##$DBPNAM7= <>
##$DBPOAL= (0..7)
0.5 0.5 0.5 0.5 0.5 0.5 0.5 0.5 
##$DBPOFFS= (0..7)
0 0 0 0 0 0 0 0 
##$DE= 6
##$DECBNUC= <off>
##$DECIM= 32
##$DECNUC= <off>
##$DECSTAT= 4
##$DIGMOD= 1
##$DIGTYP= 9
##$DL= (0..7)
0 120 120 120 120 120 120 120 
##$DP= (0..7)
150 150 150 150 150 150 150 150 
##$DP07= 0
##$DPNAME0= <>
##$DPNAME1= <>
##$DPNAME2= <>
##$DPNAME3= <>
##$DPNAME4= <>
##$DPNAME5= <>
##$DPNAME6= <>
##$DPNAME7= <>
##$DPOAL= (0..7)
0.5 0.5 0.5 0.5 0.5 0.5 0.5 0.5 
##$DPOFFS= (0..7)
0 0 0 0 0 0 0 0 
##$DQDMODE= 0
##$DR= 18
##$DS= 0
##$DSLIST= <SSSSSSSSSSSSSSS>
$$ [...]
##$SUBNAM2= <"">
##$SUBNAM3= <"">
##$SUBNAM4= <"">
##$SUBNAM5= <"">
##$SUBNAM6= <"">
##$SUBNAM7= <"">
##$SUBNAM8= <"">
##$SUBNAM9= <"">
##$SW= 18.0517283424941
##$SWIBOX= (0..15)
0 0 2 0 0 0 0 0 0 0 0 0 0 0 0 0 
##$SW_h= 3612.71676300578
##$TD= 16384
##$TD0= 1
##$TE= 0
##$TE2= 300
##$TE3= 300
##$TEG= 300
##$TL= (0..7)
0 120 120 120 120 120 120 120 
##$TP= (0..7)
150 150 150 150 150 150 150 150 
##$TP07= 0
##$TPNAME0= <>
##$TPNAME1= <>
##$TPNAME2= <>
##$TPNAME3= <>
##$TPNAME4= <>
##$TPNAME5= <>
##$TPNAME6= <>
##$TPNAME7= <>
##$TPOAL= (0..7)
0.5 0.5 0.5 0.5 0.5 0.5 0.5 0.5 
##$TPOFFS= (0..7)
0 0 0 0 0 0 0 0 
##$TUNHIN= 0
##$TUNHOUT= 0
##$TUNXOUT= 0
##$USERA1= <user>
##$USERA2= <user>
##$USERA3= <user>
##$USERA4= <user>
##$USERA5= <user>
##$V9= 5
##$VALIST= <valist>
##$VCLIST= <CCCCCCCCCCCCCCC>
##$VD= 0
##$VDLIST= <DDDDDDDDDDDDDDD>
##$VPLIST= <PPPPPPPPPPPPPPP>
##$VTLIST= <TTTTTTTTTTTTTTT>
##$WBST= 1024
##$WBSW= 4
##$XGAIN= (0..3)
0 0 0 0 
##$XL= 0
##$YL= 0
##$YMAX_a= 450231
##$YMIN_a= -362816
##$ZGOPTNS= <>
##$ZL1= 120
##$ZL2= 120
##$ZL3= 120
##$ZL4= 120
##$ABSF1= 10
##$ABSF2= 0
##$ABSG= 5
##$ABSL= 3
##$ALPHA= 0
##$AQORDER= 0
##$ASSFAC= 0
##$ASSFACI= 0
##$ASSFACX= 0
##$ASSWID= 0
##$AUNMP= <proc_1d>
##$AZFE= 0.1
##$AZFW= 0.1
##$BCFW= 1
##$BC_mod= 2
##$BYTORDP= 1
##$COROFFS= 0
##$CY= 11.3945322036743
##$DATMOD= 1
##$DC= 2
##$DFILT= <>
##$DTYPP= 0
##$F1P= 2.36226072786647
##$F2P= -0.459571619588291
##$FCOR= 0.5
##$FTSIZE= 0
##$FT_mod= 4
##$GAMMA= 1
##$GB= 0.15
##$INTBC= 1
##$INTSCL= 1
##$ISEN= 128
##$LB= 0.24
##$LEV0= 0
##$LPBIN= 0
##$MAXI= 10000
##$MC2= 0
##$MEAN= 0
##$ME_mod= 0
##$MI= 1.114404
##$NCOEF= 0
##$NC_proc= 0
##$NLEV= 6
##$NOISF1= 3.799351
##$NOISF2= 2.8
##$NSP= 1
##$NTH_PI= 0
##$NZP= 0
##$OFFSET= 15.70392
##$PC= 1
##$PHC0= -18057.16
##$PHC1= 8.00068
##$PH_mod= 1
##$PKNL= yes
##$PPARMOD= 0
##$PSCAL= 0
##$PSIGN= 0
##$REVERSE= no
##$SF= 200.130013532006
##$SI= 16384
##$SIGF1= 3
##$SIGF2= 2
##$SINO= 400
##$SIOLD= 16384
##$SREGLST= <1H.CDCl3>
##$SSB= 0
##$STSI= 0
##$STSR= 0
##$SW_p= 3612.71676300578
##$SYMM= 0
##$S_DEV= 0
##$TDeff= 0
##$TDoff= 0
##$TI= <>
##$TILT= no
##$TM1= 0
##$TM2= 0
##$TOPLEV= 0
##$USERP1= <user>
##$USERP2= <user>
##$USERP3= <user>
##$USERP4= <user>
##$USERP5= <user>
##$WDW= 1
##$XDIM= 8192
##$YMAX_p= 0
##$YMIN_p= 0
$$ End of Bruker specific parameters
$$ ---------------------------------
##NTUPLES= NMR FID
##VAR_NAME=  TIME,          FID/REAL,        FID/IMAG
##SYMBOL=    X,             R,               I
##VAR_TYPE=  INDEPENDENT,   DEPENDENT,       DEPENDENT
##VAR_FORM=  AFFN,          ASDF,            ASDF
##VAR_DIM=   8192,          8192,            8192
##UNITS=     SECONDS,       ARBITRARY UNITS, ARBITRARY UNITS
##FACTOR=    0.0002768,     1,               1
##FIRST=     0,             0,               0
##LAST=      2.2672688,     0,               0
##MIN=       0,             -362816,         0
##MAX=       2.2672688,     450231,          0
$$ Real data points
##PAGE= N=1
##DATA TABLE= (X++(R..R)), XYDATA
$$ [...]
2286E35K42j725J205k62j51j72J538k310M56K360k982P25J348j99j439J281k4
$$ 535 777 -948 257 -5 -156 -328 1210 -1100 -644 1716 -1266 -541 807 608 -831 450 426
2303D26j594K529k002m81K465o23k184J408J888l411J084J276j176K30N94n56
$$ 426 -1168 1361 -641 -1122 1343 720 -1464 -56 1832 -1579 -495 781 -395 -165 429 -127
2319a27j5K047k612m60L038k194j299J876O72j714Q07Q48j872J689l63j655J594
$$ -127 -142 1905 -707 -1167 1871 -323 -1622 254 926 -788 19 867 -1005 684 321 -1334 260
2336B60N52j885M36K460k235k82J578r68l27O58o79o21K451j500j321K938p60
$$ 260 812 -1073 -637 1823 -412 -694 884 -84 -411 247 -432 -1053 1398 -102 -1423 1515 755
2353G55j699P89J102j712O13O08j911K403J69k251R46J940k314p57K803j909n41
$$ 755 -944 -155 947 -765 -152 456 -1455 948 1117 -1134 -188 1752 -562 -1319 1484 -425 -966
2370i66J892j104l03J731r63j693L113j127k682K610O50j881J2K431k236K88J249
$$ -966 926 -178 -481 1250 287 -1406 1707 580 -2102 508 1158 -723 -711 1720 -516 -228 1021
2387A021k480J436R82j880l52K627p42k277L324j393q06O54J07q60M40J278k678
$$ 1021 -1459 -23 959 -921 -1273 1354 612 -1665 1659 266 -540 114 221 -639 -199 1079 -1599
2404a599K626L00k740J473L36l53j148J968j662M72K107l271K066K55l93k167
$$ -1599 1027 1327 -1413 60 396 43 -1105 863 -799 -327 1780 -1491 575 830 437 -1730
2420a730K087Q43l355K909j040N16L11r76J73O09R92l966L312R66l033J211J179
$$ -1730 357 1200 -2155 754 -286 230 541 -435 -262 347 1339 -2627 685 1651 -1382 -171 1008
2437A008lk817K724q76j104K220k300J339M75q5j831J585R56l295K477k10j093
$$ 1008 1005 -1812 912 36 -1068 1152 -1148 191 666 581 -1250 335 1291 -2004 473 263 -830
2454h30R55P29j262n87K850k534m01K215o60j131N85M86n05N84p66l71J994j367
$$ -830 125 854 -408 -995 1855 -679 -1080 1135 475 -656 -71 415 -90 494 -272 -643 1351 -16
2472a6j681K761J42k362J47K365j131j348J834j019L60K33r02J207l78O9j835
$$ -16 -1697 1064 1206 -1156 -1009 1356 225 -1123 711 -308 52 285 -617 590 212 281 -1554
2489a554L080j213j976K876j592J071j786J920j018n63K711m376L808j682K44
$$ -1554 1526 313 -1663 1213 -379 692 -1094 826 -192 -755 1956 -2420 1388 -294 -50
2504e0j27k65K113m196N349m753K049J202k857K568k931M956n947L750L46l429
$$ -50 -177 -442 1671 -2525 2824 -1929 120 1322 -1535 1033 -1898 3058 -2889 861 1207 -2222
2520b222M449m791M757l628K701j622j452O353q775O396k986J784j243j901O443
$$ -2222 2227 -2564 2193 -1435 1266 -356 -1808 4545 -4230 2166 -820 964 -279 -2180 4263
2535D263q267P352n856K748J814n023N353n495P915q927M669K444o643O766n999
$$ 4263 -4004 3348 -2508 240 2054 -2969 2384 -3111 4804 -4123 546 2990 -3653 3113 -2886
2550b886O741o991L961M58m441P736r380Q447n472K237M10l371P145j0479J0798
$$ -2886 3855 -3136 825 1283 -3158 4578 -4802 3645 -1827 410 820 -2551 4594 -5885 4913
2565D913o341M09K720l627N626r766J0833o571J245J698m121Q549j0699P919m457
$$ 4913 -1428 -1019 1701 -1926 3700 -6066 4767 -1804 -559 1139 -2982 5567 -5132 2787 -1670
2580a670L610j647n462J1861j0791N414l186M477j676n944J0574r498O896o139
$$ -1670 1940 293 -5169 6692 -4099 1315 -1871 2606 930 -5014 5560 -3938 2958 -3181
2594c181L392K837p047P191o539Q287q678L005M946q352O113m598P391q507L541
$$ -3181 211 3048 -3999 3192 -3347 4940 -3738 -733 4213 -4139 1974 -2624 4767 -3740 -199
2609a99L921p321O300o077O895n483Q68K907l312N185r098R134k711l744K281
$$ -199 3722 -3599 2701 -3376 3519 -1964 -1096 1811 -1501 3684 -5414 3720 1009 -2735 -454
2624d54N25L983j0612R557j142k954R79j349N885q478M492p54J717r51m250Q347
$$ -454 71 4054 -6558 2999 1857 -1097 -118 -1467 4418 -4060 432 -322 1395 444 -3806 4541
2640D541n343L27j021L686j639n148P702l200k3j025K453K94m042L749j749J883
$$ 4541 -802 -475 -1496 2190 551 -4597 3105 -95 -118 -1143 1310 1604 -2438 1311 -438 1445
2656A445l428J374L435m354O05J685J736n283J527M406m105r46K063J714k724
$$ 1445 -1983 -609 2826 -1528 -923 762 2498 -2785 -1258 3148 -957 -1903 160 1874 -850
2671h50k35K181k33r73j928K350J793l673k82M129j105l721K136L132l638j080
$$ -850 -1085 1096 863 -110 -2038 312 2105 -1568 -1850 2279 1174 -2547 -411 2721 -917 -1997
2687a997L623j609q96M75J223p66l58P35o53J740l160J610J402k304L30P40K136
$$ -1997 1626 17 -879 -404 819 53 -305 430 -223 1517 -1643 -33 1369 -935 -605 135 2271
2704B271m773K904J419l093Q80j19K459l841K109K93m57Q58l531M806k103j146
$$ 2271 -2502 402 1821 -1272 -392 -511 1948 -1893 216 509 52 910 -2621 2185 82 -1064
2720a064L22J591O43m942N467j580m91j96L52J212l466L663l073K543p16j780
$$ -1064 -742 849 1492 -3450 2017 437 -54 -250 102 1314 -2152 1511 -1562 981 265 -1515
2736a515L410k566J365k251L148j983j314M104l994K128q87J793k076j48L123
$$ -1515 1895 -671 694 -1557 1591 -392 -1706 2398 -1596 532 -355 1438 -638 -786 2337
2751B337m311K860j721Q50M54j277J525j710L183l912J797J147k675J493o79K577
$$ 2337 -1974 886 -835 15 469 -808 717 -993 2190 -1722 75 1222 -1453 40 -639 1938
2767A938l271J748N91j965K074k330J435o87R46r95P4K154l106K124n83j45l8
$$ 1938 -1333 415 1006 -959 1115 -1215 220 -467 479 -516 -442 1712 -1394 730 147 2 -36
2784c6j72N53j547K858k173J83J434j255K05m78J316k024J131K92j083J697q00
$$ -36 -208 345 -1202 1656 -517 -334 1100 -155 50 -428 888 -1136 -5 287 -796 901 101
2801A01rl25J290j639l34J922j489L60L73K51n93M20J6j274J648q36q10J355p4
$$ 101 92 -233 1057 -582 -916 1006 -483 -123 250 501 -92 328 344 -930 718 -118 -928 427 353
2820C53n19J78P72r72K18Q8p48O62K71o88j3J301r72p10J572o80o67P81j71l76
$$ 353 -166 12 784 -188 30 118 -630 32 303 -385 -398 903 -69 -779 793 113 -554 227 56 -320
2840c20O58k77p06J261J13j544R70N12j311P7J300j048J80P70q28J9P80j105l21
$$ -320 338 61 -645 616 729 -815 155 667 -644 -567 733 -315 -135 635 -193 -174 606 -499 -820
2859h20J566n33j097J388J75r87N83M33j234P00M77j299R29K21q84R0R48o09o85
$$ -820 746 213 -884 504 679 -308 275 708 -526 174 651 -648 281 502 -382 -292 656 47 -638
2878f38J062l86o42J034o68l86J483o21j176J439K8j246O71P29j119K54J98n63
$$ -638 424 38 -604 430 -238 -624 859 238 -938 501 529 -717 -46 683 -436 -182 16 -547
2896e47O82N03j113M40J119j445j69J122o83j76N99j92o09Q96n17o56J575o45
$$ -547 135 638 -475 -35 1084 -361 -530 592 -91 -267 332 140 -469 427 -90 -746 829 184
2914A84j326R58Q86q82j99J127r92M64J24j008N64N75o53j146K331q08q16J160
$$ 184 -1142 -184 702 -180 -379 748 -244 220 344 -664 -100 475 -178 -1324 1007 199 -617 543
2932E43o68j25k40R22r18P11M65k172K469n79n75n30J191k04j732K602j813P90
$$ 543 -125 -250 -490 432 -486 225 690 -1482 987 408 -167 -697 494 290 -1442 1160 -653 137
2950A37R4q45J027o90J135k676K851q60j373K301j574J094j558K373k309K45K198
$$ 137 231 -614 413 -277 858 -1818 1033 173 -1200 1101 -473 621 -937 1436 -873 -628 1570
2967A570l170K583j787J540j196L37J093k351L437l768K112K25j163N68j034L289
$$ 1570 -1600 983 -804 736 -460 -123 970 -1381 2056 -1712 400 625 -538 30 -1004 2285
2983B285m581K806K61j400J318k330L829l683K007j265N04K150m774M881k566
$$ 2285 -2296 510 771 -629 689 -1641 2188 -1495 512 -753 -249 1901 -2873 2008 -558
2998e58J448k043J481J567m716M980k865J304j115K66J722l460M168m010L002
$$ -558 890 -1153 328 1895 -2821 2159 -706 598 -517 -251 1471 -1989 2179 -1831 1171
3013A171j336j445L498k984K248l122M326k826j617M363k910J046k698M541k245
$$ 1171 -165 -1610 1888 -1096 1152 -1970 2356 -470 -2087 2276 -634 412 -2286 2255 10
3028A0j480L036l000L677m479K699L62j249N29j720N147n364J520J601j186j93
$$ 10 -1470 1566 -1434 2243 -2236 463 825 -424 105 -1615 3532 -1832 -312 1289 103 -90
3044i0k154M964m017J236L15l11J866l917L592j519K21j421J304J965m582L624
$$ -90 -2244 2720 -1297 -61 254 -57 1809 -2108 1484 -35 186 -1235 69 2034 -2548 1076
3060A076n96l11r92J081J456m187K844m23O83j242l58K681j501o50n45L031j968
$$ 1076 480 169 -823 258 1714 -2473 371 -52 631 -611 -969 1712 211 -439 -984 2047 79
3077G9k743L923k90j637q16L399r72k495K000J25m12j234O97J075n60r90O69J608
$$ 79 -2664 1259 969 -668 -1484 1915 943 -1552 448 573 161 -1073 -376 699 139 -851 -182 1426
3095A426j489j147K282l63k377J262J440q87j556K455j35j801Q27N5N19j641P14
$$ 1426 -63 -1210 1072 709 -1668 -406 1034 147 -1409 1046 911 -890 -63 -8 511 -1130 -416
3112d16J188o73j26r06L280k881p43K069m14n97j840M082k043n34J146n08J588
$$ -416 772 99 -27 -933 2347 -534 -1277 792 378 -219 -2059 2023 -20 -554 592 84 1672
3129A672l767K309l63L08q37l34M143m775K342k87J77r97j161L551m020K936j229
$$ 1672 -2095 214 -149 159 -678 -1012 3131 -1644 698 411 588 -409 -1570 1981 -2039 897 -332
3146c32N90O00k220K935l282L203l259J637J793l759M089k712K295l542K412R38
$$ -332 258 858 -1362 1573 -1709 1494 -1765 -128 1665 -2094 1995 -717 1578 -1964 448 1386
3162A386m141M456l141K915k665J426J361l134L911n184M629k170n78J655j757
$$ 1386 -2755 1701 -1440 1475 -1190 236 1597 -1537 2374 -2810 1819 -351 -929 726 -1031
3177a031L309n096M980k325n98J972k899L711m177L391k164J277O30l167M565
$$ -1031 2278 -2818 2162 -163 -761 1211 -1688 2023 -2154 1237 -927 350 980 -2187 2378
3192B378l827K360j531Q32N17k564M141m515L360j379j91J200k208L181l613L385
$$ 2378 -1449 911 -620 212 729 -1835 2306 -2209 1151 -228 -419 781 -1427 1754 -1859 1526
3208A526k328K30J896k711K719k232K514k944Q72K124l604L133j989J931j547
$$ 1526 -802 -572 1324 -1387 1332 -900 1614 -1330 -458 1666 -1938 1195 -794 1137 -410
3223d10O22P67k246L127l712K315j37p33L18n31K468l379K477n84q13J192j841
$$ -410 212 979 -1267 1860 -1852 463 326 -407 -89 -620 1848 -1531 946 362 -451 741 -1100
3240a100J695j656K014j430N27J252k295J636q89M00j045Q86M14j652K490j560
$$ -1100 595 -1061 953 -477 50 1302 -993 643 -246 154 -891 -5 409 -1243 1247 -313
3256c13J94L12k37k16n68J501j583J276n25K7P48m89j38n80J250j038m87J547
$$ -313 -119 193 -44 -260 -828 673 -910 366 -159 -132 616 127 -11 -591 659 -379 -866 681
3274F81o26P7o9M09n33Q0K92j121J512p21l58P55R3p15J49Q16j164M14K95n31
$$ 681 55 132 63 472 -61 19 311 -810 702 -19 -377 378 471 -244 -95 721 -443 -29 266 -265
3294b65J71L55k34j97O87m36m36M84k49l96O85M0n17N87j41l50M23J16q84L06
$$ -265 -94 261 27 -170 517 81 -355 129 -120 -516 169 209 -308 279 138 -212 211 327 -557 -251
3314b51N75p23KP78l08l08L77j49l14P27o13l54R57j83p41P89L29q19J89L24m55
$$ -251 324 -399 -397 381 73 -235 142 -7 -321 406 -207 -561 396 213 -528 261 590 -229 -40 284 -171
3335a71K45K73o94K62P55q45m1O83n15k89O83k51m27L45K1l68Q64l21n41N69K18
$$ -171 74 347 -347 -85 670 -175 -216 467 -48 -337 346 95 -332 13 34 -334 530 209 -332 237 455
3356D55q71K79M62p02K71K55j92J89L21n56k13Q74p39m20J026l62l93M23J80m53
$$ 455 -416 -137 325 -377 -106 149 -43 146 467 -89 -302 572 -167 -587 439 77 -316 107 287 -166
3376a66L35qo87P41j7m93P9P91n66m09Q81q49L15K61n02J98L65l90m09J132l72
$$ -166 169 161 -526 215 198 -295 -216 575 9 -400 481 -368 -53 208 -294 -96 269 -121 -530 602 230
3397B30m47L21N0m54J17K22n04N05O13j196R01k3l26n59R65n17k72R49o88K54
$$ 230 -217 104 154 -300 -183 39 -465 40 653 -543 358 335 9 -550 415 -102 -374 575 -113 141
3417A41J9O1m58L75N30j616J269J35o11K15J59J25n85R82j369P23L19r31O36N2
$$ 141 160 221 -237 138 668 -948 321 456 -155 60 219 344 -241 741 -628 95 414 -517 119 171
3437A71K71j110R65K93j214R11p18P28m25J46j49J4R52j489J168l15m25L01p1
$$ 171 442 -668 297 590 -624 287 -431 297 -128 18 -131 -117 835 -654 514 199 -226 75 4
3456DM57j325J493o90q3M98o42N55p03O34r09R28k99n42J427j000K70j52K33m02
$$ 4 461 -864 629 -61 -144 354 -288 267 -436 198 -711 217 -82 -624 803 -197 73 -79 154 -248
3476b48l27J405j414M59K15K35k7o41Q29q89R73j205N57Q57r08l93O61N38j473
$$ -248 -575 830 -584 -125 90 325 298 -343 486 -403 570 -635 -78 779 -129 -522 139 677 -796
3495g96L78J246j357L57Q3J42j29J98K2l70P51o85j55Q79o60m50Q17%p77O38N32
$$ -796 -418 828 -529 -172 -89 53 -76 122 144 -226 525 -160 -315 564 -96 -546 271 271 -506 132 664
3516F64j153M18M11n06p6J08P24r25L82J21j12L14j080R52K48q73J57L22P18j461
$$ 664 -489 -71 340 -166 -242 -134 590 -335 47 168 56 370 -710 242 490 -383 -226 96 814 -647
3536f47R11m8m66K2l30J326r45K76m99Q66L30j923J717n67k14n59Q84N35k037
$$ -647 264 216 -250 -228 -558 768 -177 99 -400 466 796 -1127 590 23 -191 -750 134 669 -1368
3555a368K694j731M65l06q5P44j504K111k134K057r17o65J804j826J253j851K486
$$ -1368 1326 -405 60 -246 -331 413 -1091 1020 -1114 943 26 -639 1165 -661 592 -1259 1227
3572A227j525j069K691k338J791j917K130q25j049J848k128K733k918J772R1q52
$$ 1227 -298 -1367 1324 -1014 777 -1140 990 165 -884 964 -1164 1569 -1349 423 514 -338
3588c38J111k360L576l827J943J55m18J036k618L580k994J863o90n76K187l795
$$ -338 773 -1587 1989 -1838 105 260 -158 878 -1740 1840 -1154 709 19 -557 1630 -2165
3604b165L563k091J265r90l7J898l778M015k439J289q99k23K187l413L626l179
$$ -2165 1398 -693 572 -418 -455 1443 -2335 1680 -759 530 -369 -592 1595 -1818 1808 -1371
3620a371K353o44j722L036k633K126k854L315j411j802L229k521K258k856K431
$$ -1371 982 338 -1384 1652 -981 1145 -1709 1606 195 -1607 1622 -899 1359 -1497 934
3635I34p56j382K453k703L221k791J005K77k99R01k588L608k930Q17L58l05P65
$$ 934 178 -1204 1249 -1454 1767 -1024 -19 258 -41 860 -1728 1880 -1050 -233 125 -180 585
3652E85k112K984k449J207p2o65J499k107K027j526J002q05M29J410k842J941
$$ 585 -1527 1457 -992 215 143 -522 977 -1130 897 -629 373 -432 -3 1407 -1435 506
3668E06p33Q24j273K10J647k356J767j001P31l1j000J377j115J118j870J810q2
$$ 506 -227 597 -676 -466 1181 -1175 592 -409 322 291 -709 668 -447 671 -1199 611 529
3685E29j443J050N9N64j786J415j73q05J022p84P45n50J00L10k30J38j045J457
$$ 529 -914 136 195 759 -1027 388 215 -590 432 -352 393 -157 -57 253 23 161 -884 573
3703E73p44l73J025m7n94j67P79o18j87N58l42p4J88K39k30J73k11r3M98l37p38
$$ 573 -171 -544 481 434 -160 -327 452 -166 -353 205 -137 -211 -23 216 -14 159 -52 -145 353 16 -722
3724g22Q70j7n06K09P00n35l02P29o01P2K41l51K48j96J88j91N54m63l87R83q76
$$ -722 148 131 -375 -166 534 -1 -303 426 -175 -103 138 -213 35 -161 27 -164 390 -73 -460 523 -353
3745c53J48L14K89n93j77Q04q71N73J20n86N99m14L28m43M64l32K14M98j177P01
$$ -353 -205 109 398 -195 -372 432 -439 134 254 -332 267 -147 181 -262 202 -130 84 582 -595 106
3765A06j87L72q53O69K66r68O93q9L3k9j74J19K4Q97j393N38N42q78M21O8j40
$$ 106 -81 291 -562 107 373 -595 98 9 42 13 -161 -42 -18 879 -514 24 566 -312 109 177 37
3786C7p00J076m12k46O61o56N40m58N80o09P1M69n31N64p16M00K0o1K01m90P58
$$ 37 -663 413 1 -245 416 -240 300 -158 422 -187 -116 353 -178 386 -330 70 90 29 230 -260 498
3807D98p50J70L26q0k10K7J02o35R34l54l84P28l80k43O4P00q57J66N26o16L51
$$ 498 -252 -82 244 164 -46 -19 83 -552 382 28 -356 372 -8 -251 -187 513 -344 -178 348 -268 83
3828H3l63L18k55N42l82l54R92m49l22O16m12r0J97K76p39L43J42l32L78m2k65
$$ 83 -280 38 -217 325 -57 -411 581 132 -190 426 14 -76 121 397 -342 1 143 -189 189 147 -118
3849a18J23L80m64n5L03k43O7p1o7P7K71k50k87O78k76l00M61k06j71K41J21n96
$$ -118 5 385 -79 -134 169 -74 -7 -78 -145 -68 203 -47 -334 344 68 -232 229 23 -148 93 214 -382
3871c82N23L27p52K40J54j42k77L81Pl66M75k28k11L25n0m17N04J63n13P11j21
$$ -382 141 468 -284 -44 110 -32 -309 72 79 -287 188 -40 -251 74 24 -393 111 274 -239 472 351
3892C51o88K92M87n93l8M65l22L1J56l17L9J61J86p00P62m2m15L01j8j27j73K20
$$ 351 -337 -45 442 -151 -189 276 -46 -15 141 -176 -137 24 210 -490 272 230 -185 116 98 -29 -202 18
3914A8k79M5N76m35l6M42j95m2J8j27k24K56j38q8M29k03N4N7j51k47J57L96l65
$$ 18 -261 -216 360 -75 -111 331 136 94 112 -15 -239 17 -121 -209 220 17 71 128 -23 -270 -113 283 -82
3937h2J23j02m9L09k9k91n2N54m95j22O56o04J15L76k69j30N4K75l01J45ql31
$$ -82 41 -61 -110 199 170 -121 -173 381 -114 -236 420 -184 -69 307 38 -92 -38 237 -64 81 73 -258
3959b58N18m58J54K17K1l43kN28n88L96j35k1j55K00J57q33Q91m58K81j45m4J34
$$ -258 260 -198 -44 173 194 -149 -151 377 -211 185 50 29 -126 74 231 -602 289 -169 112 -33 -77 57
3981E7j77M01p76N98L07p96N51k47N30j112R70K7r96J015p44N99n14N09q6k24
$$ 57 -120 281 -495 103 410 -386 165 -82 448 -664 306 333 -663 352 -392 207 -307 202 116 -108
4001a08P44j652J534o11j06M16l85P50r73J193j120K79N18j298J296j146J474
$$ -108 636 -1016 518 -93 -199 217 -168 582 -391 802 -318 -39 479 -819 477 -669 805
4018H05j168Q13k43q49J717j933J117m76M23l07m68J602j958J385o33J62J61p88
$$ 805 -363 450 207 -642 1075 -858 259 -217 206 -101 -569 1033 -925 460 -173 -11 150 -638
4036f38J123j257J729j529L84J210j611R30q83J336j437O43M74j231J548j435
$$ -638 485 -772 957 -572 -188 1022 -589 341 -542 794 -643 0 474 -757 791 -644
4052f44J510j375N24K52r83J580j877J672q56K01Q0n51J468k030J812j069j50
$$ -644 866 -509 15 267 -716 864 -1013 659 -197 4 84 -467 1001 -1029 783 -286 -436
4069d36P91q36J460j694J261q87N34Q0j340K087j548P48n40O91K2j298J891j610
$$ -436 355 -481 979 -715 546 -341 193 273 -1067 1020 -528 220 -320 371 393 -905 986 -624
4087f24P25m72K94O65j071Q01r33J372j190J44N93n17P55j087J287j348M44R39
$$ -624 101 -371 -77 588 -483 318 -615 757 -433 -289 304 -213 542 -545 742 -606 -162 777
4105G77j336R37q04P23p55P12J76r17J072r48J65M40j85K4j65M99j140Q36p4k74
$$ 777 -559 378 -426 297 -458 254 430 -487 585 -363 -198 242 57 81 -84 415 -725 111 37 -237
4125b37O3M12K31q08M65%m3K53p83L64K17k18O3L14O2o88J43M47m94J43N1N8J30
$$ -237 -174 238 469 -339 126 126 83 336 -447 -83 134 -84 -21 293 355 -333 -190 257 -237 -94 -43 15 145
4148A45j92N0K03K91p46J56N56j046P38j69L40m65R0O67j231P38o08O35l14m1
$$ 145 -47 3 206 497 -249 -93 463 -583 155 -14 326 -139 -49 618 -613 125 -483 152 -162 -203
4168b03M29l55P13j037P59j0q18O40r1K52r37J364m94q38J164r71R49r44P09l49
$$ -203 226 -129 584 -453 306 296 -522 118 27 279 -658 706 212 -626 538 -433 516 -428 281 -68
4188f8o8M95j228J815j417K96J58J88n4j279K170j317L96Rm52Q55j384J657j167
$$ -68 -136 359 -869 946 -471 -175 -17 171 117 -1162 1008 -309 87 96 -356 499 -885 772 -395
4207c95N23l60m16J391j618R99o03Q54n80j7R18j345J153n42L19l87l37J131j429
$$ -395 128 -232 -648 743 -875 124 -479 375 -205 -222 696 -649 504 -38 281 -106 -443 688 -741
4226g41J397j179P38K1q58J095q24J001j476J027L69r34P68n51O11r57N91l0m68
$$ -741 656 -523 215 236 -622 473 -351 650 -826 201 570 -364 404 -147 464 -493 98 68 -400
4245d00O57j004J353n42Oo1j29L45j103J391q12J44L86k71L85q98J108r26K55
$$ -400 257 -747 606 64 70 9 -120 225 -878 513 -299 -155 231 -40 345 -553 555 -371 -116
4264a16K85m94O80o32O15l08L45k79o63Q71q26M92k45N51k98j82O54p03O40m67
$$ -116 169 -325 355 -277 338 30 375 96 -567 304 -522 -30 -275 276 -22 -204 450 -253 387 -80
4284h0J28k47O8L18k15L42m76K45L30n50J36j99K22nL5m5q0M08m43J15j2J68m33
$$ -80 48 -199 -131 187 -28 314 -162 83 413 -137 -1 -200 22 17 52 7 -73 335 -108 7 -5 163 -270
4307b70J30L60m21M41j36j42J41P4k25k61N57l75J20P9R9k00K63j30l06L91j76
$$ -270 -140 220 -201 240 104 -38 103 177 -48 -309 248 -127 -7 72 171 -29 234 104 -202 189 13
4328A3k13M58m3l44L7J55m25K14K41j59J2M2p1J18J70k44q3K55j74k81L64jl05
$$ 13 -200 258 215 -129 -92 63 -362 -148 93 -66 -54 -12 -83 35 205 -39 -122 133 -41 -322 42 41 -264
4351b64M51j57l16K96L3j4j80M18m12l6K24l6jJ76j54k47O40l33k37K02J01l09
$$ -264 187 30 -286 10 43 29 -151 267 -145 -181 43 7 6 182 28 -219 421 88 -149 53 154 -155
4373a55J84kk23m7K60j58J65o7k22K71Q0k55K8L06r0k70L01J83m6l34n4j23N3
$$ -155 29 27 -196 -243 17 -141 24 -43 -265 6 86 -169 -141 165 75 -195 106 289 243 -91 -145 -268 -215
4396b15K62n98O93j34P4j83K75k56j61K23J10j10K61j35j23K02j23j76L63k51
$$ -215 47 -551 142 8 82 -101 174 -82 -243 -20 90 -20 241 106 -17 185 62 -114 249 -2
4416bp2K70l40K35n9n1j48K77K6o40P85k96J44m3Q3k28o9M76o62M12M5j7k95K61
$$ -2 -74 196 -144 91 32 -19 -167 110 136 -504 281 -15 129 86 169 -59 -128 348 -314 98 143 126 -169 92
4440I2P6o44N66l51K13j03J31R8l15O59p00M97o9m14K88q9M33q10O83k66m17P70
$$ 92 168 -476 90 -261 -48 -151 -20 78 -237 422 -278 219 150 -264 24 -65 368 -442 241 -25 -442 328
4462C28l74L85m77J13j37J32J50n75Q44m98J74j85l6M14n38O44p02N47l34J51
$$ 328 -46 339 -138 -25 -162 -30 120 -455 389 -109 65 -120 -156 258 -280 364 -338 209 -125 26
4482B6N4l16P03j049O16k45j07P28o03M19k50K78j85j02P14j268P50m68L94k63
$$ 26 80 -236 467 -582 34 -211 -318 410 -193 226 -24 254 69 -33 681 -587 163 -305 89 -174
4502a74J5M15o79O96n09L6M35m09J68j80P25j106R37j31p00O54l04K34p38Q92
$$ -174 -159 256 -423 273 -236 -200 235 -174 -6 -186 539 -567 370 239 -461 193 -111 123 -615 277
4522B77k19m26P44o66K88J7O0O1Q7k30m79J080o40j24L71j25K21p35O17n4m9j72
$$ 277 58 -368 376 -290 -2 15 75 136 223 -7 -486 594 -46 -170 201 76 297 -438 179 125 76 -96
4544i6J85J36l74nK21L55n11j52M64k42k73K23K59k75j26N59k94n6K2r2L78n55
$$ -96 89 225 -149 -154 67 422 -89 -241 223 -19 -292 -69 190 -85 -211 348 54 -2 20 -72 306 -249
4566b49K29K92n79J07J43M63q99Q5Q01l07j23j21L68k75k13P30r00P15p56N04
$$ -249 -20 272 -307 -200 -57 406 -493 -408 393 86 -37 -158 210 -65 -278 452 -448 267 -489 15
4586A5K63l39r2L6R00j281M13O59p66Q4j79J028j031L21K00l72O03r56J051p60
$$ 15 278 -61 -153 -117 783 -498 -85 574 -192 -108 -287 741 -290 31 231 -141 462 -494 557 -203
4606b03K05L6j19L49j108J349l14l70K68j85O56j455J316m95l1M5l72J455j661
$$ -203 2 38 -81 268 -840 509 195 -175 93 -92 564 -891 425 -70 -101 -56 -428 1027 -634
4625f34Q51m41M99k16r45J788j240M37m49Q44m35j110J799j191O59p34M75O65
$$ -634 217 -224 275 59 -886 902 -338 99 -350 494 59 -1051 748 -443 216 -518 -43 622
4643F22j177J095j069J316j306J30R38j039R19j110J537j191l5J013j221J221
$$ 622 -555 540 -529 787 -519 -389 549 -490 429 -681 856 -335 -370 643 -578 643
4659F43j296J328j136P7P54p74J259j912J548m60k51M63l80Q31j490J263l16l46
$$ 643 -653 675 -461 -384 370 -404 855 -1057 491 31 -220 243 -137 694 -796 467 151 -195
4677a95K05j35P11j249R54m94K38L34r39J399j252O62m08L68K39j337J690j268
$$ -195 10 -125 586 -663 291 -203 35 369 -570 829 -423 239 -169 199 438 -899 791 -477
4695d77O80m06L37J11p36J091j095R41o60j17P48p90Q06p96R04r87K70J006j194
$$ -477 203 -203 134 245 -491 600 -495 446 -214 -331 417 -373 433 -363 541 -446 -176 830 -364
4714c64N03m34J045r57J88L70p12O37p55N16j83O6J52j75M32q48P86j35k52K01
$$ -364 139 -295 750 -207 -19 351 -361 276 -479 37 -146 -80 72 -103 329 -519 267 132 -120 81
4734H1m3M52r67M98M4m5K16l56L18m21M39m62K63J90l49L94l92p0J98K66l74l2
$$ 81 38 490 -477 21 65 20 236 -120 198 -223 216 -246 17 207 -142 252 -140 -210 -12 254 -120 -152
4756a52J55j13jL14k27k31L62r9j84L23J7l29J09J86m46K62P3m5q1J43p5j05K26
$$ -152 3 -110 -111 203 -24 -255 107 8 -176 147 164 -165 -56 130 -316 -54 19 -26 -107 36 -39 -144 82
4779H2j42q8J11j47L68R1k01k76L50q1j66J66p8k06J88O4j9J94L5j83n6R3J43
$$ 82 -60 -148 -37 -184 184 275 74 -202 148 67 -99 67 -11 -217 -29 35 16 210 245 62 6 99 242
4802B42l21j5J58m2N9k66p8M76l66K4L0K20j95nJ16l85L98K3n6J48m9kN2O0l50
$$ 242 -79 -94 64 22 81 -185 -263 213 -153 -129 -99 121 -74 -79 37 -348 50 73 17 165 116 114 166 226 -124
4827a24l0L25pJ04k45K66m67L92j65k06K56R8Ll00L23j40j75J57K0K7k01J96p4
$$ -124 -154 171 164 268 23 289 -178 214 49 -157 99 197 200 -100 223 83 -92 65 85 112 -89 107 33
4850C3J78l7o04P23j66k40Q2m5N4MJ44k02J37J12k11K99l96N1r8L65j93l1J07
$$ 33 211 174 -430 293 127 -113 -31 -76 -22 -18 126 -76 61 173 -38 261 -135 -84 -182 183 -10 -41 66
4873F6k99J71R1M7k53J75Ok06L10q5J06j48P2o7j13J93r0Q1R5k17J32J00j61q8
$$ 66 -233 -62 29 76 -177 -2 4 -202 108 23 129 -19 53 -14 -127 66 -24 57 152 -65 67 167 6 -82
4897h2L29m44K24r2J45qL6j88K2J46J24l37J07m4N4jK0J80j91J09l82K40K56j42
$$ -82 247 -197 27 -65 80 72 108 -80 -58 88 212 -125 -18 -62 -8 -9 11 191 0 109 -273 -33 223 81
4921H1k9J71l66J43Q6j61j54J20K93k58N2J29k80K53R2m23J27Q4J8mJ99k58o9
$$ 81 52 223 -143 0 86 -75 -229 -109 184 -74 -22 107 -173 80 172 -251 -124 -40 -22 -26 173 -85 -154
4944a54M61k23j84L2l3jJ10J18j18k07L30o1j57Q0K09k34J98j14J52J30l06j03
$$ -154 307 84 -100 -68 -101 -102 8 126 8 -199 131 70 -87 -7 202 -32 166 52 204 334 28 -75
4966g5N3M1m01M47l3n5J61k2j51K89l22j73L23J06j20J88l5m03N0J62m29J63M05
$$ -75 -22 19 -382 65 32 -23 138 116 -35 254 -68 -241 82 188 68 256 221 -182 -132 30 -399 -236 169
4989A69l77K6J91L0j60K00K4j04p2K46k12j87L47k80L25k94J42K2o5J66n36P21
$$ 169 -208 -182 9 39 -121 79 103 -1 -73 173 -39 -226 121 -159 166 -128 14 36 -29 137 -399 322
5011C22l87k0J82n5n3k81O20l25j15O1k14P03l76P9j46o9K19l38N85q64L82Q6
$$ 322 -65 -85 97 42 -11 -292 328 3 -112 -51 -265 438 62 141 -5 -74 145 -193 392 -472 -90 -4
5033dM8J42n28Q46q49L49k28K81J45o08P26m85K89r6k01P39j196R47m07K32m09
$$ -4 44 186 -342 504 -345 4 -224 57 202 -406 320 -165 124 28 -173 566 -630 317 -90 142 -267
5054b67Q5Q17j184R29o92K52o2j25M60n68Q55j018Q86k38m03N90o52N20q40J028
$$ -267 -182 635 -549 380 -312 -60 -122 -247 213 -355 500 -518 368 130 -273 317 -335 185 -655 373
5074C73l99m97Q36p27P33p22N77j52k21L22n07J021j014L34o8j20L17o74J150
$$ 373 -26 -523 313 -414 319 -403 174 22 -199 123 -384 637 -377 -43 -111 -231 86 -588 562
5093E62q43L19k2r6M11p39Q84o08K92m55J73M37o75O07o16M43j72j30P28j175
$$ 562 -281 38 16 -80 331 -408 476 -132 160 -295 -122 315 -360 247 -369 74 -98 -228 500 -675
5113f75J060m49K94j98l16R08j089Q43q07N11l5l57O72o15M68o28N64J00p36Q98
$$ -675 385 -64 230 32 -284 624 -465 378 -429 82 47 -310 362 -253 215 -413 151 251 -485 413
5133D13q46P59o22L93j50j60N03p45P62o31M76k17L7L79o98O74n28L24k30j77
$$ 413 -433 326 -296 97 -53 -213 290 -455 307 -324 152 -65 -28 351 -347 327 -201 123 -107 -284
5153b84M60m41L63l07M39j22k86M03k02j36M8K83k03k08K35k15K38Rq2j46O3J57
$$ -284 176 -265 98 -209 230 108 -178 225 23 -113 -65 218 15 -193 42 -173 65 74 -8 -154 -91 66
5175F6j21K91k20l33L94j44o1K02K39m06O6q7L45k97j9l6K31Lj36j6J54O6l98
$$ 66 -55 236 16 -317 77 -67 -128 74 313 -93 -27 -114 231 -66 -85 -121 110 113 -23 -39 115 181 -217
5198b17O61l91J9K4Jj76j2J67l0l41K15j98N47l84K05J2k24L1l08P08o48L68r
$$ -217 444 53 72 96 97 -79 -91 76 46 -295 -80 -278 269 -115 90 102 -122 -91 -399 309 -339 29 20
5221B0J21j89p3L04m48L79k13K85O0m00M32m43K96j89K15kl35L17k02Q8j28J50
$$ 20 141 -48 -121 183 -265 114 -99 186 246 -154 278 -165 131 -58 157 155 -180 137 -65 23 -105 45
5243D5K50n22L99k65K25m55L6K55p8J24k52O01l65j49M65l89j06k37O41k46oJ0
$$ 45 295 -227 172 -93 132 -323 -287 -32 -110 14 -238 363 -2 -151 314 -75 -181 -418 223 -23 -29 -19
5265a9m04P33o28L60j50P8j2j5L42n85K74K84l33J7j07N62o00P9J16j10L21m32
$$ -19 -423 310 -318 42 -108 -30 -42 -57 285 -300 -26 258 -75 -58 -165 397 -203 -124 -8 -118 203 -229
5287b29M40m19J20k30R1M12m00M79k23M4j51O4J36n03M10k6m0M2q8J74l1q2j03
$$ -229 211 -208 -88 -318 -227 185 -215 264 41 85 -66 -2 134 -369 41 15 -25 17 -71 103 72 -10 -113
5310a13R3M3r2R5KQ0l02L29R2m86M48l32O6m2m8K25k43M76l17K78j26j23R0J74
$$ -113 -20 23 -69 26 28 108 -194 135 227 -259 189 -143 -77 -119 -167 58 -185 291 -26 252 126 3 93 267
5334B67l43j39J87KJ45l54M04k09nR7k5J7%j58J78j41Q1j61J39m9L06k4j88k1
$$ 267 -76 -215 -28 -26 119 -235 169 -40 -45 52 27 44 44 -114 64 -77 4 -157 -18 -67 239 215 27 6
5358Fj59O4p7J16J01k57J92P1j02Rm4J6K8K13l65J84N6j94L43j31J1o9M7o4j22
$$ 6 -153 -89 -166 -50 51 -206 -14 57 -45 -36 -80 -64 -36 177 -188 -4 52 -142 201 70 81 12 59 -5 -127
5383a27J88l62K38J39o4j54J94k09J21L4K02o7j4R7k87o7L0J87j12J65k46J72
$$ -127 61 -301 -63 76 12 -142 52 -157 -36 -2 200 133 119 216 -71 -138 -108 79 -33 132 -114 58
5405E8o1J04k17K7J24l5mJ37j78K06j5j49p1K3J90J7L4l5j53L9l5j05J44k94m3
$$ 58 -3 101 -116 -89 35 0 -4 133 -45 161 146 -3 -74 -51 139 156 190 155 2 41 6 -99 45 -249 -292
5430b92K54K3p0K21k63P6j2j45J23J12J18l55J07L51l07K20k41J34k24L40k97
$$ -292 -38 -15 -85 136 -127 -51 -63 -208 -85 27 145 -210 -103 248 -59 161 -80 54 -170 170 -127
5451a27j22M15l12J75J88k38j07r7J21KK70j99L42m58J94p6o3K21l46J65M2O2
$$ -127 -249 166 -146 29 217 -21 -128 -225 -104 -102 168 -31 311 -147 47 -29 -92 129 -217 -52 -10 52
5473E2j13m6L91n00M60l15L28j49l3q5p7K40l59N52k39k16K49m6L6l18r6N70k76
$$ 52 -61 -107 284 -216 244 -71 257 108 75 -10 -87 153 -206 346 107 -109 140 94 130 -188 -284 286 10
5496A0K96l42J00j63L32J20m09J90n81Q64n32R5J92l60L40m77L71l27K51K31n15
$$ 10 306 -36 64 -99 233 353 -56 134 -447 417 -115 -20 172 -188 152 -325 46 -281 -30 201 -314
5517c14M66m89J75J89N4j47k29M06k84K48j07J08R2m53M80o00O86k77j68L65k62
$$ -314 152 -337 -162 27 81 -66 -295 111 -173 75 -32 76 168 -285 195 -405 281 4 -164 201 -61
5538f1M85o38O75p19n6O04k92J2r5J02L0k56M10l82M75m93J97k01M25k1m71N42
$$ -61 424 -214 461 -258 -314 290 -2 10 -85 17 47 -209 201 -181 294 -199 -2 -203 222 201 -270 272
5560B72m54J23P7k8j3j08L49k43J14k27J67L66m82J40j30J05m23L09M74o03J66
$$ 272 -182 -59 18 -10 -23 -131 218 -25 89 -138 29 395 -87 53 -77 28 -395 -86 388 -215 -49
5581d9O3l0l9j28K41k1j7k10K50l7o3J58j27j0j74L93j48l38L85j68J24j04J35
$$ -49 14 -16 -55 -183 58 37 20 -190 60 23 -40 118 -9 -19 -193 200 52 -286 99 -69 55 -49 86
5604H6p5pn4l9O3J48k69L03n5l32L7M65k35l5L03l52n5J08j4K83l94K46Q5k39
$$ 86 11 4 -50 -89 -26 122 -147 156 101 -231 -194 271 36 1 304 -48 -103 5 -9 274 -120 126 211 -28
5628b8J31n06P52o44K79j79K29P2m04P63n03K9J32l06N42o98O71n19M02n41L48
$$ -28 103 -403 349 -295 -16 -195 34 106 -298 465 -38 -9 123 -183 359 -339 332 -187 215 -326 22
5649B2M92q28N89l69K93j70r9L77n93M18p03N82J5j56N66o92K80j91M85j12n11
$$ 22 514 -314 275 -94 199 29 -70 307 -286 132 -571 11 26 -130 436 -256 24 -167 318 206 -305
5670c05N00m99O66o92M05J28l40M30o24N19o53P61k42qJ61p95R63n09M2J34k82
$$ -305 195 -304 362 -330 75 203 -137 293 -331 188 -465 296 54 46 207 -588 375 -134 -92 42 -240
5691b40M12p36R68m38J20p6q6N05q19P23m92J41j23j79P07q24O13l61K77k29j91
$$ -240 172 -564 404 -34 86 10 -76 429 -390 333 -159 -18 -141 -320 387 -437 176 -185 92 -137 -328
5712c28Q86q70O05m74J00P3k67Q01p78L91j96Q4M60o52L93m08O13o72K8M27n25
$$ -328 558 -312 293 -181 -81 -8 -275 526 -252 139 -57 27 487 -165 228 -180 433 -239 -211 216 -309
5733c09M44k77L17m14K05J01l10M63n17M40j55O8R4m48M95m78L17j15J60k9j2
$$ -309 135 -142 175 -239 -34 67 -243 220 -297 143 -12 56 150 -298 197 -281 36 -79 81 52 40
5754D0J37n88N71l84J0L6J74ON9P3j0j15j25k22N94l51L1M5j6P7k16N16m90K97
$$ 40 177 -411 160 -224 -214 -178 -4 2 61 134 124 9 -116 -338 256 -95 -64 -19 -35 42 -174 342 -148 149
5778A49k88rO7j30L58m49L06K5j39K44j24O2q7J0j86K41J20l42J32J08N0k9J12
$$ 149 -139 -148 -81 -211 147 -302 4 29 -110 134 10 72 -15 -5 -191 50 170 -172 -40 68 118 89 201
5801B01m34J68L0O3P0k51J52rN7J3k29J62q3j4P2R8Q7o3j22K8m4K39k20j06K03
$$ 201 -233 -65 -35 28 98 -153 -1 -10 47 60 -169 -7 -90 -104 -32 66 153 90 -32 -4 -48 191 -29 -135 68
5826F8j37L30k44K6k26Q7K18k55MM49l30K17j29l09K87J0q3m6J57J6p9j06j9O3
$$ 68 -69 261 17 43 -183 -96 122 -133 -129 320 -10 207 78 -231 56 66 -17 -63 94 110 31 -75 -94 -31
5850c1n0J50j10K01k31o1K19k42K07j06M19l61j54R6n3J94j50K25N0k62o2j69
$$ -31 -81 69 -41 160 -71 -132 87 -155 52 -54 365 4 -150 -54 -107 87 -63 162 212 -50 -112 -281
5872b81L09j41J36q2l0J79m4j9O2k25R4O6j05M2p8m2K72q5k12J07K5L27j42k94
$$ -281 28 -113 23 -59 -89 90 46 27 89 -136 -42 24 -81 -39 -117 -159 113 28 -184 -77 -52 275 133 -161
5896a61K05r4R8m5O9l24K36j17K4L87j73k55N0J20j1O2R9q4m1j71J98J00k9o9
$$ -161 44 -50 48 3 72 -252 -16 -133 -109 278 105 -150 -100 20 9 71 170 86 45 -126 72 172 143 74
5920G4j32P3R8k3pj46Rp2J92q4J42j36K98p8j13J60j55k78J64O4o7q7L5k8L8P8
$$ 74 -58 15 113 90 83 -63 -54 -126 66 -18 124 -12 286 208 95 255 100 -178 -14 50 -17 -104 -69 -97 -59 19
5946A9M1j88J03o9j4J67p2J94j78N6J9j07K64l19m4K8j60M42k58J12J63j63j0
$$ 19 60 -128 -25 -94 -108 59 -13 181 3 59 78 -29 235 -84 -128 -100 -260 182 -76 36 199 36 26
5969B6r9K98k79L7K3l4l3M5J66p2J0P2j83K4p4R0J7j62K28l12M5J62J63k66m9
$$ 26 -73 225 -54 -17 6 -28 -61 -16 150 78 88 160 -23 1 -73 17 34 -128 100 -212 -167 -5 158 -108 -157
5994a57J2P7K22k40J43o8l9N0l6RP2p3l51N12l50J83J65q5J0O8j06nj39J28%L2
$$ -157 -145 -68 154 -86 57 -11 -50 0 -36 -27 45 -28 -379 133 -217 -34 131 46 56 124 18 13 -126 2 2 34
6020C4j12N4K06k59L2MJ2L4o5K06j78Q8J42o8j37o0M47m48K45j17J04k55R3j0
$$ 34 -78 -24 182 -77 -45 -41 -29 5 -60 146 -32 56 198 130 -7 -67 380 -68 177 60 164 -91 2 -8
6044hK6J24J23k76K49k95Q3J56k74O2J38J47n72J14M4J04J37q8J7l35O10m49J71
$$ -8 18 142 265 -11 238 -57 26 182 -92 -30 108 255 -317 -203 -159 -55 82 -6 11 -324 286 -163 8
6067HL29l38J71m59L71k58K78J76n18J19r4K74j68n3L23j65K38l69K78j21j58
$$ 8 337 -1 170 -289 82 -176 102 278 -240 -121 -215 59 -109 -162 161 -4 234 -135 143 22 -136
6088a36K46l03K76k78L40Lq6J7k12M61m98J54J27k49K47l26N02m96M26j99q7K97
$$ -136 110 -193 83 -195 145 148 62 79 -133 328 -170 -16 111 -138 109 -217 285 -211 215 16 -71 226
6110B26n40N98p21N28p3j6J43n51M88k19J39r7j11L10n16O67o30O82n99oP65p11
$$ 226 -314 284 -437 91 18 2 145 -406 82 -137 2 -95 -206 104 -412 255 -375 307 -292 -298 467 -244
6132b44N66o74N05l32J56K09l86L55m06N04M6n42L16m10M94l57J35K65l67L84
$$ -244 322 -352 153 -179 -23 186 -200 155 -251 253 299 -243 73 -337 157 -200 -65 200 -167 217
6152B17j84K98p58N69l13J1L05m50N57n26L44k80K33J19l90M24l03J6K34m15K58
$$ 217 33 331 -427 142 -171 -160 145 -305 252 -274 70 -210 23 142 -248 176 -127 -111 123 -292 -34
6173c4p6L30l57L41l20K53L48p16N23m72L71l52N9K58l90K65J44k33J14k39L05
$$ -34 -110 220 -137 204 -116 137 485 -231 292 -180 191 -161 -102 156 -234 31 175 -58 56 -183 122
6194A22l22K49j69K23L6M6k87j15J25j59K67J00l30K63J09o2k9j04j81R2J74j7
$$ 122 -200 49 -120 103 139 185 -102 -217 -92 -251 16 116 -214 49 158 96 67 -37 -218 -126 48 31
6216C1J92n17K64J21j33J43j76K79l17j33J28Q5l0j0J36K4l34K62j0Q%j16J86
$$ 31 223 -294 -30 91 -42 101 -75 204 -113 -246 -118 -33 -63 -73 63 87 -247 15 5 13 13 -103 83
6239H3L6j73mK04k00P9R6j26o3K21m22J79l9K07p6Q9O3l19J04L04k43j74L85j41
$$ 83 119 -54 -58 146 -54 25 121 -5 -68 153 -269 -90 -129 78 2 91 154 -165 -61 243 0 -174 211 70
6263G0n71N40k32J47Oj12K7k02M09j57K72k78K80j63j92K74k82J79J52k37K28
$$ 70 -501 39 -193 -46 -40 -152 -125 -327 82 -75 197 -81 199 36 -156 118 -164 15 167 -70 158
6284A58l95M54l43J52M2k3n6k27L80k42L13l13K04l19J2J37l01O06k08r9L9m6
$$ 158 -237 217 -126 26 68 45 -11 -238 142 -100 213 -100 104 -215 -203 -66 -367 239 31 -68 -29 -75
6306g5R0j90K36ll1j49M8L17l33K45k31J22N3k11K17j58M5J54j35L6o3j76J37
$$ -75 15 -175 61 58 27 -122 -74 243 -90 155 -76 46 99 -112 105 -53 -8 146 11 47 -16 -192 -55
6329e5O8j43J58r9KK22k49K82j7m63K77k16J56J14p4k78J87J37l6L06m07R9J06
$$ -55 13 -130 28 -71 -69 153 -96 186 169 -294 -17 -233 -77 37 -37 -315 -128 9 -27 279 -128 -29 77
6352G7j47l5j57M47k85P5K4j9J10j7J86j98j23j02M8Q6l9J42o7p1O4P7k04N6K9
$$ 77 -70 -105 -262 185 -100 -25 -1 -20 90 73 259 61 -62 -164 -116 -30 -69 73 6 -65 -1 76 -128 -72 -43
6377d3Q9q2r4L34J2n89L56j49j5J92P3J16j40O7j11j33K78k24K91q0k48N1J87
$$ -43 46 -36 -130 204 216 -373 -17 -166 -181 11 84 200 60 127 16 -117 161 -63 228 148 -100 -49 138
6400A38j30J03j93n6J50k51J81j25J61J52n0J19r5l00J74j11n9K42Q7l38K17P1
$$ 138 8 111 -82 -138 12 -239 -58 -183 -22 130 80 199 104 -196 -22 -133 -192 50 137 -201 16 87
6422H7j46J07J7k25K35Kp0o0O2mJ02N9j63J39k57RJ40p5m5k02K53j03M3R8p9J47
$$ 87 -59 48 65 -160 75 77 7 -53 9 5 107 166 3 142 -115 -106 34 -41 -86 -288 -35 -138 -95 3 -76 71
6448G1j37k60N07l29K91N9j86O6j50R5j12J45k37J28N1q4J82m6Kj92K2K35k20
$$ 71 -66 -326 181 -148 143 202 16 82 -68 27 -85 60 -177 -49 2 -82 100 54 56 -136 -114 121 -99
6471i9o8L53m43K83o3K4L0n1Q7M3l07rm4K95j0l3K50l09J43P4M8j50k4N3k17J09
$$ -99 -167 186 -257 26 -37 -13 17 -34 53 96 -211 -220 -264 31 21 -12 238 -71 72 146 194 44 20 73 -144 -35
6497c5pP6lk03P3n2L55k95O3J09j94K97j36K68m4l79J08j37K43l71J58j24M3J14
$$ -35 -42 34 31 -172 -99 -151 204 -91 -28 81 -113 184 48 316 272 -107 1 -136 107 -264 -106 -230 -187 -73
6521g3J19j16n4J33J24j05J14j66n6K65k41L09l27n2j5K72l98L17J4q7K86n07
$$ -73 46 -70 -124 9 133 28 142 -24 -80 185 -56 253 -74 -126 -141 131 -267 50 64 -23 263 -244
6543b44M08m02J66n1K27k16J1O7J0J93k81K93l16J44N3k73K92j28j34O9m3K28
$$ -244 164 -238 -72 -123 104 -112 -101 -34 -24 169 -112 181 -135 9 62 -211 81 -47 -181 -112 -155 73
6565G3k83N45m00J68O0k15K55n82N15Jk39L09k88J97j48J26j71N5n8j0L70k91
$$ 73 -210 335 -65 103 163 -52 203 -379 136 137 -102 207 -81 116 -32 94 -77 -22 -80 -90 280 -11
6587a1R2k49N3K14o9M0k86K05J35l06L59l10M45n30N08k97J8J11m85L59J03J2
$$ -11 81 -168 -115 99 30 70 -216 -11 124 -182 177 -133 312 -218 290 -7 11 122 -363 -4 99 111
6609A11l22N5M22m84K85r4J23J3j98K25k70J07o2J38M2n6K36l36R9j35K12k3j44
$$ 111 -211 -156 266 -218 67 -27 96 109 -89 136 -134 -27 -89 49 91 35 271 -65 34 -101 111 88 -56
6632e6j73K42L5J67k34J56k59R7R3nR6k91K33j76J28k75J31J71N9qm8j90N8K06
$$ -56 -229 13 48 215 -19 137 -122 -25 68 63 159 -132 101 -75 53 -222 -91 80 139 131 83 -107 -49 157
6656A57j33Q1J24j90N1j33q8n5J90j28L25m7m5r3R7q2j72J6j34L41k03M1n0L20
$$ 157 24 105 229 39 90 -43 -131 -186 4 -124 201 154 109 16 113 31 -141 -125 -259 82 -121 -80 -130 190
6680A90k40q3K60m07L26j84qK24j86Mk4L47k75K30j45j56K41j80K81l24L04j81
$$ 190 -50 -133 127 -280 46 -138 -146 78 -108 -104 -128 219 -56 174 29 -127 114 -66 215 -109 195 14
6702A4m5L05l05m4l6Q4p4MK45k54J47j91J21J4k12L80j86K85j85j76M3M7K35l04
$$ 14 -31 274 -31 -75 -111 -27 -101 -97 148 -106 41 -150 -29 -15 -227 153 -33 252 67 -109 -66 -19 216 -88
6726h8M17k17n7pj95J98j77L52l65K86K00k74R7k40J95j58J35l7j56M79n09K46
$$ -88 329 112 55 48 -147 51 -126 226 -139 147 347 73 170 -70 125 -33 102 65 -91 388 -121 125
6748A25j85k9l7L3J42k23K49k21l0L36k45K46l44L18j35j86L35k05K27l55L14
$$ 125 -60 -89 -126 -93 49 -174 75 -146 -176 160 -85 161 -183 135 0 -186 149 -56 171 -184 130
6769A30j31j43J83m5p3m3J59l68J91J33k88L76j35M4j17o3K25k25J49n0K31k17
$$ 130 -1 -144 39 -6 -79 -122 37 -331 -140 -7 -295 81 -54 -10 -127 -190 35 -190 -41 -91 140 -77
6791g7J83n6j32O1o7J00l71J76M07k47l9j29n4K76J7J2mn3O0M4l21J13L3N6K19
$$ -77 106 50 -82 -21 -88 12 -359 -183 224 -23 -62 -191 -245 31 48 60 56 3 63 107 -214 -101 -68 -12 207
6816B07l21n1N3J84J03j78j66j55M97k4l01K37qlr1J19k92M22k53J53j13J31k39
$$ 207 -114 -165 -112 72 175 -3 -169 -324 173 149 -152 85 77 74 -17 102 -190 232 -21 132 19 150 -89
6839h9J17m9K17k63J25j17K03j05j42j6L2m9qK54q8%j14P1j36J09J7j13L01j88
$$ -89 28 -21 196 -67 58 -59 144 39 -103 -119 -87 -136 -144 110 22 22 -92 -21 -157 -48 -31 -144 157 -31
6863c1L9R6m5j6m7k4r8L18k36o4K8J06k42J19l1J44L1j49J16J77j12j4J26q2j63
$$ -31 8 104 59 43 -4 -28 -126 192 -44 -108 -80 26 -216 -97 -128 16 47 -102 14 191 79 65 191 109 -54
6888e4J59N0on5j02n5l5J84o8k96L04k6J72l28J91O9k71L7J79J07j02O6l64K79
$$ -54 105 155 149 94 -8 -63 -98 86 18 -278 26 0 172 -156 35 104 -167 -130 49 156 54 120 -244 35
6912C5j11N0k20J49J14k47L44K0j03J20m4j00J83j22M8k12j8J09j38P2j4J72q7
$$ 35 -76 -26 -246 -97 17 -230 114 134 31 151 107 7 190 68 116 -96 -114 -5 -143 -71 -85 87 0
6935@J88j93j43J76K3j2j64L31j86K4K16k89m5J93K0l52K32O5l1P1l44J68Q8K16
$$ 0 188 -5 -148 28 51 39 -125 206 20 44 260 -29 -74 119 139 -213 19 84 53 124 -220 -52 36 252
6959B52k81J88j47r5J34p3J68lk29K38p8l05J25K21k05j14K62j58L72Jk01J6J50
$$ 252 -29 159 12 -83 51 -22 146 143 -86 152 74 -231 -106 115 -90 -204 58 -100 272 273 72 88 238
6982B38l43J39J52k65J27r7J42k19J41j07J77j93O8j5m5K4j8j12J82R7n8N3j27
$$ 238 -105 34 186 -79 48 -49 93 -126 15 -92 85 -108 -40 -55 -100 -76 -94 -206 -24 73 15 68 -59
7005e9J77j07J00j14k85J98R1K9j07J87j31n0o2j5L16r3k8p2PKl7R7J14n2j48
$$ -59 118 11 111 -3 -288 -90 1 30 -77 110 -21 -71 -133 -148 168 75 47 -25 -18 -16 -53 44 158 106 -42
7030d2Pj03K85j18m3J53k73J81k1k26J53j74K69k11k07N71l25J51k01L19o2k22
$$ -42 -35 -138 147 29 -14 139 -134 47 26 -200 -47 -221 48 -163 -370 201 -124 27 -174 145 83 -139
7052a39K97k26L4p3J37j69J08m8m6qP3J32J2j7J14k22m1j03K37j24P2K69l04k6
$$ -139 158 -68 -34 -107 30 -139 -31 -79 -125 -133 -60 72 84 67 181 -41 -82 -185 52 -72 0 269 -35 -61
7076f1M2o5QL7m9L79k09O9j95J48r6J40j89P2j84M4k1J55K15j55j29L5k89K01
$$ -61 -19 -84 -76 -39 -88 291 82 151 -44 104 8 148 -41 31 -153 -109 -130 25 240 85 -44 -9 -298 -97
7100i7O8r1K06J25m4j04j00K38j46p3j55J03J26l73M72k14K72n1k27NP3j35k1
$$ -97 -29 -120 86 211 167 63 -37 201 55 -18 -173 -70 56 -317 155 -59 213 162 -65 -60 13 -122 -143
7123a43K37j11K58n0q7n6o6J2k2j04K71l17L22k27K91j77j6j05o3L08l66K78j34
$$ -143 94 -17 241 191 104 48 -18 -6 -28 -132 139 -178 144 -83 208 31 15 -90 -153 155 -211 67 -67
7146f7n3K18N2k50J43K63j67k10N3p8K68k44J34l90M02J1l17M97j84n0j87K62
$$ -67 -120 98 150 -100 43 306 139 -71 -18 -96 172 -72 62 -328 74 85 -232 265 81 31 -156 106
7168A06n2k18L06j96J57j45P7L2k55O0k16M58J5j61J30l52J34ML03k83M6J01k4
$$ 106 54 -164 142 -54 103 -42 35 67 -188 -128 -344 114 129 -32 98 -254 -120 -116 187 -96 -50 51 27
7191B7K4k69M12j46k03J12j1k4rJ94l50J26k6r3M15m88K76L1p2J75j49J63k88
$$ 27 51 -218 194 48 -155 -43 -54 -78 -87 107 -243 -117 -143 -236 179 -309 -33 -2 -74 101 -48 115 -173
7214a73K23j50J40m7j56J99q4j99J01J02J78m16L15j08J9J15j05K32k55l3J33
$$ -173 50 -100 40 -7 -163 36 -48 -247 -146 -44 134 -282 33 -75 -56 59 -46 186 -69 -102 31
7235C1l2r0J18k4P4j28J7R7k7j92L51r8j00K42m63M9J87q5j17N4J42k01K53o6
$$ 31 -1 -91 27 3 77 -51 -34 63 36 -156 195 97 -3 239 -224 -175 12 -73 -190 -136 6 -195 58 -8
7259hP4j06m0p5J51k01K68n3L5JNk78L23n2L1N1n1l9J00k07NN2pP1q9j40J45R9
$$ -8 66 -40 -80 -155 -4 -205 63 10 45 46 51 -227 96 44 75 126 75 36 136 -71 -66 -14 -21 50 -39 -179 -34 65
7287F5k4J67l54M01j76j76l1J6K8K06q1lj39m4L8K63K4P4k42j21J03Q3j07m6K9
$$ 65 41 208 -146 255 79 -97 -128 -112 -84 122 41 38 -101 -145 -107 156 180 254 12 -109 -6 77 -30 -76 -47
7312d7o3J02k8M4n3K21l4k68L56k74P0K9j68K68j97J31j47n2K9j41J09o9K55k7
$$ -47 -110 -8 -36 8 -45 176 142 -126 230 -44 26 55 -113 155 -42 89 -58 -110 -81 -222 -113 -182 73 46
7336D6O0l2j4n7l3L2L9k30K24r0J25p5Q3q0j0o6Qj33Q1j01J97M2k0J08k38Q5J02
$$ 46 106 74 60 3 -30 2 41 -189 35 -55 70 -5 78 -2 -12 -78 -70 -203 -122 -223 -26 16 -4 104 -134 -49 53
7363E3K9o8J39M3l19J45J00n2P9j55j2M9p5R8K6j82K97j71l9l7Q5L9O4j22q7l7
$$ 53 82 14 153 196 -123 22 122 70 149 -6 -18 31 -44 54 80 -102 195 24 -15 -52 33 72 136 14 -73 -110
7389a10L42k76p9p3O7p4L03m8j25O9k23L09k63J11o3K83j89L9K94l23L6N1q3N2
$$ -110 232 -44 -123 -196 -129 -203 100 52 -73 -4 -227 82 -181 -70 -133 150 -39 0 294 -29 7 58 -25 27
7413B7jJ28k24J02J3k45J89J80M3k04N8j10oJ97q4M2j05k67K57J60j51N8l54L81
$$ 27 26 154 -70 32 45 -200 -11 169 212 8 66 -44 -50 147 63 105 0 -267 -10 150 -1 57 -297 84
7437H4Q7k08j01Q5M3J44k22K8J05q8K02k32Q7P7k77J36k8kJ39j34m0R3K72k53
$$ 84 171 -37 -138 -53 -10 134 -88 -60 45 -43 159 -73 14 91 -186 -50 -78 -80 59 -75 -115 -22 250 -3
7461cN1k13K12k9o4rJ00j98O0J40L4K03j54k55J42M5j41K61o7j06j51L9n4J58
$$ -3 48 -165 47 18 -46 -55 45 -153 -93 47 81 284 130 -125 17 62 -79 182 115 9 -142 -103 -157 1
7485AR1j07O0qJ28m9j15M3l14L83j15PJ20l04J18J23J37j94m7jm3K46j44k01M
$$ 1 92 -15 45 37 165 116 1 44 -270 113 -2 5 125 -179 -61 62 199 5 -42 -43 -86 160 16 -185 -181
7510a81K08M0p1n8N5n0j63L58k1j39k1m6M1J39m9L9m18J92J37M2K5j21p9O9P2
$$ -181 27 67 -4 -62 -7 -57 -220 138 117 -22 -43 -89 -48 91 42 81 -337 -145 -8 34 59 -62 -141 -72 0
7535@l7N5k72L31j00N4Q3k30L12j46m7j11O0j82L11K3o1j34P2j59J89Po8k1J94
$$ 0 -37 18 -254 77 -23 31 114 -116 196 50 3 -108 -48 -230 81 104 43 -91 -19 -178 11 18 -50 -71 123
7560A23k47K68k09K43j54j5j17j2Q2J7p4K66K51n84J78j06J35j59J6J25k33J84
$$ 123 -124 144 -65 178 24 9 -108 -120 -38 -21 -95 171 422 -162 16 -90 45 -114 -98 27 -206 -22
7582b2j42K86j4J33j59j66p2R1K50q7K43k06k79J67o6K59k00M2M7k87K00j40K67
$$ -22 -164 122 108 241 82 -84 -156 -65 185 98 341 135 -144 23 -43 216 16 58 105 -182 18 -122 145
7605A45r6p2K2N4j9N3j44K5J99k06Q4K3r3J6L1p5L40l75N3k22L41n6k4J9N2J18
$$ 145 49 -23 -1 53 34 87 -57 -32 167 -39 45 68 -25 -9 22 -53 287 -88 -35 -257 84 28 4 23 75 193
7631A93k66j17K31n6l8K60m73L77p1oO5P4j8j61%j49J88k13O4jN6j00K04N4l35
$$ 193 -73 -190 41 -15 -53 207 -266 111 40 34 99 173 155 -6 -6 -155 33 -180 -116 -117 -61 -161 43 97 -238
7656b38L76k12j2j98M33j83p0K02j76Q1M0m9K44k69J34q9M9k65L73k19P6J53l95
$$ -238 138 -74 -86 -284 149 -34 -104 98 -78 3 43 -6 238 -31 103 14 63 -202 171 -48 28 181 -214
7679b14R1K47j3j12K09k88N8n4p9J66j76J82J10j42J4K25k68O1j5m0Q3k18R9K04
$$ -214 -123 124 111 -1 208 -80 -22 -76 -155 11 -165 17 127 -15 -1 224 -44 17 2 -38 45 -173 -74 130
7703A30k57j2K96j22j88J29o0J30J65q9n7j22J33j57J71N0j00r3L09k49L8n7o4
$$ 130 -127 -139 157 35 -153 -24 -84 46 211 122 65 -57 76 -81 90 140 40 -53 256 7 45 -12 -76
7726g6O1J04l04M54j31j53K09l19J87O1R9k80J9K34k50P9o1O1k8J06J04j05o7
$$ -76 -15 89 -215 239 108 -45 164 -155 32 93 192 -88 -69 165 -85 -6 -67 -6 -34 72 176 71 4
7749DL1j32P6J81j4k9k13Q5N0j01R9K2K29j02k07j28J11M2K45p1r2k24P5j74J10
$$ 4 35 -97 -21 160 146 117 -96 -11 39 -62 37 59 288 186 -21 -149 -38 4 249 178 86 -138 -63 -237 -127
7774a27J59j15P3j12j5P6J58j08j98K14J0j04l2J84k26l7L00m7j20m0lJ92o5J01
$$ -127 32 -83 -10 -122 -137 -61 97 -11 -209 5 15 -89 -121 63 -163 -200 100 53 -67 -107 -110 82 17 118
7798A18KK4j71j85J47J3q6J13P7M7J75j97j51P3L6M2j99m5K66l1R6p0N6j83K56
$$ 118 120 144 -27 -212 -65 -52 -138 -25 52 99 274 77 -74 -1 35 77 -122 -167 99 68 164 94 150 -33 223
7823B23j56j13N4j02J54QR4r3j79M16m55K44r3K51l50K94k67J59j03j02J77o4
$$ 223 67 -46 8 -94 60 68 162 69 -110 306 -149 95 2 253 -97 197 -70 89 -14 -116 61 -3
7845cj78L4K00%Q1q3K3k29J04J55m1j63K56Lqj3j25Q2L5l75K29R3k34J18j4k30
$$ -3 -181 -147 53 53 134 51 74 -155 -51 104 63 -100 156 159 151 138 13 95 130 -245 -16 77 -157 -39 -53 -283
7871b83K60p1J57j27J22j23J13j41k2K40p0P5k41J21l5K18l59K37%Q4k15j14K18
$$ -283 -23 -94 63 -64 58 -65 48 -93 -115 125 55 130 -111 10 -25 193 -166 71 71 155 -60 -174 44
7894D4o3O9n7Q7M0k18J60M1j20l8J7k6Q4j43J52o2J49R9k34L0k5J56r9r1k64M11
$$ 44 -19 50 -7 80 120 -98 62 103 -17 -55 -38 -64 20 -123 29 -33 116 215 -19 11 -14 142 43 -48 -312 99
7920I9q6j77J49j07K2J46m1k82M27j13np3P1J55j23p6Mj31J75O2k63J37K04j89
$$ 99 13 -164 -15 -122 -100 46 5 -277 150 37 32 -41 30 185 62 -14 -10 -141 34 96 -167 -30 174 -15
7944a5J02l6k0j9p5J77o2m7r4J33j90J24j8J6Q9l13L86Np3j09m0J72L1m40M75
$$ -15 87 51 31 12 -63 114 52 5 -89 44 -146 -22 -40 -24 65 -248 138 143 70 -39 -79 93 124 -316 159
7969A59j20j82K98j70N0k48M95j04j49J06j13J09l33K93k3K51l21p3lQ0K10l20
$$ 159 39 -143 155 -15 35 -213 282 178 29 135 22 131 -202 91 68 319 -2 -75 -78 2 212 -108
7991a08L54k92j58J45J69N9j21J90m82J38K00r3Q1r8J49j28N1q5r8m2J94j18J3
$$ -108 246 -46 -204 -59 110 169 48 238 -244 -106 94 1 82 -16 133 5 56 -29 -127 -169 25 -93 -80
8014h0Q8Q0j39L5K67j64j40j20Q8J09j0o2kJ05j15J85l5J8j37J03j3J02j24l33
$$ -80 8 88 -51 -16 251 87 -53 -173 -85 24 14 -48 -50 55 -60 125 90 108 -29 74 61 163 39 -294
8038b94M25k71J99j77J79k14K14K5r5J42j46K2q5k4K37j4n2j27o1K2J59l2N0j72
$$ -294 131 -140 59 -118 61 -153 61 86 -9 133 -13 9 -76 -100 137 123 71 -56 -117 -95 64 32 82 -90
8062i0K05j48l6Q2J02L4n9J63k16L6Lk42K06r5l8J47k44K23o3p0MJ37j22J44Q4
$$ -90 115 -33 -69 13 115 149 90 253 37 73 76 -166 40 -55 -93 54 -190 33 -30 -100 -96 41 -81 63 147
8087A47m7J60j31m00K73K4K3qJ7m3r7J63k55J96o0J60j1r9j25J00o8J59R4j40
$$ 147 100 260 129 -271 2 26 49 41 58 15 -82 81 -174 22 -38 122 111 12 -113 -13 -81 78 172 32
8111C2o4P5J08n8K24k32j29J38m6J2P2k23K15rm67L76K4l4Q0K07k24Q6j96o3K78
$$ 32 -32 43 151 93 317 85 -44 94 48 60 132 -91 124 115 -352 24 48 14 94 301 77 163 -33 -96 182
8136A82k50R0J03j84q4K87m29K54r8K33J5m40K78j8N9K01j35j2M0K2p4J40O7k50
$$ 182 -68 22 125 -59 -143 144 -285 -31 -129 104 119 -321 -43 -61 -2 199 64 52 92 114 40 180 247 -3
8160cj50J92j36M8j26k67L28Q8K40k50P9M9j43R6p2J58j66J44p9oq2L3L30j69
$$ -3 -153 39 -97 -49 -175 -442 -114 -26 214 -36 43 92 -51 45 -27 131 -35 109 30 24 -58 -25 305 136
8184A36j00q3J2j1O4l7O2
$$ 136 36 -47 -35 -46 18 -19 43
8191D3
$$ Imaginary data points
##PAGE= N=2
##DATA TABLE= (X++(I..I)), XYDATA
0@%%%%%%%%Qj6J6k4L2m0N6p2Q8j04J28j60J92k25K65l13L70m33M99n76O65p62
$$ 0 0 0 0 0 0 0 0 0 8 -8 8 -16 16 -24 32 -40 48 -56 72 -88 104 -121 144 -169 201 -232 267 -309 356 -406
30d06Q70r93J127j274J438j619J818k035K272k531K815l126L466l835M237m677
$$ -406 464 -529 598 -676 762 -857 961 -1074 1198 -1333 1482 -1644 1822 -2013 2224 -2453
46b453N157n682O256o886P581q347R194j0136J1187j2373J3720j5261J7047j9145
$$ -2453 2704 -2978 3278 -3608 3973 -4374 4820 -5316 5871 -6502 7218 -8043 9004 -10141
60a0141K1647k4690K8478l3337L9820m8926O2698q6140J36327m11120P9236M21175
$$ -10141 11506 -13184 15294 -18043 21777 -27149 35549 -50591 85736 -325384 -246148 175027
72A75027l77798K50057j42140N45085n05424J11357K195j91168J58372l88379
$$ 175027 -202771 47286 -94854 450231 -55193 56164 58359 -132809 25563 -362816
82c62816M46344r5391P9853m3633R6449J85007n95781L68356j40094m9631m5735
$$ -362816 83528 -11863 67990 24357 120806 305813 -289968 78388 -61706 -111337 -157072
93a57072J34518K20740l15886L19524j69138O4025j60139j10239K80768k78739
$$ -157072 -22554 198186 -117700 201824 32686 96711 -63428 -173667 107101 -171638
103a71638J53276m0201K65889j56721j77947L49116k69405j1162q7469J94888
$$ -171638 -18362 -58563 207326 50605 -127342 221774 -47631 -58793 -146262 48626
113D8626l8981j26529K28611j08004J41962k35824P0106J11130j84083L8244k173
$$ 48626 9645 -116884 111727 3723 145685 -90139 -20033 91097 -92986 -54742 -56915
124e6915K19379k56896P1755J55060j66670K5043n7572J47002j53765O5319N8727
$$ -56915 162464 -94432 -22677 132383 -34287 -9244 -66816 80186 -73579 -8260 50467
135E0467q0922R7189j35347J15530o3336j5964K1756J9010O5173j56143J49301
$$ 50467 -30455 66734 -68613 46917 -16419 -32383 -10627 8383 73556 -82587 66714
146F6714l5796o9562k602K6048N6268j26907J18054J9725j8502l5854j7163P0314
$$ 66714 30918 -38644 -41246 -15198 41070 -85837 32217 51942 33440 -2414 -19577 50737
158E0737j02656n031K6391O5887k5764k8745R2427l2354m1394l2950J4612J549
$$ 50737 -51919 -56950 -30559 35328 9564 -19181 73246 40892 -502 -33452 -18840 -17291
170a7291m1741L8487N0152q25O91M161m272l5066l8360J9770j4919J7757K2300
$$ -17291 -59032 -20545 29607 28782 29473 33634 29362 -5704 -44064 -24294 -39213 -21456 844
183H44K8931J2332k1637J9767m7611j3422k9208K7926J2313l2698Q3637k871j518
$$ 844 29775 42107 20470 40237 -7374 -20796 -50004 -22078 -9765 -42463 41174 38303 36785
196C6785l1456J0086j2401n3278L1874k8513O4030q835k595L6249j1090r313p5420
$$ 36785 5329 15415 3014 -50264 -18390 -46903 17127 8292 5697 41946 30856 21543 -53877
209e3877P0253l7573l5544O1491l243K8328k3864L2187m0115N348N260o8980O3036
$$ -53877 16376 -21197 -56741 4750 1507 29835 5971 38158 -1957 3391 8651 -60329 2707
222B707r069K920J262L1992m980m4656N2444o2274J5027J7434k4692J7187J5815
$$ 2707 -6362 -3442 -2180 29812 24832 -19824 32620 -29654 -14627 2807 -21885 -4698 11117
235A1117K1940o1228N4810j2503m1756L5340k6432K1388p151K0860k9909J8164
$$ 11117 33057 -28171 26639 14136 -27620 7720 -18712 2676 -4475 16385 -13524 4640
247D640L1264p6002M1921N576j2702o770K1215N887k9090M2352n0522J4491K5085
$$ 4640 35904 -40098 1823 7399 -5303 -12073 9142 15029 -14061 28291 -22231 -7740 17345
260A7345l4933O091K2926J5012n1930M0028J227l9637K4025j0800L603Q033J7537
$$ 17345 -17588 -11497 11429 26441 -25489 14539 15766 -23871 154 -10646 -7043 990 18527
273A8527l1544K3377K8341o3790J3223J8932j4829j2992K5702K947j0332L3560
$$ 18527 -13017 10360 38701 -25089 -11866 7066 -7763 -20755 4947 7894 -2438 31122
285C1122l3123r699K5463k2088k4062K9450J8462l2579K8834J6233k7338M500
$$ 31122 -2001 -11700 13763 -8325 -32387 -2937 15525 -17054 11780 28013 675 5175
297E175k815k1925R830J4681k9839J8279M1737k7928j6151K6553j0179k7590J2818
$$ 5175 2360 -19565 -9735 4946 -24893 -6614 35123 7195 -8956 17597 7418 -20172 -7354
310g354l703m989L0751o977j5417L1998j742m2204J2098J6786l0453L864K6615
$$ -7354 -11057 -16046 14705 7728 -7689 24309 22567 -19637 -7539 9247 -21206 -17342 9273
323I273q415M389J4666k1953p34J9213l2681j1998M0605o996k3558K9684R885
$$ 9273 858 5247 19913 -2040 -2774 16439 -16242 -28240 12365 5369 -18189 11495 21380
336B1380k4241Q145l781j9717K1523m27k6810K4975K6698l4135l719L2648k5743
$$ 21380 -2861 5284 1503 -18214 3309 2882 -23928 1047 27745 -6390 -10109 22539 -3204
349c204j2023J9773j1608Q8J9858j3199q834L1640j8271k8731L2249K749k8250
$$ -3204 -15227 4546 -7062 -6974 12884 -315 -9149 22491 4220 -24511 7738 10487 -17763
362a7763J2963J8611j7620Q642K754k4429K1273R341l3560Q797L5393k3283j4102
$$ -17763 -4800 13811 -3809 4833 7587 -16842 4431 13772 -19788 -10991 24402 1119 -12983
375a2983K6805j2597q990J1178j4043K361K5014j8497j2977L5662p215l8948K3930
$$ -12983 13822 1225 -7765 3413 -10630 -8269 16745 -1752 -14729 20933 13718 -25230 -1300
388a300J6095l3950J3410J4848j1304J3313J00k0959R304J7942m1397O071L4697
$$ -1300 14795 -19155 -5745 9103 -2201 11112 11212 -9747 -443 17499 -23898 -17827 16870
401A6870k2006l22J9316j235k2418K2806j3912k9489M0738j1907j0887J4718K0707
$$ 16870 -5136 -5458 13858 12623 -9795 13011 -901 -30390 10348 -1559 -12446 2272 22979
414B2979j8072j0377K0479l0542J9436j7266n844L0308k421o092j5986N2971l9626
$$ 22979 4907 -5470 15009 -15533 3903 -13363 -19207 11101 8680 2588 -13398 39573 -53
427e3k7467L1998j0493Q428k9392M3062m137k716k682k0800M6931o3093J8459
$$ -53 -27520 4478 -6015 2413 -26979 16083 11946 9230 6548 -14252 32679 -30414 -11955
440a1955R849K395K193j7783N8193n9101K9025j4860r251J4705l3868N6483n1411
$$ -11955 -2106 289 2482 -15301 42892 -16209 12816 -2044 -11295 3410 -30458 26025 -25386
453b5386M8468k1191L437K0508o7541P1559n2272K2743k5295L4898K8128q5445
$$ -25386 23082 1891 5328 25836 -41705 29854 -22418 325 -24970 9928 38056 -47389
465d7389Q6392m3463K5773n8390K6124N1515r2200P7457m5234O3060n1797j2078
$$ -47389 39003 -4460 21313 -37077 -10953 40562 -51638 25819 -19415 43645 -8152 -20230
477b0230N4479o4139N4349q3829R4142k7949l0761M8015l5103O2322j17760R7244
$$ -20230 34249 -29890 24459 -59370 34772 6823 -23938 24077 -11026 51296 -66464 30780
489C0780k4573m3859N8843m2198O6793r1805Q5493l6932k4963M4055o5363Q8670
$$ 30780 6207 -37652 21191 -21007 45786 -46019 39474 2542 -22421 21634 -43729 44941
501D4941r0223O3232j3934K177J5824p7392J25658j09504K5684J3654J0597O459
$$ 44941 -45282 17950 4016 6193 22017 -55375 70283 -39221 -13537 117 10714 17173
513A7173p1350J20976q8531L4971l3750R836N3051j03310Q6793l9392N5553o8630
$$ 17173 -54177 66799 -21732 13239 -20511 -10675 42376 -60934 25859 -13533 42020 -26610
525b6610J0298Q1459j21353P0136l4150M5149m2423O995N1657p7074Q4960q9925
$$ -26610 -16312 65147 -56206 13930 -20220 24929 -17494 -10499 41158 -35916 49044 -40881
537d0881N1852j314l8940L9117k6271O1752r7407Q8721j2667o8180O4482k8690
$$ -40881 10971 9657 -29283 9834 -16437 45315 -52092 36629 23962 -44218 20264 -8426
549h426K2142o1106Q3957l1341k7631N8481o1906N1010m2170J1523o073K1571
$$ -8426 13716 -47390 36567 5226 -22405 36076 -25830 25180 -16990 -5467 -11540 10031
561A0031R93n6393R8286n2275j8448J9554J0195j2309l3878N7551l3403J9917
$$ 10031 11024 -45369 52917 642 -17806 1748 11943 -366 -34244 23307 -10096 9821
573I821n815j6095L4378k3413j1186j045L4417l4376l721M2695k8761J488R416
$$ 9821 4006 -12089 22289 -1124 -12310 -13355 21062 -13314 -17035 25660 -3101 -1613 7803
586G803r405k340O302q747l465K2577q115k1030L3539q948k8524K9869o874j5536
$$ 7803 -1602 -3942 2360 -6387 -9852 12725 4610 -16420 17119 8171 -20353 9516 2642 -12894
600a2894Q965K3137l1681N403L2714m1726K0134n053m30J493L4M194k4307N2569
$$ -12894 -3929 19208 -12473 -7070 25644 -16082 4052 -1001 -1431 62 96 4290 -20017 32552
614C2552m5851m387L8997k2080o995r454N2384n2349J0172J9318k2446L0380m8933
$$ 32552 -13299 -17686 21311 -769 -7764 -17218 35166 -17183 -7011 12307 -10139 20241 -28692
627b8692M1356j1541O620j2805j3816O1338p2178L0116l418J1343r020k2386N9637
$$ -28692 12664 1123 7743 -5062 -18878 42460 -29718 398 -3020 8323 -697 -23083 36554
640C6554n8804M1938l3238J3669J4917m7453N6338m4624M3587l6516J9158J7243
$$ 36554 -22250 19688 -13550 119 15036 -32417 23921 -20703 22884 -13632 5526 22769
652B2769n5398N9736n0562L5527l4773K8330J7128n5456O7384n1725M1805m4862
$$ 22769 -32629 27107 -23455 12072 -22701 5629 22757 -32699 34685 -17040 24765 -20097
664b0097R365L1824m8494M6521n0271P1123m2023j3912L6353l1389K9723o9194
$$ -20097 -10732 21092 -27402 19119 -31152 39971 -2052 -15964 20389 -11000 18723 -50471
676e0471P8718l0068j3151L1898k6967M6480o7998M9013k8156M856J4053m0782
$$ -50471 28247 -1821 -14972 16926 -10041 36439 -31559 17454 -10702 -5846 8207 -32575
688c2575O6840n0508L3653k2989J3681J425m2427O1816n9753L6625m640L551L862
$$ -32575 34265 -16243 17410 -5579 8102 9527 -32900 28916 -30837 5788 1148 4699 8561
701H561k1813M9232o2900L2773j3029P83J4406k9095M3471k7648K5242l5427J4453
$$ 8561 -13252 35980 -26920 5853 -7176 -6393 8013 -21082 22389 -5259 19983 -15444 -991
714i91K3677n4426L2086m487K0423k9813J5838K0056l5347K6351l1114K1485m814
$$ -991 22686 -31740 346 -4141 16282 -13531 2307 22363 -12984 13367 -17747 3738 -1076
727a076o661P672j006K4390m1122K8034m074j8475J1941o690J1007j4722K8008
$$ -1076 -7737 -65 -1071 23319 -17803 10231 6157 -12318 -377 -7067 3940 -10782 17226
740A7226j9647j757K2050k6556N883m688J1266j0109P170N030j0866K3225k3215
$$ 17226 -2421 -4178 17872 -8684 -2801 -7489 3777 -6332 838 5868 -4998 18227 -4988
753d988m016J1845J18j5093L978K6190k2563M990P571p776m79m485o55o6J4483
$$ -4988 -9004 2841 2959 -12134 -8156 18034 -4529 461 8032 256 -223 -4708 -5363 -5429 9054
768I054j4353J254K0573j3322j1259P214M283j3791O877O172o612J3350j845j2427
$$ 9054 -5299 -4045 16528 3206 -8053 -839 3444 -10347 -3470 2702 -3910 9440 7595 -4832
782d832O558N652j7563l20J5631o851q39J0558l435l475M067j0602m389J2428
$$ -4832 1726 7378 -10185 -10505 5126 -1725 -2564 7994 4559 1084 5151 -5451 -9840 2588
796B588n069q251J7465O376j5414L852N319j1220j479K210n048Q988R384j2233
$$ 2588 -2481 -10732 6733 13109 -2305 1547 6866 -4354 -5833 -3623 -8671 317 9701 -2532
810b532L418J3792j4159j2049J1005j127r153J1817L132l256R918m018j2793Q267
$$ -2532 886 14678 519 -11530 -525 -1652 -10805 1012 4144 888 10806 6788 -6005 2262
824B262l62j7617R314J4787j1117K009J3007p485o161L979j1039o79J3304q993
$$ 2262 1900 -15717 -6403 8384 -2733 -724 12283 4798 -1363 2616 -8423 -9102 4202 -4791
838d791l085K1013k315j5205Q377R04j4576M468L391o754J2791M400j1427P931
$$ -4791 -7876 13137 10822 -4383 3994 4898 -9678 -5210 -1819 -8573 4218 8618 -2809 5122
852E122P304k0506j712J4884j2516l65J3817k274j590Q025r972r064J6901j3161
$$ 5122 12426 -8080 -9792 5092 -7424 -7789 6028 3754 2164 10189 217 -8847 8054 -5107
866e107j1598K1093K703j1427P434R299j7952O377J457j7105J5411M224j0764
$$ -5107 -16705 4388 7091 -4336 3098 12397 -5555 822 2279 -14826 585 4809 -5955
879e955L646K0574j8206j0319K2175j8330k489P630J355k593R741J548k0031K4797
$$ -5955 -2309 18265 59 -10260 11915 -6415 -8904 -1274 81 -2512 7229 8777 -11254 13543
893A3543j2521j6420J4606K946m214l642K1520j8997O328N165k1789J3848m190
$$ 13543 1022 -15398 -792 2154 -2060 -5702 15818 -3179 3149 8314 -13475 373 -3817
906c817K870q722K0195k281j5287K1430k2077Q911o353j592K753M949J1697k5891
$$ -3817 -947 -9669 10526 8245 -7042 14388 -7689 1222 -5131 -6723 -3970 979 12676 -13215
920a3215L2156j3994j2296O656p942J1437j6974K2900j4101J5968M598k9109K4827
$$ -13215 18941 4947 -7349 -693 -8635 2802 -14172 8728 -5373 10595 15193 -13916 10911
933A0911j5132J541j6341K4256R95j9395L5042k4974J3414j2238k503p14o527
$$ 10911 -4221 -2680 -19021 5235 6230 -13165 21877 -3097 10317 -1921 -4424 -5138 -11665
946a1665K0929k9878L5342o201p224N488r666J1025k9685K7595j7983P008J9024
$$ -11665 9264 -20614 14728 8527 1303 6791 -2875 8150 -21535 6060 -11923 -4915 14109
959A4109j7382J6155j6600J9273k6454J535J0722j4428J9721j5835K4114j0993
$$ 14109 -3273 12882 -3718 15555 -10899 -9364 1358 -13070 6651 -9184 14930 3937
971C937J666k744j3001K0765k8513J2928L516R324m075j0553K5999j9946j250
$$ 3937 5603 2859 -10142 10623 -17890 -4962 -1446 7878 3803 -6750 19249 -697 -1947
984a947q783R492L157j3914J5931n67Q705j4704J970Q255j5756K111J525P486
$$ -1947 -10730 -1238 1919 -11995 3936 3369 12074 -2630 -660 7595 -8161 -6050 -4525 2961
998B961m804L894O120p529K447n283k541L857l895K489O817j576l400M907M160
$$ 2961 -1843 2051 8171 642 3089 -2194 -4735 -878 -4773 -2284 4533 2957 -443 4464 8624
1013H624k2370R193J7130k3034K195J6752N607k4380Q859J2216j8951Q944j3000
$$ 8624 -13746 -4553 12577 -10457 -8262 8490 14097 -10283 -1424 10792 -8159 785 -12215
1026a2215J6635L114j1081K380N536J5150m6165K5925J4882k6438M857R821K0941
$$ -12215 4420 7534 -3547 -1167 4369 19519 -26646 -721 14161 -12277 -7420 2401 23342
1039B3342m0480K5470k605j4414J3633k6047L3415j9599J2039m053N776R645m3016
$$ 23342 -17138 8332 5727 -8687 4946 -21101 12314 -7285 4754 701 6477 16122 -26894
1052b6894M7911l0229k071O225J0324P277l6395N5945l8105R155p847r207L2245
$$ -26894 21017 -9212 -11283 -5058 5266 12543 -23852 32093 -6012 3143 -4704 -13911 18334
1065A8334m5699L5058j3884L1854l1674j0827N7201o2336J7624j2610L6923k9625
$$ 18334 -27365 7693 -6191 25663 -6011 -16838 40363 -21973 -4349 -16959 19964 -9661
1077i661r920N3594m9053M0272m5035K5382K218k9108K4732k2729N5972o4769
$$ -9661 -19581 34013 -15040 25232 -19803 5579 7797 -21311 3421 -19308 36664 -28105
1089b8105L6733J7332m1055K1859k6006M6008o2015M1013P458k9151M0973m4807
$$ -28105 8628 25960 -15095 6764 -19242 26766 -35249 5764 13222 -15929 25044 -19763
1101a9763M8043m4529J5621j708q352L0626n8926P2261l3536k080L058k61K1206
$$ -19763 28280 -16249 -628 -2336 -10688 19938 -38988 33273 -263 -2343 715 454 21660
1114B1660o5166O6432l1363R738j29j1347M3197n6795L6645k8472K9711j6402
$$ 21660 -43506 22926 -8437 1301 1172 -10175 33022 -23773 12872 -15600 14111 -2291
1126b291k7533O2745m6375K4671k5259L1667j3562k8635M6699m3292L7809l1407
$$ -2291 -29824 32921 -13454 11217 -14042 17625 4063 -24572 22127 -21165 16644 -14763
1138a4763K0414M900k2582K8595l7758M3766m1822J6949J5686k6075K4112k3764
$$ -14763 5651 10551 -12031 16564 -21194 22572 -19250 -2301 13385 -12690 11422 -12342
1150a2342L7233m3995J9781J0538k7182K5446k4176L5659l1233J1801M972j3432
$$ -12342 24891 -19104 677 11215 -15967 9479 -14697 20962 -10271 1530 6502 -6930
1162f930K0883l9242L6912j0976k212j967M818J9163m1898L0630j0369q73j865
$$ -6930 13953 -25289 11623 647 -1565 -3532 1286 20449 -21449 9181 -1188 -2061 -3926
1175c926l194K0248k2609J9901j5271R835J73j8534J6990p640P750j3138J7403
$$ -3926 -7120 13128 -9481 10420 -4851 4984 5157 -13377 3613 -4027 3723 -9415 7988
1188G988j111j3533J6630j4158K789l934P249n128k348J5919j1687M867k722j344
$$ 7988 6877 -6656 9974 -4184 -1395 -5329 1920 -3208 -5556 10363 -1324 3543 821 -523
1202e23M64l145j118N49J1544j0906R46J2533p573q570M402M673r024R06O794
$$ -523 -59 -3204 -4322 -3773 7771 -3135 -2189 10344 2771 -5799 -1397 3276 -5748 -4842 1952
1217A952J25J312j240m090O611l297j0337N978O252m837k747J1810m554l921M838
$$ 1952 2077 3389 2149 -1941 4670 1373 -8964 -2986 3266 -1571 -4318 7492 2938 -983 3855
1232C855p317J255N91N62l952Q164K603r786R578m125l371o4M85j509P20R121
$$ 3855 -3462 -2207 -1616 -1054 -5006 3158 5761 -4025 5553 1428 -1943 -2007 -1522 -3031 -2311 6810
1248F810j2203P893N375r953j395K679M058j0990Q581l42r25P020r356L730N06
$$ 6810 -5393 2500 7875 -2078 -3473 -794 3264 -7726 855 513 -412 6608 -2748 982 1488
1263A488O83r762N374R312j3605P603K469m39m320J034M62m364P846r523M222
$$ 1488 2171 -7591 -2217 7095 -6510 1093 3562 3123 -1197 -163 299 -4065 3781 -5742 -1520
1278a520P331n230k514K549N332j1018M191J059l075N499k945j23J118N191r257
$$ -1520 5811 581 -1933 616 5948 -5070 -879 180 -2895 2604 -341 -464 654 5845 -3412
1293c412o17R137p985K17L153J469k392J779l06m312P495n751l915P671J903p635
$$ -3412 -4029 5108 -2877 -2660 493 1962 -430 1349 1043 -3269 4226 -1525 -5440 2231 4134 -3501
1309c501J654P298o559n16K590l452L225J352n016J415Q172p431m721R366k508
$$ -3501 -1847 5451 -1108 -1624 966 -2486 739 2091 -2925 -1510 6662 -769 -5490 3876 1368
1324A368n970M814J519l361M087p90n148O846p03r668O477N748q607P77P833n112
$$ 1368 -4602 212 1731 -1630 2457 1667 -3481 3365 2662 -7006 -529 5219 -3388 -2611 5222 110
1340A10j452M121o049J301O306p398j974J1902m183q658R656l41p995L794K067
$$ 110 -1342 2779 -3270 -1969 4337 -3061 -5035 6867 2684 -5974 3682 3341 -4654 -860 1207
1355A207n778O260J879r406Q871L916j1990J744Q717p449m339J0536m306j163
$$ 1207 -4571 1689 3568 -5838 3033 6949 -5041 -3297 5420 -2029 -6368 4168 -138 -1301
1369a301O358n908j581P293m861r042J2616j13r704P981K444m311p1K525o410
$$ -1301 5057 -851 -2432 4861 0 -9042 3574 3461 -6243 1738 4182 -129 -200 2325 -4085
1384d085M149L629j0673P599M939p111j074P234l409n968P367n206O42N799o368
$$ -4085 64 3693 -6980 619 5558 -1553 -2627 4607 1198 -4770 2597 -2609 -1967 3832 -2536
1399b536N60P402k973q593R070j96q117O552k70k861L510J884p558M500N905j2449
$$ -2536 -1976 5426 2453 -6140 2930 2734 -5383 1169 899 -1962 1548 3432 -4126 374 6279 -6170
1415f170L717P725p099j608O446k210k786N209m835j792Q955n868n731R443R80
$$ -6170 -2453 5272 -1827 -3435 3011 801 -1985 3224 -1611 -3403 5552 -316 -6047 3396 4376
1430D376r274L045P288p039j146N107l626K475q55k473K489K562l640m514J0428
$$ 4376 -4898 -1853 5435 -1604 -2750 2357 -1269 1206 351 -2122 367 2929 -711 -5225 5203
1445E203n063k918L923q24J463n033N957n192L152P39n205P789o474N630n042
$$ 5203 140 -2778 1145 321 1784 -3249 2708 -2484 668 1407 -3798 3991 -2483 3147 -1895
1460a895J819J347m308Q274j2959J2637l632l289K657k932R853j6545J2386l952
$$ -1895 -76 1271 -3037 5237 -7722 4915 1283 -2006 651 -2281 7572 -8973 3413 -539
1474e39R90J474q817J6148j3979R386j0723Q499M916j9938J9427r835R790j4971
$$ -539 451 1925 -6892 9256 -4723 4663 -6060 2439 7355 -12583 6844 -2991 6799 -8172
1488h172R344P676j9726J9067j6327J5726j2435L930O135j4319K2692k6990K1323
$$ -8172 1172 8848 -10878 8189 -8138 7588 -4847 -917 5218 -9101 13591 -13399 7924
1501G924p876l939Q125j0689J8263k7251K7267j3553n006J4996j5589J7211k4741
$$ 7924 48 -3891 4234 -6455 11808 -15443 11824 -1729 -6735 8261 -7328 9883 -14858
1514a4858K7987j6216k563J4417k0320K6929k9223J9186o331K486K526k0844L8994
$$ -14858 13129 -3087 -5650 8767 -11553 15376 -13847 5339 -992 1494 4020 -16824 22170
1527B2170l4714J4150l187L740M222k4322L6203k9336J9640j4257J980J8481l0966
$$ 22170 -12544 1606 -1581 2159 6381 -17941 18262 -11074 8566 -5691 -3711 14770 -16196
1540a6196K5604j9199K4025k3990M512K3466l4926K7848k0744K0158j7555L487
$$ -16196 9408 -9791 14234 -9756 -5244 18222 -16704 11144 -9600 10558 -6997 -3510
1552c510J5811k7914L1549l0117K3990r047q505J5580j5879K1762l5336L5264
$$ -3510 12301 -15613 15936 -14181 9809 762 -7743 7837 -8042 13720 -21616 13648
1564A3648q355j8677K1326j1414J5942l2630L0903q298r691J3702j8640L0068
$$ 13648 5293 -13384 7942 -3472 12470 -20160 10743 2445 -7246 6456 -12184 17884
1576A7884k7804R954m62M995m92k4742M0887k4672L21K357P366J79k2009K9646
$$ 17884 -9920 34 -428 4567 4075 -20667 20220 -4452 -4131 -1774 5592 5771 -16238 13408
1590A3408j9778R945o758n15J4696j9984J3381q820J3910j6436R73J9758k2501
$$ 13408 -6370 3575 -3183 -3698 10998 -8986 4395 -4425 9485 -6951 -5978 13780 -8721
1603h721Q822p95R221j5478L213J4274j7620Q636o163J0278m177p605Q349Q04
$$ -8721 101 -694 8527 -6951 -3738 10536 -7084 1552 -4611 5667 1490 -6115 2234 3038
1617C038J080j6493J6157N140j7102L959J0264O4j5647R753O244p953j672J003
$$ 3038 4118 -12375 3782 8922 -8180 -4221 6043 6107 -9540 213 6457 -1496 -3168 -2165
1631b165O121k378o188M062P031o283p049R135L904j3782N520Q517p907r39L642
$$ -2165 3956 1578 -4610 -548 6483 200 -6849 2286 6190 -7592 -2072 6445 -1462 -2401 1241
1646A241L130q999M724J664m399M644o733R212l422k939O13M030J227j6472J8637
$$ 1241 4371 -4628 96 1760 -2639 2005 -4728 4484 1062 -1877 -1264 2766 3993 -12479 6158
1661F158k719q226K717N226L810j7537J5206m308l79j099m331J4029j2110N140
$$ 6158 3439 -4787 -2070 3156 6966 -10571 4635 327 -52 -1151 -5482 8547 -3563 1577
1675A577o010J1304m704j4066K0577j0901L287o406J0362j857j0493J5008j4145
$$ 1577 -4433 6871 2167 -11899 8678 -2223 1064 -5342 5020 3163 -7330 7678 -6467
1688f467J0784p983L360L054o821J0209j2462J4404j3424L647P808j2631R062
$$ -6467 4317 -3666 -306 2748 -4073 6136 -6326 8078 -5346 -1699 6109 -6522 2540
1701B540o611J3173j6196P104P594j4063R838r781J2537r491K061L338m257J1087
$$ 2540 -4071 9102 -7094 10 7604 -6459 3379 -6402 6135 -3356 -1295 2043 -2214 8873
1715H873j9302J4965k301m833l17Q84J1080j8407J4590m506j720L335p062Q739
$$ 8873 -10429 4536 2235 -2598 -2915 -2031 9049 -9358 5232 726 -994 2341 -4721 4018
1729D018r664J0030q708M876N492j1901J0745p360M843o413M999N90p899J4324
$$ 4018 -5646 4384 -4324 552 6044 -5857 4888 -2472 2371 -4042 957 1547 -6352 7972
1743G972j1235L933l1J563k501n011J0249r365O722l591M33N420o293K779m454
$$ 7972 -3263 670 639 2202 -299 -5310 4939 -4426 2296 -1295 -862 4558 -1735 1044 -3410
1758c410Q465q399l82Q237o303K657k872N663m794N82J107m108P470o188J296
$$ -3410 5055 -3344 -3726 4511 -1792 865 -2007 3656 -1138 -556 551 -3557 3913 -2275 -979
1773i79J998J349l292k018P067o725K524L53j264J812j05j3l439O373l862l039
$$ -979 1019 2368 -924 -2942 4125 -2600 -76 277 -987 825 720 707 -2732 3641 -221 -3260
1789c260M899j020j101l49K487k508J320N30m270M656ml274J031M077l272k496
$$ -3260 1639 619 -482 -831 1656 -852 468 998 -3272 1384 1380 -1894 -863 3214 -58 -2554
1805b554M695k327r30J594j133N5K787j729l068N112p12n221K924K355k979N39
$$ -2554 2141 -186 -1116 478 -655 -600 2187 458 -2610 2502 1790 -3431 -507 1848 -1131 -592
1821e92K463k804J509J243m134J391L652m484j248O195k370l062M011l16l115
$$ -592 1871 -933 576 1819 -2315 -924 2728 -1756 -3004 3191 821 -2241 1770 1454 -1661
1836a661K415r96k887M835j04m751M410K334n555N93L742l801n54L317k240K73
$$ -1661 754 -242 -3129 1706 1602 -3149 1261 3595 -1960 -1367 2375 -1426 -1980 1337 -903 -630
1852f30L381l186j429N097l088m186N225Q5l727K931J175k640K768p33l772L459
$$ -630 2751 -435 -1864 3233 145 -4041 1184 1269 -2458 473 1648 -992 1776 1043 -2729 730
1868G30P28m767K124M276l801o64M462l637j95J808l020M50L945l007k555P603
$$ 730 1458 -3309 -1185 3091 -710 -1374 3088 -549 -744 1064 -1956 -1506 2439 -568 -3123 4480
1884D480l276m112M022m34k685R22K389l781M511M45n517M474J203m753j207O615
$$ 4480 1204 -2908 1114 680 -2005 -1083 1306 -2475 2036 2481 -3036 1438 2641 -2112 -3319 3296
1900C296l923k694P018m458J163R91j459k498L181Q32o693Q114j161k869J840
$$ 3296 -627 -3321 3697 -761 402 1393 -66 -2564 617 1449 -5244 2870 1709 -1160 680
1915F80N89p54l476N651o716L885L389n795L614J47J951p431M845K93l943M986
$$ 680 1269 515 -2961 2690 -4026 -141 3248 -2547 1067 1214 3165 -4266 579 872 -3071 1915
1931A915n278O740k882L9j412J139L620j1216R516k176m71L09k19N348q372O673
$$ 1915 -3363 3377 495 534 -878 261 3881 -7335 2181 5 -466 -157 -376 4972 -3400 3273
1947C273o679M007P19o742Q775m457M682o898O281j017p589J0364q899N101l048
$$ 3273 -3406 601 1320 -5422 3353 -1104 3578 -3320 2961 1944 -5645 4719 -4180 921 -2127
1962b127N532k534m671J1219j2009O882n343L293J391n391P351p283J1118j1260
$$ -2127 3405 871 -3800 7419 -4590 2292 -3051 242 1633 -3758 3593 -3690 7428 -3832
1976c832J621P513q492K633m849J4219j2736J348P884o868M884j0030J1499o674
$$ -3832 -2211 5302 -3190 -557 -5406 8813 -3923 -2575 5309 -1559 3325 -6705 4794 -1880
1990a880Q52J130k651J0445j4584R364j650o88k202j588J0737j4751J0248j479
$$ -1880 -1028 102 -2549 7896 -6688 2676 1026 338 -1864 -3452 7285 -7466 2782 1303
2004A303o12l90l228R047j2256P794l771L754L35p730J2633p556K23l729Q291
$$ 1303 691 301 -2927 6120 -6136 1658 -2113 1641 1976 -5754 6879 -677 -454 -4183 4108
2019D108k075j1009J4118l852o27n002O877J461r288N824k560O778p556m64Q524
$$ 4108 2033 -8976 5142 1290 663 -4339 2538 3999 -5289 535 -2025 4753 -2803 -3267 5257
2034E257m041l380j790J0887r178l818R843k196l144j04O017m395k055K361m13
$$ 5257 1216 -2164 -3954 6933 -2245 -6063 3780 1584 -1560 -1664 4353 -42 -2097 264 -149
2049a49R40l075J616M279l528l018N252J429q149P35R467o607m756Q896R2m023
$$ -149 791 -2284 -668 3611 83 -2935 2317 3746 -4403 -3668 5799 -808 -5564 3332 3424 -599
2065e99k777O723k272l716J260J55P110j0344K826O471k597n727n40J2852j4008
$$ -599 -3376 3347 1075 -2641 -1381 -1226 5884 -4460 -1634 4837 2240 -3487 -4027 8825 -5183
2080e183K194N756j543j59n562J0783r083L875l146P43O439j2510J1244m645L981
$$ -5183 -2989 2767 1224 1065 -4497 6286 -2797 1078 -2068 -1325 5114 -7396 3848 -797 3184
2095C184o491L100P450j6784J4187o345L389m008J603P467j4133J3046j0664R154
$$ 3184 -3307 -207 7243 -9541 4646 -1699 1690 -2318 -715 6752 -7381 5665 -4999 4155
2109D155m903n191J2538j0160Q360j2902J5446n897r487J4258j0134R514j3394
$$ 4155 -748 -5939 6599 -3561 4799 -8103 7343 1446 -8041 6217 -3917 5597 -7797
2122g797J2969m003n160R997j4313J6956j4010N580N89j915O103j4386J9808j5634
$$ -7797 5172 1169 -3991 6006 -8307 8649 -5361 219 808 -1107 4996 -9390 10418 -5216
2136e216N146J593m311O891j1551J6373j5839J0133q80p407J1018j2731J2906
$$ -5216 -70 1523 -2788 4103 -7448 8925 -6914 3219 2339 -5068 5950 -6781 6125
2149F125j1993R256l671l700J2601j6941J3986q834N481m081j521J0721j6067
$$ 6125 -5868 3388 -283 -3983 8618 -8323 5663 -3171 2310 -1771 -3292 7429 -8638
2162h638J5029r928N694o57n274Q692j0883J2628j3474Q866J295p887R041r103
$$ -8638 6391 -3537 2157 1500 -3774 4918 -5965 6663 -6811 2055 3350 -4537 4504 -4599
2176d599J0828j1186O535r41m324R624j2422J0626n532L219k990p77P895j3072
$$ -4599 6229 -4957 1578 637 -3687 5937 -6485 4141 -1391 1828 -1162 -1939 5956 -7116
2190g116J1122n963J971J173l028N248p678R840r523M035K481n624N076m329N656
$$ -7116 4006 -1957 14 1187 -1841 3407 -4271 5569 -3954 81 2562 -3062 2014 -2315 3341
2205C341o669N477r28n089Q212o819L015k147L566k448k332O967o776M617k744
$$ 3341 -3328 2149 1221 -3868 4344 -2475 540 -1607 1959 -489 -2821 4146 -2630 1987 -757
2220g57O18Q72j498R80l022O952n669r5M109k336l04j765M037l840J243R59j807
$$ -757 -139 733 -765 215 -2807 4145 -1524 -1619 2490 154 -150 -1915 2122 -1718 -475 484 -1323
2237a323L349k559L91K34J519k590l66L067l319J216J002q70j5J363p64k218L094
$$ -1323 2026 -533 -142 92 1611 -979 -1345 1722 -1597 -381 621 -249 -264 1099 335 -1883 1211
2254A211j000j668J664O16j118M96N5n29J050m14k132J886J860l667P58K942j802
$$ 1211 211 -1457 207 823 -295 201 256 -273 777 363 -1769 117 1977 -1690 -932 2010 208
2271B08j273J514N78j971J151m9o58J695j640l89J305Q40k935J308K108k846J033
$$ 208 -1065 449 1027 -944 207 158 -500 1195 -445 -834 471 1311 -1624 -316 1792 -1054 -21
2288b1L28n46k04J078j115q13L122k431n04K007k82j345M39Q19j628J641k22j554
$$ -21 307 -239 -443 635 -480 -1293 1829 -602 -1106 901 619 -726 -287 532 -1096 545 323 -1231
2306a231K285l02j790M88K504k786p34K665j116k08N90k62j46R57j215j468L352
$$ -1231 1054 752 -1038 -550 1954 -832 -1566 1099 -17 -225 365 103 -43 914 -301 -1769 1583
2323A583j217k058K135R36j821r0J701j674M57O17j877J185J257j517o37K692
$$ 1583 366 -1692 443 1379 -442 -532 1169 -505 -48 569 -1308 -123 1134 -383 -1020 1672
2339A672j398j501J862n93r26R70k85n20J918n68k328K591J84k591J094J399j440
$$ 1672 274 -1227 635 42 -884 86 -199 -719 1199 631 -1697 894 1078 -1513 -419 980 -460
2356d60m04J724j600J035J115k341M89K095k105j569L094m09k308K611p79q78
$$ -460 -864 860 -740 295 1410 -931 -442 1653 -452 -2021 1073 664 -1644 967 188 -690
2372f90J436n1j945J962M35l385K295J287j922k15K236j015j425K062k068L14
$$ -690 746 695 -1250 712 1147 -2238 57 1344 -578 -793 1443 428 -997 1065 -1003 -689
2388f89K146j989k76J738M23l251K820J3k135J410l80M2k82J550j597J90K436
$$ -689 1457 -532 -808 930 1353 -1898 922 935 -1200 210 -170 -128 -410 1140 -457 -267 2169
2405B169l643J488O36n98j145J385M02j716K733k507K06J928j390j018N90K477
$$ 2169 -1474 14 650 52 -1093 292 694 -1022 1711 -796 -590 1338 -52 -1070 -480 1997
2421A997l782J834J005j646J597j769P65l52J512k737J064L203m493J440J292
$$ 1997 -1785 49 1054 -592 1005 -764 1 -351 1161 -1576 -512 2691 -1802 -362 930
2436I30k00j857J029J308k962K571j216j81J607p61r10K95J933l277J592J466
$$ 930 730 -1127 -98 1210 -1752 819 -397 -578 1029 268 -642 -347 1586 -1691 -99 1367
2452A367k359J250M59o81j097K472j294j895K664l03j299O22P28n58m82M13n58
$$ 1367 -992 258 717 36 -1061 1411 117 -1778 886 583 -716 -94 634 76 -406 7 -551
2469e51J421m64j978J980J082k328q1J921l77k175J882M02j292J183j715J270
$$ -551 870 406 -1572 408 1490 -838 -919 1002 625 -1550 332 734 -558 625 -1090 180
2485A80J43l70p18J041J258l694L195o49o98M26m47J529k972L680l164R56J950
$$ 180 323 -47 -765 276 1534 -2160 1035 386 -312 114 -333 1196 -1776 1904 -1260 -304 1646
2502A646l220K531k130K875l231K107L01l214N273m981K933j322J289q29k407
$$ 1646 -1574 957 -1173 1702 -1529 578 879 -2335 2938 -2043 890 -432 857 28 -2379
2517b379N949o741M904k466M45J493k889L978n565P127n609K08M375m849L839
$$ -2379 3570 -3171 1733 -733 -288 1205 -1684 2294 -3271 3856 -1753 -1545 2830 -2019 1820
2532A820m883O972n623J172K415n407Q008q130N300k631K148n11m871R850r997
$$ 1820 -3063 3909 -1714 -542 1873 -3534 4474 -3656 1644 -987 1161 650 -4221 5629 -4368
2547d368O017k094P31P45m624Q895r891Q016m999P35L703o791P457p472P598o189
$$ -4368 1649 -445 286 1031 -3593 5302 -4589 3427 -1572 -837 2866 -3925 3532 -3940 3658 -2531
2563b531K525L770q775R097o848N617o033L383L420q415R171q030P942o010j5
$$ -2531 -6 3764 -5011 4086 -2762 2855 -3178 205 3625 -4790 4381 -3649 4293 -1717 -1732
2578a732M856n964O374r351J1004n532k748O045m721N563j0107J0396m488j488
$$ -1732 3124 -2840 3534 -5817 5187 -345 -3093 2952 -1769 3794 -6313 4083 -405 -1893
2592a893L885n899R710j0036N774j782O41N98o417J1858j0564M571j99Q54k44
$$ -1893 1992 -3907 5803 -4233 1541 -241 400 998 -5419 6439 -4125 446 247 1101 857
2607H57n437J1030j0412M651j039J64K448o420Q104o196M694m709J602N157r527
$$ 857 -4580 6450 -3962 689 -350 -186 2262 -4158 3946 -2250 2444 -2265 -663 4494 -5033
2622e033O233j771L873o933K708O499r288M565k524M823m814o25N246m219L119
$$ -5033 1200 -571 3302 -3631 -923 5576 -3712 853 -1671 3152 -1662 -2287 2959 -1260 1859
2637A859n804O919j628m414L451j98J986o703O675k39l887K626r51K757n141K917
$$ 1859 -3945 2974 1346 -3068 383 185 2171 -4532 2143 1904 -1983 643 -308 2449 -2692 225
2653B25M78p79J29j940N256m477m88K538P12l119j045N856l758j843L124R74k112
$$ 225 703 -76 53 -1887 3369 -1108 -1596 942 1654 -1465 -2510 3346 -412 -2255 869 1843 -269
2670b69j551L088q75r03p56J421J557k788p83L661L5m165J548L582l293k299M374
$$ -269 -1820 1268 393 -510 -1266 155 1712 -1076 -1859 1802 1837 -2328 -780 2802 -491 -2790 1584
2687A584l06k305N90J311q2j864J467r04J120j011p04L340l397P72O14J473l051
$$ 1584 1278 -1027 -437 874 792 -1072 395 -509 611 -400 -1104 2236 -1161 -389 225 1698 -1353
2704a353j12M219m437J170O72J128j805r02L398l093K084k658K119J224m124K727
$$ -1353 -1465 2754 -1683 -513 159 1287 -518 -1420 1978 -1115 969 -1689 430 1654 -2470 257
2720B57k94K187m677K820J946l978K117q29K116l362J767M77j739L035l994L797
$$ 257 -37 2150 -2527 293 2239 -1739 378 -451 1665 -1697 70 547 -1192 1843 -2151 1646
2736A646j567o22M40m8J343m036M895k249n95K111j375M91k523M175l329N57J677
$$ 1646 79 -543 -103 -151 1192 -2844 2051 -198 -793 1318 -57 434 -2089 2086 -1243 -686 991
2753I91k011K487k402K010j511J436j349j589M126l476R79K73J043r99r46K654
$$ 991 -1020 1467 -935 1075 -436 1000 -349 -1938 2188 -1288 -309 -36 1007 8 -938 1716
2769A716l080J823j243K94J341j326R62j330K927k941K35J795k079R91m78J042
$$ 1716 -1364 459 -784 -490 851 -475 487 -843 2084 -857 -622 1173 -906 85 -393 649
2785F49j458J553j97j458K132j649N2k26R49o89n21K155j971J430k70r11M29L87
$$ 649 -809 744 547 -911 1221 -428 -376 -602 347 -342 -863 1292 -679 751 481 -430 -1 386
2803C86m48j336K400r84o77J383n10r6l56L11q46R03k1j211J794J7j216o2J243
$$ 386 -62 -1398 1002 18 -659 724 214 118 -238 73 -773 130 109 -1102 692 709 -507 -569 674
2822F74n13j030J435r05K3O68m88K28Q41p50j118J365k56r67P63K09k51J75M91
$$ 674 161 -869 566 -339 -316 352 -136 92 933 183 -935 430 174 -793 -30 179 -72 103 594
2841E94r90O65N32j735P68R03j011m57J316m79m41Q73n94l65J144p85q47J448
$$ 594 -396 269 801 -934 -166 737 -274 -731 585 106 -335 538 -56 -421 723 -62 -909 539
2859E39J11j611J285L71j114L40L25n41K9J077j553K93J293j087l28J231k13j232
$$ 539 650 -961 324 695 -419 -79 246 -295 -266 811 -742 -449 844 -243 -571 660 447 -785
2877g85J010R6p91O12j5o87J121k0j223J042O21j557P2J031o82k11R93q74J53
$$ -785 225 321 -470 142 127 -560 561 541 -682 360 981 -576 -504 527 -155 -366 627 -247 -94
2896i4Q15r48j12J019p80p92J529l11o67L65K84o35N16K52j397J104L98j585P31
$$ -94 721 -227 -339 680 -100 -892 637 326 -341 24 308 -327 189 441 -956 148 546 -1039 -308
2915c08J297r64o77J730j106n80J065j046N64M73m74q72J371K65j920J629m03
$$ -308 989 25 -652 1078 -28 -608 457 -589 -25 448 -26 -898 473 738 -1182 447 44
2932D4l15K49L02l09j34J189k188J162R20j866P28K33Q48k256J862Q7j226J740
$$ 44 -271 -22 280 -29 -163 1026 -1162 0 920 -946 -218 15 863 -1393 469 556 -670 1070
2950A070j821J297j064J176j495Q12J587l439K882j200J59k28J47J002k481L361
$$ 1070 -751 546 -518 658 -837 -25 1562 -1877 1005 -195 -36 -264 -117 885 -1596 1765
2966A765k807J102J99p49J477k263K982k874K226j164j070L236l584K184j336
$$ 1765 -1042 60 259 -490 987 -1276 1706 -1168 1058 -106 -1176 2060 -1524 660 -676
2981f76K433k559o01L722m127K598j971K187q46j379K742l133M125m636K342J173
$$ -676 1757 -802 -1403 2319 -1808 790 -1181 1006 160 -1219 1523 -1610 2515 -2121 221 1394
2997A394k533J466j759L988m813K590Q70k213K323k946L837l871K228m53j067
$$ 1394 -1139 327 -1432 2556 -2257 333 1203 -1010 1313 -1633 2204 -1667 561 108 -959
3012i59K860m597M771k442K96m85L57K054n275N755k462l13K28M07J949n042M817
$$ -959 1901 -2696 2075 -367 -71 -556 -199 1855 -3420 2335 -127 -440 -212 195 2144 -2898 1919
3029A919k703J358j036j363M403m106K121j976L243j651k883N114l304J077j994
$$ 1919 -784 574 -462 -1825 2578 -1528 593 -1383 1860 209 -2674 2440 -864 213 -1781
3044a781L050q15k436L959k911K158k896J910P05k062J547j095K937m066J760
$$ -1781 1269 454 -1982 1977 -934 1224 -1672 238 943 -1119 428 -667 2270 -1796 -36
3059c6K093l172J166q62K854l825J300J754j841R35j687K959j391j010J59J227
$$ -36 2057 -1115 51 -811 2043 -1782 -482 1272 -569 366 -1321 1638 247 -763 -604 623
3075F23L21l744L806O62k661J17K100K54l755K268R98j439k25L4J744p68r79M52
$$ 623 944 -2800 1006 1668 -993 -876 1224 1478 -2277 -9 989 -450 -675 -641 1103 335 -644 -192
3093a92J431j042j990K414M00k731J306J870j187j397J793O28k699R45N61L7o71
$$ -192 1239 197 -1793 621 1021 -1710 -404 1466 279 -1118 675 1303 -1396 -451 110 147 -524
3110e24k16K309j514p0n16J772j018k813L747p73m06j057K442P6l264K788j286
$$ -524 -740 1569 55 -15 -531 1241 223 -2590 1157 384 -22 -1079 1363 1439 -1825 963 -323
3127c23J269k223M72K192k054J393k126M121k938j340L184k692J383j978L582
$$ -323 946 -1277 -805 1387 -667 726 -1400 2721 -217 -1557 1627 -1065 318 -1660 1922
3142A922k714M27K143l095L209l552K263j124J16J134k657N006m893K676j82j100
$$ 1922 -792 -365 1778 -1317 1892 -1660 603 -521 -405 729 -1928 3078 -1815 861 679 -421
3158d21O25j890M357n697M051l79j238J725k891M038m227L148k024K46K656m699
$$ -421 204 -1686 2671 -3026 1025 646 -592 1133 -1758 2280 -1947 1201 -823 -577 2079 -2620
3174b620M344k499J876k197R91K193m906M765l760K949j611k9J999l267M193m736
$$ -2620 1724 -775 1101 -1096 -105 2088 -2818 1947 -1813 1136 -475 -504 1495 -1772 2421 -2315
3190b315L636r34j461K207k605L106l398L205j750m60K484l686L379l082K609
$$ -2315 1321 387 -1074 1133 -1472 1634 -1764 1441 -309 -769 1715 -1971 1408 -1674 935
3205I35j508N0J898l365M234l288J432r4m12N03k275M125l886J954J25p47J313
$$ 935 -573 -523 1375 -1990 2244 -1044 388 294 -118 385 -1890 2235 -1651 303 428 -319 994
3222I94k048K633l025K359j147q69K460k516J820j197J911j810k11K064l022K112
$$ 994 -1054 1579 -1446 913 -234 -1103 1357 -1159 661 -536 1375 -435 -646 1418 -1604 508
3238E08j359J007k44k2O41j548K504k430Q59L73r93R27q25J511j631J563m32j140
$$ 508 -851 156 -88 -110 531 -1017 1487 -943 -84 289 -704 223 -602 909 -722 841 409 -731
3256g31J190o51K75p61J254n98j15Q88j221J143p29j95pM66q1j092J734n14n67
$$ -731 459 -192 83 -678 576 -22 -137 751 -470 673 -56 -251 -258 208 127 -965 769 255 -312
3275c12L71J01k80l21M06o99J052j33n83Q09N1m03k86O73q29J1N60m73J85K89
$$ -312 59 160 -120 -441 -35 -734 318 185 -398 411 462 59 -227 446 -383 -372 188 -285 -100 189
3295A89N8n36N08j5r81P21J34n75L43L54m60N81n2o46L50M05o84j86R17k59o00
$$ 189 247 -289 219 204 -777 -56 78 -497 -154 200 -260 321 269 -377 -27 378 -306 -492 425 166 -434
3316d34Q72k76l65K17J63m42N34j37p40J088k76n52K16P11r29P7N08m07J35J50
$$ -434 438 162 -203 14 177 -265 269 132 -608 480 204 -348 -132 579 -350 -273 235 -172 -37 113
3336A13l73j0P25m66n11P09r0m86O32k61l34K11L39n16L40K19q82O17N90o11m99
$$ 113 -260 -270 455 -11 -522 187 97 -389 243 -18 -352 -141 198 -318 22 241 -641 -24 566 -45 -544
3357e44R05m29p2N60n39L5M97k52n46Q46j60j063R57R0o14K62L64l11k60O86j076
$$ -544 361 -68 -140 420 -119 -84 413 161 -385 461 301 -762 195 285 -329 -67 297 -14 -274 412 -664
3378f64O49K00n60L85N57l86m29P86m01n73Q52m69q7K79J4o43R17J18j162P54
$$ -664 -15 185 -375 10 567 181 -248 538 137 -436 416 -53 -140 139 153 -490 427 545 -617 137
3398A37j11l17j3M53q4k07O45q50M77K29o03O8J67N11j205R20j5n65O35k90m0
$$ 137 26 -291 -304 149 65 -142 503 -347 130 359 -244 -176 -9 502 -703 217 202 -363 272 -18 -58
3419e8j69O81r68L23P45j049O47K2K05q12O29o1o49J092j164N18J96K22o18k33
$$ -58 -227 454 -514 -191 554 -495 152 174 379 -433 196 135 -514 578 -586 -68 128 350 -268 -501
3439e01J326j624O88P7m4J91k53N39p00J162j142L1Q67j066M83j32N81q34M71
$$ -501 825 -799 -111 -34 -78 113 -140 399 -301 861 -281 -250 617 -449 34 -98 483 -351 120
3458A20M19j302J474j289O27k51K90k0n26J147j293R08j64o99O51j50r1q26J736
$$ 120 539 -763 711 -578 49 -202 88 68 -458 689 -604 304 140 -559 92 -58 -149 -975 761
3477G61o16o24J128q21L43o10O16l51K09J43r72J762j138k82O47J20m97o33K028
$$ 761 145 -479 649 -172 171 -439 177 -174 35 178 -794 968 -170 -452 195 315 -182 -815 1213
3496A213j374k91O13l27K57k27L62m67N04m26l05O60o6m93P68K5r58J83Q15r45
$$ 1213 -161 -452 161 -166 91 -136 226 -241 263 -163 -468 192 126 -367 401 426 -532 -349 466 -479
3516d79J60O96k52l31L22L44m88l56N05k25L33o76M36Q67r73q5K56O44j209P9
$$ -479 -319 377 125 -206 116 460 -28 -384 121 -104 229 -447 -11 856 -117 -202 54 698 -511 -432
3536d32J153j224P99q18R20k67n12Q32p74J174k044J288M46j268P82k69J335k322
$$ -432 721 -503 296 -522 398 131 -381 451 -323 851 -1193 95 541 -727 55 -214 1121 -1201
3554a201J590K86j485J604j724J758j446J063l13m71J366k535K576j466K16J2
$$ -1201 389 675 -810 794 -930 828 -618 445 132 -339 1027 -1508 1068 -398 -182 -170
3570a70n1J147k960L961k310J23K05l88J665k861K971k076J503o29j472L084k924
$$ -170 -221 926 -2034 1927 -383 -260 -55 -443 1222 -1639 1332 -744 759 130 -1342 1742 -1182
3587a182J988k137K205m36j986L172k878K701k504J480K2j376K409l019L089k813
$$ -1182 806 -1331 874 438 -1548 1624 -1254 1447 -1057 423 445 -931 1478 -1541 1548 -1265
3603a265J543L10j480J871k568L545l331J396R49k264K527k829L360l098J819
$$ -1265 278 588 -892 979 -1589 1956 -1375 21 970 -1294 1233 -1596 1764 -1334 485
3618D85K47j760L006m262L650j823M28k90k50K766m751L766j440j6k4m67K509
$$ 485 732 -1028 1978 -2284 1366 -457 -29 -319 -569 2197 -2554 1212 -228 -244 -268 -735 1774
3635A774l555L196k403J328r0j538K609k441K131k362K061R1k333K661k082J632
$$ 1774 -1781 1415 -988 340 250 -1288 1321 -1120 1011 -1351 710 801 -1532 1129 -953 679
3651F79j775J786k16j414K152k366K222j917J000J37j039J505j799K468k096J99
$$ 679 -1096 690 474 -940 1212 -1154 1068 -849 151 288 -751 754 -1045 1423 -673 -474
3667d74J332j292R71j599K509k250O70O73q15J220k038J582m84o4l10K14J521
$$ -474 858 -434 537 -1062 1447 -803 -133 540 -275 945 -1093 489 5 -59 -369 -155 1366
3684A366k508J190M54l67n54J06J118j862J324l72K07Q1m77O11n78M63q54P79
$$ 1366 -1142 48 502 135 -419 -313 805 -1057 267 -105 102 183 -294 317 -261 202 -652 127
3702A27L12j081R75M5m52l36P90l65n67R98l92l09K73L20q8j90j72l6M61l90n40
$$ 127 439 -642 333 378 -74 -410 380 15 -552 446 54 -255 18 338 250 60 -112 -148 313 -77 -617
3723f17J007l1p69K98O07o48l98P84j20n56N90l26K92M5j37J6J97l09n27P45k4
$$ -617 390 359 -410 -112 495 -153 -551 233 113 -443 147 -179 113 158 21 37 234 -75 -602 143 119
3744A19n33N30K23l36m26R55p56j83P65o61K74O6K15m51M31j37n36J027r14OM27
$$ 119 -414 116 339 3 -423 532 -224 -407 358 -303 -29 37 252 -199 232 95 -441 586 -328 -322 105
3765A05n4j25l6J025j238L15K43m94K60k57O33o39P12m80k81J018j103L38j37
$$ 105 51 -74 -110 915 -323 -8 235 -259 1 -256 377 -262 450 -30 -311 707 -396 -58 -195
3784a95L06m11J63O16r38P66l91j05K72P4k7m87Q80q24K39L39n45N45k98K07o88
$$ -195 111 -300 -137 479 -459 307 -84 -189 83 157 130 -357 523 -301 -62 277 -268 277 -21 186 -502
3805e02O07o8q71J320m53J15k11J40m17L43J82n97P64m61j40K23J7q0m69Q32n12
$$ -502 105 37 -834 486 33 148 -63 77 -340 3 185 -412 352 -109 -249 -26 -9 -89 -558 274 -238
3826b38J70K65m01n4J84K29o24M85M04q44P45k05l17Q5N0o2K83pl62K78L30o12
$$ -238 -68 197 -204 -258 -74 155 -469 16 420 -424 321 116 -201 -116 -66 -128 155 148 -214 64 394 -218
3848b18P8L18J01m87L02j10j68M51l23qJ18K7l68K76K62m06N1L56r3k76L95n22
$$ -218 -140 178 279 -208 94 -16 -184 267 -56 -64 54 81 -287 -11 251 -155 -104 252 159 -117 278 -244
3870b44n8M52m30J00M98j26o41O78ql90J88j36k26K59K35l11M79N3m68PO07p36
$$ -244 -302 150 -280 -180 318 192 -449 229 221 -169 19 -117 -343 -84 151 -160 319 372 -96 -89 518 -218
3892b18k8N23k11k91N32k61l06N18l40l06M43M4k50K00L38o32J42J76l93K78J37
$$ -218 -246 277 66 -225 307 46 -260 258 -82 -388 55 99 -151 49 387 -245 -103 73 -320 -42 95
3913I5ll41O82p20Q7M67l8n80L07J04j32k4L13rNK6l47K32K37m58P7N4j10l4J06
$$ 95 92 -249 433 -287 -200 267 229 -351 -44 60 -72 -96 217 208 213 239 -108 124 361 -97 -20 34 -76 -110 -4
3938dJ59j06j37o7K33K53m01k83O83k35k96M00K4l04J38R1k22q1M58n78L56J04
$$ -4 155 49 -88 -155 78 331 -70 -353 330 95 -201 199 223 -81 57 148 -74 -155 303 -275 81 185
3960A85n37L32n8J33l03O29l84k22P25n78j53J09O61r40K70N78q85M99k50L05
$$ 185 -352 -20 -78 55 -248 381 -3 -225 500 -78 -231 -122 539 -401 -131 447 -438 61 -189 116
3980A16j35K96k17n14J216j089J76J99j45j4j83P85j266J201n53J64L15n55N17
$$ 116 -19 277 60 -454 762 -327 -151 48 -97 -111 -294 491 -775 426 -127 37 352 -203 314
3999C14r27J136p83K97K29q72J261j017N34n46L77K50r77J405j016N87k23N8K51
$$ 314 -613 523 -260 37 266 -606 655 -362 172 -374 3 253 -724 681 -335 252 29 87 338
4018C38o56J087j399J325r40l39J043q33P24j066J589r46j60Q82j292J283j454
$$ 338 -318 769 -630 695 -245 -584 459 -374 350 -716 873 -73 -233 649 -643 640 -814
4035h14J168n84M46J93j431K339k172P96p5K25R2r50J917j876J372n74k80O48
$$ -814 354 -230 216 409 -1022 1317 -855 -59 -134 91 183 -767 1150 -726 646 72 -208 440
4053D40j305J720j646J431p86l29J041j086J413j679J305j309M88J167j810J831
$$ 440 -865 855 -791 640 -146 -475 566 -520 893 -786 519 -790 -302 865 -945 886
4069H86j534J292q87R5Q68j644J610j525J542o56n54J186r45R32j715J752p13
$$ 886 -648 644 -243 -148 720 -924 686 -839 703 47 -507 679 -266 666 -1049 703 -10
4086a0n58R43j050J460j446Q26n09M11M06j428J665r81K12l49O55n5j023J982
$$ -10 -568 375 -675 785 -661 165 -344 67 473 -955 710 -271 -59 -408 247 192 -831 1151
4104A151j733P48j90l0K62o15P60r26O62Q2n34O25m04N6k8M57o15k47J052o44
$$ 1151 -582 166 -24 -54 208 -407 353 -573 89 171 -363 262 -142 -86 -114 343 -272 -519 533 -111
4124a11L41k14K34k13j35K00l87N09n95N36L94n27l10M87M6m08j84O38l73j44
$$ -111 230 16 250 37 -98 102 -285 224 -371 165 559 32 -278 209 255 -153 -337 301 -72 -216
4144b16J89P0J49l50K91M2k10m47M08L26m73J25L10j62k08n3Q57j165M06L70o54
$$ -216 -27 43 192 -158 133 175 -35 -482 -74 252 -221 -96 214 52 -156 -209 648 -517 -111 259 -395
4165c95O79o27Q27n85K44l65J14M03j198J302l38J50n95O30N39j646J236n17N2
$$ -395 284 -343 484 -101 143 -222 -108 295 -903 399 61 211 -384 246 785 -861 375 -142 -90
4184i0j34k37R88r04P69j019O96M9q11J065p56P53j001R36J9j027J427r41P39
$$ -90 -224 -461 527 -377 392 -627 69 118 -693 372 -384 369 -632 304 323 -704 723 -218 521
4203E21r93O53Q8m75R70j643J643j073R2N36n51O66j218J677j475L35Q30p75N98
$$ 521 -472 181 269 -206 764 -879 764 -309 -217 319 -232 434 -784 893 -582 -247 583 -192 406
4222D06j331J491p44K02K30n77Q38j455J344n16K68k57j14J175j518Q37n57K79
$$ 406 -925 566 -178 24 254 -323 515 -940 404 -112 156 -101 -215 960 -558 279 -278 1
4240An1n13J163j264J438q77P4L77j006Q71p55Q81r94P15M33r10Q01l42L39o29
$$ 1 -50 -563 600 -664 774 -103 -29 348 -658 213 -542 339 -655 60 493 -417 384 42 381 -248
4260b48M41k2n91J021p57O39m55R7m5j45K42p92R62o67q9P28k66N3m46O92k34
$$ -248 193 171 -420 601 -156 483 28 125 80 -65 177 -615 347 -320 -409 319 53 106 -340 352 118
4281A18j12Q7l67M99n10M71k92M53l15l18M71o10K25K29J04l80K42M00o10L98
$$ 118 6 93 -274 225 -285 186 -106 347 32 -286 185 -425 -200 29 133 -247 -5 395 -215 183
4301A83r2l79M31j32j3j3L69m10O1R1m85M27Q4m28l1N78k55o0L14l66Q7P6j0j50
$$ 183 91 -288 143 11 -2 -15 354 -56 5 96 -389 38 122 -306 -337 241 -14 -74 240 -126 -39 37 27 -123
4325a23j77L82k57K82M8m67M05K44k62p8L4j47J19J02j10q1K2K07l56L14Nl92
$$ -123 -300 82 -175 107 155 -312 93 337 75 -3 31 -116 3 105 -5 -86 -64 143 -213 101 106 -286
4347b86J71K23k05L6K03m48M72k01N8k90M47k54m9L15l25j29L22j20J57J16j46
$$ -286 -115 108 -97 -61 142 -306 166 -35 23 -267 180 -74 -123 192 -133 -262 60 -60 97 213 67
4368F7k87L69j66l6j74N85m83nL74k21J00L5q0j75J59k77J16L11P0k84k2L4m1
$$ 67 -220 149 -17 -53 -227 358 -125 -130 244 23 123 158 78 -97 62 -215 -99 212 282 -2 -24 10 -31
4391c1k4L12l95j07L28k21K26l1j59J22K2r7k80N26k04J13qj31P7n8J97p23Q28
$$ -31 -55 257 -138 -245 83 -138 88 57 -102 20 42 -55 -335 191 -13 100 92 -39 38 -20 177 -546 282
4414B82k98k00K97j26J58j68M8k52O8M05o10M60k6L9l15M05j97l82P65l39r5J22
$$ 282 -16 -216 81 -45 113 -55 -7 -259 -191 214 -396 64 38 77 -238 167 -30 -412 353 14 -81 41
4436D1j57P4l2J66l77R9J96j72K52k01L97m32M99o16K56L22n27K13RJ97m65R1
$$ 41 -116 -42 -74 92 -285 -186 10 -162 90 -111 286 -146 353 -263 -7 315 -212 1 10 207 -258 -167
4458a67M57o72P33l41j31k02J03J34j83L09j68J58J14j22K74m24M28p75O70m01
$$ -167 290 -382 351 10 -121 -323 -220 -86 -269 40 -128 30 144 22 296 -128 300 -475 195 -206
4478b06j71R05q11N81n49K78R5k84M85n08M42l39J61J3m4j34l46J067j158L25
$$ -206 -377 528 -283 298 -251 27 122 -162 323 -185 257 -82 79 92 48 -86 -432 635 -523 -198
4498a98K58j38J57l16N19n37M31k21j36M93n25K80k24M66n51Q4O55j142P51j23
$$ -198 60 -78 79 -237 282 -255 176 -45 -181 312 -213 67 -157 309 -242 -158 497 -645 106 -17
4518a7L29m45j63P78q46O03m05K51K03k86J04l69N59p11O33J2m57K59P7r1m68
$$ -17 312 -133 -296 482 -364 239 -166 85 288 2 106 -263 296 -415 218 230 -227 32 109 18 -450
4539d50K81L86l70R9O2J09J70p74P00j91j29l31O75j35n63N57J28j36m46L67n7
$$ -450 -169 217 -153 -54 8 117 287 -487 213 22 -107 -438 237 102 -461 96 224 88 -358 9 -48
4560d8k26M48K7k1j51l33M91k51j49J29K73k19o90J103k54l92L11J75n2o60R24
$$ -48 -274 174 201 180 29 -304 187 -64 -213 -84 189 -30 -720 383 129 -263 48 223 171 -489 435
4581D35o61J01N4j36P13p99K91J27L04p27k88J308j162O7Q3P66m90n10R43o99
$$ 435 -226 -125 -71 -207 506 -293 -2 125 429 -298 -586 722 -440 -373 -290 476 -14 -524 419 -280
4601b80N40o32M68J84p80R55n89N29p93N34M83j301P70k06O97j064L04O35j160
$$ -280 260 -372 96 280 -500 455 -134 395 -398 136 619 -682 88 -118 579 -485 -181 454 -706
4620g06J244q42J010j148K95O24p74O78j341J422k23n14M46k69N34j494J388j19
$$ -706 538 -304 706 -442 -147 477 -297 381 -960 462 239 -275 171 -98 436 -1058 330 211
4638B11n21Q47r07J099j404J092m20J20P0r40J738j559N06N6L47O1j358J794j561
$$ 211 -310 537 -370 729 -675 417 -3 117 187 -753 985 -574 -68 -12 335 396 -962 832 -729
4657g29R46n23M17L48j260J408q08N65m13l25J055j479J178n18P04r51P2J101
$$ -729 217 -306 111 459 -801 607 -201 364 -49 -374 681 -798 380 -138 566 -385 -313 788
4675G88j322N84o75J202q07k81J013r55J264j522J128l09m38N67p62R40j185J144
$$ 788 -534 50 -625 577 -230 -511 502 -453 811 -711 417 108 -330 237 -525 415 -770 374
$$ [...]
8191i5
##END NTUPLES=NMR FID
##END=
