##TITLE=1H_LR-750-R2-RM2
 200.13Hz, CDCl3.
 8 sc
 19.6.2026
##JCAMPDX= 6.0         $$ Bruker NMR JCAMP-DX V2.0
##DATA TYPE= NMR FID
##DATA CLASS= NTUPLES
##ORIGIN= UXNMR, Bruker Analytische Messtechnik GmbH
##OWNER= pz
$$ XWIN-NMR		Version 3.5
$$ Fri Jun 19 16:30:09 2026 Russian Standard Time (UT+4h)  she@DPX200
##.OBSERVE FREQUENCY= 200.1313
##.OBSERVE NUCLEUS= ^1H
##.DELAY= (6, 6)
##.ACQUISITION MODE= SIMULTANEOUS
##.ACQUISITION SCHEME= undefined
##.AVERAGES= 8
##.DIGITISER RES= 18
##SPECTROMETER/DATA SYSTEM= spect
##.PULSE SEQUENCE= zg30
##.SOLVENT NAME= CDCl3
##.SHIFT REFERENCE= (INTERNAL, CDCl3, 0, 14.3821)
##AUDIT TRAIL= $$ (NUMBER, WHEN, WHO, WHERE, WHAT)
$$ ##TITLE= Audit trail, XWIN-NMR		Version 3.5
$$ ##JCAMPDX= 5.01
$$ ##ORIGIN= Bruker BioSpin GmbH
$$ ##OWNER= she
$$ F:/spectra/data/she/nmr/H-C/1/audita.txt
$$ ##AUDIT TRAIL=  $$ (NUMBER, WHEN, WHO, WHERE, WHAT)
(   1,<2026-06-19 16:28:04.73 +0400>,<she>,<DPX200>,
      <created by zg, POWCHK disabled, PULCHK disabled
       configuration hash MD5:
       00 E9 B6 7A A2 85 ED C7 34 08 36 98 17 FE 4E 26
       data hash MD5: 16K
       27 75 0A A9 80 86 1E 81 AA 31 A6 B9 FD 2B D4 2B>)
$$ ##END=
$$ 
$$ hash MD5
$$ 2D AB A9 A5 97 75 8C DF A7 C1 3D EC 68 38 09 A4
##$RELAX= 
##$RELAX= 
##$RELAX= 
##$RELAX= 
##$RELAX= 
##$RELAX= 
$$ Bruker specific parameters
$$ --------------------------
##$DU= <F:/spectra>
##$EXPNO= 1
##$NAME= <H-C>
##$PROCNO= 1
##$TYPE= <nmr>
##$USER= <she>
##$AMP= (0..31)
100 100 100 100 100 100 100 100 100 100 100 100 100 100 100 100 100 100 
100 100 100 100 100 100 100 100 100 100 100 100 100 100 
##$AQSEQ= 0
##$AQ_mod= 1
##$AUNM= <au_zg>
##$AUTOPOS= <>
##$BF1= 200.13
##$BF2= 200.13
##$BF3= 200.13
##$BF4= 200.13
##$BF5= 200.13
##$BF6= 200.13
##$BF7= 200.13
##$BF8= 200.13
##$BYTORDA= 1
##$CFDGTYP= 0
##$CFRGTYP= 5
##$CHEMSTR= <none>
##$CNST= (0..31)
1 1 145 1 1 1 1 1 1 1 1 1 1 1 1 1 1 1 1 1 1 1 1 1 1 1 1 1 1 1 1 1 
##$CPDPRG= <>
##$CPDPRG1= <>
##$CPDPRG2= <>
##$CPDPRG3= <>
##$CPDPRG4= <mlev>
##$CPDPRG5= <mlev>
##$CPDPRG6= <mlev>
##$CPDPRG7= <mlev>
##$CPDPRG8= <mlev>
##$CPDPRGB= <>
##$CPDPRGT= <>
##$D= (0..31)
0 0.7 0 0 0 0 0 0 0 0 0 0.03 0 0 0 0 0 0 0 0 0 0 0 0 0 0 0 0 0 0 0 0 
##$DATE= 1781872084
##$DBL= (0..7)
120 120 120 120 120 120 120 120 
##$DBP= (0..7)
150 150 150 150 150 150 150 150 
##$DBP07= 0
##$DBPNAM0= <>
##$DBPNAM1= <>
##$DBPNAM2= <>
##$DBPNAM3= <>
##$DBPNAM4= <>
##$DBPNAM5= <>
##$DBPNAM6= <>
##$DBPNAM7= <>
##$DBPOAL= (0..7)
0.5 0.5 0.5 0.5 0.5 0.5 0.5 0.5 
##$DBPOFFS= (0..7)
0 0 0 0 0 0 0 0 
##$DE= 6
##$DECBNUC= <off>
##$DECIM= 32
##$DECNUC= <off>
##$DECSTAT= 4
##$DIGMOD= 1
##$DIGTYP= 9
##$DL= (0..7)
0 120 120 120 120 120 120 120 
##$DP= (0..7)
150 150 150 150 150 150 150 150 
##$DP07= 0
##$DPNAME0= <>
##$DPNAME1= <>
##$DPNAME2= <>
##$DPNAME3= <>
##$DPNAME4= <>
##$DPNAME5= <>
##$DPNAME6= <>
##$DPNAME7= <>
##$DPOAL= (0..7)
0.5 0.5 0.5 0.5 0.5 0.5 0.5 0.5 
##$DPOFFS= (0..7)
0 0 0 0 0 0 0 0 
##$DQDMODE= 0
##$DR= 18
##$DS= 0
##$DSLIST= <SSSSSSSSSSSSSSS>
$$ [...]
##$SUBNAM0= <"">
##$SUBNAM1= <"">
##$SUBNAM2= <"">
##$SUBNAM3= <"">
##$SUBNAM4= <"">
##$SUBNAM5= <"">
##$SUBNAM6= <"">
##$SUBNAM7= <"">
##$SUBNAM8= <"">
##$SUBNAM9= <"">
##$SW= 18.0517328524113
##$SWIBOX= (0..15)
0 0 2 0 0 0 0 0 0 0 0 0 0 0 0 0 
##$SW_h= 3612.71676300578
##$TD= 16384
##$TD0= 1
##$TE= 0
##$TE2= 300
##$TE3= 300
##$TEG= 300
##$TL= (0..7)
0 120 120 120 120 120 120 120 
##$TP= (0..7)
150 150 150 150 150 150 150 150 
##$TP07= 0
##$TPNAME0= <>
##$TPNAME1= <>
##$TPNAME2= <>
##$TPNAME3= <>
##$TPNAME4= <>
##$TPNAME5= <>
##$TPNAME6= <>
##$TPNAME7= <>
##$TPOAL= (0..7)
0.5 0.5 0.5 0.5 0.5 0.5 0.5 0.5 
##$TPOFFS= (0..7)
0 0 0 0 0 0 0 0 
##$TUNHIN= 0
##$TUNHOUT= 0
##$TUNXOUT= 0
##$USERA1= <user>
##$USERA2= <user>
##$USERA3= <user>
##$USERA4= <user>
##$USERA5= <user>
##$V9= 5
##$VALIST= <valist>
##$VCLIST= <CCCCCCCCCCCCCCC>
##$VD= 0
##$VDLIST= <DDDDDDDDDDDDDDD>
##$VPLIST= <PPPPPPPPPPPPPPP>
##$VTLIST= <TTTTTTTTTTTTTTT>
##$WBST= 1024
##$WBSW= 4
##$XGAIN= (0..3)
0 0 0 0 
##$XL= 0
##$YL= 0
##$YMAX_a= 436154
##$YMIN_a= -558985
##$ZGOPTNS= <>
##$ZL1= 120
##$ZL2= 120
##$ZL3= 120
##$ZL4= 120
##$ABSF1= 10
##$ABSF2= 0
##$ABSG= 5
##$ABSL= 3
##$ALPHA= 0
##$AQORDER= 0
##$ASSFAC= 0
##$ASSFACI= 0
##$ASSFACX= 0
##$ASSWID= 0
##$AUNMP= <proc_1d>
##$AZFE= 0.1
##$AZFW= 0.1
##$BCFW= 1
##$BC_mod= 2
##$BYTORDP= 1
##$COROFFS= 0
##$CY= -3
##$DATMOD= 1
##$DC= 2
##$DFILT= <>
##$DTYPP= 0
##$F1P= 0
##$F2P= 0
##$FCOR= 0.5
##$FTSIZE= 0
##$FT_mod= 4
##$GAMMA= 1
##$GB= 0.15
##$INTBC= 1
##$INTSCL= 1
##$ISEN= 128
##$LB= 0.25
##$LEV0= 0
##$LPBIN= 0
##$MAXI= 10000
##$MC2= 0
##$MEAN= 0
##$ME_mod= 0
##$MI= 1.114404
##$NCOEF= 0
##$NC_proc= 0
##$NLEV= 6
##$NOISF1= 3.799351
##$NOISF2= 2.8
##$NSP= 1
##$NTH_PI= 0
##$NZP= 0
##$OFFSET= 14.38212
##$PC= 1
##$PHC0= -4376.738
##$PHC1= 8.592289
##$PH_mod= 1
##$PKNL= yes
##$PPARMOD= 0
##$PSCAL= 0
##$PSIGN= 0
##$REVERSE= no
##$SF= 200.129724274929
##$SI= 16384
##$SIGF1= 3
##$SIGF2= 2
##$SINO= 400
##$SIOLD= 16384
##$SREGLST= <1H.CDCl3>
##$SSB= 0
##$STSI= 0
##$STSR= 0
##$SW_p= 3205.1282051282
##$SYMM= 0
##$S_DEV= 0
##$TDeff= 0
##$TDoff= 0
##$TI= <>
##$TILT= no
##$TM1= 0
##$TM2= 0
##$TOPLEV= 0
##$USERP1= <user>
##$USERP2= <user>
##$USERP3= <user>
##$USERP4= <user>
##$USERP5= <user>
##$WDW= 1
##$XDIM= 8192
##$YMAX_p= 0
##$YMIN_p= 0
$$ End of Bruker specific parameters
$$ ---------------------------------
##NTUPLES= NMR FID
##VAR_NAME=  TIME,          FID/REAL,        FID/IMAG
##SYMBOL=    X,             R,               I
##VAR_TYPE=  INDEPENDENT,   DEPENDENT,       DEPENDENT
##VAR_FORM=  AFFN,          ASDF,            ASDF
##VAR_DIM=   8192,          8192,            8192
##UNITS=     SECONDS,       ARBITRARY UNITS, ARBITRARY UNITS
##FACTOR=    0.0002768,     1,               1
##FIRST=     0,             0,               0
##LAST=      2.2672688,     0,               0
##MIN=       0,             -558985,         0
##MAX=       2.2672688,     436154,          0
$$ Real data points
##PAGE= N=1
##DATA TABLE= (X++(R..R)), XYDATA
0 0 0 0 0 0 0 0 0 0 0 0 -8 8 -8 9 -16 16 -24 30 -32 40 -48 58 -72 86 -97 114 -134 155 -181 207 -238 271
32 271 -309 349 -393 444 -499 558 -626 698 -778 865 -961 1064 -1177 1302 -1437 1586 -1747
49 -1747 1923 -2120 2336 -2575 2839 -3135 3467 -3846 4279 -4777 5362 -6061 6911 -7967
63 -7967 9327 -11152 13735 -17708 24651 -40328 153765 -152533 -224428 248992 20018 31846
75 31846 436154 261451 -211368 26491 153081 -229001 -230064 93840 -64349 -172298 62458
86 62458 -56098 -390368 -206497 57357 8103 68647 164502 -84672 -176776 123438 225762
97 225762 77695 137384 181337 -4254 -37246 86987 -12426 -102903 87524 164761 -52829
108 -52829 -164194 -126449 -191136 -170221 80573 167641 -23982 -102953 -44060 -92070 -67423
119 -67423 128989 147271 633 49474 128701 -18255 -89445 23149 12268 -19911 114942
130 114942 93672 -118815 -108618 9034 -51829 -19791 131208 20321 -142124 -18528 51362
141 51362 -42690 60029 154333 -56093 -134052 57479 29920 -115136 9718 95447 -45856
152 -45856 -36189 55981 -83287 -157076 29513 103965 23469 62331 75670 -64551 -82080 53666
164 53666 83642 37846 45328 30515 -7692 6488 -285 -65641 -83934 -28915 19396 11063 -46114
177 -46114 -89643 -68003 -14997 27416 41501 -1674 -46044 3934 78819 79417 65898 52697
189 52697 -11228 -20861 64108 62913 -28229 -29474 9344 -12787 -5596 -1078 -104891 -149052 -25872
202 -25872 46262 1795 -1077 -2713 -60206 -27305 63316 35055 -12255 46198 74725 38984
214 38984 53395 46576 -40639 -52462 27852 38325 -3335 -7428 -30555 -64805 -22053 16076
226 16076 -39716 -76473 -26825 14799 20467 31175 15721 -25685 -15722 32595 34984 9929 16350
239 16350 25137 14205 22812 32772 -8790 -55404 -39319 -580 10616 15319 9251 -27595 -39144
252 -39144 -764 8263 -23467 -17785 13765 18526 26017 37966 2896 -37822 -20677 5158 4451
265 4451 19358 28548 -6701 -23319 5244 5677 -23487 -22535 -7837 997 30995 47212 6374
278 6374 -30322 -15417 2147 911 7677 7955 -6141 1419 19378 4688 -23610 -31503 -27831 -12628
292 -12628 18436 31413 8072 -15957 -14496 -152 10261 8559 -3107 -1761 23794 43607 29695
305 29695 -4598 -29957 -29803 -7945 11884 11168 -3381 -13640 -11933 -5328 -6345 -18575 -29960
318 -29960 -22947 5403 33897 36231 10257 -16367 -16066 6658 24537 20422 4450 394 14492
331 14492 24337 10837 -17729 -39176 -35126 -6390 19058 15880 -5730 -21356 -21824 -9923 3140
344 3140 -1615 -18059 -11564 20906 42425 33763 4223 -25910 -24844 11840 35104 17821 -5397
357 -5397 -7881 272 10482 8204 -21664 -46712 -25966 13710 28432 20094 -3396 -32216 -29601
370 -29601 5608 19331 -885 -12636 450 22954 39474 26630 -18267 -45645 -20053 21837
382 21837 33589 16168 -8187 -19963 -8446 10002 5441 -20336 -29101 -2735 27221 28762 8352
395 8352 -17372 -32380 -13338 22378 20084 -12871 -16724 6390 18455 23093 11992 -32296 -51848
408 -51848 -5504 32026 19125 9754 6835 -12880 -6152 18289 -6919 -38359 -5214 32973 28188
421 28188 25481 11071 -42832 -56766 -2600 27490 16514 15679 1943 -29981 -20087 9639 -4848
434 -4848 -23835 -199 19875 10603 7396 8933 -5833 -9969 13213 23630 2813 -11382 -4573
447 -4573 -3740 1101 30361 30795 -24144 -49101 -18003 -11586 -13401 31387 38021 -19959 -22063 6230
461 6230 -38561 -50531 31495 51209 14378 49441 40542 -70769 -69070 34589 29545 8507
473 8507 67076 19571 -84952 -23350 42688 -37925 -37242 48700 -3521 -47854 41881 13715
485 13715 -98491 -14366 87035 3481 -17203 46253 -41173 -86094 77788 116847 -25470
496 -25470 -24439 24676 -69934 -56791 89979 47759 -61916 18949 50562 -75651 -67800 24276
508 24276 -29974 -32227 109687 83010 -82527 -67881 13643 -28790 -1993 105469 42221 -66268
520 -66268 4118 43976 -55874 -40780 59591 9914 -37501 53171 29110 -107551 -51038 78027
532 78027 20142 -25661 43005 -19038 -109389 21037 112345 -8724 -28437 56162 -31023 -92052
544 -92052 45978 57159 -64745 12944 101978 -34775 -80011 26570 -31839 -86857 78275
555 78275 114540 -46002 -31991 38467 -72374 -66690 99334 56142 -54233 41791 54216
566 54216 -89132 -38016 73797 -24952 -51795 77717 24721 -93359 -1396 44255 -62007
577 -62007 -16333 85570 -14151 -75279 33154 29936 -45094 36081 82438 -31276 -47907 37833
589 37833 3943 -42498 30004 46661 -22389 -4848 30484 -41486 -77236 -1139 31727 3985
601 3985 25619 31279 -46754 -71366 7127 37226 -843 12839 38593 -851 -10404 31745 -244
614 -244 -57090 -3918 55723 17448 -1677 16635 -34063 -62791 17330 45053 -23376 -25432 12068
627 12068 -17698 -16128 38168 6316 -48609 1446 39171 -6667 -11242 16700 -9540 -6789 49138
640 49138 28196 -41078 -32924 1518 -169 20294 41883 1095 -32768 -7739 4320 -17774
652 -17774 -17389 2567 11199 20378 26035 -1642 -44624 -46589 -2981 30543 28244 16896 849
665 849 -26544 -23277 14252 13667 -14750 3099 27501 6584 3807 19334 -15938 -35408 17787
678 17787 31937 -13830 -8514 9210 -26914 -15905 40827 8499 -47916 -14852 4389 -25620
690 -25620 9672 47841 -7796 -29524 22343 6778 -35191 8057 32776 -5270 17545 55039
702 55039 -4671 -48831 -7250 1826 -14118 28060 37277 -27382 -35997 6523 -9207 -29655 3173
715 3173 4555 -21762 8763 35563 -6759 -28015 4001 9367 789 24096 21374 -16840 -7786
728 -7786 31185 20197 -8576 -6848 -13444 -25106 5943 32522 2021 -23820 -8531 -6336 -17695
741 -17695 -4613 -942 -20224 -4085 33501 21445 -12241 -13176 -11364 -13017 18546 40842 9958
754 9958 -11634 6333 8601 -3848 4212 -36 -21183 -4236 27928 13101 -15251 -15317 -17329 -19775
768 -19775 3073 11608 -13386 -17341 6985 12912 5327 3457 -9841 -19964 4082 30150 22960
781 22960 7627 2658 -3073 -625 10674 4064 -13694 -10294 6742 13348 8111 -7503 -28337
794 -28337 -30482 -8717 8019 5164 -3559 -7364 -3340 7461 10787 -1427 -12434 -5402 14295
807 14295 29368 26139 6944 -9487 -8936 2804 9547 2761 -9501 -10936 923 9318 706 -18147
821 -18147 -29990 -23202 -1693 14490 10842 -2772 -8383 -1619 8786 10102 -456 -7931 1345
834 1345 19668 28646 18386 -4119 -18848 -12108 3948 8715 1065 -7639 -9397 -1827 5729 -2103
848 -2103 -19103 -23277 -10441 7073 18101 13624 -2771 -10896 -3251 4403 3912 1566 848 4628
862 4628 14278 17374 5000 -9866 -13869 -7881 3185 10860 7127 -1501 -4325 -2587 -2113 -5387 -11492
877 -11492 -11447 -382 9873 9750 3138 -6333 -14007 -8414 3205 4173 1166 3680 4286 6742 14792
892 14792 8391 -11656 -13896 832 9182 15069 18146 691 -17012 -8069 910 -7693 -8260 -3474
906 -3474 -9666 -2856 16492 5829 -22217 -22171 -7840 -255 16789 26585 3645 -12364 5392 14502
920 14502 2826 3295 5289 -5557 2494 23444 10655 -18127 -16556 -4717 -8610 -5181 1910 -13566
934 -13566 -20291 7567 19326 -6926 -18103 -5923 -5711 2486 30101 23343 -9965 -1484 21592
947 21592 2630 -11015 4572 -5222 -13542 26718 34601 -22006 -37108 -7090 -13854 -11362 29055
960 29055 11249 -37283 -5815 28914 -10042 -15803 19619 -7144 -22305 39403 39728 -28394 -14830
973 -14830 23912 -12274 -12458 35837 -1002 -46065 11305 33870 -22325 -9832 25452 -24529
985 -24529 -35207 30750 17304 -32327 10911 35818 -19023 -14749 23846 -18841 -36880 30884
997 30884 35590 -18317 302 18701 -33109 -29901 28597 10114 -23149 20206 30920 -20571
1009 -20571 -12654 18517 -19100 -28467 33048 34564 -15911 -3323 10825 -33469 -25305 33733 14310
1022 14310 -30058 1334 14290 -27298 -6974 36386 -5979 -32974 21136 23334 -24243 2638
1034 2638 30729 -14093 -8237 45543 5528 -50366 -6977 15961 -18645 14533 49283 -20890
1046 -20890 -55175 3388 2926 -31308 15806 39313 -13710 -6425 31471 -18415 -48224 15710
1058 15710 36087 4515 25732 27427 -38286 -40007 20324 15140 -10676 12774 6585 -29600 -8597
1071 -8597 16982 -15001 -22631 15405 15816 -7924 -1721 -2653 -18853 3812 39325 25760 -9538
1084 -9538 -20257 -17574 -7954 17594 33539 13698 -14974 -18473 -11795 -15965 -11692 8547 15371
1097 15371 8509 11312 1357 -32013 -33529 6258 24973 20755 25569 6609 -32754 -23097 13155
1110 13155 8123 -10 19332 7713 -22303 -7904 5964 -17338 -9546 25440 11310 -16788
1122 -16788 -4805 -4997 -21232 8927 40448 10494 -17701 -7690 -13954 -19973 18122 37500 4249
1135 4249 -9200 3224 -15934 -30801 137 16849 1980 12649 25270 -10827 -38164 -13563
1147 -13563 3905 3020 26997 34412 -10801 -32090 -3282 1991 -8824 15434 22377 -13477 -13388
1160 -13388 14924 -5048 -24966 8254 18001 -9711 1620 14386 -23193 -24436 27093 25986
1172 25986 -7540 4278 1937 -33874 -10871 35530 11934 -12357 13035 2017 -31474 -5841
1184 -5841 13777 -16907 -4876 36796 11278 -23887 -4601 -5803 -26324 10530 41409 2742
1196 2742 -15852 8998 -2697 -19159 11238 15728 -17438 -4920 22626 -1254 -17713 3544
1208 3544 -1192 -16271 7899 17298 -14615 -16932 10195 7174 -1302 11901 1989 -22912 -7320
1221 -7320 18571 8797 210 10152 1120 -12692 753 6628 -12421 -10644 11319 10196 -610
1234 -610 1878 -7105 -22816 -8077 14344 7483 -2239 3504 -761 -7240 5587 9137 -8443 -8149
1248 -8149 9928 10474 4323 7536 -1008 -14382 -3447 9460 -905 -7988 -432 -538 -1589 7081
1262 7081 1575 -16351 -13650 2460 5943 6254 8528 -476 -7085 2889 7744 -1627 -4158 1965 4442
1277 4442 8536 11675 383 -13211 -10415 -1281 1794 2562 181 -5523 -4278 2329 1312 -5834 -8456
1292 -8456 -4920 2508 10604 11051 2429 -4072 -2784 1758 4349 2788 -1033 -859 4005 6526 2777
1307 2777 -5248 -11593 -10267 -1750 4827 4157 -325 -3969 -3783 177 2219 -1189 -4231 -1047 5536
1322 5536 10177 9029 1324 -6380 -6878 -1473 3544 4401 781 -2892 -1804 1190 294 -3943 -7426 -6878
1338 -6878 -96 7910 8696 2450 -2964 -4181 -1826 2401 3128 -478 -1369 2484 5159 3442 -2125 -8608
1354 -8608 -9138 -1629 5293 5091 1016 -2554 -2685 1380 3362 -1153 -4764 -1551 5162 10613 9363 -422
1370 -422 -9229 -7169 23 3377 1899 -3226 -6792 -1435 5797 2126 -6657 -9532 -7091 1006 12143
1385 12143 11484 -534 -4604 849 3175 4106 4557 -2281 -5231 5492 10980 993 -7215 -9207 -11623
1400 -11623 -5495 6022 3066 -6577 -3165 2419 -1109 -961 1269 -4260 -2425 12213 14637 2762
1414 2762 -554 946 -3140 94 7358 -458 -9513 -987 5134 -2844 -5540 -3976 -11446 -10672 5519
1429 5519 8097 -3693 -1430 6266 862 973 9041 103 -10046 4596 16001 5520 2399 5035
1443 5035 -10468 -17232 2435 7043 -7164 -1333 6709 -8378 -10306 5005 -4108 -15202 5924
1456 5924 16423 210 2943 11448 -8066 -12363 13287 11811 -7018 3497 8495 -11613 -5593
1469 -5593 13399 -4020 -16883 3842 3644 -14787 -954 11195 -7653 -4476 17083 1059 -18451
1482 -18451 -96 8252 -2356 12640 22577 -6769 -19517 1045 1070 -7983 8849 12806 -8076
1495 -8076 -4807 8736 -8779 -20453 283 9255 1849 10587 11113 -14375 -19054 5310 10966 1967
1509 1967 7159 4310 -12952 -7356 10846 3092 -7827 3515 5618 -8108 -4330 4674 -5135 -4428
1523 -4428 15367 12268 -9252 -10079 -4591 -9028 3551 22773 9713 -10939 -6211 -4365 -13926 -3005
1537 -3005 12902 4903 400 9869 -736 -19452 -10491 4939 5669 12619 18252 -1535 -18186 -6845
1551 -6845 3600 1578 7265 10012 -4262 -10965 -1641 -711 -6432 92 6961 564 -4602 -2667 -5585
1566 -5585 -7753 4700 16686 9751 -2660 -5710 -8201 -7974 7615 20149 9043 -3709 -2695
1579 -2695 -8042 -15617 -2516 9754 1328 1028 10137 -4028 -20717 -8221 2200 -2266 11045
1592 11045 21389 -2814 -17216 476 2864 -5610 11308 16927 -8005 -9026 9538 -2180 -12871
1605 -12871 7414 8709 -10472 -783 8290 -14517 -14827 13763 10891 -5752 4296 1472 -21256
1618 -21256 -7576 19873 8369 -3335 10120 1652 -18250 -2862 10701 -6375 -3512 18860
1630 18860 7146 -13264 -3138 -1587 -15817 793 22849 4372 -11544 1749 -1188 -13714
1642 -13714 4213 15026 -6995 -8833 11436 2281 -12024 4219 7223 -10877 -239 15816
1654 15816 -4870 -15239 6886 7804 -5753 7930 11213 -15701 -14090 11354 4725 -5969 10683
1667 10683 7035 -15869 -5194 9751 -8674 -11189 12736 8432 -6919 5501 5039 -17857 -8658
1680 -8658 15054 4899 -3938 9778 2431 -14233 852 11284 -7098 -7487 9694 2095 -6931
1693 -6931 5879 2805 -13867 -3366 11058 -1081 -6192 4767 -396 -6986 7525 10079 -7548
1706 -7548 -7665 3989 -237 -1902 8482 3867 -8165 -945 6236 -3701 -6557 1639 -134 -1886
1720 -1886 7741 6575 -7491 -8213 898 281 293 6813 3156 -4876 22 4879 -2576 -5657 44 294
1736 294 -246 6156 4736 -5861 -6296 922 533 -634 2987 505 -3678 1959 5969 -505 -4053 -1055
1752 -1055 -1297 -478 4930 3828 -3080 -2692 1376 -228 -1684 -519 -2477 -2585 3474 5702 769 -2509
1768 -2509 -2722 -2861 -145 3707 2332 -745 258 1902 957 -484 -2355 -4152 -1662 3136 4401 1612
1784 1612 -1813 -3677 -2300 777 1533 -150 -887 188 2367 3767 1333 -3231 -4593 -1826 1861
1799 1861 3873 2621 -1384 -3048 -549 1129 -235 -2181 -2838 -1222 3001 5279 2129 -2678 -3749
1814 -3749 -1734 1327 3195 1793 -935 -681 1705 1893 -565 -3570 -4392 -1435 2885 3961 1096 -2203
1830 -2203 -2750 -764 1222 648 -1208 -1197 1414 4025 3902 190 -3858 -3912 -447 2581 2934 571 -2126
1847 -2126 -1757 927 1135 -1803 -3791 -3003 332 4338 4807 592 -3116 -2687 -296 1907 2516 365
1863 365 -1291 721 2776 1508 -1035 -3519 -4312 -967 3194 2786 -150 -1319 -1793 -1556 536 571 -1837
1880 -1837 -721 2681 3213 2287 1234 -2219 -3960 -133 2522 635 201 965 -967 -1032 885 -1770
1896 -1770 -4875 -1350 2562 1993 2138 1750 -2797 -3855 1417 2945 -198 -33 1092 -351 1487 3967
1912 3967 -724 -5534 -2508 863 450 2032 2380 -2489 -3426 1941 2099 -2623 -2174 16 -393 2938
1928 2938 6778 883 -5936 -2930 714 -227 2347 4331 -1354 -3418 2219 1040 -5045 -2498 1403
1943 1403 -698 1825 6003 -928 -6746 -353 3179 -727 1156 3079 -3271 -2734 5678 2993 -4463
1958 -4463 -836 1662 -3107 -360 4534 -2052 -4737 3798 4305 -3040 -2230 -952 -5181 -27 9571
1973 9571 4669 -4044 -1954 -1321 -4543 801 5736 -6 -1957 3912 2162 -4291 -2765 -806 -2743
1988 -2743 1730 7458 1905 -5268 -3225 -667 -1236 2113 4271 -1238 -4104 593 2132 -972 5
2003 5 1834 -1089 -1704 2140 767 -3175 277 4919 2156 -863 -462 -3861 -5855 1449 6942 2223
2019 2223 -1216 -345 -3922 -5870 587 3260 -990 1025 5343 303 -4400 -1381 -1295 -2790 4639 9176
2035 9176 980 -4294 -824 -1641 -3028 3501 4770 -3413 -3799 2266 -531 -4058 1085 1511 -3862 7
2051 7 4664 -2532 -5653 2801 4781 411 3404 3349 -6710 -6039 5577 5239 -505 3537 2254 -7951
2067 -7951 -4891 3805 -2290 -5433 5615 5717 -4521 -1647 1263 -8511 -5314 10258 7040 -3139
2081 -3139 2600 2434 -8410 -1820 9524 -138 -5283 6379 3405 -8296 -533 4495 -7244 -3620
2095 -3620 9901 496 -9738 1212 2929 -6349 2967 11029 -4254 -8598 5011 1942 -5835 5993
2109 5993 8415 -6363 -3091 7268 -4006 -9881 4448 5247 -4110 4036 7066 -9568 -10303 5135
2123 5135 2910 -2878 7407 6075 -8679 -3913 6600 -2508 -5859 6620 4553 -5328 1888 4759
2137 4759 -8487 -6464 7506 2952 -4569 3433 2055 -8721 -799 9603 -354 -5076 4414 945
2151 945 -6857 2776 6904 -4437 -2470 7305 -885 -8298 668 1044 -5719 3197 9493 -3182 -7473
2166 -7473 1423 -948 -4400 6172 7641 -3782 -1562 5562 -1989 -5477 3415 2388 -3501 3445
2180 3445 5753 -5382 -6618 1592 -556 -2769 3878 1892 -6481 -2051 4618 155 -1333 3552 219
2195 219 -3754 2288 4384 -1487 -652 4100 745 -2360 361 -1318 -4819 121 4873 986 -2121
2210 -2121 -1378 -3386 -4157 1227 3729 321 -73 1998 223 -1492 283 223 -1276 1637 4436 1553
2226 1553 -1770 -1411 -1473 -1342 1437 2103 -1546 -2726 -110 724 -80 476 -335 -2404 -860 2049 1317
2243 1317 -377 473 941 286 751 270 -2183 -2014 1361 2922 1731 197 -1698 -3028 -1262 1402
2259 1402 1248 -198 -113 513 566 253 -697 -1988 -1614 1141 2895 1616 -721 -1802 -1558 -317 1067
2276 1067 728 -990 -1177 851 1829 892 -299 -1561 -1928 136 2290 1422 -469 -438 91 5 414 -220
2294 -220 -2041 -1550 1201 2008 702 -260 -1419 -2045 -231 1535 530 -471 362 1011 804 571 -670
2311 -670 -2161 -1041 1397 1798 817 -134 -994 -1029 174 616 -631 -1225 -181 1069 1556 895 -834 -2174
2329 -2174 -1359 663 1672 993 -154 -529 -70 546 347 -687 -1593 -887 941 1894 1255 -227 -1562
2346 -1562 -1534 92 1113 487 -203 -80 389 841 815 -698 -1927 -1104 526 1186 1037 183 -1050 -1002 251
2365 251 305 -620 -601 54 803 1755 1209 -919 -1775 -531 443 845 1039 -29 -920 258 1087 -286 -1509
2384 -1509 -1364 -913 593 2256 1121 -1331 -1558 -362 177 814 806 -782 -897 1402 1934 81 -947
2401 -947 -1251 -1383 211 2142 848 -1135 -637 208 -123 1 -141 -1510 -943 1708 2192 324 -673 -944
2419 -944 -1379 -109 1728 664 -776 348 1009 -243 -646 -480 -1646 -985 1873 2056 -365 -870 -304
2436 -304 -911 -113 1384 39 -1540 390 1728 254 -110 106 -1438 -1325 1344 1189 -914 -378 732
2453 732 -211 71 872 -1209 -2565 179 2109 1116 673 373 -1744 -1855 683 980 -498 235 1278
2470 1278 202 -145 68 -1426 -2246 229 2404 1413 79 -395 -1473 -1446 685 1454 -304 -749 672
2487 672 407 -444 349 133 -1529 -507 1793 438 -1540 -192 640 -254 1045 1754 -1715 -3006 590
2504 590 1518 26 1504 1566 -2183 -2077 1267 -279 -2124 1418 2522 -526 266 1121 -3216 -3650 2235
2521 2235 2954 -158 1323 1253 -3480 -2161 2741 480 -2120 1843 1962 -2337 -444 1911 -2434 -2515
2537 -2515 3455 2286 -2559 -218 945 -2842 -150 5060 575 -3767 373 816 -2865 1132 4509
2552 4509 -1229 -2773 2350 -116 -4675 210 2878 -1501 717 4842 -1744 -5830 640 1989 -1763
2567 -1763 2722 5115 -2677 -3926 2554 -112 -3908 2342 3738 -2831 -808 3450 -3139 -5146 3089
2582 3089 3067 -2535 1088 2526 -4747 -2754 5517 2068 -2646 2411 1449 -5001 -363 4997 -1125 -2437
2598 -2437 4117 840 -5207 -643 1368 -3945 -52 6522 467 -4578 97 -541 -4208 2424 6579
2613 6579 -485 -2026 2658 -885 -4197 1873 3252 -2082 470 3898 -2349 -5010 687 696 -2287 2198
2629 2198 3241 -3557 -3539 2303 839 -1162 3263 2418 -3244 -959 2953 -806 -1574 3364 2006 -2338
2645 -2338 -125 334 -4254 -2197 3713 1854 -1370 554 -980 -4688 -796 3752 967 -264 2643
2660 2643 430 -2630 332 1510 -1553 121 3605 688 -2084 -300 -1013 -2849 578 2716 -762
2675 -762 -2054 132 -533 -1127 1672 1796 -1116 -610 1523 124 -601 1299 990 -429 702 912 -1711
2692 -1711 -2294 5 684 406 878 -112 -2325 -1896 327 813 396 968 913 -63 194 726 -371 -941 586
2711 586 1582 681 -15 -396 -1501 -1402 406 715 -783 -971 -186 -237 46 925 173 -1076 -33 1314 581
2730 581 284 864 277 -173 845 559 -1341 -1332 134 208 135 488 -615 -2023 -1030 506 109 -118 548
2749 548 339 16 904 860 -708 -604 900 985 598 733 -161 -1337 -681 523 -255 -1033 -413 -320 -482 445
2769 445 560 -876 -1033 338 590 402 857 593 -302 299 1068 37 -866 -170 18 -85 595 463 -1059
2788 -1059 -1291 -144 -126 -357 74 114 -273 505 1082 3 -767 -100 254 414 1105 708 -573 -629 164 -8
2808 -8 -397 -359 -548 -387 393 788 -142 -881 -627 -222 365 802 544 -184 -106 525 500 -38 -399 -595 -268 475
2830 475 706 49 -726 -756 -403 -15 60 -61 -255 -31 558 677 52 -470 -380 65 673 824 304 -308 -274
2851 -274 95 -3 -315 -502 -580 -50 555 488 -317 -754 -594 -119 442 572 77 -121 271 476 340 -3 -447
2872 -447 -571 100 826 522 -33 -524 -646 -257 153 77 -434 -290 257 451 361 31 -600 -660 90 567 519
2893 519 230 -34 -251 -5 267 -84 -532 -297 195 498 534 5 -609 -567 -51 300 116 13 10 -44 200 270
2915 270 -188 -715 -445 236 584 465 86 -377 -429 99 329 -18 -272 13 210 330 365 -65 -684 -473 241
2936 241 361 77 -45 -251 -309 251 418 -276 -707 -195 233 348 543 332 -468 -446 195 213 -106 104 152
2957 152 -47 353 508 -506 -995 -245 349 257 473 328 -569 -724 252 300 -236 134 333 -119 147 602
2977 602 -265 -931 79 571 -84 -73 270 -646 -474 867 522 -742 -316 220 -543 -21 1101 122 -860
2996 -860 283 459 -868 -269 602 -322 -155 1417 252 -1554 -592 203 -572 355 1619 -179 -1285
3013 -1285 296 260 -956 234 1131 -536 -323 1317 -14 -1631 153 802 -543 174 1089 -939 -1567
3030 -1567 901 762 -674 418 738 -1329 -793 1303 343 -800 974 886 -1189 -465 796 -868 -773
3047 -773 1669 973 -1120 -210 110 -1686 -504 1883 471 -915 606 386 -1471 -190 1290 -465
3063 -465 -341 1697 340 -1620 -54 576 -973 167 1788 -407 -1758 253 284 -1012 568 1399
3079 1399 -1071 -1089 999 72 -985 947 1191 -814 0 1071 -961 -1325 1027 932 -508 607 529
3096 529 -1712 -1281 974 294 -458 981 531 -1229 -358 782 -566 -505 1343 746 -672 221 261 -1128
3114 -1128 -311 1316 296 -702 161 -91 -982 107 973 -331 -603 479 38 -748 338 594 -299 262
3132 262 882 -144 -1059 9 309 -158 501 909 -480 -1029 302 126 -163 709 621 -372 -262 33 -277
3151 -277 -572 246 310 252 196 345 -575 -1014 275 152 390 19 -15 -841 72 266 272 74 78 272 -261 -99
3173 -99 399 119 -266 220 634 -35 -351 -137 1 153 146 318 -513 -989 -280 -74 -484 296 525 -72 84
3194 84 -231 -365 -631 300 229 223 299 128 -432 -502 386 199 -32 213 -84 -303 -102 311 -29 -500 214 142
3216 142 -245 205 230 -133 -147 624 362 -247 81 58 -419 -2 643 56 -412 57 -77 -514 12 273 -303
3237 -303 -169 458 130 -396 -69 5 -261 238 679 156 -289 27 44 -228 149 239 -264 -149 308 68 -353
3258 -353 -33 5 -266 10 370 -81 -286 194 172 -52 191 170 -309 -169 367 271 -81 29 -28 -299 -139 151
3280 151 -128 -231 137 167 -24 -59 -12 -289 -90 360 219 -43 11 20 -169 21 182 -69 -251 84 197 55
3302 55 70 -83 -266 -160 153 123 -115 30 35 -17 82 95 -138 -186 46 201 98 84 -13 -118 -105 126 55 -91
3326 -91 -89 -35 49 55 43 -94 -189 -37 154 158 47 21 -66 17 61 32 -103 -108 59 167 86 88 -60 -202 -24 73 70 -21
3354 -21 -52 -58 -11 128 82 -121 -184 41 90 82 144 -50 -109 -29 73 8 -7 -67 5 17 154 89 -63 -228 -119 -3
3380 -3 77 22 -30 -67 35 97 -16 -121 -81 -35 79 162 151 -72 -109 -65 9 68 -36 9 -47 39 127 3 -149 -152 -14
3407 -14 43 92 72 -45 -89 29 73 -38 -49 -34 -52 103 157 -29 -199 -111 -30 -76 79 62 -115 -85 120 101 -94
3432 -94 -62 -74 -140 25 302 67 -153 -32 2 -145 20 25 -228 -149 267 169 -135 -50 -172 -265 27 332 64 -122
3456 -122 101 -37 -162 68 132 -225 -135 301 23 -259 5 -7 -204 98 344 -150 -333 128 89 -129 208
3477 208 190 -340 -146 358 82 -194 236 174 -262 71 265 -402 -382 368 210 -171 205 51 -640 -218 471
3498 471 93 -160 299 111 -463 95 384 -319 -196 527 137 -334 250 101 -638 -62 612 -57 -399 178
3518 178 -54 -483 320 519 -323 -208 400 -147 -370 431 324 -398 153 515 -375 -584 270 66 -229 469
3538 469 479 -662 -461 314 -107 -218 584 296 -493 100 377 -383 -465 502 206 -187 372 288 -775 -428
3558 -428 557 50 -218 344 3 -747 21 612 -130 -180 499 -87 -502 279 361 -370 61 678 -63 -573 151
3579 151 -147 -525 349 741 -187 -276 87 -384 -492 390 440 -229 57 435 -191 -423 137 105 -131 426 518
3600 518 -379 -534 13 -1 -135 343 207 -455 -304 214 -17 -134 278 194 -233 34 204 -243 -300 282 405
3621 405 22 84 -50 -553 -260 390 380 -68 14 -49 -511 -263 263 108 -106 347 353 -257 -251 24 -214 -121 596
3644 596 417 -356 -214 31 -248 -62 489 104 -436 -7 230 -285 -95 317 -72 -202 308 169 -572 -166
3664 -166 456 81 -64 329 -127 -709 -12 511 -76 -32 375 -151 -572 153 243 -370 85 663 36 -248 233
3685 233 -156 -614 229 777 -88 -245 190 -304 -594 372 404 -469 -115 452 -281 -360 457 37 -505 339 566
3706 566 -375 -313 385 -42 -270 581 264 -685 -250 347 -174 -70 544 -37 -661 185 330 -441 -174 526
3726 526 50 -188 485 48 -684 -22 476 -20 -24 439 -160 -538 203 255 -366 -85 331 -153 -221 383 8
3747 8 -536 90 421 -117 -175 312 -198 -258 449 405 -324 -189 169 -115 -51 398 5 -389 71 264 -196 -166
3769 -166 116 -104 -136 418 238 -314 -183 87 -129 49 327 33 -331 69 157 -156 -123 49 -88 -46 312
3790 312 190 -206 -142 63 -69 22 169 -63 -236 126 269 -43 -121 -70 -207 -40 273 110 -163 -79 70 -1
3812 -1 15 14 -92 -94 162 255 36 -51 -136 -134 38 104 30 -119 -94 12 -11 -9 -110 -219 -107 51 191 103 -72 -149 8
3839 8 94 117 52 -121 -86 150 139 42 -137 -195 -77 44 188 92 -108 -103 -24 81 22 -30 -46 -54 167 257 97 -66
3865 -66 -144 -103 68 113 9 -104 -102 27 52 -47 -95 -221 -96 140 209 81 -8 -22 -26 11 127 -5 -61 58 154 108
3891 108 18 -144 -225 -118 138 213 -65 -79 -17 -17 90 92 -111 -187 72 290 163 -15 -48 -198 -118 146 135 -135
3915 -135 -120 37 -47 132 163 -118 -325 76 204 108 94 108 -143 -101 202 -21 -286 38 92 -38 108 202 -244
3938 -244 -314 125 171 -59 110 126 -159 -52 321 -1 -332 90 160 -39 97 195 -278 -345 200 112 -242 -13
3960 -13 24 -307 -6 435 -60 -412 32 77 -152 223 388 -206 -189 335 76 -372 -1 78 -258 163 550 -204
3982 -204 -601 -26 -14 -371 220 464 -299 -239 349 -4 -358 271 278 -301 208 571 -276 -457 241 130 -261
4003 -261 220 226 -563 -243 416 -52 -368 290 63 -474 137 526 -246 -202 523 221 -311 218 85 -527 -1
4024 -1 641 42 -365 68 -164 -536 110 507 -248 -179 419 -5 -376 124 139 -329 166 676 -20 -404 144
4045 144 -22 -367 235 392 -319 -375 174 -59 -289 173 181 -344 -50 362 -192 -298 320 299 -76 193 215 -463
4067 -463 -404 332 250 -73 178 36 -565 -272 306 -94 -282 269 255 -199 -78 135 -287 -222 475 401 -49 35
4089 35 8 -338 -93 429 133 -275 -31 56 -240 -140 231 -54 -233 259 228 -387 -161 225 52 26 441 118
4111 118 -520 -176 342 -4 49 361 -16 -479 -32 171 -431 -188 506 139 -274 208 10 -648 18 616
4131 616 124 -42 410 -110 -607 188 508 -303 -122 487 -183 -464 248 69 -574 47 645 -233 -419 254
4151 254 -61 -459 508 647 -434 -264 394 -158 -323 547 265 -499 -14 402 -486 -433 455 36 -383 449
4171 449 320 -718 -339 399 -45 -194 633 222 -661 47 380 -443 -214 575 -36 -460 400 194 -695 -207
4191 -207 524 -135 -285 437 -39 -626 198 508 -290 -167 427 -208 -413 469 309 -482 67 515 -270 -357
4211 -357 313 -60 -438 349 449 -339 -168 224 -242 -254 588 237 -419 50 297 -327 -212 336 -41 -308
4231 -308 386 257 -407 -149 277 -189 -71 354 -32 -421 90 250 -149 -52 258 -183 -243 216 160 -208 -33
4252 -33 285 -104 -139 187 -99 -296 84 340 6 -6 63 -253 -230 206 226 -141 3 150 -22 -47 91 -41
4274 -41 -206 95 264 -16 -6 -8 -186 -151 204 166 -129 -83 73 -22 7 79 -69 -159 17 81 -1 -30 10 24 -22 74
4300 74 37 -144 -41 57 142 87 52 -98 -102 -27 76 -1 -90 -47 52 6 -21 -5 -116 -44 102 165 62 -48 -56 -27 -16
4327 -16 24 90 -30 -73 38 100 72 -2 -115 -204 -2 73 -39 -5 -20 -33 -30 52 57 -45 -45 139 188 43 96 -17 -154
4354 -154 16 55 11 -43 -37 -30 8 38 4 -130 -80 71 101 30 57 -32 -83 74 80 8 -45 -28 19 39 111 -44 -182 -132
4382 -132 71 20 17 18 -15 -63 35 88 -7 -20 25 -13 105 101 32 -85 -70 55 22 69 44 -53 -69 75 74 -111 -64 10 -17
4411 -17 113 164 84 -46 27 78 -25 -20 -6 -50 -20 113 27 -187 -68 -72 -126 -41 141 -89 -105 68 50 -115 7 49
4437 49 -68 70 267 44 -152 -6 39 -69 -55 121 -158 -201 42 49 -110 -29 1 -218 -47 307 53 -126 73
4460 73 115 -94 42 185 -143 -113 158 108 -126 -4 -4 -293 -122 129 -66 -187 85 51 -168 -9 62 -169 -104
4483 -104 304 139 -22 59 111 -151 0 249 -63 -153 35 24 -199 39 124 -247 -73 214 -4 -143 26 99
4505 99 -103 164 269 -130 -168 75 136 -87 134 108 -231 -217 75 -15 -140 69 48 -122 7 74 -225 -228 86
4528 86 193 24 177 122 -173 -157 96 110 -113 31 94 -100 -57 47 -43 -179 101 173 -104 -80 39 -81 -40
4551 -40 209 180 -95 -65 45 -80 23 222 66 -120 20 79 -137 -157 115 98 -46 111 119 -322 -185 168 80
4574 80 15 252 32 -260 -97 221 -51 -66 263 61 -233 27 83 -234 -101 295 39 -218 110 16 -287 -38
4596 -38 350 69 -189 170 23 -310 141 336 -84 -69 226 -128 -384 92 126 -216 170 422 -193 -352 102
4617 102 8 -226 328 432 -245 -166 233 -127 -265 299 221 -310 57 327 -342 -315 289 109 -195 258 192 -449
4639 -449 -142 331 -18 -179 308 45 -520 11 378 -211 -110 397 -17 -420 100 123 -426 18 473 -106
4659 -106 -235 137 -121 -415 173 390 -179 -133 284 -82 -329 231 242 -199 53 369 -212 -306 196 4 -220
4680 -220 266 324 -323 -219 171 -41 -147 321 158 -351 -46 204 -200 -178 332 93 -228 94 121 -312 -97
4701 -97 313 37 -68 199 20 -367 33 191 -59 -96 236 -59 -278 92 110 -229 -7 248 28 -79 93
4722 93 -47 -204 112 270 -36 -92 34 27 -111 145 137 -148 -33 78 -21 -27 114 15 -83 38 58 -94 -62 89
4746 89 54 8 169 101 -161 -96 86 34 -29 39 65 -110 -24 28 -70 -118 13 50 -60 -9 22 -132 -52 94 76 -49
4772 -49 21 18 -23 77 4 -3 -69 -25 27 -75 -17 -7 17 -53 11 26 -44 -94 -4 18 85 115 5 -110 -30 81 24 -17 54
4801 54 -4 -98 52 84 -64 -49 12 12 27 81 15 -94 -73 27 31 -29 3 -27 -44 60 61 -30 -34 28 44 -9 41 -31 -107 26
4831 26 26 24 -71 -6 -31 -1 81 66 -40 -58 34 -26 -12 18 45 -86 23 76 -78 -19 -43 -82 -16 19 77 -28 -70 37
4859 37 37 41 23 -56 -46 74 96 -3 -123 -58 -82 -47 73 81 1 -22 63 50 26 -2 -39 -50 -8 132 -17 -55 21 -34 -58
4888 -58 42 66 -32 -56 17 51 -75 -46 -37 -85 35 18 -19 15 17 -5 -46 48 36 -86 -28 69 33 21 0 -38 -79 41 56
4917 56 -70 -83 -8 -11 50 -6 6 -114 -57 152 54 14 42 -31 -39 83 99 21 -64 12 -14 -18 45 -11 -90 -52 -9 16 -21 80
4947 80 -77 -19 112 27 -41 -26 37 -3 -31 166 41 -90 -36 23 -48 -25 95 -25 -21 32 37 -143 -28 79 -22 18
4973 18 57 -58 -119 105 37 -10 -21 93 -27 -19 90 -58 -36 -8 28 -55 36 48 8 -109 66 81 -26 -59 21 -63
4999 -63 -85 97 130 -13 -59 15 -65 -67 56 -14 10 52 65 -129 -108 42 12 34 69 49 -76 -86 4 -7 -95 103 56
5026 56 -77 9 71 -58 -116 68 70 -52 58 7 -117 -95 129 79 11 55 11 -150 -31 173 48 -29 64 18 -159
5051 -159 -20 62 -72 -106 225 84 -243 -20 55 -141 7 262 51 -170 44 80 -201 103 249 -75 -98 152
5073 152 -94 -268 50 106 -127 13 228 -156 -279 126 151 -99 78 192 -243 -172 170 36 -158 228 187
5094 187 -217 -62 233 -155 -245 283 139 -197 41 49 -336 -125 366 60 -161 185 137 -306 5 291 -86
5115 -86 -124 243 98 -313 36 182 -229 -3 324 -103 -317 39 35 -185 111 316 -157 -200 193 8 -235 208
5137 208 255 -203 -88 236 -215 -259 207 130 -213 135 213 -248 -169 234 29 -184 183 178 -265 -73 258 -164
5159 -164 -218 211 68 -193 60 194 -229 -60 273 -40 -200 132 27 -219 -7 216 -110 -144 125 -3 -180
5180 -180 32 151 -131 -76 191 13 -187 104 21 -138 78 172 -129 -128 62 -61 -107 117 108 -63 -22 125 -59
5203 -59 -96 76 42 -95 62 74 -40 -112 76 60 -51 39 -16 -138 -1 101 28 -141 -24 35 -100 6 77 -61
5227 -61 -74 53 14 -14 -25 15 -71 -7 115 79 -73 7 66 -122 -22 64 35 -120 -8 55 -47 -89 7 -9 -67 70
5253 70 35 -73 -63 110 -54 -20 81 17 -72 54 127 8 -50 22 -2 -43 26 71 -117 -71 79 -21 -4 40 -19 -61
5279 -61 12 145 0 -27 64 -6 -64 26 69 -64 -59 56 -32 -105 0 -32 -51 57 124 -53 -14 47 -9 -39 51 102 -31
5306 -31 -8 74 58 -36 4 -11 -67 17 82 -62 -15 67 7 -18 39 39 -96 -74 74 50 20 28 54 -93 14 79 -50 -78
5334 -78 3 8 -28 -5 36 -97 -33 79 43 -30 2 -17 -88 30 19 -18 5 -12 61 38 50 12 -9 -21 43 -26 -34 -17 -87 -45
5364 -45 -4 50 1 -88 11 -47 72 7 29 -50 -14 52 -27 -6 26 31 -29 61 33 -90 -54 14 -1 -10 42 -28 -37 46 20 -6 42
5395 42 0 68 44 121 37 -18 -37 37 -21 15 -71 -2 -30 32 -36 -16 -31 12 -43 5 30 13 -57 -45 -15 -69 -14 33 -35 -32 29
5426 29 38 -39 3 -55 -58 -83 51 12 -60 -20 23 25 10 -38 12 -1 49 92 -25 25 44 -15 -60 29 45 -34 17 18 0 -43 -17
5457 -17 -63 -60 59 84 21 -29 21 32 -4 11 -4 -77 -8 42 -14 -47 -56 22 -57 50 -11 -32 -67 4 14 -59 12 29 -49 -2
5487 -2 98 40 -3 32 51 -47 -23 23 -53 -58 68 64 -98 -49 22 -71 -34 105 -16 -22 7 23 1 48 83 -48 -49 82 67
5516 67 -104 -23 69 -21 -5 80 -91 -83 18 88 -19 1 128 -51 -137 77 57 -36 5 80 -60 -106 42 21 -131 34
5542 34 122 -90 23 57 -70 -107 109 71 -78 48 84 -108 -56 139 -5 -117 31 187 -169 -21 116 -118
5564 -118 -121 152 57 -165 24 121 -127 22 140 -35 -161 90 62 -143 69 131 -24 -97 117 29 -144 61 115
5587 115 -149 0 117 -55 -130 78 53 -124 58 160 -91 -80 153 -62 -140 110 102 -151 10 131 -105 -146
5609 -146 123 11 -143 84 79 -145 -61 132 5 -118 87 77 -172 -11 156 -116 -124 159 15 -63 11 75 -140
5632 -140 -17 187 -25 -88 69 8 -144 -3 87 -36 -24 164 -63 -94 7 18 -58 52 134 -15 -113 47 -27
5655 -27 -80 70 113 -88 -11 119 -5 -65 110 71 11 27 51 -50 -88 9 50 -22 10 21 -52 -107 103 102 -67 5 53
5682 53 -68 20 61 3 -24 103 142 -89 15 31 -3 -42 1 52 -70 -32 42 -39 -3 30 66 -79 56 23 -50 -17 31
5709 31 34 -35 47 38 -51 -41 54 4 22 29 -4 -52 -30 61 -2 17 67 51 -39 -3 -16 19 36 84 50 -8 40 -59 -66 37 31 35 -7
5742 -7 27 -49 -98 -35 42 -45 -7 41 -10 -36 -32 15 -23 4 59 -43 -76 -13 42 -22 52 20 -86 -100 25 -31 -36 7 -37 -37 12
5773 12 66 -2 -7 79 -17 -19 13 48 -23 -23 84 -43 -74 33 21 -73 16 55 -23 -2 97 10 -45 36 74 -7 -5 107 4 -65
5803 -65 -9 -29 -54 17 9 -56 -80 -19 53 -26 21 2 -91 42 64 25 -20 61 0 49 2 53 -16 -62 -7 6 -11 5 14 -40 -14
5834 -14 4 49 -34 29 -12 -57 9 -72 -29 -14 43 46 18 26 -47 -21 21 8 -23 -85 -39 -25 -26 -24 8 26 7 40 38 -12 62 -38
5866 -38 15 27 27 18 -11 22 19 -12 -16 14 -24 1 -33 -40 -7 -20 18 -25 11 2 -11 11 32 -16 -15 37 4 -14 31 52 -42 -31 7 -48
5900 -48 -29 19 10 -18 27 32 -32 11 39 17 -28 13 16 11 26 -26 -2 34 9 35 27 -24 15 28 28 -16 -13 -10 -7 41 54 1 10 -11 38
5935 38 34 9 51 -9 58 52 22 -23 10 -12 -28 24 -27 40 -18 1 -26 5 28 18 64 -39 -13 -26 9 36 26 22 19 62 -23 -36
5967 -36 68 -6 57 56 19 -40 -59 -1 -61 2 -6 25 -37 1 13 4 2 101 -17 86 27 -37 2 12 38 -68 -3 33 -47 31
5997 31 56 -27 -28 2 14 -88 -15 33 20 -39 74 11 -73 -23 35 -58 -25 56 81 -33 -10 2 -53 -49 0 -16 -53 65 24
6026 24 -27 16 45 -43 17 43 -47 -75 26 -18 -27 36 65 -28 -14 4 31 -97 -56 9 -59 -33 38 -64 -26 38 -30 -29 6 70
6056 70 -57 -60 -13 -41 -10 21 44 -58 56 -3 -48 -8 34 51 -80 19 -18 -77 -51 4 60 -19 23 -42 -98 -37 49 -3 -11
6085 -11 71 46 26 8 61 -6 12 13 -25 -14 12 1 -40 -11 44 -14 -65 16 -3 -40 70 37 -13 50 10 5 -26 -12 38 33 -19
6116 -19 70 -74 -23 11 34 -24 19 -13 -28 54 -38 2 -23 1 25 18 -50 23 -53 -12 14 14 -9 -18 21 -53 7 22 -1 7 25 -12
6148 -12 -7 -20 -15 15 -52 -23 -2 -42 9 6 8 37 -17 -17 -25 51 -31 19 47 -3 -18 66 11 17 21 8 -14 -22 20 12 36 -10 -46 58 36
6183 36 -49 -48 14 45 9 5 -16 19 -27 -42 11 26 -34 -17 -28 -13 19 -32 -33 -24 35 -16 17 -53 -16 -67 17 65 73 54 -27 -11 5
6216 5 -65 -19 -20 32 -28 23 29 -26 19 19 -11 4 23 -12 -86 -14 19 -8 -7 62 32 9 33 -12 24 -26 -72 -53 18 -2 1 -54 33
6249 33 -2 -4 26 10 -42 9 7 6 -34 -31 -26 -24 -10 60 50 -55 -16 24 -23 36 18 37 -62 -12 8 -14 -2 32 -7 6 -14 -36 -63
6282 -63 14 4 -30 -23 -17 -24 -30 7 31 -22 42 4 14 -33 -20 -28 11 3 7 18 -73 26 -10 21 -20 19 16 22 7 -4 -27 24 -2 -39 -35
6317 -35 -14 27 -14 -4 -45 4 12 23 -23 -28 16 5 -52 -25 -23 -22 -30 -23 -11 29 -5 -61 16 9 -27 2 -3 -38 10 -4 -48 -9 14 -1
6351 -1 -49 -17 0 4 4 26 -34 12 -31 30 -21 1 31 -25 10 -51 -23 -43 -14 19 -12 -29 -39 -20 -33 -5 17 8 9 -16 -21 -25 4 3
6385 3 -13 -1 -16 -29 -11 26 27 15 -43 -16 18 13 13 8 28 36 -38 -2 -37 -13 -38 -14 10 55 23 27 -17 49 -21 60 16 -17 7 -33
6419 -33 -16 17 -14 -31 -9 -2 30 40 33 -6 46 15 23 15 -5 -15 33 -28 17 12 -39 69 -5 -20 0 -28 -6 -13 19 -50 -32 -1 -6
6452 -6 -35 10 12 25 -2 -24 -18 45 -11 -24 -11 17 -11 -37 -10 -29 45 17 -8 3 -19 -24 -19 8 -11 19 -44 19 20 7 31 -54 -21
6485 -21 57 51 -50 -44 -21 -30 -29 63 -19 18 31 19 -10 91 9 -28 32 26 -47 5 43 15 -41 62 30 -54 -22 37 41 16 26 20
6517 20 -3 9 29 -3 -30 52 23 -21 3 20 -75 60 52 41 -25 -24 4 -19 -72 21 -41 -49 32 12 -20 42 31 -29 -38 41 30 21
6549 21 8 44 17 27 -11 -18 -1 14 -14 -3 29 18 -33 -18 8 -5 -47 60 -14 -58 55 82 -61 -46 22 13 -10 51 63 -99
6579 -99 -30 3 -18 15 35 4 -48 -55 3 -71 16 18 -23 -24 44 -19 -48 4 23 32 25 -11 0 23 -13 49 -16 -14 26 3 -45 17 28
6612 28 -2 2 57 -32 -2 11 36 -7 -26 15 28 -78 32 -5 -20 -32 16 21 -45 42 26 -19 53 -23 -38 -36 59 11 -63 33 43
6643 43 -23 -3 -14 15 -50 73 13 -20 -23 24 -24 -31 52 19 7 23 24 -69 -54 38 -18 -55 39 11 -47 14 -11 -41 17 43 17
6674 17 -57 116 6 -56 13 10 -49 -61 64 54 -60 52 73 -26 23 45 -9 -67 90 19 -22 9 48 -34 -77 5 42 -56
6702 -56 62 114 -9 14 83 -3 -71 12 -13 -20 35 16 -41 -69 47 -1 -61 5 80 -34 -62 73 -64 -72 50 45 -64 -7
6730 -7 81 -34 -39 65 -28 -6 31 36 -67 5 26 -74 -34 58 -21 -44 29 22 -37 -17 51 -91 -64 12 28 -57 94 -6 -38
6759 -38 -13 9 -24 -47 33 44 17 30 12 -50 -86 46 -6 -23 48 -6 -42 -31 31 -9 -22 41 20 -41 -27 14 -57 5 2 -4 -35
6790 -35 16 12 -26 0 35 46 4 -5 -34 -59 -35 63 -34 -61 24 -4 -63 43 37 50 58 56 6 -39 20 -8 -15 11 -27 -7 -19 48 38
6823 38 -71 -24 -8 -23 -7 46 63 -57 46 37 -83 -48 15 -10 46 33 54 1 -4 -96 -42 -45 -7 -2 -47 9 2 -32 5 31 44
6854 44 17 22 4 -3 21 11 -54 25 18 -4 -37 -15 12 -60 -20 -18 -2 2 35 -7 -4 -17 24 9 -24 -1 -54 27 -35 59 14 -35 29
6887 29 -49 -57 47 56 31 -5 13 0 -8 36 41 -47 -44 29 42 -27 28 26 -36 -6 60 15 18 -33 6 -3 -29 -16 -18 3 53 -6 -11 -14 9
6922 9 -28 -29 7 52 -26 -41 59 -24 37 26 8 1 19 -2 2 -27 33 -20 5 47 -76 55 33 -18 -9 34 31 28 -5 44 13 -38
6954 -38 8 -15 -2 47 -22 17 -39 6 -15 -18 22 -36 12 -12 96 -34 -3 51 -8 -35 26 -15 15 13 26 -52 -36 21 10 -52
6984 -52 35 -28 -34 7 85 1 -20 47 48 17 -4 73 -7 15 17 73 -45 68 48 -10 -20 -19 -49 -71 96 61 -6 42 -34 -57 -34
7015 -34 58 -30 -26 35 3 -5 -36 76 -35 -90 45 13 -36 -2 35 -31 -15 20 -58 -69 21 25 -62 -17 36 30 -41 36 -3 -29 1
7046 1 37 -45 -17 48 -28 -107 21 77 -35 13 39 40 7 69 -21 -10 19 31 -26 -10 17 -2 -35 -1 7 -106 1 -27 -29 -63
7076 -63 36 3 -58 -29 45 2 -61 15 47 -61 30 18 -45 -21 81 -24 -70 25 8 -64 -47 76 32 36 57 14 -53 -9 0
7105 0 25 4 43 -1 4 -5 52 -69 -1 107 6 -74 -3 61 -78 3 65 -38 1 69 -29 -45 22 62 -30 10 101 -17 -57
7134 -57 99 97 -40 -7 90 -51 -143 87 12 -88 32 104 -12 -22 80 -9 -105 63 126 -91 38 100 -51 -92 91
7159 91 12 -57 24 79 -93 -24 131 -42 -99 137 36 -91 45 87 -92 -48 167 34 -65 75 38 -129 -16 46
7183 46 -86 -90 74 9 -52 53 82 -152 31 114 -90 -111 41 -3 -36 15 113 7 -66 48 -16 -61 87 60 -118
7208 -118 14 64 -20 -33 83 -33 -55 17 62 -78 -78 129 -21 -45 55 41 -74 -56 23 -34 24 69 20 -82 12 27
7234 27 -57 -16 124 -2 -33 -21 19 -66 33 91 9 -47 5 -1 -89 12 48 -15 6 62 -20 6 22 40 -31 -24 54 -34 21 5
7264 5 11 -2 -10 52 -58 -54 84 -16 -56 43 1 -62 10 -4 -84 -21 14 8 -66 10 17 -44 -12 -48 -24 -41 -65 24 -4 1 -17 20
7296 20 -31 -7 20 -58 22 -24 60 -25 26 25 -30 -33 20 11 40 31 16 -31 1 27 14 41 -30 -19 -87 -14 7 -12 32 46 23 4
7328 4 58 20 5 -20 91 45 -21 15 4 -25 27 39 4 -2 -2 -12 -49 35 -49 -5 9 -11 -44 -35 -9 4 51 32 61 8 -60 31
7360 31 0 17 23 -25 -16 -9 -26 -35 -8 42 38 41 14 -51 -1 34 -24 -7 -13 34 42 -1 0 -25 -50 7 32 13 -4 70 56 -34 8 56 42
7395 42 33 39 62 -23 29 75 -14 -63 -11 0 -9 18 11 1 7 15 2 -3 -48 29 2 -17 30 -27 -75 -49 -65 -43 6 6 -56 8 40 -39
7429 -39 17 14 2 -56 57 -3 -11 -4 -4 -3 -9 19 40 14 -13 -35 -5 -18 64 8 -23 7 6 -40 -58 -19 -31 -34 -8 23 -29 60 100 -6
7463 -6 94 89 -17 19 36 15 0 24 33 -80 -43 36 -13 3 29 23 -52 12 12 -20 -26 5 -17 -7 -22 35 -57 39 5 -26 -84 21
7495 21 10 -53 11 -4 -25 -65 16 14 8 -13 -5 -26 17 63 50 -1 10 24 12 56 23 -30 -34 -21 21 -24 -23 -76 22 3 3 -14 -24
7528 -24 0 60 -7 -50 22 7 35 42 17 -51 -24 34 -65 -67 -5 1 -34 -31 -26 37 -40 74 23 -37 -29 39 -38 29 21 -24 -73 -24 -2
7561 -2 -18 -25 38 -51 -26 32 57 -24 -22 30 0 23 125 -51 26 19 -17 -38 31 35 -80 -40 49 -29 -51 62 35 -77 -10 56
7591 56 -42 -79 69 56 -42 43 84 -32 -30 45 46 -22 69 23 -93 35 50 -52 -39 102 107 -88 49 76 -72 -47 110
7618 110 37 -85 64 49 -103 7 105 -32 -29 40 -12 -97 -2 92 -95 -51 76 -22 -152 75 30 -142 62 99 -12
7643 -12 -54 84 4 -95 49 54 -99 13 86 -44 -54 115 29 -46 -6 76 -51 -53 63 35 -73 75 63 -118 3
7668 3 175 -46 -57 155 26 -96 7 68 -79 13 38 -6 -46 46 40 -116 -8 104 -69 -109 96 15 -89 98
7692 98 54 -55 -56 29 19 -84 28 68 -104 23 72 -39 -31 46 28 -87 48 65 -30 -15 58 2 -56 94 32 -71
7718 -71 -80 40 -63 9 71 1 -70 37 8 -72 -35 83 48 -35 73 18 -26 38 3 -88 -20 82 3 -61 68 72 -52
7745 -52 20 24 -49 -31 -34 13 -54 -7 85 34 19 -24 -9 -32 -13 42 10 7 -8 38 -36 5 9 -10 5 32 -16 -61 -30 -18 -6 -31
7777 -31 23 -8 -36 -17 30 -14 -67 33 -6 -14 61 44 -32 -5 15 -2 29 67 14 -38 56 17 -8 -14 47 -21 0 10 15 -48 26
7808 26 83 -70 -26 2 -13 -30 62 7 -11 -26 35 -25 -25 54 24 -41 -82 81 -68 -14 16 -14 -56 -11 93 -51 -18 11
7836 11 4 -88 21 39 -10 -10 75 -38 -70 74 -17 -4 43 34 -34 31 -6 29 -34 -31 23 11 -14 19 -15 -7 -5 26 -24 -14 51 -7
7868 -7 -21 18 -2 -59 -21 -9 -50 31 47 10 -41 10 -4 -51 18 26 -30 -5 58 -51 1 14 -13 -49 -9 59 -45 -42 41 -5 -54
7899 -54 15 -10 -74 27 1 18 -46 -21 33 7 17 65 3 -7 52 -49 52 31 -37 -14 12 68 10 27 -20 -26 -71 22 -35
7928 -35 -28 -10 47 -13 14 -9 39 52 -11 -26 25 5 20 -42 -27 -40 -10 -46 -14 -33 18 -3 -50 7 -19 28 51 -12 -30 27 -43
7959 -43 44 25 7 -38 36 23 -39 5 64 47 20 -5 -5 49 0 11 25 36 66 -40 42 5 0 42 8 47 16 -21 -18 13 33
7990 33 -22 13 -44 6 27 99 9 -49 23 29 11 4 17 -75 -18 3 -5 -26 -36 -25 4 20 19 -10 0 6 -16 -19 7 -5 -15 -27 2
8023 2 -24 -41 -6 -79 -46 28 -4 -53 -29 73 -3 -55 11 31 -27 4 39 -26 -15 -3 -34 -15 34 31 -72 -17 54 3 -71 41
8053 41 -3 -41 46 87 -51 -31 21 -14 -59 -10 -11 -54 44 64 -11 -27 32 57 -80 -23 74 -55 51 69 1 -131 2 67
8081 67 -26 39 93 -25 -58 48 -19 -93 44 97 20 22 119 -50 -10 78 37 -92 -51 77 -81 -23 109 13 -108 60
8107 60 55 -79 -13 36 -34 -53 64 45 -55 58 75 -29 -36 114 41 -36 32 30 -107 14 110 18 -40 85 14 -95 9
8134 9 67 -79 -46 71 25 -105 64 64 -22 30 98 -97 -30 38 32 -89 -38 42 -53 9 83 33 -37 67 55 -20 -2 91
8162 91 -74 -95 105 12 -17 63 17 -50 -47 79 -16 -70 68 -31 10 6 82 22 -21 84 28 -73 -4 0 -22 -33 36 -6 -62
8191f2
$$ Imaginary data points
##PAGE= N=2
##DATA TABLE= (X++(I..I)), XYDATA
0 0 0 0 0 0 0 0 0 0 0 -8 8 -8 10 -16 16 -24 32 -34 40 -50 64 -73 88 -104 120 -139 162 -186 217 -246 282 -322
32 -322 366 -412 464 -524 589 -658 737 -820 910 -1012 1122 -1242 1374 -1516 1675 -1845 2032
49 2032 -2239 2468 -2718 2999 -3308 3657 -4051 4504 -5022 5629 -6347 7215 -8286 9649
63 9649 -11446 13935 -17615 23627 -35097 64762 -303967 -558985 164336 83734 -37417 303653
75 303653 249862 -224540 17521 322522 25557 -41252 331329 209230 -48445 98073
85 98073 43811 -298459 -149035 147915 13950 -118380 -61905 -237890 -315750 3808 144784
96 144784 -59268 -54542 59826 -48930 -64916 128126 120858 29415 177320 243034 87
107 87 -125890 -14509 5355 -1142 154454 161122 -106030 -225567 -107483 -79660 -74004 73650
119 73650 83535 -89976 -73694 46429 -45605 -106418 50705 99450 29624 100783 93840 -103713
131 -103713 -97687 74770 40499 -6822 93932 4509 -169620 -43874 89713 -14782 4785
142 4785 102440 -61527 -149010 67781 103392 -63745 18777 132032 -21087 -75198 34105
153 34105 -50943 -135223 40849 118780 -26077 -55051 -17314 -110099 -108735 56934 98164 17070
165 17070 14531 32409 8931 26672 44705 5576 3109 62325 83999 34446 -38582 -74568
177 -74568 -44738 -102 4491 -22494 -71272 -101362 -45125 30585 15956 -23576 -22133 -35221
189 -35221 -18348 74833 92065 7479 10704 77726 59669 31250 32775 -35877 -69415 43133
201 43133 95838 -5274 -61698 -54736 -91201 -70423 16502 -5499 -68264 -12846 36726 -3828
213 -3828 -4113 17320 -26749 -16914 81369 96783 29931 14707 14172 -11204 14784 43860 -15956
226 -15956 -61698 -11647 25446 -462 -21192 -37570 -65396 -45733 11167 17342 -12528 -4125
238 -4125 19350 15522 17193 26127 -1600 -29709 3235 49451 44852 20204 1890 -28472 -37470
251 -37470 -647 10887 -23443 -22722 12976 14455 1794 3398 -20572 -46127 -12846 29080 24329
264 24329 19002 21570 -8591 -26309 3559 10562 -19133 -16618 8326 13115 20168 20939 -19735 -49059
278 -49059 -17788 15959 13991 13021 15363 3833 6109 20119 4404 -22921 -20111 -2397 11040
291 11040 24687 19358 -14931 -39042 -28175 -6972 1754 -1723 -8984 -3660 18969 29915 8579
304 8579 -20934 -25959 -3540 27198 41124 28083 5162 -5753 -2754 1220 -4515 -17268 -23091
317 -23091 -11625 10289 20417 3351 -28718 -44645 -27386 5104 21285 12544 -1548 809
329 809 17952 25214 8837 -12951 -16117 3751 31972 41507 18927 -13406 -26574 -19657 -7415
342 -7415 -939 -8771 -21965 -13766 13297 20788 -2630 -30050 -38962 -17291 24778 42007 15977
355 15977 -8580 -2111 12918 17595 9697 -12602 -24217 3636 37680 31542 467 -25754 -40400
368 -40400 -26843 9296 18498 -7468 -18800 -294 17971 18721 -1693 -34672 -39929 2450 44146
381 44146 39193 6120 -17110 -17617 105 15828 7439 -14997 -16245 11646 31781 16312 -14138
394 -14138 -31255 -27901 -1540 28569 19943 -15462 -16859 12502 20547 8316 -7084 -33963 -36450
407 -36450 15370 48950 17726 -10746 -9804 -17911 -13508 10930 -2880 -28229 6503 45419 24291
420 24291 -1877 -11725 -39732 -35375 27800 55343 20549 -494 -8053 -28667 -17384 15103 3070
433 3070 -21142 -864 18542 42 -13596 -9030 -13871 -13770 8672 18004 -2912 -13814 2776
446 2776 14081 14861 27554 21471 -25689 -40946 5580 26409 11062 28032 26254 -35568 -47450
459 -47450 -3987 -21994 -36861 35177 54460 -11074 -10112 512 -74433 -61771 62201 68133
471 68133 4420 33091 13255 -76262 -18803 74708 3282 -31484 53096 20799 -53718 15293
483 15293 21429 -84378 -23999 89564 362 -67219 8633 -22299 -71650 66574 112417 -51180
495 -51180 -75398 25012 -18288 -27860 103894 73903 -66369 -10567 55699 -55779 -66683
506 -66683 51741 24095 -24112 71798 47988 -120447 -99596 36243 17959 -1776 77245
517 77245 25705 -91636 -24235 55188 -27587 -34552 73110 39841 -40821 25304 32619 -86070
529 -86070 -41929 98570 38113 -58589 1609 -7386 -86036 20152 118867 -13305 -76144 27721
541 27721 -6392 -77823 46205 89296 -45732 -15163 88776 -29556 -102907 26716 25970
552 25970 -53057 65052 107759 -72246 -91751 27906 -32185 -56941 95860 72443 -75639
563 -75639 -7475 54184 -69784 -44347 94689 18827 -54174 62303 43503 -90004 -15806
574 -15806 69329 -34420 -34837 70972 -9332 -95816 14473 47381 -44808 1022 62449 -40596
586 -40596 -70949 37144 33105 -29669 29159 60479 -16487 -19907 29696 -18338 -52117 28556
598 28556 65112 7850 -6520 525 -55834 -69374 17008 50914 -5869 -14722 16160 -12535
610 -12535 -31243 12329 4921 -40506 9043 72574 23906 -21718 3218 -14532 -37513 32838
622 32838 62502 -17311 -36488 15956 -268 -19891 23221 4640 -52839 -9266 39940 -9242
634 -9242 -29527 10763 741 -11413 31052 16719 -49220 -31650 26366 25205 19642 29106 -8296
647 -8296 -40958 -7530 17456 -3774 -5994 16893 20120 11602 4675 -19312 -44789 -27528 22587
660 22587 44985 20364 -8725 -21633 -32079 -20780 16303 18270 -14127 -4562 22988 2255
672 2255 -13345 5275 -10023 -25830 23456 43312 -8659 -14961 17782 -3521 -7518 39227 13451
685 13451 -49148 -16284 24448 -7418 302 33385 -17876 -52072 3718 8799 -36621 -1276
697 -1276 37523 -2906 -4040 33171 -11746 -53022 4721 37957 11288 28418 37570 -23609 -36743
710 -36743 17042 12572 -19922 5168 15222 -17469 -4763 19875 -20194 -45088 -4317 12401
722 12401 -5566 5851 10018 -20486 -12304 29413 19730 -15267 -8176 4917 607 21786 40762
735 40762 5353 -26314 -6285 6433 -7709 -1964 5828 -11180 -5471 22048 4416 -35416 -30080
748 -30080 -8701 -4260 15467 29669 -3647 -27640 -2009 11983 -1588 3629 9784 -3726 8518
761 8518 35859 16428 -18816 -13860 -1066 -1900 11413 15937 -11283 -19579 4615 7912 -10645
774 -10645 -16037 -18722 -20335 3175 24909 9265 -12510 -11169 -4920 1310 13119 10791 -2376
787 -2376 4639 23143 22908 7633 -7836 -18495 -11730 11062 20339 5259 -11107 -14817 -10645 -4464
801 -4464 -5232 -16563 -21482 -7434 12180 18534 7184 -10646 -16621 -3841 14239 20367 12284 2739
815 2739 4684 15312 17421 2998 -14593 -18094 -4986 12448 16376 497 -18350 -21874 -11944
828 -11944 -2663 -3392 -11752 -12956 1008 17253 18175 2845 -14108 -15602 2118 21086 21817 8858
842 8858 -179 384 6314 8593 -1981 -16710 -15073 1462 13597 11795 -2090 -19123 -22268 -8568
856 -8568 2233 782 -2303 -560 3833 9621 8629 -4118 -14031 -8292 4985 15009 16628 7609
870 7609 -2966 -4333 -288 805 -1852 -4508 -1730 7831 12813 4871 -6619 -13490 -14396 -5764 5705
885 5705 4364 -3213 -2366 -475 -1246 1681 -3071 -16656 -11746 10026 18388 14620 10916 -2752 -14755
900 -14755 -1007 13961 5626 922 7514 3335 1962 11813 -963 -28460 -23371 50 5936 8124
914 8124 8358 -14049 -28308 -5709 10177 -1858 -3393 6339 2957 7846 24873 13021 -14208
927 -14208 -7691 13128 10308 5041 8509 -3652 -13207 6598 13421 -17396 -31093 -10616 -1854
940 -1854 -1096 14464 7036 -24657 -16247 15072 3571 -12992 7937 13268 2275 27471 32913
953 32913 -21470 -36272 9109 15141 892 23517 9758 -40178 -16775 26399 -10124 -31097
965 -31097 9425 1127 -23219 24014 32137 -36090 -28788 28967 5189 -13940 30590 11147 -38321
978 -38321 10573 45209 -15914 -23326 22809 -10430 -33891 27729 26939 -33489 -4373 33452 -18849
991 -18849 -29616 20341 -1789 -28575 30760 41946 -24049 -19723 15927 -20858 -26731 33025
1003 33025 22810 -25214 5216 25578 -25480 -27081 17506 -3078 -20658 32777 38076 -22166
1015 -22166 -18876 13674 -14588 -15571 39259 24031 -32231 -8574 19852 -18365 -14825 28759 -4453
1028 -4453 -41417 9252 25673 -25991 -11974 29156 -6753 -17772 33364 9005 -47552 -1555
1040 -1555 42935 3760 7153 38708 -20177 -58999 8529 28312 -18240 6934 34943 -21084
1052 -21084 -32947 13031 -15534 -46470 18580 48306 -1196 -2997 11560 -34233 -32879 37145
1064 37145 37728 -7060 5840 12413 -21530 -8320 23235 -4944 -22289 13154 15050 -18727 -16103
1077 -16103 -3398 -12482 2715 30086 9418 -28493 -26175 -3179 12594 28108 30724 3322
1089 3322 -24055 -18293 438 3143 4477 17637 17037 -1341 -8630 -13308 -31390 -23498 19479 33566
1103 33566 10077 -760 -11620 -35161 -17554 26678 22821 290 10944 6308 -21507 -8451
1115 -8451 15447 -3010 -5896 23379 9661 -25737 -13085 2581 -9759 7880 32273 -1518
1127 -1518 -34964 -13970 599 -3065 23117 35923 -4272 -25060 -3657 -6147 -17330 11766
1139 11766 29974 5395 -1174 8309 -19067 -39534 -4610 23318 13006 15343 15950 -23321 -39313
1152 -39313 1166 18882 1362 11833 19823 -13509 -18979 13576 3640 -20504 7676 23001
1164 23001 -10148 -11145 9327 -15249 -20900 27094 27197 -18848 -13865 2318 -20402 -4076 41143
1177 41143 16782 -22239 602 5793 -24893 -4006 25778 -2436 -6957 28525 5667 -37091
1189 -37091 -14155 5538 -12087 10382 37574 -3701 -31563 693 5084 -14357 9790 21719
1201 21719 -11426 -7447 23426 3322 -20321 2763 8770 -9850 5123 16791 -13513 -19803
1213 -19803 11222 10933 -8100 -632 -2123 -21205 -5554 22900 10525 -7632 1448 408 -11773
1226 -11773 726 11896 -3842 -4754 16657 13868 -5376 -5707 -6031 -14899 -1099 19514 7928
1239 7928 -10051 -5068 -3153 -9554 -113 5970 -8707 -8958 10946 11604 -1218 -379 -2006 -10042 1207
1254 1207 15770 4954 -5575 3378 5967 227 3226 -531 -15225 -10543 8072 8894 348 -1374
1268 -1374 -7271 -12247 -1796 5422 -3093 -5326 4217 7707 6826 6579 -2374 -11473 -3386 9646 10413
1283 10413 5755 1455 -3577 -3301 1967 -188 -7947 -8637 -2358 3687 6425 2292 -7251 -11076 -4952
1298 -4952 2380 4817 3124 567 1958 6614 7333 1702 -4719 -6387 -1155 7227 9760 3714 -3923
1313 -3923 -6989 -5421 -1850 -570 -3828 -5617 -972 5029 6015 1657 -5314 -8411 -3480 4928 8897
1328 8897 6830 1759 -1627 -248 2237 239 -4005 -5386 -2358 3454 7275 3455 -5003 -8781 -5935
1343 -5935 -942 3310 3593 340 -116 3729 5038 1450 -3481 -6126 -3180 4614 8528 3853 -3193
1358 -3193 -6139 -4846 -1027 434 -3313 -5145 111 6532 7855 3344 -5086 -9050 -2063 7580 8984
1373 8984 4330 -807 -2926 1510 5996 -163 -9614 -9543 -3107 3302 8077 3068 -9819 -11838 -1747
1388 -1747 3319 2547 2861 -29 -770 8891 13065 1169 -7193 -3520 -303 4138 11068 4972 -8148
1403 -8148 -6642 45 -4289 -7362 -3900 -5722 -4511 7226 8134 -5524 -8043 28 1327 3745 10656
1418 10656 5362 -3229 4671 11503 1383 -4965 -1404 -4554 -5269 6390 6611 -8932 -10010 -320
1432 -320 -3973 -7316 666 -2337 -9583 4639 17410 4695 -3492 2704 -3682 -7805 11400 17628
1446 17628 -944 -2267 7038 -5834 -12529 2779 -696 -13975 2245 13817 -6050 -10683 2188
1459 2188 -8449 -13186 12612 15731 -6939 -679 11688 -4393 -3876 16206 3303 -14341 4809
1472 4809 10838 -10234 -3450 11892 -5967 -11417 9000 -1392 -22303 -2686 13867 151 3763
1485 3763 13456 -10773 -22410 5127 13690 -249 8664 14199 -7374 -9521 7136 -4027 -16318
1498 -16318 4856 16201 1055 -641 1603 -16845 -18377 9570 16688 -173 -1075 1172 -10692
1511 -10692 -5718 13533 7008 -8303 698 6690 -6709 -5896 6347 -3 -4068 10663 7489 -14951
1525 -14951 -13674 1998 2430 7557 19667 4470 -18445 -10374 1888 -3797 2760 16605 5645
1538 5645 -7192 -459 -5077 -19407 -7153 13015 10051 5364 6207 -9434 -21144 -3287 13211
1551 13211 8141 6058 7252 -4680 -10339 1924 6404 -1095 1619 6944 -1261 -8665 -4876 -3356
1565 -3356 -4305 4559 11551 437 -13328 -11476 -4492 263 11959 18854 3846 -11342 -6198 -1879
1579 -1879 -4668 6609 17703 5729 -3145 3244 -6009 -20002 -4982 10907 3253 4211 10235 -11031
1593 -11031 -24501 -1396 9709 -1893 6483 13730 -8752 -12680 10288 5405 -9198 7786 13628
1606 13628 -7992 -4819 9326 -7468 -11965 15077 13118 -11856 -6462 324 -15737 -5328 22323
1619 22323 9545 -11756 -182 677 -16180 -2377 16626 839 -4691 14768 5570 -17918 -6939
1632 -6939 5433 -5748 3349 22137 2480 -18859 -3316 3677 -8624 3285 15770 -5234
1644 -5234 -12361 9258 5350 -12656 652 9726 -8079 -4182 13395 -3060 -16661 6238 12585
1657 12585 -5992 93 8127 -13055 -13100 15452 12028 -6925 4119 6674 -14764 -7361 12925
1670 12925 -1500 -9954 12224 10493 -11162 -3608 3620 -14138 -7734 17737 8110 -9261 2352
1683 2352 2593 -13086 -773 14000 -2980 -8180 10385 6124 -8056 2076 4808 -10686 -3425
1696 -3425 12998 876 -9572 2355 2231 -6752 3541 7998 -8894 -9997 5916 4536 -1843
1709 -1843 5810 3652 -8569 -2554 7352 -1447 -6277 3439 4164 -1115 4141 3511 -9462 -9133 3515
1724 3515 4426 442 3952 1597 -6441 -2185 4628 -1516 -5238 2235 4275 1150 3887 2521 -7054
1739 -7054 -6805 2792 3299 -730 1282 369 -3758 484 4626 -1834 -5741 -480 1936 1351 4373 3063
1755 3063 -3869 -3344 2280 1192 -1720 -90 -282 -823 3354 4183 -2229 -5521 -2971 -841 1360 3916
1771 3916 1881 -1828 -775 1443 200 -1332 -1615 -1416 1297 4864 3780 -825 -3866 -3729 -1045 1856
1787 1856 1879 -387 -1159 300 1697 1589 -1037 -4185 -3225 1338 4452 4061 1204 -2522 -3113 85 1842
1804 1842 -101 -1927 -1462 554 3146 3152 -1325 -5319 -4129 -47 2846 3269 1140 -1465 -786 1815
1820 1815 1575 -1161 -2870 -1684 1825 4621 3359 -1143 -4057 -3188 -425 1233 168 -1624 -1066 1470
1836 1470 2761 1163 -2401 -4377 -2008 2703 4873 3104 -40 -2085 -995 1468 1080 -2036 -3062
1851 -3062 -891 2134 3703 1799 -3076 -5507 -2842 1007 2534 1955 -49 -1201 1026 2793 843
1866 843 -1755 -2348 -1165 2219 4772 2469 -1939 -2914 -1925 -1243 217 436 -1673 -885 2354 1939 -549
1883 -549 -1436 -2662 -2671 1777 4608 1832 43 947 -306 -1067 720 -664 -3234 220 3993 1643 -804
1900 -804 -1195 -3839 -3947 1654 3450 -615 -1180 1076 313 763 2570 -995 -4824 -468 4235 2572
1916 2572 1279 1124 -2690 -3661 1470 2080 -3106 -2765 1137 1049 1713 3546 -1657 -7368 -2376 3896 2535
1933 2535 2112 3403 -1417 -3866 1676 2059 -3973 -1831 3682 1345 362 3024 -2412 -7751 -413 4903
1949 4903 -237 -939 2155 -2156 -2754 5007 3328 -5031 -1837 3393 -802 -504 4409 -520 -4658 3009
1965 3009 4355 -4293 -4200 586 -1510 996 8209 2369 -7798 -4553 565 -1418 1728 6289 426
1980 426 -3587 2041 1706 -4826 -2752 2176 830 2291 5967 18 -7260 -3359 2074 1294 1984 3103
1996 3103 -1919 -4757 567 2962 -1016 -1320 1129 -959 -2140 1485 1278 -2486 176 4550 1160
2011 1160 -3202 -1753 -1611 -2141 4090 8011 1225 -4366 -2097 -2291 -3346 2387 5104 -468 -1272 2434
2027 2434 -1811 -6816 -2161 1173 -339 3856 6807 -1837 -7300 -1117 1837 72 4146 5476 -2556
2042 -2556 -3839 3253 1896 -3207 791 2571 -3169 -1760 3249 -2557 -6407 2024 4910 -1839 -1543
2057 -1543 679 -5767 -4516 7642 7745 -1488 181 1930 -5684 -3333 6898 2529 -3583 4753 5657
2072 5657 -6353 -5635 1135 -4887 -3975 9671 6353 -7656 -3511 1641 -6468 -2020 10446 2353
2086 2353 -6363 4535 5340 -7006 -1454 7285 -2700 -3578 9186 1872 -11048 -603 5906 -4481
2100 -4481 -498 8225 -5010 -11486 4164 5488 -5013 2908 8053 -6088 -5849 7156 -164 -8173
2114 -8173 5650 9163 -3758 -698 4763 -8458 -10007 7431 7214 -3727 2297 3996 -9414 -6097
2128 -6097 7550 960 -5666 5868 6338 -5866 -1366 5045 -5529 -5639 8810 5266 -6405 -356
2142 -356 2605 -7054 -1918 9280 34 -7922 2152 2943 -5662 1581 8049 -2858 -4151 6544
2156 6544 979 -7933 1146 5475 -2622 1480 7635 -4498 -10526 905 2464 -3421 3732 6155
2170 6155 -5637 -5440 4392 -342 -5352 3944 5587 -2078 1863 5595 -4329 -6187 4041 3658 -1877
2185 -1877 2301 1836 -6434 -3162 4726 170 -4215 628 -241 -4459 849 4398 -1473 -1921 3728 1463
2201 1463 -2584 642 1496 -1483 2104 6115 927 -3972 -2075 -1732 -2140 2071 3795 -948 -2827 -288
2217 -288 -1095 -2923 -514 849 -392 1529 3691 429 -2844 -1204 805 922 2445 2503 -1118 -2338
2233 -2338 713 1626 -318 -622 -803 -2150 -801 2021 946 -1404 -641 434 -321 -280 -45 -1436 -692
2250 -692 2659 3327 546 -1519 -2074 -1929 248 2533 1727 -572 -805 81 -41 -635 -967 -1265 -219 2151
2268 2151 2746 474 -2038 -2081 -692 761 1438 679 -956 -978 929 1412 -232 -1513 -1675 -1021 1060
2285 1060 2554 1062 -1234 -903 340 365 246 4 -1072 -344 2027 2097 -279 -1506 -1613 -1350 423
2302 423 1775 397 -1086 -158 631 -85 -469 -985 -1458 78 2343 2057 46 -950 -1022 -544 584 836
2320 836 -379 -815 354 1278 887 -380 -1738 -1941 -366 1571 1869 392 -847 -856 -45 485 113 -655
2338 -655 -941 34 1595 1637 131 -1388 -1905 -1023 758 1498 397 -559 -138 380 515 173 -876 -1366
2356 -1366 -104 1686 1590 466 -561 -1329 -916 415 413 -595 -452 419 755 768 -35 -1745 -1844 223 1406
2375 1406 1104 762 -142 -783 328 1104 -354 -1376 -557 488 1206 1682 104 -2317 -1923 185 739
2392 739 540 326 -763 -846 1220 1484 -747 -1634 -683 -119 1157 2225 666 -1607 -845 512 86 -218
2410 -218 -168 -901 -405 1820 1602 -971 -1886 -965 -561 564 1905 800 -1022 -59 965 -335 -985 -182
2428 -182 -439 -34 2084 1762 -1331 -1856 -268 -235 -11 1202 137 -1499 210 1706 -15 -985 -152
2445 -152 -751 -639 1804 1661 -1002 -818 851 -2 -507 382 -877 -1935 876 2674 596 -846 -729
2462 -729 -1644 -1348 1344 1748 -263 -103 1058 -77 -916 -324 -823 -1160 1203 2729 755 -1359 -1300 -1116
2480 -1116 -668 1196 1675 -381 -1095 517 599 -643 -187 284 -954 -313 1753 513 -1756 -336 1173
2497 1173 6 133 852 -1636 -2573 1211 2662 115 134 753 -2133 -2175 1702 1123 -1451 1277 2699
2514 2699 -1017 -1556 346 -2238 -2537 3110 3898 -1036 -968 351 -2861 -1888 3333 1773 -2169 922
2530 922 2237 -2235 -1392 2060 -1083 -2200 3258 2557 -3334 -1619 1569 -1416 -511 4141 246 -4836
2546 -4836 -381 2410 -1393 595 4244 -947 -3866 1728 1174 -3732 421 4264 -598 -1163 2840
2561 2840 -2005 -6253 834 4248 -865 730 3598 -3116 -5028 2556 2297 -2733 1953 4551 -2382
2576 -2382 -2372 3088 -1420 -4529 3364 4341 -3125 -1532 1994 -3646 -3066 5229 2447 -4415 -66 1911
2592 1911 -3813 -570 5987 388 -3247 3103 1817 -4972 -709 3731 -1398 -384 5411 -322 -6650
2607 -6650 -1258 1287 -2509 1706 5716 -1670 -4877 1185 343 -3353 2093 4766 -1118 -757 3552
2622 3552 -1315 -4515 1854 3305 -1327 750 2460 -3719 -4354 2374 1790 -2162 905 1401 -3794 -2009
2638 -2009 3282 530 -1666 2895 2431 -2593 -846 1726 -1662 -597 4809 2379 -2838 -1341 -797
2653 -797 -3602 -348 4212 726 -2459 316 -275 -3194 -203 2481 -346 167 3410 907 -2589 -263
2669 -263 882 -864 1344 3183 -713 -2842 -101 185 -1186 672 974 -2020 -1758 1013 268 -928
2685 -928 918 1242 -406 246 1023 -878 -1110 1472 2097 597 51 -657 -2232 -1539 945 1039 -299 -317
2703 -317 -204 -1033 -861 206 -229 -501 1066 1975 642 -376 -161 -457 -119 1376 1300 -579 -1043 -35
2721 -35 -23 -468 -33 -611 -1697 -574 958 206 -525 262 182 -149 722 829 -611 -316 1399 1412 399
2740 399 239 -524 -1657 -579 991 145 -855 -265 -285 -897 -239 -23 -1114 -649 1098 1384 360 378
2758 378 67 -657 208 1452 586 -453 104 283 -188 108 9 -1277 -1412 85 516 -251 -130 5 -673
2777 -673 -87 887 148 -612 339 980 587 799 569 -767 -948 353 559 -308 -65 -46 -602 -122 248 -686
2797 -686 -1267 -129 580 564 678 389 -606 -488 640 613 -31 -32 119 -2 511 485 -646 -1291 -557 61 322
2818 322 462 -15 -665 -406 343 337 -150 -242 -29 425 938 845 -21 -682 -419 129 344 174 -140 -376 -130
2839 -130 157 32 -589 -808 -294 373 745 604 62 -419 -136 374 324 -20 -16 46 386 654 248 -732 -910
2860 -910 -441 74 366 223 -349 -525 -83 300 37 -300 -309 -79 603 1012 436 -328 -473 -239 142 418 275
2881 275 -314 -269 254 269 -175 -417 -750 -536 327 695 235 -209 -295 -191 76 304 -102 -347 -36 609 540
2902 540 182 -264 -632 -463 267 510 112 -71 -98 -36 52 8 -320 -544 -70 590 555 165 -340 -441 -284 139
2924 139 384 -13 -237 83 288 173 54 -186 -553 -255 542 573 -43 -211 -162 -163 191 298 -321 -687 17
2945 17 490 311 190 -130 -699 -468 312 431 -12 62 199 27 156 290 -483 -838 159 813 400 167 -39
2966 -39 -741 -690 314 455 -269 -82 377 -135 -54 325 -242 -688 226 969 -46 -206 229 -356 -380 740
2986 740 529 -894 -553 402 -194 -107 889 58 -1085 65 627 -690 -358 864 164 -276 951 124
3004 124 -1656 -516 982 104 197 1150 -369 -1703 51 716 -648 32 1180 -361 -739 947 121
3021 121 -1492 175 1386 -287 -226 915 -632 -1435 959 1203 -804 -260 555 -1104 -864 1393 602
3038 602 -1059 362 821 -1208 -726 1051 -57 -574 1548 1020 -1530 -755 538 -797 -180 1993 489
3055 489 -1597 -136 442 -1331 -391 1478 -71 -723 1172 415 -1711 -255 1245 -194 23 1610
3071 1610 -237 -1824 302 1081 -662 133 1122 -1050 -1458 920 458 -1126 434 1114 -992 -706 931
3088 931 -421 -1054 1243 1442 -608 -77 454 -1211 -905 1518 889 -710 318 374 -1442 -694 965
3105 965 -167 -587 1050 705 -1152 -363 398 -600 -107 1480 460 -960 -73 281 -611 171 985 -239
3123 -239 -925 308 149 -758 86 686 -283 -357 501 -160 -1145 390 873 210 402 396 -468 -885 -109 206
3143 206 264 523 547 -212 -515 308 -176 -538 212 91 16 -306 -62 -283 -473 521 426 133 -195 -86 -307
3164 -307 -379 358 41 -215 -365 -12 -460 -168 110 95 19 201 440 -441 -563 65 328 330 581 10 -502 -281
3186 -281 146 -158 122 66 270 -146 -47 26 -244 -699 146 214 20 -45 -134 -562 -629 564 407 103 560 562 -430
3209 -430 -271 175 -146 -314 119 336 -330 -219 281 -323 -452 473 361 -465 -177 154 -211 57 657 144
3229 144 -471 3 160 -257 13 296 -193 -246 353 17 -626 -189 114 -198 98 543 -84 -509 97 193 -169
3250 -169 189 399 -38 -169 402 143 -339 -135 99 -155 -13 274 -81 -414 36 156 -172 -60 48 -220
3270 -220 -93 435 267 -205 -108 44 -178 -65 261 -24 -194 131 121 -227 -189 -50 -216 -109 328 159 -259
3291 -259 -174 -16 -66 28 219 -41 -113 178 262 9 -130 -61 -202 -57 214 35 -197 -116 52 -32 -24 65 -102 -160
3315 -160 132 216 85 -4 -120 -161 -15 132 117 -90 2 119 70 -7 -50 -137 -131 -29 202 83 -43 -80 -52 1 92
3340 92 -24 -69 -73 107 154 45 27 -96 -116 38 199 61 -66 -24 23 12 -30 -48 -159 -116 66 113 58 -30 -157
3365 -157 -172 -19 55 -24 -66 -23 53 44 122 -65 -138 -103 21 149 91 -44 -54 -108 38 55 -72 -100 -61 69 102 145
3391 145 2 -118 -154 22 133 6 17 3 45 24 99 -33 -142 -136 59 109 75 43 -86 -139 -7 35 -66 -48 27
3416 27 -13 103 121 -20 -200 -49 129 74 41 74 -137 -106 107 123 -127 -96 -18 -114 112 245 31 -231 37 12
3440 12 -54 45 53 -83 -18 249 80 -223 -108 -51 -142 135 190 7 -249 -33 31 -131 57 169 -59 5 279 91
3464 91 -291 -23 143 -116 96 289 -144 -349 122 189 -179 5 93 -301 -195 371 145 -285 126 144 -289
3485 -289 -50 286 -209 -249 401 315 -222 -29 21 -494 -207 586 201 -325 70 2 -522 -69 453 -285 -301 498
3507 498 185 -465 64 288 -354 0 671 -23 -475 116 164 -379 148 501 -375 -466 334 28 -457 313 451
3528 451 -379 -97 483 -301 -510 365 443 -149 171 370 -650 -598 387 155 -252 370 272 -641 -192 383 -248
3549 -248 -371 559 366 -324 167 259 -601 -267 757 292 -371 178 50 -678 -21 645 -124 -431 260 -17
3569 -17 -625 114 422 -312 -100 607 -22 -618 28 188 -229 341 734 -289 -574 13 -106 -320 361 505
3589 505 -358 -280 249 -162 -580 190 369 -69 322 354 -380 -520 252 381 23 351 178 -499 -347 314 84
3610 84 -223 17 156 -258 -195 203 -193 -277 360 395 -169 -145 14 -271 -60 657 474 -232 -202 -56 -364 -108
3632 -108 414 221 -221 121 205 -326 -366 138 54 20 457 309 -525 -373 161 72 39 383 168 -428 -91 351
3654 351 -183 -198 360 68 -369 153 205 -453 -90 505 130 -249 110 -114 -568 123 773 82 -353 205 -120
3675 -120 -555 100 446 -288 -67 519 -96 -584 50 99 -391 307 823 -122 -503 186 -47 -451 382 516
3695 516 -440 -255 428 -177 -479 270 164 -524 119 536 -387 -501 421 196 -239 373 231 -719 -231 597
3715 597 108 -212 363 62 -656 11 420 -350 -276 518 67 -362 230 76 -745 -86 706 91 -177 298
3735 298 -68 -530 212 513 -326 -212 435 -29 -323 237 68 -548 -74 490 -156 -278 102 -27 -282 315
3755 315 365 -345 -254 266 90 16 394 35 -446 7 365 -129 -229 181 58 -108 264 195 -422 -246 254
3776 254 84 16 330 -13 -352 15 242 -153 -183 76 6 -57 245 86 -371 -128 162 82 -34 150 -22 -183
3798 -183 81 218 -112 -182 11 -32 83 293 105 -233 -131 102 -16 -75 82 -18 -83 192 201 -24 -140 -87
3820 -87 73 103 269 19 -114 -93 136 68 -100 -118 -107 -36 151 134 -61 -207 -115 32 70 99 46 -87 7 176
3844 176 154 -101 -218 -102 11 140 230 50 -194 -174 30 17 -25 -114 -113 9 141 199 -92 -151 -111 60 76 113
3868 113 1 -74 -43 -10 50 5 -85 -113 -5 152 112 -17 -168 -114 -55 29 11 -23 -26 52 188 19 -59 -149 -117 -4
3894 -4 172 186 -67 -159 2 19 51 -1 -69 -159 44 328 71 -179 -62 -107 -20 228 133 -140 -99 112 3 41 51
3919 51 -196 -262 65 253 9 -74 -22 -163 -156 206 75 -197 84 199 65 11 97 -275 -351 158 316 -77 -48
3942 -48 -8 -259 -140 136 -26 -270 47 256 -62 23 191 -149 -204 333 259 -188 -28 170 -153 -79 328 -139
3964 -139 -461 -47 149 -139 31 315 -228 -397 323 191 -307 -8 317 -55 157 497 -148 -604 93 283
3984 283 -235 123 344 -378 -491 307 -17 -479 82 345 -289 5 453 -210 -528 331 409 -279 82 307
4004 307 -352 -234 501 67 -503 89 154 -454 -75 461 -198 -368 460 235 -429 -31 265 -316 103 784
4024 784 101 -487 32 81 -377 162 550 -205 -329 183 -37 -553 -35 175 -268 42 567 -141 -593 66
4044 66 219 -158 307 436 -241 -396 236 216 -262 111 262 -397 -198 334 -121 -390 225 323 -192 -70 178
4065 178 -299 -285 486 488 -87 -7 103 -379 -186 383 103 -250 146 193 -366 -321 -3 -235 -182 411 359 -270 -317
4088 -317 36 -105 49 521 267 -349 2 235 -159 -78 208 -13 -271 70 132 -326 -221 279 99 -167 211
4109 211 78 -481 -70 543 174 -43 292 16 -477 12 405 -235 -77 460 136 -480 -20 -8 -541 -36
4129 -36 655 87 -409 103 -74 -505 181 600 -185 -206 417 9 -490 135 358 -409 -19 611 -197 -540 209
4150 209 141 -487 306 533 -538 -488 464 61 -344 427 366 -562 -121 516 -227 -418 490 242 -405 168 325
4171 325 -704 -392 564 159 -289 420 134 -764 -114 573 -230 -325 541 148 -535 233 362 -582 -233 665
4191 665 32 -433 298 75 -537 138 600 -290 -439 331 -62 -441 404 411 -456 -145 490 -182 -430 364 204
4212 204 -342 349 456 -467 -427 261 -38 -256 475 295 -494 -223 349 -195 -317 347 99 -248 221 263 -337
4233 -337 -249 329 1 -191 308 111 -491 44 385 -130 -136 206 -89 -275 212 223 -209 -101 232 -85 -166 167
4255 167 19 -215 106 359 -49 -183 1 -108 -128 267 268 -142 -84 22 -65 -102 88 15 -144 133 217 -66 -89
4278 -89 22 22 4 160 188 -105 -110 83 35 13 49 -7 -188 36 168 -25 -83 6 -29 -85 29 19 -122 -5 105
4303 105 136 24 -34 -68 -68 87 134 97 -64 -16 11 23 21 -66 -87 -85 104 116 -13 -136 -91 11 14 66 47 -21 39 32 67
4332 67 66 -21 -83 -65 60 150 12 -80 -85 -36 -85 37 -18 -107 -31 41 61 51 -33 -37 -18 27 171 35 -34 4 35 -33 18
4361 18 -55 -149 -66 117 55 13 -33 -57 -73 74 143 -95 -46 49 105 117 67 11 -113 4 114 107 -1 -92 -22 -45 79
4388 79 -5 -81 -139 29 47 54 84 -18 -124 -30 143 125 11 33 18 -19 24 -1 -111 -77 -11 -70 -15 15 -64 -167 -17
4415 -17 87 -41 -21 132 18 -10 226 33 -193 -38 73 -16 -15 79 -33 -139 -12 60 -136 -34 -13 16 2 177
4439 177 90 -185 24 161 -17 80 114 -14 -67 85 133 -78 -71 11 -137 -62 112 22 -257 -36 38 -122 -35 79
4463 79 -88 -66 220 177 -160 -14 90 -113 -35 150 -8 -162 -29 75 -208 -137 112 -89 -133 198 101 -187
4485 -187 -34 113 -75 7 300 -19 -208 128 171 -51 8 98 -145 -193 163 18 -314 -69 93 -122 -54 158
4507 158 -100 -258 94 193 -10 89 80 -152 -122 182 142 -134 95 148 -151 -75 50 -167 -224 152 158 -110 -37 -12
4531 -12 -219 -156 175 134 -47 50 87 -81 -118 129 39 -54 118 166 -121 -128 31 -18 -57 123 120 -238 -187 73 68 -8
4557 -8 209 72 -180 -43 131 -71 -98 202 98 -88 57 26 -255 -187 260 199 -17 70 -32 -312 -81 253
4579 253 109 -65 160 95 -162 9 173 -91 -86 273 100 -324 -38 47 -268 35 343 -41 -341 88 15 -224
4601 -224 179 344 -119 -180 231 -8 -328 73 300 -120 25 315 -202 -441 85 213 -143 182 250 -371 -373
4622 -373 241 26 -219 267 316 -297 -117 339 -194 -254 366 268 -278 49 221 -396 -165 406 61 -304 138
4643 138 74 -479 -47 453 -95 -225 335 62 -453 65 236 -257 26 472 -49 -374 23 57 -261 128 488
4664 488 -138 -252 168 -67 -390 196 333 -173 -73 282 -131 -352 144 217 -188 164 347 -305 -218 268 83
4685 83 -160 200 176 -324 -68 240 -49 -197 237 113 -296 38 176 -278 -92 370 119 -145 96 2 -372
4706 -372 45 376 41 -112 211 -58 -250 40 189 -170 -12 248 -21 -209 18 -13 -108 45 268 -33 -176
4727 -176 35 -4 -147 121 104 -180 -45 155 -7 -75 106 107 -26 -8 109 -80 -141 135 60 -7 30 14 -160 -101
4751 -101 86 53 -18 86 -4 -84 -60 27 -58 -99 38 20 0 -21 -11 -82 -55 56 51 -103 -11 31 -34 8 69 -3 -81 -1
4779 -1 94 1 -34 22 9 -14 16 17 -63 -70 72 58 27 20 -65 -70 6 98 62 -17 6 -82 -6 10 44 -20 -109 69 62 25 12 -9
4811 -9 -84 -69 104 31 -68 -45 6 -60 80 127 -78 -69 53 65 -2 85 51 -79 75 84 -15 -34 21 28 -86 39 36 -124
4839 -124 -82 -16 8 -27 61 27 -80 47 50 -38 -103 -36 -41 -17 58 0 -44 -75 15 38 27 -10 2 -50 -3 70 -16 -29 -15 -1
4869 -1 -12 106 41 27 -63 -31 5 -40 -43 -32 27 1 92 0 -109 1 10 -54 -2 128 -30 8 99 13 -55 -13 -8 -129 16
4898 16 132 -46 -23 39 33 -80 46 -10 -43 22 129 82 -18 20 -26 -17 60 63 14 -9 27 -1 -37 50 -38 -126 -13 48
4926 48 2 -41 -27 -53 -74 -9 126 -14 3 70 60 39 46 -30 -85 10 52 -33 -22 13 26 -70 53 68 -94 3 62 41 42
4955 42 26 25 -23 -22 90 -3 18 44 -18 -80 24 -54 -124 -34 140 18 -9 8 -94 -117 25 88 7 7 21 5 16 66 83
4984 83 -39 -9 115 7 -41 20 -16 -81 32 50 -33 -49 -7 -25 -9 107 120 -29 -128 0 -19 10 115 65 -20 2
5010 2 44 -107 -138 2 79 15 99 24 -103 -172 39 99 -45 4 55 -58 -62 82 3 -83 62 142 -10 -36 82 -92
5036 -92 -65 162 155 -100 -58 18 -97 15 198 55 -161 40 27 -192 -48 123 -37 -86 201 82 -256 -53 76
5059 76 -59 51 199 -47 -289 -27 100 -138 106 285 -22 -184 154 56 -202 91 192 -97 -67 147 -43
5080 -43 -270 100 244 -160 -53 128 -213 -203 256 190 -146 90 173 -178 -171 194 -57 -112 301 202 -220 -104 124
5103 124 -178 -164 351 107 -241 30 122 -289 -32 359 20 -179 174 104 -264 4 262 -147 -53 326 -39
5124 -39 -369 86 171 -138 43 315 -189 -314 167 123 -220 76 257 -212 -140 293 -81 -251 219 196 -218 -35
5146 -35 159 -241 -205 241 87 -220 113 126 -241 -76 233 -19 -177 196 151 -174 -3 220 -142 -63 250 48
5168 48 -148 52 159 -205 -27 296 -56 -186 95 -16 -122 45 176 -134 -137 124 -11 -221 76 85 -93 75
5190 75 211 -78 -184 84 93 -108 3 184 -114 -72 103 -7 -138 72 141 -91 47 110 -82 -132 104 51 -50
5213 -50 -2 8 -65 -2 80 -10 -52 12 81 32 -20 82 -76 -62 82 41 -35 -44 -32 -30 8 166 38 -77 -61 18 0 50
5241 50 83 60 -61 20 29 -24 -75 -23 13 -50 62 92 -48 -86 54 20 -97 47 80 -32 32 89 52 -100 49 -1
5267 -1 35 61 62 -82 -35 76 11 -29 -40 12 -88 -53 122 -41 -72 -16 90 -72 81 73 -48 -24 60 3 -66 14 3
5294 3 -112 15 102 20 -44 70 -8 -51 11 42 -38 -20 76 40 -49 -16 -8 -34 20 45 -4 -10 5 13 -57 -76 -42 -103 -2 -29
5324 -29 54 -113 -43 -11 -12 27 89 -5 22 57 68 13 13 43 -53 -1 83 32 -65 -55 26 -11 23 42 3 -75 13 59 -7 40 25
5355 25 -78 -23 5 82 -30 23 43 1 -48 -4 -50 -75 12 -16 -25 6 17 -82 -69 33 -6 -28 74 64 -3 24 47 -35 -59
5384 -59 50 22 -102 13 12 -65 34 -9 -35 -94 -36 14 -17 12 61 -30 6 20 46 48 39 39 -10 -34 5 -22 -44 -18 3 2 50
5415 50 22 -68 4 94 17 37 13 34 18 50 34 -22 -46 10 22 20 -55 8 10 -99 59 -48 -28 -46 -46 28 17 65 -26 -53
5445 -53 32 -6 59 70 5 -30 3 31 -22 -36 -75 -25 43 6 66 18 -51 -2 19 -22 10 85 -26 30 23 4 -3 44 24 -4 -18
5476 -18 66 8 -65 -6 13 -61 -74 -32 -7 -14 74 76 7 -15 29 -9 -17 73 81 40 67 58 18 3 49 -18 43 60 -1 -21 8 69 -5
5509 -5 -41 41 -27 -48 66 20 -21 4 65 -80 -33 97 -9 -141 -22 87 -64 -40 70 -21 -117 61 59 9 32 74
5535 74 -52 -102 57 69 -79 41 158 -87 -40 119 -47 -157 67 70 -88 -18 54 -64 -102 107 7 -115 67
5558 67 117 -98 -51 89 -23 -123 99 61 -100 -82 109 -112 -54 188 -39 -168 35 123 -37 -53 160 -87 -135
5581 -135 192 33 -166 58 167 -36 1 138 -17 -190 103 124 -124 28 174 -62 -139 141 40 -133 109
5602 109 130 -87 -53 115 -105 -141 115 84 -227 32 179 -127 -57 163 -15 -156 31 122 -89 -46 214 -57
5624 -57 -74 127 42 -145 5 64 -88 -17 170 42 -110 42 55 -76 -10 141 -30 -106 92 3 -159 -4 105
5647 105 -77 -74 106 -52 -193 44 97 -25 36 137 -62 -81 -10 -2 -109 18 136 -46 -78 58 -27 -83 89 91
5671 91 -27 -7 35 -87 -42 77 134 -41 -25 16 -78 -47 1 16 -70 84 50 -36 -55 60 -10 -19 93 74 -43 -55 32
5698 32 -35 -21 56 62 -74 -11 16 -32 -14 19 31 -20 53 50 -64 -29 56 57 -6 104 39 -63 6 82 9 -4 22 32 -97
5727 -97 -74 41 -30 -22 58 60 -98 16 32 -106 10 107 -6 -107 4 -21 -32 5 140 4 -24 54 -13 -78 -3 52
5753 52 -18 -33 56 22 -148 62 67 -29 59 45 -52 1 61 11 -34 39 6 -42 -43 82 26 13 49 -11 -33 28 1 -38 -37 55
5783 55 6 -75 38 46 -19 -39 59 -40 -42 21 26 -42 -8 49 -16 -3 42 61 -32 58 48 11 16 52 -5 -56 -2 20 -61 -5 59 -69
5815 -69 -42 57 7 -25 54 -14 -16 13 25 -26 -17 78 37 20 -21 59 -14 -45 -18 -44 -64 -15 -1 -24 6 1 5 -9 31 7 33 -16
5847 -16 20 2 66 -12 41 35 22 29 -47 -30 -1 -39 -24 13 11 -11 -3 -32 -27 33 29 -22 -43 -1 -14 21 14 55 16 -6 23 21 -24 35
5881 35 4 1 53 58 -11 11 7 29 -19 23 41 7 14 56 30 4 -1 53 43 -47 9 -55 -17 -38 -54 -24 -42 27 -4 2 18 29 -43
5914 -43 10 34 -39 85 2 23 24 26 -17 48 -20 -51 9 -14 17 10 -65 6 6 -24 -44 2 31 66 66 -23 37 1 3 -12 -10 -18 51 1
5948 1 13 -33 -12 17 -51 -19 -52 -14 19 5 3 23 23 19 31 61 -3 4 12 29 -7 75 29 -29 -42 64 -18 18 29 -19 -41 1 24
5981 24 10 10 67 3 4 51 -31 -76 20 43 30 16 11 22 -28 -9 -10 -43 -40 54 -37 -20 14 -26 -3 3 6 -47 -8 76 39 23 17 65
6015 65 -84 -7 13 -45 -17 57 -17 18 9 47 -63 -46 38 -17 8 55 -25 -53 -19 5 1 5 67 -42 -46 34 -6 -79 56 49 21
6046 21 -58 32 -5 -38 -12 19 8 14 45 -55 -28 -11 33 -77 53 22 -31 -73 -12 30 -6 35 -4 37 -65 5 -24 14 8
6075 8 89 -51 -1 21 -19 19 87 11 -59 61 33 -37 -11 55 17 -4 62 15 -36 3 -1 -17 41 25 -2 -9 23 -13 -2 -1 26
6106 26 5 -80 32 23 -19 4 18 -18 0 21 -31 -25 29 8 15 11 -85 -95 -85 39 -6 10 23 -4 -30 26 27 20 3 51 1 14
6138 14 -15 -20 32 -13 102 -37 8 8 11 -26 76 34 -18 -16 -29 -21 -71 0 32 -6 7 -85 -10 -27 -30 56 30 70 -31 -53 -63
6169 -63 37 38 -29 18 -29 -10 10 -9 46 23 0 47 -7 9 25 19 20 12 18 -17 -22 17 -21 -32 -12 29 45 -1 1 -15 40 -52 -13
6202 -13 -20 -57 7 -36 -1 -33 -23 -3 -16 4 -58 -46 -30 -42 -54 -14 -9 35 -35 -34 29 -27 58 7 -44 1 59 -55 15 1 25
6233 25 26 -4 -29 -11 -2 -22 -1 -36 -22 3 12 8 17 -17 -12 -50 -12 21 41 7 7 18 1 -39 7 -6 -51 -40 16 -8 -11 46 -16 11
6267 11 -4 5 -20 26 -13 -58 -31 47 44 -33 3 -20 22 17 -28 -6 -45 -18 27 -56 17 -6 10 -52 -52 0 4 -26 36 -7 -12 -21 16 10
6301 10 41 -3 21 30 -14 30 77 57 12 18 23 49 -15 27 9 83 -4 -24 -8 28 -3 56 60 -61 -9 13 65 6 13 -8 26 36
6333 36 -46 51 10 -35 -21 -4 -29 -17 4 -19 26 3 57 50 46 16 -27 -7 20 -22 -1 24 -5 -29 5 -3 -46 3 34 -4 -9 25
6365 25 -27 -52 22 2 -46 -37 2 -17 4 0 -25 -86 1 21 -53 47 1 -24 15 84 10 -49 -59 20 15 -23 43 23 20 -7 7 24
6397 24 -30 8 5 -3 53 0 -10 39 43 -79 4 -10 36 40 27 50 29 -27 -35 11 -52 -26 26 19 -19 -27 16 6 41 -18 15 -2 -15
6430 -15 2 -5 -17 36 -51 -37 -20 42 8 -52 -13 -37 -5 40 -1 -33 16 -42 -35 -25 33 -3 -4 -48 -30 -73 -45 10 39 44 -39 -8
6462 -8 -6 16 38 -6 -24 1 52 9 26 -23 -8 -21 40 31 -5 12 -2 17 31 -23 -38 -56 45 23 13 45 -3 8 -6 8 43
6493 43 -70 -13 17 -5 82 -18 -67 1 76 -31 -32 -16 -14 -42 25 25 -51 3 45 59 -1 27 -62 -15 -43 -18 6 -22 31 22 -51
6524 -51 17 46 -23 4 66 -6 -27 45 22 -17 -5 32 8 -54 11 -34 5 37 9 -65 -28 96 -8 -25 -1 58 3 58 19
6553 19 -32 -32 28 -34 -14 -6 34 -40 -7 65 7 49 29 9 26 -28 -14 -41 -26 54 32 -53 -4 -14 -42 -69 35 27 -89 18
6583 18 6 -34 9 38 -43 -10 24 5 -4 16 40 -31 -35 27 32 -45 53 -2 -51 -9 -25 32 -40 -22 -11 -49 10 89 -81 -35 -24
6614 -24 -6 -16 7 30 -13 -28 41 41 -46 -17 62 12 -35 16 -19 24 19 13 4 67 42 -50 -7 -11 -26 -19 40 51 8 20 57 -1 -41
6647 -41 70 70 -11 -40 36 22 -39 38 35 -13 -6 32 -35 14 25 -10 -49 40 49 -9 -2 51 11 -34 31 4 -36 21 13 -114 -27 30
6679 30 -11 -75 23 57 -105 -33 58 -52 -23 113 10 -69 4 34 14 -16 57 -16 -56 90 25 -42 -13 122 -77 -14 128
6706 128 -44 -49 61 57 -60 -50 49 -36 -60 67 29 -89 0 28 -28 18 26 -25 -102 19 52 -61 30 3 -29 -55 8 32
6734 32 -31 -1 33 -36 -11 16 -58 38 -34 8 -98 -20 23 -8 1 52 -1 -64 53 3 -7 8 8 -30 -93 42 25 -34 9 24
6764 24 -74 -31 23 -19 -79 5 55 -71 14 77 -95 -59 69 -29 -74 75 49 13 19 38 17 -7 6 17 -131 -48 47 -27
6792 -27 -16 -36 1 -63 -26 19 -1 -40 -15 -27 -2 -34 -4 -23 9 48 -51 17 41 -12 -63 -12 -49 18 -63 1 17 -77 -10 -24
6822 -24 16 -20 68 12 -5 -12 -34 8 7 10 -17 20 -56 27 13 44 -18 -16 43 -16 42 -6 28 9 -68 -20 -28 2 6 63 42 -49 -26
6855 -26 14 -26 -35 -15 -38 -20 -28 58 10 -23 34 -42 55 -69 58 -45 -2 2 10 -30 -16 47 -41 -6 6 39 20 44 -22 40 1
6886 1 48 3 14 28 2 41 2 -3 5 -65 -12 7 37 23 -12 -17 34 -6 -45 11 14 2 29 13 19 -28 -10 38 -9 19 16 -82 18
6919 18 9 -49 -31 -12 -7 -7 -3 -1 8 -32 -1 59 1 -36 -46 64 31 -3 -37 35 -20 -16 -14 -52 22 28 10 4 19 -41 7 -19 -27 -11 47
6954 47 3 -11 -22 24 -37 -2 52 -1 -30 -57 1 -79 -54 29 1 7 36 -5 -60 6 22 4 -29 96 -6 -54 11 16 -52 -7
6984 -7 -2 3 28 42 40 -69 67 93 -7 -25 -6 28 -31 57 84 -4 15 -23 -60 8 66 -15 5 33 3 -90 -73 83 -10 -37
7014 -37 75 -19 -76 25 44 -21 -5 81 -11 -52 29 -8 -62 -34 58 -8 -85 35 31 -32 34 -6 -29 -59 46 -42 -40 5 9 -63
7044 -63 40 36 -29 -16 10 49 -43 13 64 -72 -32 51 -2 -26 9 32 -5 -4 78 -14 54 30 47 -17 43 84 -28 41 67 -15
7074 -15 -58 21 -12 -55 -47 45 -44 -67 15 1 -54 21 44 5 -32 34 -6 -51 12 -17 -88 -39 63 -19 -34 23 -8 -75 -47 24
7104 24 5 -36 35 33 -64 5 4 -21 -35 88 56 -65 45 26 -44 -21 33 -73 -106 70 -3 -87 -1 46 -85 -17 113 -2
7132 -2 -105 42 17 -68 -7 72 -4 -89 41 29 -50 -5 50 -86 0 83 -50 -99 18 125 -55 6 70 -60 -39 33
7158 33 133 -38 62 149 -89 -23 61 -79 -58 75 77 -47 -28 67 -55 -37 71 2 -117 34 68 -128 -25 119
7182 119 -2 -15 43 81 -97 17 154 -46 -81 14 -40 -75 94 18 -76 23 63 -87 -103 4 57 -95 -18 80 -68
7207 -68 -51 52 -3 -94 86 46 -98 34 61 -65 -89 51 -8 -86 -38 105 -136 -21 116 29 -48 8 -30 -67 8
7232 8 85 -12 -78 109 15 -90 14 41 -69 9 53 -12 -72 21 0 -27 -11 52 10 -1 34 23 -63 37 15 -25 -10 81
7260 81 -4 -76 53 21 -89 29 29 -61 -9 55 15 -42 25 8 28 -5 19 -30 21 4 84 -23 -13 38 -60 -27 33 27 22 9
7290 9 -11 -29 6 1 -4 -13 9 62 -35 -43 39 -76 -24 -14 61 -51 54 -8 -10 34 -48 9 -50 28 25 15 24 12 0 21 20 58 -5
7323 -5 -20 4 -10 -46 -22 -52 -40 59 53 36 -19 -42 10 -14 17 10 2 -21 13 -38 -20 -9 14 -21 15 37 -11 -23 -8 10 13 -4 19
7356 19 -16 -13 -2 49 7 11 40 -65 -8 31 30 -32 44 20 -22 -19 15 -45 -7 67 13 9 10 70 -52 -36 13 -9 -47 -13 79 -31
7388 -31 -24 -28 -52 -30 22 -7 -24 18 30 -6 23 72 -31 -18 -19 12 9 15 4 -36 -33 16 -14 39 -11 12 9 -9 -10 -42 -32 49 20 -44
7422 -44 12 11 18 -10 -46 -8 -26 50 -3 -21 -9 -23 -7 -19 7 2 -34 -48 57 -62 57 41 -10 -8 90 -14 6 15 -13 -43 -12
7453 -12 39 -50 8 23 17 43 44 79 -12 -2 -24 -24 -20 46 76 -79 4 44 -57 -5 68 7 -53 34 45 -41 -51 14 -44 -37 15 -7
7485 -7 -2 32 28 -55 2 52 -43 8 2 38 18 10 40 4 8 7 39 -54 48 51 -18 42 15 31 -39 2 34 -37 -33 32 5 3 -33 28 13
7520 13 27 24 21 -27 32 24 -61 25 -17 -13 39 94 37 -18 4 30 -14 50 52 81 15 46 7 -30 -11 -20 -14 -45 50 -9 -45 -42 -53 -67
7554 -67 -39 32 -21 -45 49 -26 -54 -21 49 -18 -29 16 -4 -46 6 45 6 -61 -29 9 -82 4 21 -13 13 99 -20 -53 79
7583 79 23 -29 49 57 -17 -77 82 -68 -78 40 42 -85 -31 22 -54 -61 85 86 -53 62 85 -53 -112 63 -29 -99 68
7610 68 51 -73 -14 77 -35 -28 77 39 -96 -8 10 -93 3 98 -27 -97 62 63 -80 24 122 -33 -56 62 -49
7635 -49 -60 37 37 -22 -34 104 -42 -106 44 82 -105 38 130 -163 -85 85 9 -110 72 104 -65 5 86 -66 -76
7660 -76 93 89 -68 -27 62 -68 -44 132 -30 -117 43 1 -111 -12 108 -5 -26 7 4 -134 19 41 -59 -64 136
7685 136 -28 -62 46 53 -57 36 109 -38 -12 113 49 -115 68 74 -47 -12 120 -50 -48 8 -3 -77 11 44 -89 -19
7711 -19 86 -19 -72 8 59 -26 -16 63 -6 -20 41 -21 -83 -3 -34 -26 -1 33 -6 -64 13 53 -59 -3 74 -4 -45 67 -27
7740 -27 -28 23 47 -42 -23 82 29 -15 1 -26 -13 -18 -14 55 -15 41 73 -43 9 27 -9 3 1 26 -13 16 4 -40 4 26 12
7771 12 -86 -50 39 37 -25 -9 -8 -25 4 45 29 -19 46 16 -20 52 103 -50 -20 -26 -5 -16 -55 8 4 27 18 53 -10 56 -1 -35
7803 -35 38 21 -8 43 53 -13 -44 40 12 -24 14 39 -6 34 49 -5 -76 31 21 -53 6 93 40 -3 83 31 -50 7 75 -44
7833 -44 -81 53 54 -43 11 22 -39 20 54 -52 -26 22 1 -54 14 -17 -8 -20 -24 17 -25 3 34 0 10 6 -40 -38 3 7 -33 14
7865 14 52 -22 -38 2 -32 -72 24 12 6 -32 68 -44 -28 9 19 -18 60 45 -32 -15 3 -24 -51 45 30 -43 -14 13 -14 -100
7895 -100 11 12 -51 -3 -6 -23 -48 21 -28 -48 6 -4 26 31 12 -16 -6 -5 -26 20 49 54 -35 -53 31 20 -2 7 5 -1 3 15 -3 -7
7929 -7 -16 -8 0 -7 6 3 15 55 -15 27 56 -63 -55 62 41 11 16 23 -37 -13 -43 -71 -60 19 -34 -58 30 32 32 -47 27 13 40 1 27
7964 27 14 -39 -61 22 -61 -39 48 -8 -35 -47 -7 -39 31 8 41 -23 -12 27 27 36 -5 3 -10 12 -28 -31 -14 -19 -41 -19 13 -20 4
7997 4 21 63 -5 11 59 -26 46 43 23 -28 27 6 -49 18 -6 19 14 15 23 -64 -56 24 -11 -19 59 23 -53 13 105 -31 45 77 1
8030 1 7 27 -22 -17 58 76 -15 3 37 -13 -26 8 61 21 -7 24 -9 5 46 -4 18 13 23 -67 7 89 -13 -40 69 25 -21
8061 -21 -50 61 -51 -12 20 -5 -61 -33 19 -65 -7 77 -12 -59 37 33 -64 30 73 -29 -32 80 32 -74 0 38 -82 -21
8089 -21 93 -13 1 20 -31 -63 71 61 -53 10 53 -58 -59 74 -18 -98 7 90 -66 -58 72 36 -110 26 18 -73
8115 -73 -30 29 -21 -50 60 78 -154 -8 78 -61 -53 37 -39 -57 22 36 -31 29 107 -13 -41 90 2 -87 40 29 -46
8142 -46 -36 96 -92 -113 56 -31 -89 -3 67 -40 -71 41 32 -30 0 79 -26 4 73 -4 -85 43 61 -45 -96 77
8168 77 11 -10 55 34 -86 -16 52 -32 -56 32 -71 -60 49 23 -134 10 26 -80 -21 59 0 -75 1
8191A
##END NTUPLES=NMR FID
##END=
