##TITLE=1H_LR-748-R2-M1
 CDCl3
 8 sc, 
 8.04.2022
##JCAMPDX= 6.0         $$ Bruker NMR JCAMP-DX V2.0
##DATA TYPE= NMR FID
##DATA CLASS= NTUPLES
##ORIGIN= UXNMR, Bruker Analytische Messtechnik GmbH
##OWNER= root
$$ XWIN-NMR		Version 3.5
$$ Fri Apr  8 15:46:18 2022 Russian Standard Time (UT+4h)  she@DPX200
##.OBSERVE FREQUENCY= 200.13135
##.OBSERVE NUCLEUS= ^1H
##.DELAY= (6, 6)
##.ACQUISITION MODE= SIMULTANEOUS
##.ACQUISITION SCHEME= undefined
##.AVERAGES= 8
##.DIGITISER RES= 18
##SPECTROMETER/DATA SYSTEM= spect
##.PULSE SEQUENCE= zg30
##.SOLVENT NAME= CDCl3
##.SHIFT REFERENCE= (INTERNAL, CDCl3, 0, 15.7039)
##AUDIT TRAIL= $$ (NUMBER, WHEN, WHO, WHERE, WHAT)
$$ ##TITLE= Audit trail, XWIN-NMR		Version 3.5
$$ ##JCAMPDX= 5.01
$$ ##ORIGIN= Bruker BioSpin GmbH
$$ ##OWNER= she
$$ F:/spectra/data/she/nmr/H-F/1/audita.txt
$$ ##AUDIT TRAIL=  $$ (NUMBER, WHEN, WHO, WHERE, WHAT)
(   1,<2022-04-08 15:44:55.54 +0400>,<she>,<DPX200>,
      <created by zg, POWCHK disabled, PULCHK disabled
       configuration hash MD5:
       00 E9 B6 7A A2 85 ED C7 34 08 36 98 17 FE 4E 26
       data hash MD5: 16K
       6B 0D EE 59 42 CA 60 9B B0 DF 27 E7 83 66 2C FA>)
$$ ##END=
$$ 
$$ hash MD5
$$ 4C CC B6 F6 B7 CF D8 91 B8 85 73 47 66 19 25 C5
##$RELAX= 
##$RELAX= 
##$RELAX= 
##$RELAX= 
##$RELAX= 
##$RELAX= 
$$ Bruker specific parameters
$$ --------------------------
##$DU= <F:/spectra>
##$EXPNO= 1
##$NAME= <H-F>
##$PROCNO= 1
##$TYPE= <nmr>
##$USER= <she>
##$AMP= (0..31)
100 100 100 100 100 100 100 100 100 100 100 100 100 100 100 100 100 100 
100 100 100 100 100 100 100 100 100 100 100 100 100 100 
##$AQSEQ= 0
##$AQ_mod= 1
##$AUNM= <au_zg>
##$AUTOPOS= <>
##$BF1= 200.13
##$BF2= 200.13
##$BF3= 200.13
##$BF4= 200.13
##$BF5= 200.13
##$BF6= 200.13
##$BF7= 200.13
##$BF8= 200.13
##$BYTORDA= 1
##$CFDGTYP= 0
##$CFRGTYP= 5
##$CHEMSTR= <none>
##$CNST= (0..31)
1 1 145 1 1 1 1 1 1 1 1 1 1 1 1 1 1 1 1 1 1 1 1 1 1 1 1 1 1 1 1 1 
##$CPDPRG= <>
##$CPDPRG1= <>
##$CPDPRG2= <>
##$CPDPRG3= <>
##$CPDPRG4= <mlev>
##$CPDPRG5= <mlev>
##$CPDPRG6= <mlev>
##$CPDPRG7= <mlev>
##$CPDPRG8= <mlev>
##$CPDPRGB= <>
##$CPDPRGT= <>
##$D= (0..31)
0 1.2 0 0 0 0 0 0 0 0.06 0 0.03 0 0 0 0 0.0002 0 0 0 0 0 0 0 0 0 0 0 0 
0 0 0 
##$DATE= 1649418294
##$DBL= (0..7)
120 120 120 120 120 120 120 120 
##$DBP= (0..7)
150 150 150 150 150 150 150 150 
##$DBP07= 0
##$DBPNAM0= <>
##$DBPNAM1= <>
##$DBPNAM2= <>
##$DBPNAM3= <>
##$DBPNAM4= <>
##$DBPNAM5= <>
##$DBPNAM6= <>
##$DBPNAM7= <>
##$DBPOAL= (0..7)
0.5 0.5 0.5 0.5 0.5 0.5 0.5 0.5 
##$DBPOFFS= (0..7)
0 0 0 0 0 0 0 0 
##$DE= 6
##$DECBNUC= <off>
##$DECIM= 32
##$DECNUC= <off>
##$DECSTAT= 4
##$DIGMOD= 1
##$DIGTYP= 9
##$DL= (0..7)
0 120 120 120 120 120 120 120 
##$DP= (0..7)
150 150 150 150 150 150 150 150 
##$DP07= 0
##$DPNAME0= <>
##$DPNAME1= <>
##$DPNAME2= <>
##$DPNAME3= <>
##$DPNAME4= <>
##$DPNAME5= <>
##$DPNAME6= <>
##$DPNAME7= <>
##$DPOAL= (0..7)
0.5 0.5 0.5 0.5 0.5 0.5 0.5 0.5 
##$DPOFFS= (0..7)
0 0 0 0 0 0 0 0 
##$DQDMODE= 0
##$DR= 18
##$DS= 0
##$DSLIST= <SSSSSSSSSSSSSSS>
$$ [...]
##$SUBNAM2= <"">
##$SUBNAM3= <"">
##$SUBNAM4= <"">
##$SUBNAM5= <"">
##$SUBNAM6= <"">
##$SUBNAM7= <"">
##$SUBNAM8= <"">
##$SUBNAM9= <"">
##$SW= 18.05172834244
##$SWIBOX= (0..15)
0 0 2 0 0 0 0 0 0 0 0 0 0 0 0 0 
##$SW_h= 3612.71676300578
##$TD= 16384
##$TD0= 1
##$TE= 0
##$TE2= 300
##$TE3= 300
##$TEG= 300
##$TL= (0..7)
0 120 120 120 120 120 120 120 
##$TP= (0..7)
150 150 150 150 150 150 150 150 
##$TP07= 0
##$TPNAME0= <>
##$TPNAME1= <>
##$TPNAME2= <>
##$TPNAME3= <>
##$TPNAME4= <>
##$TPNAME5= <>
##$TPNAME6= <>
##$TPNAME7= <>
##$TPOAL= (0..7)
0.5 0.5 0.5 0.5 0.5 0.5 0.5 0.5 
##$TPOFFS= (0..7)
0 0 0 0 0 0 0 0 
##$TUNHIN= 0
##$TUNHOUT= 0
##$TUNXOUT= 0
##$USERA1= <user>
##$USERA2= <user>
##$USERA3= <user>
##$USERA4= <user>
##$USERA5= <user>
##$V9= 5
##$VALIST= <valist>
##$VCLIST= <CCCCCCCCCCCCCCC>
##$VD= 0
##$VDLIST= <DDDDDDDDDDDDDDD>
##$VPLIST= <PPPPPPPPPPPPPPP>
##$VTLIST= <TTTTTTTTTTTTTTT>
##$WBST= 1024
##$WBSW= 4
##$XGAIN= (0..3)
0 0 0 0 
##$XL= 0
##$YL= 0
##$YMAX_a= 318455
##$YMIN_a= -341099
##$ZGOPTNS= <>
##$ZL1= 120
##$ZL2= 120
##$ZL3= 120
##$ZL4= 120
##$ABSF1= 10
##$ABSF2= 0
##$ABSG= 5
##$ABSL= 3
##$ALPHA= 0
##$AQORDER= 0
##$ASSFAC= 0
##$ASSFACI= 0
##$ASSFACX= 0
##$ASSWID= 0
##$AUNMP= <proc_1d>
##$AZFE= 0.1
##$AZFW= 0.1
##$BCFW= 1
##$BC_mod= 2
##$BYTORDP= 1
##$COROFFS= 0
##$CY= 11.3945322036743
##$DATMOD= 1
##$DC= 2
##$DFILT= <>
##$DTYPP= 0
##$F1P= 2.36226072786647
##$F2P= -0.459571619588291
##$FCOR= 0.5
##$FTSIZE= 0
##$FT_mod= 4
##$GAMMA= 1
##$GB= 0.15
##$INTBC= 1
##$INTSCL= 1
##$ISEN= 128
##$LB= 0.24
##$LEV0= 0
##$LPBIN= 0
##$MAXI= 10000
##$MC2= 0
##$MEAN= 0
##$ME_mod= 0
##$MI= 1.114404
##$NCOEF= 0
##$NC_proc= 0
##$NLEV= 6
##$NOISF1= 3.799351
##$NOISF2= 2.8
##$NSP= 1
##$NTH_PI= 0
##$NZP= 0
##$OFFSET= 15.70392
##$PC= 1
##$PHC0= -18389.55
##$PHC1= 11.80078
##$PH_mod= 1
##$PKNL= yes
##$PPARMOD= 0
##$PSCAL= 0
##$PSIGN= 0
##$REVERSE= no
##$SF= 200.130013532006
##$SI= 16384
##$SIGF1= 3
##$SIGF2= 2
##$SINO= 400
##$SIOLD= 16384
##$SREGLST= <1H.CDCl3>
##$SSB= 0
##$STSI= 0
##$STSR= 0
##$SW_p= 3612.71676300578
##$SYMM= 0
##$S_DEV= 0
##$TDeff= 0
##$TDoff= 0
##$TI= <>
##$TILT= no
##$TM1= 0
##$TM2= 0
##$TOPLEV= 0
##$USERP1= <user>
##$USERP2= <user>
##$USERP3= <user>
##$USERP4= <user>
##$USERP5= <user>
##$WDW= 1
##$XDIM= 8192
##$YMAX_p= 0
##$YMIN_p= 0
$$ End of Bruker specific parameters
$$ ---------------------------------
##NTUPLES= NMR FID
##VAR_NAME=  TIME,          FID/REAL,        FID/IMAG
##SYMBOL=    X,             R,               I
##VAR_TYPE=  INDEPENDENT,   DEPENDENT,       DEPENDENT
##VAR_FORM=  AFFN,          ASDF,            ASDF
##VAR_DIM=   8192,          8192,            8192
##UNITS=     SECONDS,       ARBITRARY UNITS, ARBITRARY UNITS
##FACTOR=    0.0002768,     1,               1
##FIRST=     0,             0,               0
##LAST=      2.2672688,     0,               0
##MIN=       0,             -341099,         0
##MAX=       2.2672688,     318455,          0
$$ Real data points
##PAGE= N=1
##DATA TABLE= (X++(R..R)), XYDATA
0@%%%%%%%%%%qJ6j6J6k4L2m0M8n6P2q8J04j21J45j72J99k33K71l14L62m12M68
$$ 0 0 0 0 0 0 0 0 0 0 0 -8 8 -8 8 -16 16 -24 24 -32 40 -48 56 -65 80 -92 107 -126 145 -169 193 -219 249
32B49n36O09o89P77q74R82j097J222j361J516j683J867k067K284k523K784l067
$$ 249 -287 322 -367 410 -464 518 -579 643 -718 798 -885 982 -1085 1199 -1324 1460 -1607
49a607L379l722M100m520M986n506O089o749P504q377R400j0617J2095j3936J6297
$$ -1607 1772 -1950 2150 -2370 2616 -2890 3199 -3550 3954 -4423 4977 -5640 6455 -7481 8816
64H816j9459K3941l0838M2949p0510K53315O7174k17905J20659j51455p6577J47089
$$ 8816 -10643 13298 -17540 25409 -45101 208214 275388 57483 178142 26687 -49890 97199
76I7199L8555j77751N1882L8345j31664J0377J09083k02112j75013R5569J3034
$$ 97199 135754 -41997 9885 48230 -83434 -73057 36026 -166086 -341099 -245530 -232496
87b32496p2798K12039J81608r9545k3289J05675p5576k5918J67488O829j20358
$$ -232496 -305294 -93255 88353 -11192 -34481 71194 -4382 -30300 137188 144017 23659
98B3659R3326P6403r5269O6519J53817j25676j66679J5473p7857j34280Q7787
$$ 23659 116985 193388 98119 164638 318455 192779 26100 41573 -36284 -170564 -82777
109h2777P4450j10113n319O9698r6594l1862J43714j4460j26076N7623N6705o9727
$$ -82777 -8327 -118440 -123759 -54061 -150655 -182517 -38803 -53263 -179339 -121716 -65011 -134738
121a34738Q4822J79109p993l1337P7927l5689q4334P9442M2428j05230p761M7876
$$ -134738 -49916 129193 121200 89863 167790 132101 47767 127209 169637 64407 56646 104522
133A04522q7752l6537R7092k1734j08454J893k4922j10336J6951Q5376l3118r599
$$ 104522 16770 -19767 77325 55591 -52863 -50970 -75892 -186228 -169277 -83901 -117019 -126618
145a26618Q3822p569l8936Q6850N7408n1772J1977M6366m1419L907R6102J8639
$$ -126618 -42796 -50365 -89301 -2451 54957 3185 15162 61528 20109 24016 120118 138757
157A38757k8887L5048j4350q8520q677K0121o6208m0737K5619l3679m1754M7044
$$ 138757 109870 144918 130568 42048 33371 53492 -12716 -53453 -27834 -61513 -103267 -56223
169e6223K4521m3156Q59J0447m9959r182N9778J9939R005O2170L1548j3271L0559
$$ -56223 -31702 -74858 -73999 -63552 -113511 -122693 -62915 -42976 -33971 28199 59747 46476 77035
182G7035L2382k8021j4112J2473l0274k6295L1110J3154k3911K236n969n4557
$$ 77035 109417 81396 67284 79757 49483 23188 54298 67452 43541 45777 39808 -14749
194a4749l6841n755k7910k2244J6103P014k271L1624L1533j59O926J3700j2320
$$ -14749 -51590 -57345 -85255 -107499 -91396 -84382 -86653 -55029 -23496 -23655 -16729 -3029 -15349
207a5349o238K5011K2092J7687L4338K1650m528l12l145l0177l1288j4457k1510
$$ -15349 -21587 3424 25516 43203 77541 99191 94663 94351 91206 61029 29741 15284 -6226
220f226k2835R21R448o90j521o712j8059j7971j3398j2858K181K1516K0409K0185
$$ -6226 -29061 -28140 -18692 -19382 -20903 -27615 -45674 -63645 -77043 -89901 -87720 -66204 -45795 -25610
234b5610L3107L0572J0848K989K096p587j0527m073L164R929J2497N116k550o150
$$ -25610 7497 38069 48917 51906 54002 46415 35888 31815 34979 44908 57405 62521 59971 53821
248E3821j7560l0454k9623k2809j9651j0503L068J1418J5693J6527P775P15o43
$$ 53821 36261 5807 -23816 -46625 -66276 -76779 -73711 -62293 -46600 -30073 -22298 -21583 -22226
261b2226m612p070K118J4912J9187K1781K5497K1725J1752l78j2821j8970j8688
$$ -22226 -26838 -33908 -31790 -16878 2309 24090 49587 71312 83064 82686 69865 50895 32207
274C2207k0005j6759m144N226K597N8R52o206j7412k0631j6737j1790m083O925
$$ 32207 12202 -4557 -8701 -3475 -878 -820 132 -6074 -23486 -44117 -60854 -72644 -76727 -69802
288f9802J7706K5083K5338J9268J3065N956l329q538o174j679K406Q932J3555
$$ -69802 -52096 -27013 -1675 17593 30658 36614 33285 24747 18573 16894 19300 28232 41787
301D1787J1281M494j999j1761k1602k5303k3125j8140j0471L3Q525J2305J1457
$$ 41787 53068 57562 55563 43802 22200 -3103 -26228 -44368 -54839 -54806 -46281 -33976 -22519
314b2519P430K235l940q156p668j231O389J2464J9398K2784J9414J1370K872m933
$$ -22519 -15089 -12854 -16794 -24950 -32618 -33849 -27460 -14996 4402 27186 46600 57970 60842 55909
328E5909j3191j6903j4448r644m296J784N417M758L56n250j0483j5065j7048j2668
$$ 55909 42718 25815 11367 1723 -2573 -789 4628 9386 9742 4492 -5991 -21056 -38104 -50772
342e0772n427K807R638J5962J9749J5409P903M095o35p385o810l37M087O508J0218
$$ -50772 -56199 -53392 -43754 -27792 -8043 7366 15269 19364 18729 11344 4534 4197 8284 14792 25010
357B5010J1940O880K06p309j4082j6040j5851j4982p493K758M144M197Q908O553
$$ 25010 36950 43830 44036 36727 22645 6605 -9246 -24228 -31721 -28963 -24819 -20622 -11714 -5161
371e161l982n775l474p828n675N234R811J1156J6674J5358N802L060r37j0598
$$ -5161 -9143 -14918 -18392 -26220 -31895 -26661 -16850 -5694 10980 26338 32140 35200 34263 23665
385B3665j0611k997n090m945O642P265j901J105J899j3358j5662n987j0166r674
$$ 23665 13054 10057 4967 22 6664 13929 12028 13133 15032 1674 -13988 -19975 -30141 -39815
399c9815P145J0826K657J0656J3520q32k038N135n919j0149N521N720n8J4500
$$ -39815 -32670 -21844 -19187 -8531 4989 4157 2119 7254 1335 -8814 -3293 2427 2369 16869
413A6869J6498l659l011K826j5494j8956J357k628j4206M837J2285n329K447J3509
$$ 16869 33367 29708 26697 29523 14029 -4927 -3570 -6198 -20404 -15567 -3282 -8611 -6164 7345
427G345p090j5055J114o229j3045J1755J7952q20R494J9030o341q764J2245m790
$$ 7345 255 -14800 -13686 -19915 -32960 -21205 -3253 -4073 5421 24451 18110 9346 21591 16801
441A6801k0850L148N829j3347P530K4437l197r524P403j3397k6600L995N168j5384
$$ 16801 -4049 -901 4928 -8419 -889 23548 20351 10827 18230 4833 -21767 -17772 -12604 -27988
455b7988O152J9174q342N04K6808m01j9596P119k362k7535N550K8374k123K242
$$ -27988 -21836 -2662 -11004 -10500 16308 15907 -3689 3430 1068 -26467 -20917 7457 5334 7576
469G576K4943o131k1867J2305K470k7625j299R151k2982l207L2915M803j0013
$$ 7576 32519 26388 4521 16826 19296 -8329 -9628 -477 -23459 -26666 6249 11052 1039
482A039J7617m869l6057O71J5711j6730J587K9186p346j3489L0882J3211k2765
$$ 1039 18656 13787 -22270 -21599 -5888 -22618 -21031 8155 809 -12680 18202 31413 8648
495H648O060O063l7422j3285K7915j9l875L1043J505l0671Q172J2680k8374m766
$$ 8648 14708 20771 -16651 -29936 -2021 -2040 -5915 25128 26633 -4038 4134 16814 -11560 -16326
509a6326J9876k4506k0536L4311J6674j1863K5013J3972m0250j4219J9717j5778
$$ -16326 3550 -20956 -41492 -7181 9493 -2370 22643 36615 -3635 -17854 1863 -13915
521a3915q442L3128p15k5825K2165K1658k1281O159J8817l6969l0225K2612J027
$$ -13915 -22357 10771 10056 -15769 6396 28054 6773 12932 31749 -5220 -35445 -12833 -11806
534a1806j2649L5162J9915l2532j532K1535k1786j1531K6720j3134l3085K0001
$$ -11806 -24455 10707 30622 -1910 -3442 18093 -3693 -15224 11496 -1638 -34723 -14722
546a4722J9634j2082K2080K9344k9866k4559J4532j3860j9175K9559J2278k8832
$$ -14722 4912 -7170 14910 44254 14388 -10171 4361 -9499 -28674 885 13163 -15669
558a5669Q144K4765j6343R2K9437j8586l7312R793M234j8197K5384L3324j8841
$$ -15669 -7525 17240 897 989 30426 11840 -25472 -15679 -11445 -29642 -4258 29066 10225
571A0225r804J9425j4874j7602K4173M45l2976N493J6356j5716J1243L6508j2011
$$ 10225 421 19846 4972 -12630 11543 11988 -20988 -15495 861 -14855 -3612 32896 20885
584B0885k6773R315p717k6571J7216K2673j8136k595K1805q872o749K7479M90
$$ 20885 -5888 3427 -4290 -30861 -13645 9028 -9108 -11703 10102 1230 -5519 21960 22450
597B2450k8861J702L626k0877J0850L2623n739j1673J4118q736k3799J3136J0258
$$ 22450 -6411 -4709 -1083 -21960 -11110 21513 15774 4101 18219 9483 -14316 -1180 9078
610I078k2726l558J2979j1618l59K8671M165j7027M566l133k3185N916K0697o499
$$ 9078 -13648 -17206 -4227 -15845 -16204 12467 16632 -395 4171 1038 -22147 -16231 4466 -2033
624b033j404J8106m745j0784J7583O491j9309k309L184j8664j985K1852K389p355
$$ -2033 -3437 14669 9924 -860 16723 23214 3905 1596 4780 -13884 -15869 5983 8372 1017
638A017R671l915k0016K154P347j1092j512J0453n446k126J8885P204o679N100
$$ 1017 10688 6773 -13243 -11089 -3742 -14834 -16346 -5893 -11339 -13465 5420 12624 5945 11045
652A1045k51j8307j207J2779j216M7J3542J35r618M876K356j2230m596j249j2301
$$ 11045 10794 -7513 -8720 4059 2843 2890 16432 16567 6949 11825 14181 1951 -2645 -3894 -16195
667a6195l484J0905K547J69J0252k87j2174p24L433p407Q7J0129M58P62J1947
$$ -16195 -19679 -8774 -6227 -6058 4194 3907 -8267 -8991 -5558 -12965 -12878 -2749 -2291 -1529 10418
682A0418O574k001L305j333j2185n548J839l732N04R135J189m224K906k085j0279
$$ 10418 16992 14991 18296 16963 4778 -770 1069 -2663 -2159 6976 8165 3941 6847 4762 -5517
697e517l765k298r175k029P953L723L288J1213M805m537k60l24o072j253N150
$$ -5517 -9282 -11580 -20755 -22784 -14831 -11108 -7820 3393 8198 3661 3401 3077 -2995 -4248 902
712I02J057L462Q790M115o92J853l124j1248o960k924p568k358O425K831Q2M213
$$ 902 1959 5421 14211 18326 17634 19487 16363 5115 -1845 -4769 -12337 -14695 -8270 -5439 -5357 -1144
728a144Q88n543l506k503n135m19N179M479O422J1069N748K91K474j543q138m744
$$ -1144 -256 -5799 -9305 -11808 -16943 -17362 -12183 -7704 -1282 9787 15535 15826 18300 16757 8619 3875
744C875K50k976n42N658L434q60N03k500q228o955n765o508j967M001L867N025
$$ 3875 4125 1149 607 6265 9699 8839 9342 6842 -1386 -8341 -14106 -20614 -22581 -18580 -14713 -9688
760i688P826M854k89L36p77m430j707L061K366L917P459N399P01M58k482p231
$$ -9688 -1862 2992 2703 3039 2262 -2168 -3875 -814 1552 5469 12928 18327 19028 19486 17004 9773
776I773p455n669m759k894J740K358K102K399K94l284k516l430m750j002L799
$$ 9773 2318 -3351 -8110 -11004 -9264 -6906 -4804 -2405 -2111 -5395 -7911 -11341 -16091 -17093 -13294
791a3294M568N166Q262O933K635P04q68l433m273k474r41J073K368J970J303Q2
$$ -13294 -8726 -3560 4702 11635 14270 14974 14106 10673 6400 3926 2985 4058 6426 8396 9699 9781
807I781l127o162o118n225n244k741J535L691L651M369M367J696p32j257o52n74
$$ 9781 6654 492 -5626 -10851 -16095 -18836 -17301 -13610 -9959 -5590 -1223 473 -259 -1516 -2168 -2742
823b742Q04L096M458N475L933K386P42k605m868n699m505l803k544K31J133R06
$$ -2742 -1938 1158 5616 11091 15024 17410 18152 15547 10679 4980 475 -3328 -5872 -5641 -4508 -3602
839c602J29n03k463l362l326j821q78K319M355N689N679N143L112R60o68k011
$$ -3602 -3473 -3976 -6439 -9801 -13127 -14948 -15826 -13507 -9152 -3463 2216 7359 10471 11431 10763 8752
855H752j531q09l04O15K986J576m08j706k446n470o704m399l195k266K69K696
$$ 8752 7221 6412 6108 6723 9709 11285 10877 9171 6725 1255 -5449 -9848 -13043 -15309 -15040 -12344
871a2344K871K816K123j03K7K00j563K95M253M147K903N609N382K81j574j83m023
$$ -12344 -9473 -6657 -4534 -4637 -4610 -4410 -5973 -5678 -1425 2722 5625 11234 16616 16897 15323 15140 11117
888A1117n982k760j802k162N96J902j454j166j335m983n272p35j955k670M525
$$ 11117 5135 2375 573 -1589 -993 909 -545 -1711 -3046 -8029 -13301 -14036 -15991 -18661 -14136
903a4136O053K409N049P089Q08j711K189j301m124K642M309n52K760N112k586
$$ -14136 -8083 -5674 -625 6464 7272 5561 7750 6449 2325 4967 9276 8724 11484 16596 14010
918A4010m121K25n593r704k427j892n959J677O864p23j241O246k100p670L161
$$ 14010 9889 10114 4521 -5183 -7610 -9502 -15461 -13784 -6920 -7643 -8884 -2638 -4738 -12408 -9247
933i247K829m928L536J0009J508K226J1020K487o179J812j512j0855j232N284
$$ -9247 -6418 -11346 -7810 2199 3707 5933 16953 19440 13261 15073 13561 2706 1474 6758
947F758n366j426Q354k888q808L644kj4004k649M439q313j802J3716M237k478
$$ 6758 1392 -34 8320 5432 -3376 268 266 -13738 -16387 -11948 -20261 -22063 -8347 -4110 -6588
962f588J0540M194r797K257P139p507j381J2277j743n202J3015N186j1522Q68
$$ -6588 3952 8146 -1651 606 7745 238 -1143 11134 9391 4189 17204 22390 10868 11736
976A1736K656j7060q515Q364n173q070J1650L108j1619N022Q339j1284l849J0209
$$ 11736 14392 -2668 -11183 -2819 -7992 -16062 -4412 -1304 -12923 -7901 438 -10846 -14695 -4486
990d486o740p517J5530Q676n288J1445J0626j2135l585J0137q501r824J1225m47
$$ -4486 -11226 -18743 -3213 5463 175 11620 22246 10111 6526 16663 8162 -1662 9563 9116
1004I116j3197P184R911j1362k564Q404j3411j4688Q175L84r486J0860J0822r771
$$ 9116 -4081 3103 13014 1652 -912 7492 -5919 -20607 -12432 -12048 -21534 -10674 148 -9623
1018i623K245J4339o219n726J2319j651j3963R376J1366p222M660J4284r279j1709
$$ -9623 -7378 6961 742 -4984 7335 5684 -8279 1097 12463 5241 9901 24185 14906 3197
1032C197P754m115j4209N220M341j3690J46J1914o068m182J1602m301j5355N673
$$ 3197 10951 6836 -7373 -2153 2188 -11502 -11356 558 -5510 -9692 1910 -2391 -17746 -12073
1046a2073O148q939O008J5631l978l489J3267J83r173P262L990j3636j301R308
$$ -12073 -5925 -14864 -8856 6775 2797 -692 12575 12758 3585 10847 14837 1201 -100 9208
1060I208n861k094J1639k897j2875K276m0j2458L12P700p490l248J0554N16m213
$$ 9208 3347 1253 12892 9995 -2880 -604 -644 -13102 -12790 -5090 -12580 -15828 -5274 -4758 -8971
1075h971R882M391r572Q0O909m889N67J1986J378m525N558J346p856M18K577r094
$$ -8971 911 5302 -4270 -4190 2719 -2170 -1603 10383 11761 7236 12794 14140 6284 6702 9279 185
1091A85m789L987l666l697O952K102p311o01J471o576j920O564O07o68N762M175
$$ 185 -4604 -617 -4283 -7980 -1028 1074 -6237 -6838 -5367 -11943 -13863 -7299 -6692 -7360 -1598 2577
1107B577o7L997L682k774j654P61l044j000M516J552j688R79o34n171l011j667
$$ 2577 2510 6507 10189 7415 5761 6522 3478 2478 6994 8546 6858 7837 7203 2032 -979 -2646
1123b646m117l009k42r0M28L252K668P65J041q95j335J01J005J173L882L773J621
$$ -2646 -6763 -9772 -10014 -10104 -9676 -6424 -3756 -2991 -1950 -2845 -4180 -4079 -3074 -1901 1981 5754 7375
1140G375K845K519j571k006j364m067m047k18l95j227K041J164l001j008l39n118
$$ 7375 10220 12739 11168 9162 7798 3731 -316 -534 -929 -2156 -115 1049 -1952 -2960 -3299 -8417
1156h417l321K184q34j188N761M971j20L661N208k253k499K311j607l353L847
$$ -8417 -11738 -9554 -10388 -11576 -5815 -844 -964 2697 7905 5652 3153 5464 3857 504 4351
1171D351K742j507K808L252m720l522P56n898p097K104j53m499L567N980k420
$$ 4351 7093 5586 8394 11646 6926 3404 4160 -1738 -8835 -6731 -6884 -11383 -7816 -1836 -4256
1186d256o75M584k602m826L050J197k652M958O935j167K393O624k429n170K428
$$ -4256 -4931 -347 -2949 -7775 -4725 -3528 -6180 -1222 5713 4546 6939 13563 11134 5964 8392
1201H392k487p849J633L027l893P04N766l087n461K308k502p719Q64K802l529
$$ 8392 5905 -1944 -311 2716 -1177 -473 5293 2206 -3255 -947 -3449 -11168 -10304 -7502 -11031
1216a1031J886P907P88l64O200J76n347J716J775m807J455O520q15j093N582n21
$$ -11031 -9145 -1238 -450 -814 5386 5562 215 1931 3706 -1101 354 6874 6059 4966 10548 10027
1232A0027o344L00q79q055k411L008k081r82N280J582l007K024L42n300m8K914
$$ 10027 3683 3983 3104 -4951 -7362 -4354 -6435 -7417 -2137 -555 -3562 -1538 -1196 -6496 -6544 -3630
1248c630j805N78O728K125m20M801K179n019j722J412m120k889L196M94j551K608
$$ -3630 -5435 -4857 1871 3996 3576 8377 10556 5537 3815 5227 1107 -1782 1414 1908 357 2965
1264B965J058l610j141m36m435k558J630p09l40M450L649j064K064J831k668j629
$$ 2965 4023 413 -728 -1164 -5599 -8157 -6527 -7236 -7576 -3126 523 -541 1523 3354 686 -943
1280i43J674n84j211L236K573j82J520J880k952k431j125k762k886M36M34j05
$$ -943 731 147 -1064 2172 4745 4563 6083 7963 5011 2580 1455 -1307 -4193 -3757 -3323 -3428
1296c428J566J639p34p40L27j808k183J014P74M8K776L535R92P27P69o72j648
$$ -3428 -1862 -223 -957 -1697 -1370 -3178 -5361 -4347 -3573 -3525 -749 2786 3778 4505 5274 4602 2954
1313B954j504r06p84N63O94M53J091K16j216j872j144k008k147j57J208O19J917
$$ 2954 1450 544 -240 323 1017 1470 2561 2777 1561 -311 -1455 -3463 -5610 -5767 -4559 -3940 -2023
1330b023K250J120j07j61n99j056l09j5M94J982J732O77Q61J04j247k596j395
$$ -2023 227 1347 1240 1079 480 -576 -885 -900 -406 1576 3308 3985 4846 4950 3703 1107 -288
1347b88j618q94l23J381N60R38Q44J99j268j158j021j169j28P57J162K227K187
$$ -288 -1906 -2800 -3123 -1742 -1182 -244 600 799 -469 -1627 -2648 -3817 -3945 -3188 -2026 201 2388
1364B388J056N76k8j689j512p27q35l51J041J669O35M83M34r99k119j873r49j657
$$ 2388 3444 4020 3992 2303 791 64 -771 -1122 -81 1588 2223 2706 3140 2141 22 -1851 -2800 -4457
1382d457k12J467J316J756J573N27o14m74j351j876j12J327QJ521K732J387q29
$$ -4457 -4669 -3202 -1886 -130 1443 1970 1356 882 -469 -2345 -2457 -1130 -1122 399 3131 4518 3689
1399C689M42o72k890k180o7j014l57K199Q09Q19J557n6k193q47r14k233r26K553
$$ 3689 4131 3459 569 -1611 -1678 -2692 -3049 -850 -41 778 2335 2279 86 -761 -1675 -3908 -4834 -2281
1417b281O26R86L181J672j132n72J35l612j478J166l07j64K708J756m85J076M49
$$ -2281 -1655 -669 2512 4184 3052 2480 2615 -997 -2475 -1309 -1616 -1780 928 2684 2199 3275 3724
1434C724l389k067J63k194o45L026J328l03K693J576k548q49R58l404k622K028
$$ 3724 335 -1732 -1569 -3763 -4408 -1382 -54 -357 2336 3912 1364 515 1473 -1931 -4553 -2525
1450b525R58n68L586K689j593l58N24l043k031J367j255j284L263J971j250K031
$$ -2525 -1567 -2135 1451 4140 2547 2189 2713 -330 -2361 -994 -2249 -3533 -270 1701 451 2482
1466B482L056l707k865J220k272k705L042K118j377J603K874k146q86K020l020
$$ 2482 5538 1831 -1034 186 -2086 -4791 -1749 369 -1008 595 3469 1323 437 2457 -563
1481e63l409J237n0j483L822L827j509k10K193k987l290K497J88l079J521K903
$$ -563 -3972 -2735 -2785 -4268 -446 3381 1872 1662 3855 868 -2422 75 263 -2816 -1295 1608
1497A608j704J727L977k135k956O22k266m067K338K574j920J475L066k364j090
$$ 1608 -96 1631 5608 3473 517 1139 -1127 -5194 -2856 -282 -2202 -727 2339 -25 -1115
1512a115L245j263l994J146J43k780K589N461q49m25K595k092l954K227M12l091
$$ -1115 2130 867 -3127 -1981 -1838 -4618 -2029 3432 2583 2158 4753 2661 -1293 934 1346 -1745
1528a745J302J703k445J002M296j448k794J525k729n243K102L053j626J403L578
$$ -1745 -443 1260 -1185 -183 4113 2665 -129 1396 -1333 -6576 -4474 -1421 -3047 -1644 1934
1543A934j970j400L477k88k793J353m82l278K217M551n83O34K773l023m150K103
$$ 1934 -36 -1436 2041 1753 -1040 313 -169 -3447 -1230 3321 2738 3372 6145 3122 -1028 1075
1559A075k38l331J193J815l010j20M211q88j722J982j971m914J881J832j166K530
$$ 1075 837 -2494 -1301 514 -2496 -2616 1595 707 -1015 967 -1004 -5918 -4037 -2205 -3371 -841
1575h41M170k145j074L438q00k878K421j3m655J624L718j400O24L386k790m215
$$ -841 3329 1184 110 3548 2748 -130 2291 2278 -2377 -753 2965 1565 2189 5575 2785 -1430
1591a430J012p25l979K276J792l040P30M352j412r15L788j810m660K053J892k457
$$ -1430 -418 -1143 -5122 -2846 -1054 -4094 -3364 988 -424 -1339 2449 639 -4021 -1968 -76 -2533
1607b533K275N205j717j500L478j218l407J615m39m485O43K649j774M62M328k480
$$ -2533 -258 4947 3230 1730 5208 3990 583 2198 1759 -2726 -2083 566 -1208 -746 3582 1102
1623A102l868K068p95m563J874L251k995O86N364m35j095L596o15m745J309J650
$$ 1102 -2766 -698 -1493 -6056 -4182 -931 -3926 -3240 2124 1689 594 4190 3575 -1170 139 1789
1639A789l212J139M659j930j239L931j617m684J770J19o063L96L516j779l27N494
$$ 1789 -1423 -284 4375 2445 1206 5137 3520 -1164 606 725 -5338 -4942 -1426 -3205 -3532 1962
1655A962j069l627K536R76m612P75L445k670N31N485J24j607L775m32n201M57
$$ 1962 893 -2734 -198 778 -3834 -3059 386 -2284 -1753 3732 3856 2249 6024 5592 391 848
1671H48J466m129o43M359j464k672M304J53m617P95R46n015q93M033r19o4N052
$$ 848 2314 -1815 -2458 1901 437 -2235 2069 2222 -2395 -1600 -654 -5669 -6562 -2529 -3448 -3512 1540
1688A540Q81k449K378J250l797O6L001k944j156M460Q69k171K442R99m978j558
$$ 1540 2421 -28 2350 3600 -197 -131 2870 -74 -1230 3230 4099 1928 4370 5369 391 -1167
1704a167J132l190j692L176m66k018L385J407k647Q53J686l456j366L155J1m24
$$ -1167 -35 -3225 -4917 -1741 -2207 -4225 -840 567 -2080 -1227 459 -2997 -4363 -1208 -1197 -1621
1720a621M279K201k210J111J840l376j380J747k143k320K259R83j821J917R18
$$ -1621 2658 4859 2649 3760 5600 2224 844 2591 448 -1872 387 1370 -451 1466 2384
1735B384l277j901R14k426j648K755O99j278K956K431j442O99K397k234j922J792
$$ 2384 -893 -2794 -1880 -4306 -5954 -3199 -2500 -3778 -822 1609 167 866 3263 1029 -893 899
1751H99N29r92J923K316j141p8P52k306j611O5j804k283J122Q93j506J420J734
$$ 899 1428 436 2359 4675 3534 3456 4208 1902 291 356 -1448 -3731 -2609 -1716 -3222 -1802 -68
1768f8j472j122Q58p86j559J621J592K48J219K320K24K99J068j051j809K79p67
$$ -68 -1540 -2662 -1804 -2590 -4149 -2528 -936 -688 531 2851 3075 3374 4442 3391 1582 1861 1094
1785A094q81R19J561j239p8M0j505j894m82q00j591K47J602J19Q63J963J67l07
$$ 1094 213 1132 2693 1454 1376 1416 -89 -1983 -2465 -3265 -4856 -4609 -3007 -2888 -2025 -62 105 -202
1803b02L70k44p79N89J183L82J003J524Lk16J5r08j719q57q11p45l35R94L8k25
$$ -202 168 -76 -855 -266 917 1299 2302 3826 3829 3613 3628 2720 1001 144 -667 -1412 -1747 -753 -715 -940
1823i40L18n92q12j034k86k05M48R18J062J553J429M31L21L8k98j198m24L67L53
$$ -940 -622 -1214 -2026 -3060 -3346 -3551 -3103 -2185 -1123 430 1859 2290 2611 2649 2351 1153 729 1096 1449
1842A449O4Q31M97l15q90r60j080j304j450k48J48N76N38J001N52L94l17m14k77
$$ 1449 1513 2344 2841 2526 1636 676 -404 -1708 -3158 -3406 -3258 -2682 -2144 -1143 -591 -197 -514 -928 -1205
1861a205m60J98J104J051J138P17J382k50n87p46j237j112m07l25j49P10M08J25
$$ -1205 -1665 -1467 -363 688 1826 2543 3925 3675 3088 2342 1105 -7 -414 -739 -888 -178 230 355
1879C55j58n63j321q42m55p17N9J279J163R11J320J119l16k41k25o94o33L32L19
$$ 355 197 -366 -1687 -2529 -2984 -3701 -3642 -2363 -1200 -289 1031 2150 1834 1593 1368 674 41 373 692
1898F92N83J317K94m0l56q41j706j300n64q22m79J135N55L82R03P51j004r72J87
$$ 692 1275 2592 2886 2846 2490 1649 -57 -1357 -1921 -2743 -3222 -2087 -1532 -1150 -247 504 -500 -1472 -1285
1917a285o20J26J037J024M95J631O57j36jk64j334j709J03m7p75J379J192o02
$$ -1285 -1905 -1779 -742 282 777 2408 3065 2929 2928 2664 1330 -379 -276 -323 -1098 281 1473 871
1935H71o61J36j144j472k23m78m86R38J098N61J238J641o85l51Q0j168n45R40
$$ 871 210 346 -798 -2270 -2493 -2971 -3457 -2519 -1421 -860 378 2019 1334 983 1063 -105 -650 290
1953B90J094j97O66J336p99n59N59j287k432Nn74q13O65J474j62k33O71p62q45
$$ 290 1384 1187 1853 3189 2390 1831 2390 1103 -1329 -1324 -1898 -2711 -2046 -572 -734 -967 -296 -1058 -1903
1972a903M96n9n89Q63J080J16J101K312m12q29J16o69j872K48J079l58m02J156
$$ -1903 -1407 -1466 -2055 -1192 -112 4 1105 3417 3005 2176 2292 1623 -249 -1 1078 720 318 1474
1990A474o37q83P66r41j536k64o11j280Q78K375K44L43R89j09j643R54O60r22
$$ 1474 837 -46 720 -221 -1757 -2021 -2632 -3912 -3034 -659 -415 -72 917 808 -835 119 779 -143
2008a43K16J051k65N72J507M72r47l59j219k024j38K48k75N27O26p44j89N86k80
$$ -143 73 1124 859 1431 2938 3410 2463 2104 885 -1139 -1277 -1029 -1304 -777 -151 -895 -1084 -498 -778
2027g78p24R3n26j163R37J871O42R63J299n50r53J35l30j40L47J36j006L10J198
$$ -778 -1502 -1409 -1935 -3098 -2161 -290 352 1315 2614 2064 1111 1246 916 776 1123 1259 253 563 1761
2046A761m26q3K75j295k217m31K58m26J375P50m66M48N94l19n45J004p06j264
$$ 1761 1335 1252 1527 232 -1985 -2416 -2158 -2584 -1209 -459 -925 -477 117 -202 -747 257 -449 -1713
2064a713J146R71l48J696J827j203j075O26j139j362O33J80j551J072Q82r17K20
$$ -1713 -567 404 56 1752 3579 2376 1301 1927 788 -574 59 239 -1312 -240 642 -275 -55
2081e5J152j521j871N11j38j218J626J845j048P33J735p44j041J648p70k002J002
$$ -55 1097 -424 -2295 -1784 -1922 -3140 -1514 331 -717 16 1751 1007 -34 1614 844 -1158 -156
2098a56J300j217Q41K099j209j129J334j312k312Q65L58k275R77K267j045l06
$$ -156 1144 -73 768 2867 1658 529 1863 551 -1761 -896 -538 -2813 -1836 431 -614 -920
2114i20K278p92k576J326N85k234R19K547j029j62K940p50j767J497n34k954Q14
$$ -920 1358 566 -2010 -684 -99 -2333 -1414 1133 104 -58 2882 2132 365 1862 1328 -1626 -812
2131h12J543j804J03L183j233k086K492l02k975N38J072k230l30L421l3j058K547
$$ -812 731 -1073 -970 2213 980 -1106 1386 1084 -1891 -1353 -281 -2511 -2841 580 547 -511 2036
2148B036k91k710O42J382k366R1K432j485r89L351M04k313J136M67l614m88K545
$$ 2036 1745 -965 -323 1059 -1307 -1216 1216 -269 -1258 2093 2497 184 1320 1787 -1827 -2315 230
2165B30j279p78L024l03k503K046J260k291k84J624k222j476L175L91r70K378
$$ 230 -1049 -1827 1197 894 -1609 437 1697 -594 -878 746 -1476 -2952 223 614 -356 2022
2181B022O36l043j8J686k051q97K293o61k003K257J749k011M41J611k903j717
$$ 2022 2658 -385 -403 1283 -768 -1665 628 -33 -2036 221 1970 -41 400 2011 -892 -2609
2197b609K170k54j099K123J078j987R70J570j741o16J995j654k492K111J200j174
$$ -2609 -439 -693 -1792 331 1409 -578 392 1962 221 -395 1600 -54 -2546 -435 765 -409
2213d09J215J964k093j529J122n94j479J517K85j645Q94J440n10Q9J512j577j794
$$ -409 806 2770 677 -852 270 -324 -1803 -286 -1 -1646 -752 688 178 267 1779 202 -1592
2230a592J108K15j228J256J894j163l06J487o77j222J022n20j762N14Q74k92K95
$$ -1592 -484 -269 -1497 -241 1653 490 184 1671 994 -228 794 274 -1488 -974 -100 -392 -97
2247i7J491n88j162J62j70j232O53Q59j151N51J340j78j96J422o20j783J86M94
$$ -97 1394 806 -356 -194 -364 -1596 -943 -84 -1235 -684 656 478 282 1704 1084 -699 -513 -19
2265a9q59N39J051j01l16M91k15q85O38m78r52j24N69r7M47J475o0j034K79J17
$$ -19 -878 -339 712 611 295 786 571 -314 324 -154 -1106 -1230 -661 -758 -311 1164 1104 70 349 466
2285D66j194n8Q14k64N3P51J34j93N14l07j047j25k15n77K20Q94J69k7O30Q7n61
$$ 466 -728 -786 28 -236 -183 568 702 509 1023 716 -331 -456 -671 -1248 -1028 -134 35 8 638 725 164
2306A64k57j09m24n25M46L80J50P92N83k72j25k61p44m30j89K41O5M18M91J27
$$ 164 -93 -202 -626 -1151 -705 -325 -175 617 1200 928 803 542 -202 -632 -821 -580 -515 -97 394 521
2326E21K14j46m92m28l10n33K4M92P57J39N61M4j37j55j84o25j68m20N20K50M90
$$ 521 735 589 97 -331 -641 -1174 -1150 -658 99 238 799 843 706 551 367 -258 -426 -846 -326 -76 414
2347D14O83r4l32k60o97l49l84m6j94L42R15K79J14K61n55P2l64n21n6O59R3M03
$$ 414 1097 1003 671 411 -286 -635 -1019 -1065 -1259 -917 -2 277 391 652 97 169 -195 -716 -772 -113 -20 383
2369C83L12O18l21k6l94m19n83l74K00J95J11M36K27j63p5n21k49l57k02J72J90
$$ 383 695 1313 992 966 572 153 -430 -804 -604 -409 -298 138 365 202 127 -394 -643 -1000 -1202 -1030 -840
2390h40N96N75M31K60l26rl77j03l99K91J29Q9L83M77j28k6m88n87l95o78J06
$$ -840 -244 331 762 1022 696 687 310 207 -192 99 228 317 700 1177 1049 1023 535 -52 -447 -1125 -1019
2411a019m17N77OJ99N15k27N4J46k73r9k17K05L80M16O35M39K43l41l92n88j64
$$ -1019 -1436 -859 -853 -654 -139 -366 -312 -166 -439 -538 -755 -550 -170 246 881 1320 1563 1222 830 242 78
2432G8m15Q9j3K48M7l7K15M3n91o20j51k73k36N52Q58j72P17L63n8R7j13l70N8
$$ 78 -337 -248 -261 -13 34 -3 212 255 -336 -956 -1107 -1380 -1616 -1064 -206 -378 339 702 644 741 628 258 316
2455C16k04L23k5N60J46M45m80J6j217n59n3ol48J04M97k02K64L61l08r0J15m70
$$ 316 112 435 410 970 1116 1561 1081 1097 -120 -679 -732 -738 -1086 -982 -485 -687 -423 -62 -370 -460 -345 -815
2477h15k44O95L78L07P81L89q02L07J75q47k36K96j31p23Q64K85m03j15K13p62
$$ -815 -1059 -364 14 321 1102 1491 689 996 1171 324 88 384 253 -470 394 679 276 161 374 -388
2497c88p67LL5m93J032J18j03N33N31l63k37Q25m88r08R16M78m41O15R93p40n71
$$ -388 -1155 -1152 -1117 -1610 -578 -460 -563 -30 501 138 -99 726 238 -670 246 724 283 898 1891 1151 580
2518E80L52p64r96M55m0p24L74O50n57J12P55m36j167P20m8m50O67J140o17M53
$$ 580 932 168 -828 -373 -413 -1137 -763 -113 -670 -558 197 -239 -1406 -686 -734 -1184 -517 623 6 459
2538D59Q97l59n29N34O6j498L74O88n83J56P50m01o74N97o73j451O93O4p70L99
$$ 459 1356 997 468 1002 1068 -430 -56 632 49 205 955 554 -120 477 -196 -1647 -954 -890 -1660 -1261
2558a261J471m48l38J217O9j166M09N19r23K96J432p93J99J153m8j567M96j57
$$ -1261 210 -238 -576 641 710 -456 -47 472 -451 -155 1277 484 683 1836 1788 221 717 560
2576E60j226l7Q42j048m66J595j74j167J055M11j594N8O84p44K22J551K71o38
$$ 560 -666 -703 139 -909 -1375 220 46 -1121 -66 345 -1249 -1191 -507 -1251 -1029 522 793 155
2594A55J025M01j362L35P88j240m09J076q05l39J532K80j548j01Lj414k10J345
$$ 155 1180 1581 219 554 1342 102 -307 769 -36 -375 1157 1437 -111 -212 -209 -1623 -1833 -488
2612d88m78p62J425L72q98R85R14j332J12M38q36k03J816L27o61R97k09j374N3
$$ -488 -966 -1728 -303 69 -829 156 1070 -262 -150 288 -548 -751 1065 1392 731 1728 1519 145 198
2631A98Q40p20q90P47p89j009J233P93o30j59K23j198m58J196n3l63J277J58r59
$$ 198 1038 318 -572 175 -614 -1623 -390 403 -227 -386 -163 -1361 -1819 -623 -676 -1039 238 396 -563
2650e63R80J434o42n30P57j149j129J296P07m19L85K09j671j71O92q06p32Q02
$$ -563 417 1851 1209 679 1436 287 -842 454 1161 742 1127 1336 -335 -506 186 -620 -1352 -550
2668e50m12j244J122J007l41K75P06j041q69J102K75j80J412J73r37K53J021m23
$$ -550 -962 -2206 -1084 -77 -418 -143 563 -478 -1347 -245 30 -150 1262 1435 498 751 1772 1349
2686A349l52M55j015j310L14M18k44O40K61j070n69M59n38j70R05o3r55O01P55
$$ 1349 997 1452 437 -873 -559 -141 -385 255 516 -554 -1123 -664 -1202 -1372 -467 -530 -1485 -884 -129
2705a29J40Q23N59n47q41K96K01k65Q25K26q24l3P33q88p5K16k13j285j50M69
$$ -129 11 834 1393 846 5 301 502 237 1062 1288 464 431 1164 276 201 417 204 -1081 -1231 -762
2725g62m56O58P35n70m52N11k80j78Q46O6l64L47O79k67M10O56l10o91k12k18
$$ -762 -1218 -560 175 -395 -847 -336 -616 -794 52 118 -246 101 780 513 923 1579 1269 578 366 148
2745A48m19K64R12q31k32L14m57l29L94j48q25K6O1P4L55J076j23j29J43J21n10
$$ 148 -271 -7 905 74 -158 156 -301 -630 -236 -384 -1209 -1183 -1122 -1048 -693 383 260 131 274 395 -115
2766a15K97M57k50J08M04j05n7L27p9o89k33l68n61o3M87O4j11J52J9q9J57j9
$$ -115 182 639 389 497 901 796 739 1066 987 298 65 -303 -864 -927 -440 -376 -487 -335 -316 -405 -248 -267
2788b67n21J82M24j51Q9J005L51n5J04k73o89L21n14L19l84J21Q7J16Q6l38j79
$$ -267 -788 -606 -182 -333 -244 761 1112 1057 1161 888 199 520 6 325 -59 62 149 265 351 13 -166
2809a66l00l61l07l6K32Q1L92L20M52OR1K27m56k1m9J05M56O0K33k2M7l18m98
$$ -166 -466 -827 -1134 -1170 -938 -857 -465 -145 307 313 404 631 175 154 105 210 666 726 959 937 984 666 168
2832A68l68j57j40l69O8Q9K97M7J96l05K62j17l01p8N66M4J30M37J97K07P7L5
$$ 168 -200 -357 -497 -866 -798 -709 -412 -365 -169 -474 -212 -329 -630 -708 -142 -98 32 469 666 873 950 985
2854I85m60j5j44j41k95K16O4O4l8j80o5l01o91K01j44m2J56K23M19J6N80m34
$$ 985 525 510 366 225 -70 146 210 274 236 56 -9 -310 -1001 -800 -944 -986 -830 -607 -188 -172 408 -26
2876b6L32k76K86j60J25K31K26K06K3k65k0J3n24k35k77r4k14Q9J49J95J5j73
$$ -26 306 30 316 156 281 512 738 944 967 702 682 695 171 -64 -341 -435 -649 -560 -411 -216 -201 -374
2898c74k11j88Nj65K17L70K61L26M10j99K94R1K6m94J10o6l44J82M00k58n3k5
$$ -374 -585 -773 -768 -933 -716 -346 -85 241 651 452 746 837 863 369 479 413 69 251 651 393 340 315
2920C15k73m00m60Rp8m0K01K30K55P7qJ60P0P4j96m4N61j0K41L02Q5k26Nl99m5
$$ 315 42 -358 -818 -809 -887 -927 -726 -496 -241 -164 -172 -12 58 132 -64 -108 453 443 684 986 1071 845 850 451 406
2945D06l35m83K16m9K05o3k04Q7j41j19K1j51m22L16K14N24n4M42K2O8N7k42k3
$$ 406 71 -412 -196 -245 -40 -103 -307 -220 -361 -480 -459 -610 -1032 -716 -502 22 -32 410 432 500 557 315 292
2968B92QJ5k12J40K10O1Qk2m85l96K26m84j89K64L04j1m2K69p6r7L04k41j44K61
$$ 292 300 315 103 243 453 514 522 500 15 -381 -155 -639 -828 -564 -260 -271 -313 -44 -120 -217 87 -154 -298 -37
2992c7L81j73L07M87m05MK4k63k28l23L2N7k08L10k33n7K15l7j39q7j36l72M20
$$ -37 344 171 478 965 560 564 588 325 97 -226 -194 -137 -345 -35 -268 -325 -110 -147 -286 -373 -509 -881 -461
3015d61L38k01M21M09j79k44J95J15l72n7L56k24M6P3K24k16K40k37o99Q0K09
$$ -461 -123 -324 97 506 327 83 278 393 21 -36 320 96 142 215 439 223 463 226 -473 -393 -184
3036a84m21K18L82k21k93Q50j92o51L67L84n46rM40m0O3O69j95l75R0Jm57PJ98
$$ -184 -605 -387 -5 -226 -519 331 139 -512 -145 239 -307 -316 124 84 147 816 621 246 336 337 -120 -113 85
3059H5q0k42K40nl17N78k55o77K89r4k10k0Q32j21j04N23O5m89J83K74k58n81
$$ 85 5 -237 3 -2 -319 259 4 -673 -384 -478 -688 -708 124 3 -101 422 487 -2 181 455 197 -384
3081c84N21l9k47N75l3k71M9j32m94j08N11l17l01K39M70q07O28N58m58j69N0
$$ -384 137 98 -149 426 393 122 171 39 -455 -563 -52 -369 -670 -431 39 -768 -140 418 -40 -209 -159
3102a59l62J68O54N6Jl3K49m91J50M01l20m46J60l41n38R32K32k01j69J74o59
$$ -159 -521 -353 301 357 358 325 574 83 233 634 314 -132 28 -313 -851 81 313 112 -57 117 -542
3123e42k55P77k94j63K9R4j5M23M37j06j06L1l96l24M46M39m07N14o8n57j11O87
$$ -542 -797 -20 -314 -477 -448 -354 -369 54 491 385 279 310 -86 -410 36 475 68 582 514 -43 -154 533
3145E33k14l58Q9m28m63K91N82l26M09q4k88l27P51l72k9L14K34n84N25K53j9
$$ 533 319 -39 50 -378 -841 -550 32 -294 115 31 -257 -584 167 -205 -234 80 314 -270 255 508 489
3166D89k94J85m9j160N98L18Q3L22k82l60j00P6J16j15P9j87o67M36M81o3J96
$$ 489 195 380 331 -829 -231 87 170 492 210 -150 -250 -174 -58 -173 -94 -281 -948 -512 -31 -94 102
3187A02K51k09m86J64N2p6K44M66m19q4J91j5Q8R4k10k89o5R0k27K39L19j65J6
$$ 102 353 144 -342 -178 -126 -202 42 508 89 5 196 181 269 363 153 -136 -201 -111 -338 -99 220 55 71
3210G1L3R9n03L51Jl57J83L6J09K00M86k78m47R8j75j87K04j85K6J40L20k20j37
$$ 71 104 203 -300 51 52 -305 -122 -86 23 223 709 431 -16 82 -93 -280 -76 -261 -235 -95 225 5 -132
3233a32M53k4n26k57M34QJ34L57L3m76L19j19j53J20r1q9j05K2qj12O47j07k48
$$ -132 321 297 -229 -486 -52 -44 90 447 480 4 323 204 51 171 80 -9 -114 -92 -100 -212 435 328 80
3256H0k45K43m68j96N71Q9M5l23L88j99K99K6j06l28Pk32J86N36J4L6qk08m04
$$ 80 -165 78 -390 -586 -15 74 119 -204 184 -15 284 310 204 -124 -117 -349 -163 373 387 423 415 207 -197
3279a97N0K6m07J79J32j06nN02J70m8m05O0N1k64L17k26P6L42J37J28L1k90j11
$$ -197 -147 -121 -528 -349 -217 -323 -328 174 344 296 -109 -49 2 -262 55 -171 -95 247 384 512 543 253 142
3302A42Q5j54l56Q1K67J85j22j03m1M2k71j9j07l35R6K71L40m9J5k84O01k58J62
$$ 142 227 73 -283 -202 65 250 128 25 -16 26 -245 -264 -371 -706 -610 -339 1 -48 -33 -317 284 26 188
3325A88j92Jj58K13K01j63L48j36K18l73Rl7l92K88j45l07L56l9J10j75J46m3
$$ 188 -4 -3 -161 52 253 90 438 302 520 147 156 119 -273 15 -130 -437 -81 -120 -10 -185 -39 -82
3347h2j23J03o2K4J7M62m0j28J91j47j38J73m36m1J60N7P6O0j05j39J25q3j67
$$ -82 -205 -102 -164 -140 -123 339 299 171 362 215 77 250 -186 -227 -67 -10 66 126 21 -118 7 -76 -243
3370b43m90l7L23K31J6K41n1L88l53k35L96k74K33j40J02L78k63K37o9k16kn5
$$ -243 -733 -770 -447 -216 -200 41 -10 378 25 -210 186 -88 145 5 107 485 222 459 390 174 172 117
3392A17q1k33Q1k81K02J74L1j59K12k77L5J06k16q4K99J10L7K68o7R6j56J7j04
$$ 117 36 -197 -116 -397 -195 -21 10 -149 63 -214 -179 -73 -289 -373 -74 36 73 341 274 370 214 231 127
3415A27Q0k24N5l9K76k50j2R8r7p9r6o6k7j97K64M3N9K32M8r2J4J91m39J83J3
$$ 127 207 -17 38 -1 275 25 13 111 14 -65 -161 -227 -254 -451 -187 -144 -85 147 195 103 117 308 -131 52 65
3440F5K18l1L24l86P4ll7j06k04j37j03K6K46l2J44o0j04L28n71J38P8j09L12
$$ 65 283 252 576 190 264 261 224 118 -86 -223 -326 -300 -54 -86 58 -2 -106 222 -349 -211 -133 -242 70
3463G0PR1K54j28J91p0Jk83Ol1j04Q3J51k13j48k16K74m9m25J68Lj87K82l34K41
$$ 70 77 168 422 294 485 415 416 133 139 108 4 87 238 25 -123 -339 -65 -114 -539 -371 -368 -555 -273 -607 -366
3488c66K11O7R9K76m2k24R4J91j26K07m5J23j17l5k01j48j21m7l5k08L55n0PP8
$$ -366 -155 -88 11 287 245 21 115 306 180 387 342 465 348 313 112 -36 -157 -204 -239 -447 -92 -142 -135 -57
3512e7k21j87O6K06m7j31P6M75j10j39M51J07l41J13o3j52J87J01j81J08k02k01
$$ -57 -278 -465 -399 -193 -240 -371 -295 180 70 -69 382 489 148 261 198 46 233 334 153 261 59 -142
3534a42K21p0l26J59j48k21k8L04JJ74P5K85j74j69q0J4L01J09mK1j12K11J74
$$ -142 79 9 -317 -158 -306 -527 -555 -251 -250 -76 -1 284 110 -59 -139 -125 176 285 281 302 190 401 575
3557E75k07j07j3k95j94K6q5L69l42k8q6K0p6L06P8l38M0q5J57K05N01j91j78
$$ 575 368 261 248 -47 -241 -215 -300 69 -273 -301 -387 -367 -443 -137 -59 -397 -357 -442 -285 -80 421 230 52
3580E2P4K40m40N8M29j00k0l1N9m3L8Q7j96m06r0j50KM78k81N4p8Q5k78K06L69
$$ 52 126 366 -74 -16 413 313 293 262 321 278 316 403 207 -199 -289 -439 -437 41 -240 -186 -264 -179 -457 -251 118
3605A18j83p9J58j25R6L85J71J8m25K59p16L76N3j28l6N5j52P9p9K52k43l46J93
$$ 118 -65 -144 14 -111 -15 370 541 559 134 393 -323 53 106 -22 -58 -3 -155 -76 -155 97 -146 -492 -299
3628b99p0m7K85q3L67j11j6l8oL29j08j08j2Q7l9J18P5k23L9K3l37j47L22j01
$$ -299 -369 -416 -131 -214 153 42 26 -12 -18 311 203 95 83 170 131 249 324 101 140 163 -174 -321 1 -100
3652a00j22J37k39k33K67K54r2k42M85j99l96N92j42L98Nq7l74K08J90Mj39J20
$$ -100 -222 -85 -324 -557 -290 -36 -128 -370 115 -84 -480 112 -30 368 373 286 -88 120 310 314 175 295
3674B95k60k22J60j2J73j92Q6l5n67P8K42k4J38L73k91J41L3p2j01K26o8j48K3
$$ 295 35 -187 -27 -39 134 -58 28 -7 -574 -496 -254 -278 -140 233 -58 83 116 44 -57 169 101 -47 -24
3697b4K25J13l25K74j23Jk18K82j50J21l38j15j47L65l1N2K32k52L4l22j12M00
$$ -24 201 314 -11 263 140 141 -77 205 55 176 -162 -277 -424 -59 -90 -38 194 -58 -24 -346 -458 -58
3719e8j05M86J8l97L19m2K50l20K42m10o7J18J75k46R2M2k32O0k26j58K07j79
$$ -58 -163 323 341 -56 263 221 471 151 393 -17 -84 34 209 -37 55 97 -135 -75 -301 -459 -252 -431
3741d31L09k94L14l2J01R3J49m63J88L03k33J91K2J55k08J32o1P8j83K4j49l40
$$ -431 -122 -416 -102 -134 -33 60 209 -254 -66 237 4 195 217 372 164 296 235 313 130 154 5 -335
3763c35n7q1N4L83J16k09L3M5J96n64J63j16L26m7J80J27k21M60Pm81K42k16j66
$$ -335 -392 -473 -419 -36 80 -129 -96 -51 145 -419 -256 -372 -46 -93 87 214 -7 453 460 -21 221 5 -161
3786a61J24O9O0J2O4J07o7Ml38j43k2o6%r8K47L84k96J72M4J3l38K17k5j03L16
$$ -161 -37 32 92 104 168 275 208 212 -126 -269 -291 -357 -357 -455 -208 176 -120 52 96 109 -229 -12 -37 -140 176
3811A76q2J64L31k78k88J50k09k08K50j02N5o4K80k01j8j45n5j81r7J33J23j40
$$ 176 94 258 589 311 23 173 -36 -244 6 -96 -41 -105 175 -26 -44 -189 -244 -425 -522 -389 -266 -406
3833d06M37m6J98l3j11L7L9L91l39k24J59L20j50J8o2j81K0K7m28J36j33J62k9
$$ -406 31 -15 183 150 39 76 115 506 167 -57 102 422 272 290 228 47 67 94 -334 -198 -331 -169 -198
3856a98J17L2rj97J04J86j8q9j96K01j2M27j22R4K04k29j51M2q6k76K20k4L13
$$ -198 -81 -49 -58 -255 -151 35 17 -72 -268 -67 -79 348 226 320 524 295 144 186 100 -176 44 20 333
3879C33l41Nl05K96j40j42M8m0m0K37j5J51j3j4O1j91l6KM7J74j6J60Om8p0k93
$$ 333 -8 -3 -308 -12 -152 -294 -246 -286 -326 -89 -104 47 34 20 81 -110 -146 -144 -97 77 61 221 227 179 109 -184
3905a84L38l02q3p6J38QQK0MJ60M8n7k92J41J36L3J88l40L95k26N0L44m87n2K39
$$ -184 154 -148 -231 -307 -169 -161 -153 -133 -129 31 79 22 -270 -129 7 40 228 -112 283 57 107 451 -36 -88 151
3930A51l21L5R5J93k23N42n70N9q4J4n9R0k36L73Q5j27lJ89J3Ln89N94j88j91
$$ 151 -170 -135 -40 153 -70 472 -98 -39 -123 -109 -168 -78 -314 59 144 17 14 203 216 219 -370 224 36 -155
3954a55L74k02Q6J08O9j83K9k5j43j22r3L72k71L19l4j45J17r0P7k79K13j81R7
$$ -155 219 17 103 211 280 97 126 101 -42 -164 -257 115 -156 163 129 -16 101 11 88 -191 22 -159 -62
3977f2q4K04J48mMj49J03o7N5j03j31J22J07l1R5l03J59l72J45j54L19m29K49
$$ -62 -146 58 206 202 206 57 160 93 148 45 -86 36 143 112 207 -96 63 -309 -164 -318 1 -428 -179
4000a79r6L05l1j65L79l1p2k61Q7J96j2JM0o9R1j88o3K78m4l24J35j7k77J98R4
$$ -179 -275 30 -1 -166 213 182 110 -151 -64 132 120 121 161 92 183 -5 -68 210 166 -158 -23 -40 -317 -119 -25
4025b5j43r2J09rm8L28j11j17OQ0J64n3P3j8j01p0rk46M00n6L22r8k98J4J17L1
$$ -25 -168 -260 -151 -160 -208 120 9 -108 -102 -22 142 89 162 144 43 -27 -36 -282 118 62 384 286 -12 2 119 150
4051A50k66J02k52P5J53M1J91rj15r9K5K09l26m7o5J56K11j27P1QMl7l5l5kJ76
$$ 150 -116 -14 -266 -191 -38 3 194 185 70 -29 -4 205 -121 -168 -233 -77 134 7 78 86 90 53 18 -17 -19 157
4077A57L6j05l2j84J56l80J26O6Q7m3N8P4l72N15k05K26k10N4J7n9J53n3l4j38
$$ 157 193 88 56 -128 28 -352 -226 -160 -73 -116 -58 16 -356 159 -46 180 -30 24 41 -18 135 82 48 -90
4101i0M4j36J95q9J13ln6k79J99Rpm5K37KN6r3P5j7m15L40j36j38N26j36l8m05
$$ -90 -46 -182 13 -76 37 34 -22 -301 -102 -93 -100 -145 92 94 150 57 132 115 -300 40 -96 -234 292 156 118 -287
4127b87K33K09o2J0Jj27l6n2J9p8K90pK8l62K3q3O6L68q5n2m4L7k50N0K58j49
$$ -287 -54 155 93 103 104 -23 -59 -111 -92 -170 120 113 141 -221 -198 -281 -215 153 68 16 -28 9 -241 -191 67 -82
4153h2J18j21j48J67L39k79O1K43m03l3K58p9j84K79j61k56K61j38J76L34j89
$$ -82 36 -85 -233 -66 273 -6 55 298 -105 -138 120 41 -143 136 -25 -281 -20 -158 18 352 163
4174A63k22r2O2k4N31j37r3l41JL11q5j49J78l7n25L82M3J67O9k1j16k1j98J88
$$ 163 -59 -151 -89 -113 418 281 188 -153 -152 159 74 -75 103 66 -459 -77 -34 133 202 181 65 44 -154 34
4198C4No0N7J72j28k41J27N7j10J60R0m13J49J41r1L07j52k25L53k47l2Q4R3k71
$$ 34 39 -21 36 208 80 -161 -34 23 -87 73 163 -250 -101 40 -51 256 104 -121 232 -15 -47 37 130 -141
4222a41rJ68J0L01j77j08Jj71n7R6N6PQ0p4m7J74M9L1l03J56j03r7K56k42k5K12
$$ -141 -150 18 28 329 152 44 45 -126 -183 -87 -31 -24 56 -18 -65 109 158 189 -114 42 -61 -158 98 -144 -169 43
4248D3k3J47k17J97k50l0k2Lj42L00K47l58M57mk65j84J49j57l8K09k7J62k82
$$ 43 20 167 -50 147 -103 -133 -155 -152 -294 6 253 -105 352 348 83 -101 48 -109 -147 62 35 197 -85
4271h5m7k4K41J55l02P3k63L13j10K04l06m0M15k05Q8l02pK64k5l43K97J19o1
$$ -85 -132 -156 85 240 -62 11 -252 61 -49 155 -151 -191 224 19 107 -195 -202 62 37 -306 -9 110 49
4294D9J29q4M9k42O1J7n4j8J99j26K23P8n17L34J39l25K11j42M7j01J78o1p2n8
$$ 49 178 94 143 -99 -38 -21 -75 -93 106 -20 203 281 -236 98 237 -88 123 -19 28 -73 105 44 -28 -86
4318h6J12k34K40j20Q7j00J81J27k02N0L2k8j60J65o1k50K58R0j47J10j44k85
$$ -86 26 -208 32 -88 -1 -101 80 207 5 55 87 59 -101 64 3 -247 11 101 -46 64 -80 -365
4340c65N35o3j51M4J16l90J92r5L84l16p8J8J35k67L44r1Q1r4k33L16nj0J62q9
$$ -365 170 107 -44 0 116 -274 -82 -177 207 -109 -187 -169 -34 -301 43 -48 33 -61 -294 22 17 7 169 80
4364H0M0J30m22J60P7j59J21O0L9o4n5L2Nk25J08k4JJ86K5l84J52R5J75m15K65
$$ 80 120 250 -172 -12 65 -94 27 87 126 62 7 39 44 -181 -73 -97 -96 90 115 -269 -117 -22 153 -262 3
4389Cp2j5J98k82M18k16Q8p8P6l98P6K24k09K3J12R5k8j63PM0k21N42m62J80n0
$$ 3 -69 -84 114 -168 250 34 122 44 120 -278 -202 22 -187 -164 -52 43 15 -148 -141 -101 -322 220 -242 -62 -112
4414a12J52j16Q8J09k05J45j29J41J66J4n61K96P2q7J17j4J36j41l71J06K83k93
$$ -112 40 -76 12 121 -84 61 -68 73 239 253 -308 -12 60 -27 90 76 212 71 -300 -194 89 -204
4436b04Q3N6K00k37L90l90l68L31ql2R1K76j90K08j72K7n3QJ78j21j77R7N4L1
$$ -204 -121 -65 135 -102 288 -102 -470 -139 -147 -179 -88 188 -2 206 34 61 8 16 194 73 -104 -7 47 78
4460G8j87K59Q0j81l3M0l58M17j59n2n6K99p4J05j42j59J85k02K42l40J46M6R9
$$ 78 -109 150 230 49 16 56 -302 115 -44 -96 -152 147 73 178 36 -123 62 -140 102 -238 -92 -46 53
4483E3q1J74j77J21J54l43R5j99J74K9K1j76K27n2M9k0j38Rj84l1N23%k26J05
$$ 53 -28 146 -31 90 244 -99 -4 -203 -29 0 21 -155 72 20 69 49 -89 -80 -264 -295 228 228 2 107
4507A07l0J7l81L83p9j75J36J87m7j61J45j90L9j31J73K17k64j20Q1R7j52L41
$$ 107 77 94 -287 96 17 -158 -22 165 118 -43 102 -88 -49 -180 -7 210 -54 -174 -93 4 -148 193
4529A93l10J35J64k72J06l9n5J49J4J27K4k47j84K31N8%k34j5n4J13n2Q4Q2l54
$$ 193 -117 18 182 -90 16 -23 -78 71 85 212 236 -11 -195 36 94 94 -140 -155 -209 -96 -148 -64 18 -336
4553c36K33M3r9P6p4L16l23K06J23n0J59j61k11J82j86j18J26R7Pj24q8K99k55
$$ -336 -103 -60 -159 -83 -157 159 -164 42 165 115 274 113 -98 84 -102 -220 -94 3 10 -114 -202 97 -158
4576a58J6K94M5k65l4N1j3K21O4l24J48o6J06j12m4J40l52M08j93K43j73j84K46
$$ -158 -142 152 197 -68 -102 -51 -64 157 221 -103 45 -21 85 -27 -71 69 -283 125 -68 175 2 -182 64
4599F4j06N8J25k04j59K85P0l60J33M61l65r9O3q4K38l17K89j14J18K23l39P0
$$ 64 -42 16 141 -63 -222 63 133 -227 -94 367 2 -97 -34 -118 120 -197 92 -22 96 319 -20 50
4621E0Q8O5m19K10j07J00N4j04mM4lrK35j42j80k33M20R4r9n7k0Q6j25J10j86
$$ 50 138 203 -216 -6 -113 -13 41 -63 -67 -23 -26 -35 200 58 -122 -355 65 159 60 3 -17 69 -56 54 -132
4646a32O5q0R3k0N9K08N4l91j1K45j15q5j11K03k17J90J24j74K7M20j10K5l37
$$ -132 -67 -147 -54 -74 -15 193 247 -144 -155 90 -25 -110 -221 -18 -235 -45 79 -95 -68 352 242 267 -70
4669g0J53j74J37J66j46M7L2j45o1K57k64j1O4L4k09K62n6J21q4Pk52J0L3J61
$$ -70 83 -91 46 212 66 113 145 0 -61 196 -68 -79 -15 19 -190 72 16 137 53 60 -192 -182 -149 12
4693A2l4J8J27K1j2j09o0M4r4j68J75k9K99j14j9J25r5J3k0M9k41K07j23P6O3
$$ 12 -22 -4 123 144 132 23 -37 7 -87 -255 -80 -109 190 76 57 182 87 100 80 129 -112 95 -28 48 111
4718A11Rj7j68J10j90j71L37n8J41R7N1m76K20PJ69o2L5J10k74J50j83K27k09
$$ 111 120 103 -65 45 -145 -316 21 -37 104 201 252 -224 -4 3 172 110 145 255 -19 131 -52 175 -34
4741c4J76J4l35K14o9Q5q1k40L96k30q8L25m8j27L96n55L16p8j44J40K29k22O0
$$ -34 142 156 -179 35 -34 51 -30 -270 126 -104 -192 133 85 -42 354 -201 115 37 -107 33 262 40 100
4764A00k79K74q4L86l83o4J8J61j47r7R6J11k1k42K9j50N00m13K4J57l8K57k98
$$ 100 -179 95 11 397 14 -50 -32 129 -18 -115 -19 92 71 -171 -142 -292 208 -205 -181 -24 -62 195 -103
4787a03K8K84l17Q9P0j5j19J98k6j34l3J76p7j01J45k00j94L27Q1j54K6k44N5
$$ -103 -75 209 -108 -19 51 36 -83 115 89 -45 -78 98 21 -80 65 -135 -329 -2 79 -75 -49 -293 -238
4810b38L05j42J89q2n0J51k53R2J32M8j90J22O4l40K48O2q9l37L16J03k09K16
$$ -238 67 -75 114 32 -18 133 -120 -28 104 152 -38 84 148 -192 56 118 29 -308 8 111 -98 118
4832A18l14K18J74l20o8j05L88k91K22L98j80l10j19M38J7m36p5Q0J73j0r0Q2
$$ 118 -196 22 196 -124 -192 -297 91 -200 22 420 240 -70 -189 249 266 -170 -245 -165 8 -2 -92 -10
4854a0N1k15j06M22k69N0j06P4P3j59K16L9Lk98K16lJ06j03Mk33K73L2p5k19K42
$$ -10 41 -174 -280 142 -127 -77 -183 -109 -36 -195 21 60 63 -235 -19 -22 84 -19 -15 -248 25 57 -18 -237 5
4879Ek19K18J2J76j53n7j15R5l1L42k49j58L03k34J16o3R3O0L6m62M30k69p8L08
$$ 5 -214 4 16 192 39 -18 -133 -38 -69 273 24 -134 169 -65 51 -12 81 141 177 -285 145 -124 -202 106
4903A06O5l3j92k02L28O3l63K10J19k4l71N39l2j25J23j13r4J58r3J22r2j63j09
$$ 106 171 138 -54 -256 72 135 -228 -18 101 77 -294 245 213 88 211 98 4 162 69 191 99 -64 -173
4926a73ok40K90L57j79J22k04k19J95l6J6j32L08Jl17J87j02J06o2j13k9J29o
$$ -173 -179 -419 -129 228 49 171 -33 -252 -57 -93 -77 -209 99 100 -217 -30 -132 -26 -88 -201 -230 -101 -107
4949a07P8j27O0Q0l1k2J28j95P1J29r7J20k30K25J06k89K16m8rJ3j69J08m4J3
$$ -107 -29 -156 -96 -16 -47 -69 59 -136 -65 64 -33 87 -143 82 188 -101 115 67 58 71 -98 10 -34 -21
4973b1m3J90o4j55M84k31k43j3L63k15j32K86l23K87Ol59K55R5k90J08J42k13
$$ -21 -64 126 62 -93 391 160 -83 -96 267 52 -80 206 -117 170 176 -183 72 167 -123 -15 127 -86
4995h6j4J07j01q4K25j26p3J55j00j33K96J88k91M32l15J47l47P3m8Q4R1r1l0
$$ -86 -100 7 -94 -178 47 -79 -152 3 -97 -230 66 254 -37 395 80 227 -120 -47 -95 -11 80 -11 -41
5018d1J06l8K40k32L8m7j81L10j43M8J35k49l5J10K46l12P7j64J23K05j76Kj24
$$ -41 65 27 267 35 73 26 -155 155 12 60 195 -54 -89 21 267 -45 32 -132 -9 196 20 22 -102
5041a02N8R4j20k72O21k94o9j07J03k6kJ68L2j82R0r8J78p3K5Mk57R6r2J94L09
$$ -102 -44 50 -70 -342 279 -15 -84 -191 -88 -114 -116 52 84 -98 -8 -106 72 -1 24 28 -229 -133 -225 -31 278
5066B78j96l6j92R2l51L59L5R5k13K88l3j99J77J23k90j14j08K67Q9j3n6k3J77
$$ 278 82 46 -146 -54 -405 -46 -11 84 -129 159 126 -73 104 227 -63 -177 -285 -18 71 58 2 -21 156
5089A56j12J76j2l19J1J95N0k61J8m0M4J7J46j14J5J18l0N4k19J66k5l04K03l
$$ 156 44 220 208 -111 -100 95 145 -116 -98 -138 -94 -77 69 -45 -30 88 58 112 -107 59 34 -270 -67 -70
5113g0k4M2j06J52J19p7o1n9J01O6k69K73j82O8j9O0o9o1J01l6j15m4K28KQ3j97
$$ -70 -94 -52 -158 -6 113 36 -25 -84 17 83 -186 87 -95 -27 -46 14 -55 -116 -15 -51 -166 -210 18 20 103 -94
5139i4K4J45j19R9R8n5j23l5n3r7K17N7q9K13j52MK04m36Q0nN0O7R4J5j75OK99
$$ -94 -70 75 -44 55 153 98 -25 -60 -113 -210 7 64 -25 188 36 40 244 -192 -112 -117 -67 0 94 109 -66 -60 239
5166B39o1k12K05k2N8K7rj75J43L7j25j11J75j14J78k07J97j40O5m3l17K8K07
$$ 239 178 -34 171 149 207 234 225 50 193 230 105 -6 169 55 233 26 223 83 148 105 -212 -184 23
5189B3J42m60K74P3J08k89P9m6K84r5j45j11jL04j96L8j34o8P7J39JJ27N2k44
$$ 23 165 -295 -21 52 160 -129 -50 -96 188 93 -52 -163 -164 140 -56 -18 -152 -220 -143 -4 -3 124 176 -68
5213f8j57K06L7j06j11L43j48r3J5J45r6k60M25j33k08J80K18j98j89L18K6q8
$$ -68 -225 -19 18 -88 -199 144 -4 -97 -82 63 -33 -293 132 -1 -209 -29 189 -9 -198 120 146 58
5235E8l2k06n8R6J7m9K98k47j7R8J31j65p1K56K4j49J40p5J04K4J8k94J63Qj68
$$ 58 26 -180 -238 -142 -125 -174 124 -123 -140 -42 89 -76 -147 109 133 -16 124 49 153 177 195 -99 64 72 -96
5260i6N1J30jK07j16r0jJ09n8j24l5k35L56r0J24o1j08J85j64R4O5k27J46m9j51
$$ -96 -45 85 84 291 175 85 84 193 135 11 -24 -259 97 7 131 70 -38 147 -17 77 142 -85 61 12 -139
5285a39K20q8M5LN4J16j55qO9j30J13Kj49K86l84o4L24k57J69q9R8j25J42J31
$$ -139 81 -7 38 41 95 211 56 48 117 -13 100 102 -47 239 -145 -209 115 -142 27 -62 36 -89 53 184
5309A84kj63%r1J57k91K22J24k11j64l5rL37p6j40J37j65k1K8j42L53j85L1p2
$$ 184 182 19 19 -72 85 -206 16 140 -71 -235 -270 -279 58 -18 -158 -21 -186 -207 -179 -321 32 -153 -122 -194
5333a94n3M44k68K25J3lm15N47l97J36J38j81j13K67j72L8P0p5j45K00k30K77
$$ -194 -247 197 -71 154 167 164 -251 296 -101 35 173 -8 -121 146 -26 12 82 7 -138 62 -168 109
5355A09k42k03K12J95L8j92J52j86J90k10L15M8m09L20R7l77m0L58l10o6N4J74
$$ 109 -133 -336 -124 71 109 -83 69 -117 73 -137 178 226 -183 137 234 -143 -183 175 -135 -201 -147 27
5377B7m3O3n1k2M3J23j08r1J11R1l32J86l2L6J74q1k57K30j55o2J17L48l40K15
$$ 27 -16 47 -4 -26 17 140 32 -59 52 143 -189 -3 -35 1 175 94 -163 67 -88 -150 -33 315 -25 190
5401A90n5j84l35L71m0q2L8Q7J15j44J80l17L02o4k47K99q3m0J28Pj18J5J35M1
$$ 190 135 -49 -384 -13 -53 -135 -97 -10 105 -39 141 -176 126 62 -185 114 31 -9 119 126 8 23 158 199
5425A99j08j10j33K36l55K82L01k45o1m5Qp7p3M8L06l60RJ06J63q6p5L75k13k43
$$ 199 91 -19 -152 84 -271 11 312 67 6 -39 -31 -108 -181 -133 173 -187 -178 -72 91 5 -70 305 92 -151
5449a51J79J5K00k76o5o9K72j58J59p8j15j5K03j24Nj27J40j8q1J00l7J4N7M2
$$ -151 28 43 243 -33 -98 -167 105 -53 106 28 -87 -102 101 -23 -18 -145 -5 -23 -104 -4 -41 -27 30 72
5473G2k5k12K95j88j66L01j13J18j85J9J71k26J47j5n7n1M8K08l15K46J15k90
$$ 72 47 -165 130 -58 -224 77 -36 82 -103 -84 87 -139 8 -7 -64 -115 -67 141 -174 72 187 -103
5495a03K82N6k25q9J6j2L36k79j85K68J11j83J53l88K71L3J2K6j97%M6j24Q8%
$$ -103 179 235 10 -79 -63 -75 261 -18 -203 65 176 -7 146 -242 29 62 74 100 -97 -97 -51 -175 -87 -87
5519h7j67K95M6j64P9J27r2J06j36K7l8j99J41o1K57Q8j19j41k67K45K41k38J37
$$ -87 -254 41 87 -77 2 129 37 143 7 34 -4 -203 -62 -123 134 222 103 -38 -305 -60 181 -57 80
5542H0m8Q4j88j21N2M7J55J34j46k92N95l02j44M6K97j58J17j15l0l22L15J79
$$ 80 32 116 -72 -193 -141 -94 61 195 49 -243 352 50 -94 -48 249 91 208 93 63 -259 56 235
5564B35pl02L9j50J90P4O4j88j97J69R0j51J80M9j80K21j32mR5k31k4L0Jl7J36
$$ 235 228 -74 -35 -185 5 79 143 -45 -242 -73 17 -134 46 95 -85 136 4 0 95 -136 -160 -130 -129 -166 -30
5589c0J2j24L08k43J94p6R2j59%J43r8k52J23m4J17q8L53k62l09M46j11J62k18
$$ -30 -18 -142 166 -77 117 41 133 -26 -26 117 19 -233 -110 -154 -37 -125 228 -34 -343 103 -8 154 -64
5612f4L1l1J57k31J80j70j5J20M2k59J67j07J12K15J15r9n10M78l31o0K06J94
$$ -64 -33 -64 93 -138 42 -128 -143 -23 19 -240 -73 -180 -68 147 262 163 -347 131 -200 -260 -54 140
5634A40k14J25M4q6J95j02m71K75K56j26j37N4O4P8m8P8j35J54m7j40k09L68J32
$$ 140 -74 51 95 9 204 102 -369 -94 162 36 -101 -47 17 95 47 125 -10 144 97 -43 -252 116 248
5657B48m53M45j14k46m7L50l08j07P2R8J01r9L90l91L7K8k77K05P7o3n0K01j6
$$ 248 -205 240 126 -120 -167 183 -125 -232 -160 -62 39 -60 330 -61 -24 4 -273 -68 9 -54 -104 97 81
5680H1J6r6K05j76L1j44JRm7K40K2j29n1K94j23l5k15P5J83r6j3j07P3J23q0j31
$$ 81 97 1 206 30 61 -83 -82 -73 -120 120 142 13 -38 256 133 98 -117 -42 141 45 32 -75 -2 121 41 -90
5706i0J4J8l04N67l39j2R6J95r0k83K44j52o6J04J21k8q1P2J25K6qk62n9J94j06
$$ -90 -76 -58 -362 205 -134 -146 -50 145 55 -228 16 -136 -202 -98 23 -5 -86 -14 111 137 129 -133 -192 2 -104
5731a04K0K0m5J83k08K35k18J12o5k29L34oo9L4j61J2N6J74j25J15L6l9r1L8O9
$$ -104 -84 -64 -109 74 -134 101 -117 -5 -70 -299 35 29 -40 -6 -167 -155 -99 75 -50 65 101 62 -29 9 78
5756G8k24R9j4J25m2j44m4R4N7k1k12K06J58J16j68j04j52K96j95Q6KJ38j05Q2
$$ 78 -146 -47 -61 64 22 -122 -166 -72 -15 -36 -248 -42 116 232 64 -40 -192 104 -91 -5 -3 135 30 112
5780A12j35J08K32k69j9N8j97J43R4J11l27j15J62m5L10l82K19n3j74J34J16n5
$$ 112 -23 85 317 48 29 87 -110 33 127 238 -89 -204 -42 -87 223 -159 60 7 -167 -33 83 28
5802B8J23j37rj05M8K10j10k50J27k40L63J42k78J29q1M24n04K53k13M6O1k17
$$ 28 151 14 5 -100 -52 158 48 -202 -75 -315 48 190 -88 41 -40 384 -120 133 -80 -34 27 -190
5824a90K38Mk84K17r4%o6K0J46p1J61j13Q5j20L5Q8j25K34k74J36K5l7J1m6o3
$$ -190 48 52 -232 -15 -109 -109 -175 -155 -9 -80 81 -32 53 -67 -32 56 -69 165 -109 27 52 15 26 -20 -83
5849h3K16j39O3r7l9K43l15R8OM1r9K86N6k42q1j08J79q5j10Q0K92j98K41k06
$$ -83 133 -6 57 -40 -79 164 -151 -53 -47 -6 -105 181 237 -5 -86 -194 -15 -100 -210 -130 162 -36 205 -1
5873aq2J32n1j52KQ6J4N7L0q5J40j0n7j70r9M16k95J72J41j83pp0J11L4o0%n0
$$ -1 -83 49 -2 -154 -152 -66 -52 5 35 -50 90 80 23 -147 -246 170 -125 47 188 5 -2 -72 39 73 13 13 -37
5900c7N4j14J87j34J77k77lJ29K7Mj67j24L43L6ml9J29KL4k73O3k00J14n3K63
$$ -37 17 -97 90 -44 133 -144 -147 -18 9 13 -154 -278 65 101 97 58 187 189 223 -50 13 -187 -73 -126 137
5925A37k71J33P8j16J18Q8j66j02K55k09m3J06j44K86l0k02Q8K02k76J37j42p2
$$ 137 -134 -1 77 -39 79 167 1 -101 154 -55 -98 8 -136 150 120 -82 6 208 -68 69 -73 -145
5947a45J54O6j2j41J39Mm7j4J93l01J44N1j89k1j23L97q3j78K8l0O7M8L3j02J54
$$ -145 9 75 63 -78 61 65 18 4 197 -104 40 91 -98 -119 -242 155 72 -106 -78 -108 -41 7 40 -62 92
5972I2mp1j3J73q8k24J29K15J17m64j15J49J77l1l14K23j13J21j9J03K21j7j34
$$ 92 88 17 4 177 89 -135 -6 209 326 -138 -253 -104 73 42 -272 -49 -162 -41 -60 43 264 247 113
5995A13j96L23j97k00n2J12K4O2K6R6J81j77l0k14J71j31K27k32N9Q8p0K9Q5J02
$$ 113 -83 240 43 -157 -209 -97 -73 -11 15 111 292 115 85 -129 42 -89 138 -94 -35 53 -17 12 97 199
6019A99k90J67j83j06R1O4M8m8J45P7j43J81j76k5k26J53j15K92l7l5m6K1J43
$$ 199 -91 76 -107 -213 -122 -58 -10 -58 87 164 21 202 26 1 -225 -72 -187 105 68 33 -13 8 151
6042A51j84L20l29j12R6J67L2J47l20J6p0L8J50k47L04k74L49Kj26J31m25K56
$$ 151 -33 287 -42 -154 -58 109 141 288 -32 -16 -86 -48 102 -145 159 -115 234 236 110 241 -184 72
6064G2k38n2K95p8P6p9j08K54m8pM4r1m9k74L20K5j30Q6pJ01j07K4o3j64L36n8
$$ 72 -166 -218 77 -1 75 -4 -112 142 94 87 131 40 -9 -283 37 62 -68 18 11 112 5 29 -34 -198 138 80
6090H0j02O2k35K05k04l4J21J19J57k77J79m1Q3N9j67K27k08o3K7K04J10n11K53
$$ 80 -22 40 -195 10 -194 -228 -107 12 169 -108 71 30 113 172 5 232 24 -39 -12 192 302 -209 44
6113D4K06k04r7m1J99l19J21J34p0J47j09J11m2o7r8K5K7j81L27j38J72p4j08
$$ 44 250 46 -51 -92 107 -212 -91 43 -27 120 11 122 80 13 -85 -60 -33 -214 113 -25 147 73 -35
6136c5m0j14L02J2j80Q7ml50L37PrK26j65k84J99k24K68P9l14K53k3j50J28j31
$$ -35 -75 -189 113 125 -55 32 28 -322 15 22 13 239 74 -210 -11 -235 33 112 -202 51 28 -122 6 -125
6160a25J47p8L96j3k53j54k1J58J55l37l7P7J85j0Q6k78K86m18K52J95k15J18
$$ -125 22 -56 340 327 74 -80 -101 57 212 -125 -162 -85 100 90 176 -102 184 -234 18 213 -2 116
6182A16j54Q9m8n3lK14l23N26p6j49l8M2j03r3K06Kj93P6j97J04j71K99j83L19
$$ 116 -38 51 3 -50 -53 161 -162 364 288 139 101 143 40 -53 153 155 -38 38 -159 -55 -226 73 -110 209
6206B09l04n6J51K0J7j75K81l05M73k94J29l06L28m3p7P9k05L4R2Q5l8j40L5%
$$ 209 -95 -151 0 20 37 -138 143 -162 311 17 146 -160 168 125 48 127 -78 -44 48 133 95 -45 -10 -10
6230a0K48m38J40r5QJ57k61M12l3P6l82K25q7P0l07L29q8Q9k36L16Rj09k09M7
$$ -10 238 -200 -60 -155 -147 10 -251 161 128 204 -178 47 -40 30 -277 52 -36 53 -183 133 142 33 -176 -129
6254a29J00r4L71j47j58J31o0N3k2j02Q1J05j00k25J64J97l96L47j30K5lK7m3
$$ -129 -29 -123 248 101 -57 74 14 67 45 -57 24 129 29 -196 -32 165 -231 116 -14 11 8 35 -8
6277hQ2j54N8J71m10L64l3j25Q8n6qQ4p2O8j09Q7r8M03l29q4qJ26j05J09o2J8
$$ -8 74 -80 -22 149 -261 103 70 -55 33 -23 -31 53 -19 49 -60 27 -71 332 3 -81 -89 37 -68 41 -21 -3
6303cP7j79J02k05K84j57k7j8J78l9Qj81K67j42J22j95L95k18P4p1j18J38p4o6
$$ -3 74 -105 -3 -208 76 -81 -108 -126 52 13 21 -160 107 -35 87 -108 287 69 143 72 -46 92 18 -48
6327d8k01L36r9J27r1k61K85l3m5Mm7N5P0l0j25J87k0OM3j19N7j3j71N8R5J2J62
$$ -48 -249 87 -12 115 24 -237 48 15 -30 -26 -73 -18 52 22 -103 84 64 70 113 -6 51 38 -133 -75 20 32 194
6354A94m2k83K65OJ24R8k81k4q6J85J20m05J06P2j16j01K49k8M6M6l17J24n3K23
$$ 194 152 -131 134 140 264 362 81 57 -29 156 276 -129 -23 49 -67 -168 81 53 99 145 -172 -48 -101 122
6378A22k35N4P0K9j4Ml1r4N5M0K28k01J13j76j08K97j85K54p9K8j55p3k4J41r
$$ 122 -113 -59 11 40 26 30 -1 -95 -40 0 228 27 140 -36 -144 153 -32 222 143 171 16 -57 -81 60 51
6403E1J46j81M7k4N2k60M8L7M5m1N2K3j35J15j34J63o5J7J68l8k2r4k1J48j09
$$ 51 197 16 63 39 91 -169 -121 -84 -39 -80 -28 -5 -140 -25 -159 4 -61 -44 124 86 64 -30 -51 97 -12
6428a2q0l2K33l37P0J9K12j76J36k1k4k7N6K1k02K11L76l54j35J60l10K84k64
$$ -12 -92 -124 109 -228 -158 -139 73 -103 33 12 -12 -39 17 38 -164 47 423 69 -66 94 -216 68 -196
6451a96Q1J29%P1j98J82O0k41J41j33J34j38L91l88R1J29k40l4K34q3m3L13k6
$$ -196 -115 14 14 85 -113 69 129 -112 29 -104 30 -108 283 -105 -14 115 -125 -159 75 -8 -51 262 236
6474B36k44J26o7J21l27J58J40j56J63k75K35l14J09L02k03K2nk02J92K34m84
$$ 236 -8 118 51 172 -155 3 143 -13 150 -125 110 -204 -95 207 4 26 21 -181 11 245 -239
6495b39K50j34j68J96L74k14j61J11n0p5P6L3Q5l34K49J13j36k2P7p0M4lJ80l75
$$ -239 11 -123 -291 -95 279 65 -96 15 -35 -110 -34 -1 84 -250 -1 112 -24 -46 31 -39 5 2 182 -193
6519a93J46K28j68J80k80j00K98J3k08M03k69N5k62K38j03K78k33k06K11K3J36
$$ -193 -47 181 13 193 -87 -187 111 124 -84 319 50 105 -157 81 -22 256 23 -183 28 51 187
6540A87k82J29j94K21k3j9l0K62k99J78J25m96J55N7Q2j22M6k2j1J32M0k88R7
$$ 187 -95 34 -160 61 38 19 -11 251 -48 130 255 -241 -86 -29 53 -69 -23 -45 -56 76 116 -172 -75
6563g5K97k01m8J2J70j63j95J59L5J81q2j08J39j03J08j68K18k12j9K27j00J01
$$ -75 222 21 -27 -15 155 -8 -203 -44 -9 172 90 -18 121 18 126 -42 176 -36 -55 172 72 173
6585A73P7k76J4j52L26j50J1p9J14M8j5K9m3q5j53L20j49l62K51nJ68p1l9L26
$$ 173 250 -26 -12 -164 162 12 23 -56 58 106 91 120 77 -8 -161 159 10 -352 -101 -106 62 -9 -48 278
6609B78p4k00J85j43l7k4q4R8M0m1J46O9k69K58j77j33K30j64k8p2M09j34k16
$$ 278 204 4 189 46 9 -15 -99 -1 39 -2 144 213 -56 202 25 -108 122 -42 -70 -142 267 133 -83
6632h3J75r4n6M7Q2Q6R6r1k85J22m7l3J67n1L5j09qM9prr7L5J99j89K16j58j05
$$ -83 92 -2 -58 -11 71 157 253 162 -123 -1 -48 -81 86 35 70 -39 -47 2 -5 -14 -111 -76 123 -66 150 -8 -113
6659a13J03L9j1m2l2J45r9K2j39l7K0J91Q0k81K23r7k4J39j71L56l38NK55j41
$$ -113 -10 29 18 -24 -56 89 -10 12 -127 -164 -144 47 127 -154 69 -28 -52 87 -84 272 -66 -61 194 53
6683E3q1R9M8j65j76J39l1K11J33k14R2j40j91J33N0K35j62j33J9q4J9P8L60j75
$$ 53 -28 71 119 -46 -222 -83 -114 97 230 16 108 -32 -223 -90 -40 195 33 -100 -81 -165 -146 -68 292 117
6707A17l6n2J3P8q4j31M7J94k71P6K41l16K18L3p0j21J46Q4r4R4n2j04J45m9J67
$$ 117 81 29 42 120 36 -95 -48 146 -125 -49 192 -124 94 127 57 -64 82 166 72 166 114 10 155 106 273
6732B73l52L98j07j57R2k04K14m67L90k9j04j08J97QJj24N2r7K6J04j06M9J25
$$ 273 -79 319 212 55 147 -57 157 -310 80 51 -53 -161 36 44 45 -79 -27 -124 -98 6 -100 -51 74
6755G4j71L27K0j34j29j39L10j46K6J12r9r6M1K03j66rJ57k47R6j0J62o4j10L4
$$ 74 -97 230 250 116 -13 -152 158 12 38 150 51 -45 -4 199 33 24 181 -66 30 20 182 118 8 42
6779D2j37L28j09k7k06J15R0j17P6J88j8k36M9l15L29o0LP2J11j34k34J62J42
$$ 42 -95 233 124 97 -109 6 96 -21 55 243 225 -11 38 -277 52 -8 -5 67 178 44 -190 -28 114
6802A14l44R5l5R2L9J70j44lK13j15j04K17j46nJ8q9J9k16M21L9k85J39J25o1
$$ 114 -230 -135 -170 -78 -39 131 -13 -16 197 82 -22 195 49 44 62 -27 -8 -224 197 236 -49 90 215 154
6826A54m01N2R3K7M19m15j95K78j42R8K08r4k88L83k57L6j4L9K05l22N2J72j77
$$ 154 -247 -195 -102 -75 344 -71 -266 12 -130 -32 176 82 -206 177 -80 -44 -58 -19 186 -136 -84 88 -89
6849h9J50oj17M5P6k76K17q4L24k62K80K5j64q2k88K40Q4k8l27N87l59Q8j37J49
$$ -89 61 55 -62 -17 59 -217 0 -84 240 -22 258 283 119 37 -251 -11 73 45 -282 305 -54 34 -103 46
6873D6o5J02k01K45l78K69r5m7J38n06M53qQ3k4j02J24r1j47K59L4j71k39M11
$$ 46 -19 83 -118 127 -251 18 -77 -124 14 -492 -39 -47 36 12 -90 34 -57 -204 55 89 -82 -321 90
6896I0p5l9K52k67L27k7m39M8J92n7K4J25j29j3qK39k70n5k0j00K7K41p5j80K2
$$ 90 15 -24 228 -39 288 261 -178 -130 62 5 29 154 25 12 4 243 -27 -82 -102 -202 -175 66 -9 -189 -167
6921a67M74l72K59j07j54M3J53k01m9j33J90J3J07l6n3J34l43K25K4q7j2N9p3
$$ -167 307 -65 194 87 -67 -24 129 -72 -121 -254 -64 -51 56 20 -33 101 -242 -17 7 -80 -92 -33 -106
6944a06J41J33k61K31l0l0k02M9o3K46J7j61q7J67P9q9j26J3L4K1j66K85q6k4
$$ -106 35 168 -93 138 108 78 -124 -75 -138 108 125 -36 -123 44 123 34 -92 -79 -45 -24 -190 95 9 -15
6968a5J00k72J02K44l45K20j23L32k28k3O2P0j47j15K58q3J20j99j65K18p3J60
$$ -15 85 -187 -85 159 -186 34 -89 243 15 -8 54 124 -23 -138 120 37 157 -42 -207 11 -62 98
6990I8k23J91o5j6Q0J06k30L3J19k63K07j20J71o6P8R4m0k37J13J0m6kk7p2M7
$$ 98 -125 66 1 -15 65 171 -59 -26 93 -170 37 -83 88 22 100 194 154 -83 30 40 -6 -8 -35 -107 -60
7015f0J25Jl7o2l4K47j65j1K5J09j21j2k26K72JN1k28K0L47k27N4j4k20L94q1
$$ -60 65 66 29 -33 -67 180 15 4 29 138 17 5 -221 51 52 103 -125 -105 242 15 69 55 -165 229 148
7040A48k0r8rr4j22L00j16q2R2Nj82N54l90np1K47J4j1j06j24K2L7J98k6j26N1
$$ 148 128 30 21 -73 -195 105 -11 -93 -1 4 -178 376 -14 -19 -90 157 171 160 54 -70 -48 -11 187 161 35 86
7066H6K75n59L75k6m49L06j35J27%j2k9p8o2J65K7M5k7j29m7L22n6k72j28K74
$$ 86 361 -198 177 151 -298 8 -127 0 0 -12 -41 -119 -181 -16 11 56 29 -100 -147 175 119 -153 -281 -7
7090gj95J30j28K27k19L58l10J20Q3q7J78j52j93J89k2M7j92N7K31l51J15N0r
$$ -7 -202 -72 -200 27 -192 166 -144 -24 59 -28 150 -2 -195 -6 -28 19 -173 -116 115 -236 -121 -71 -80
7113h0Q8N1l5j22q2L18n2j54J78j08j17J67k8q6M6J16Ml2k13p5J02n2Q3K43j03
$$ -80 8 59 24 -98 -180 138 86 -68 110 2 -115 52 24 -62 -16 100 104 72 -141 -216 -114 -166 -83 160 57
7138E7j02K3j62R4l5K76k28K79j68l2K09k11k82N49j89K5j99l9Np3N9J59j34J9
$$ 57 -45 -22 -184 -90 -125 151 -77 202 34 2 211 0 -282 267 78 103 -96 -135 -130 -203 -144 15 -119 -100
7162a00Q1M6K6q9j57M39k82Q1M3p6q2J41q7j15L52k57m9J26l2j33N2J19l9r1p0
$$ -100 -19 27 53 -36 -193 246 -36 45 88 12 -70 71 -16 -131 221 -36 -85 41 9 -124 -72 47 8 -83 -153
7187a53O0j1J24p2j5q0L53J04n42L90j79Q8o2L4o7J73Plj23n0K5Q9o0r2j0k22
$$ -153 -93 -104 20 -52 -67 -147 206 310 -232 158 -21 67 5 39 -28 145 152 149 26 -24 1 90 30 -62 -72 -294
7213b94L01K1om5J61k95J50q9J41k0r8P5l2J79j33N8k26j51J81O5m6J62J01n13
$$ -294 7 28 22 -23 138 -157 -7 -96 45 25 -73 2 -30 149 16 74 -152 -303 -122 -57 -103 59 160 -353
7237c53L04J8O6K34j66o6m9K46j37k06O9l4J53k18L85k08l25J64J63j24J29J51
$$ -353 -49 -31 35 269 103 37 -12 234 97 -109 -40 -74 79 -139 246 38 -287 -123 40 -84 45 196
7259A96j48j86K55j68N7J79j41O8j15J04k06j7J41p0R7o8P2rL5j29j3jJP2k23
$$ 196 48 -138 117 -51 6 185 44 112 -3 101 -105 -122 19 -51 46 -22 50 41 76 -53 -66 -67 -66 6 -217
7284b17M03j42j31K29q7j37J69j32L10m59R9K70k30K72j21j21M0n8J39K1N7Ql22
$$ -217 186 44 -87 142 55 -82 87 -45 265 -194 -95 175 -55 217 96 -25 15 -43 96 117 174 182 -140
7307a40J15j1j03J63L9j17N5o7j71J05K89L7k67L92l92L00j93JM1j27L41l91k6
$$ -140 -25 -36 -139 24 63 -54 1 -66 -237 -132 157 194 -73 319 -73 227 34 35 76 -51 290 -101 -127
7330a27J00n7L23l10L5J62k15p5J01q3K10p8J59j99O3k1J81j18j07J37Kn5J50
$$ -127 -27 -84 239 -71 -36 126 -89 -164 -63 -146 64 -14 145 -54 9 -12 169 51 -56 81 83 28 178
7353A78k40n7K37o3o6R6N2j76L35l14J10j1J35l64N5Q2M9K28p6k47L1L9L8l91
$$ 178 -62 -119 118 55 -11 85 137 -39 296 -18 92 81 216 -148 -93 -11 38 266 190 -57 -26 13 51 -340
7377c40L12KK0p3M8j64J69O2n4k54R8j43L26J6M4J24k15K09l77J13J62k14O5K
$$ -340 -28 -26 -6 -79 -31 -195 -26 36 -18 -272 -174 -317 9 25 69 193 -22 187 -190 -77 85 -129 -64 -62
7401f2j46N42l70P8j80L7QK2J02j31L05j95J62j88j63K02J12k51K09k98OR7Q1
$$ -62 -208 334 -36 42 -138 -101 -93 -71 31 -100 205 10 172 -16 -179 23 135 -116 93 -205 -199 -102 -21
7424b1M5n9J30l45J71J15j17J46j24J95k05J53l05J03J90j73P2P2J71j62m1J38
$$ -21 24 -35 95 -250 -79 36 -81 65 -59 136 -69 84 -221 -118 72 -101 -29 43 214 52 11 149
7446A49k38qK23k62J25k5NK3Lm2k90K80j08J41O2k07P5K13j34J15k51j36K82k3
$$ 149 -89 -97 126 -136 -11 -36 -31 -8 -5 -47 -337 -57 -165 -24 38 -169 -94 119 -15 100 -151 -287 -5 -28
7470b8o8J10o5QQ1k09J54L04k02j66L2j29J27l18L56r9J68j0J96l21J00m6r0J24
$$ -28 -96 14 -51 -43 38 -171 -17 287 85 -81 -49 -178 -51 -369 -13 -112 56 46 242 -79 21 -25 -115 9
7494IL1m4J74j27r8K18k96o6L69j09k02L69r9j21J0O7l50J59P9J86k03J62j25
$$ 9 40 -4 170 43 -55 163 -133 -199 170 61 -141 228 129 8 18 85 -265 -106 -27 159 -44 118 -7
7517gk05K47K07l9j27k69J53k7K07j37L3R9j59lJ37m8l31L49j89R8N4J9j09J92
$$ -7 -212 35 242 203 76 -193 -40 -67 140 3 36 135 -24 -27 110 62 -269 80 -109 -11 43 62 -47 145
7541A45k01N4O2q3Nj95K65J37l01Q5J5O8J6n1j30Q6J74j17r5P3k9k14J55J59j66
$$ 145 -56 -2 60 -23 -18 -213 52 189 -112 -27 -12 56 72 21 -109 -23 151 34 -61 12 -17 -231 -76 83 -83
7566h3O8P4j13j4J12p3k28L80j13K59k44r7K24k20J47J36l6l47K51k0m2l14K89
$$ -83 -15 59 -54 -68 44 -29 -257 123 10 269 25 -72 152 -68 79 215 179 -168 83 63 21 -293 -4
7589dk3J9n5lj31J08o7K9K74k01J47j49n9K65pk70J51K0K1j04J21k05K71l02J22
$$ -4 -27 -8 -63 -66 -197 -89 -156 -127 147 -54 93 -56 -115 150 143 -127 24 44 65 -39 82 -123 148 -154 -32
7614c2k2J00j67K99o4l41p4J87J55M2j55k2J27j65J12J92j02k66j16K60p0K07
$$ -32 -54 46 -121 178 114 -227 -301 -114 41 83 -72 -94 33 -132 -20 172 70 -196 -312 -52 -122 85
7636H5m1j69J54Kr2k12K40N1Jm1l03L51k3o0J97j82K01k33m6Lr6N69k23j68Q9
$$ 85 44 -125 29 31 -61 -273 -33 18 19 -22 -325 26 3 -57 140 -42 159 -74 -120 -117 -213 356 133 -35 54
7661E4J30j53q8J95l2K12l53J33R8l70L09k00r3K89j32n8J72o9k03JP0L05l32
$$ 54 184 31 -57 138 106 318 -35 98 196 -174 135 -65 -158 131 -1 -59 113 44 -159 -158 -88 217 -115
7684a15K30j89k35L31O3N3k78J45j72K88J41l60R1l6q2J69k39J92n1l9k14J72
$$ -115 115 -74 -309 22 85 138 -140 5 -167 121 262 -98 -7 -43 -125 44 -195 -3 -54 -93 -307 -135
7706a35J76k6K12m22L81j72M2j07j20L03j53P1n3k74J83L39k82Q6Oj43p7J03n6
$$ -135 41 15 227 -195 186 14 56 -51 -171 132 -21 50 -3 -277 -94 245 -37 49 55 -88 -165 -62 -118
7729a18n3K56r6p9L86k77k1Pn4R0J23K1j47J58k35l9j16M5K76K6l16K01J23k3
$$ -118 -171 85 -11 -90 296 19 -2 5 -49 41 164 185 38 196 -39 -78 -194 -149 127 153 -163 38 161 138
7753A38n22K25K61J02j75r9J02J4j51K06l21K7J33p8K64j0j86q9j62K98J25R8
$$ 138 -384 -159 102 204 29 -70 32 46 -105 101 -220 -193 -60 -138 126 116 -70 -159 -321 -23 102 200
7775B00j06m1J30k04J82j39K93l43J8ol3k3m0J90K5j1j0P4j61k4p6J74p4M3j17
$$ 200 94 53 183 -21 161 22 315 -28 -10 -16 -49 -72 -112 78 103 92 82 156 -5 -29 -105 69 -5 38 -79
7800g9M4J09j2j84R2j19J03o1K30j38K4K7J28j53K47l22RN8J32J75l20R5k82K13
$$ -79 -35 74 62 -122 -30 -149 -46 -107 123 -15 9 36 164 11 258 -64 -55 3 135 310 -10 85 -197 16
7824A6k62m1K94m4PK7k39L73J2l02J6K92l04K90j92K40j73j73M16k04K7J3j63
$$ 16 -246 -287 7 -37 -30 -3 -242 131 143 -159 -143 149 -155 135 -57 183 10 -163 253 49 76 89 -74
7847g4J15p9J91J61k29Oj03j9m8L77l31m1PN6N3J1o4m3K52j66J10R7j72L7k18
$$ -74 41 -38 153 314 85 91 -12 -31 -79 298 -33 -74 -67 -11 42 53 -11 -54 198 32 142 239 67 104 -114
7872a14O5J61P8n5J42l99K8L96j78j68K27j21l54M0K77j45M1m8O5L1k3k13M0J71
$$ -114 -49 112 190 135 277 -122 -94 302 124 -44 183 62 -292 -252 25 -120 -79 -127 -62 -31 -54 -267 -227 -56
7896e6K10l7Q1j28p2J42q0j50J82J41k98K76l97N4jJ34p3k8r2K34j9j01J07N1
$$ -56 154 117 198 70 -2 140 60 -90 92 233 -65 211 -186 -132 -133 1 -72 -100 -192 42 23 -78 29 80
7920H0k59n8J71p1Q5Q7J27k48J71J5j8k1j21K7n0K48l84J65Q8J51j10J9oj26j64
$$ 80 -179 -237 -66 -137 -52 35 162 -86 85 100 82 61 -60 -33 -83 165 -219 -54 34 185 75 94 88 -38 -202
7945b02J05L19K5j85q7o0J49J06k07k5k09K31m3r4K22o5j02N9p0l1J21O1j76K54
$$ -202 -97 222 247 62 -25 -85 64 170 -37 -62 -271 -40 -83 -177 45 -20 -122 -63 -133 -164 -43 18 -158 96
7969I6o2kmJ05j86m1Pk6J35R3o7L5l45L63K6p9r6L83k49k4k8K23l89Q0K53k74
$$ 96 34 32 28 133 -53 -94 -87 -113 22 115 48 83 -262 101 127 48 -48 335 86 62 34 257 -132 -52 201 -73
7995g3l3j23K06J23j33M3N1k30L97j01j74r9J37J8J09l2k70R8K0M6o5K24k28J04
$$ -73 -106 -229 -23 100 -33 10 61 -169 228 127 -47 -146 -9 9 118 86 -184 -86 -66 -20 -85 139 -89 15
8019A5o0N2J6l9r6J45m6M5Q5K6KJ17k63o1K28q4K22k52j70K72j15l8l9Q5J6k33
$$ 15 -45 7 23 -16 -112 33 -13 32 117 143 145 262 -1 -62 166 82 304 52 -118 154 39 1 -38 47 63 -170
8045a70J90J31k22J12j05J12j65J39J09q7o6n9L5J70j94J78k5j36J66l19L35j85
$$ -170 20 151 -71 41 -64 48 -117 22 131 44 -22 -81 -46 124 -70 108 83 -53 113 -206 129 -56
8067e6J30o6J94j75j23K45p5o4J5M9J55k47r0L33k52l6K79pj96m1K6j27j92M67
$$ -56 74 8 202 27 -96 149 74 10 25 74 229 -18 -108 225 -27 -63 216 209 13 -28 -2 -129 -321 146
8091A46k82L9K92m30K68k38J6p6J72J5m0J73k68J76K09j35J9j39j1J84R5j77k2
$$ 146 -136 -97 195 -235 33 -205 -189 -265 -93 -78 -118 55 -213 -37 172 37 56 -83 -94 90 185 8 -14
8114a4M4K5j00K4J57j78k9K14j17j99K36K3r3K99k23k8kJ22j42K14j98Q6N5l24
$$ -14 30 55 -45 -21 136 -42 -71 143 26 -173 63 86 -7 292 69 41 39 161 19 233 35 121 176 -148
8138a48r0K34O9j49L19l93L40r9j92Q0J79K69m18j7J28L1M8j06N5l67M31k15J65
$$ -148 -238 -4 65 -84 235 -158 182 83 -109 -29 150 419 1 -16 112 143 191 85 140 -227 204 -11 154
8161A54R3k43r3J01j05J42R4k06K3j58K40j93m9M14l6j1J0k09l1m2N4J91j66K09
$$ 154 247 4 -89 12 -93 49 143 -63 -40 -198 42 -151 -200 214 178 167 177 -32 -63 -105 -51 140 -26 183
8185A83k58j70M32N8k95l3
$$ 183 -75 -245 187 245 -50 -83
8191h3
$$ Imaginary data points
##PAGE= N=2
##DATA TABLE= (X++(I..I)), XYDATA
0@%%%%%%%%%%%%%qJ6j6J6j6K4l2L3m1M9n7P1q2R3j06J23j43J64j88K14k42K72
$$ 0 0 0 0 0 0 0 0 0 0 0 0 0 0 -8 8 -8 8 -8 16 -16 17 -24 25 -32 39 -43 50 -56 67 -76 88 -100 114 -128 144
35A44l06L45l86M29m79N34n94O58p29Q07q91R84j084J193j315J448j595J760j941
$$ 144 -162 183 -203 226 -253 281 -313 345 -384 423 -468 516 -568 625 -690 758 -837 923 -1018
54a018K145k377K641k944L296l710M208m822N596o607P991j0013J3244j9222L3877
$$ -1018 1127 -1250 1391 -1553 1743 -1967 2241 -2581 3015 -3592 4399 -5614 7630 -11592 22285
69B2285j35471j95724K33647N6020j1687K08984J17093j51632K5709J01274j13876
$$ 22285 -113186 -308910 -75263 -19243 -30930 178054 295147 143515 169224 270498 156622
80A56622n2125Q9330j60974j87143J24201Q1727j06130Q5752R6987k06640j53207
$$ 156622 104497 193827 32853 -154290 -30089 51638 -54492 31260 128247 -78393 -231600
91b31600P6997m3760o1025J51985N2431j14584Q9297J48957n4212L1403J56160
$$ -231600 -154603 -198363 -259388 -107403 -54972 -169556 -80259 68698 14486 45889 202049
102B02049q9619j61773Q2756O2956n6333J07712J16843j16280p0454N6497r1631
$$ 202049 112430 -49343 33413 96369 40036 147748 264591 148311 77857 134354 42723
113D2723r8216Q1761l4567j80750R836Q3077o4243K6132J42205m1862j05582N3365
$$ 42723 -55493 26268 -8299 -189049 -179213 -96136 -160379 -134247 7958 -33904 -139486 -86121
125h6121J3399n8946R4772J03400o0076Q926J12220j3938k3730J05312J227j25733
$$ -86121 -72722 -131668 -36896 66504 6428 15354 127574 113636 89906 195218 196445 70712
137G0712j2064J7773q2476K479Q3460m9592p5579L3273k6460q8488K9886L5037
$$ 70712 58648 76421 -6055 -3576 79884 30292 -45287 -12014 -38474 -126962 -97076 -62039
149f2039q2383k4108O2149o989Q470J06847M0573l7307L1933K6526m8562J9730
$$ -62039 -144422 -168530 -106381 -113370 -104900 1947 42520 5213 37146 63672 15110 34840
161C4840P2686j7890k3671N1594P92m3910K6843J0888p8712m7701o067n6239l1893
$$ 34840 107526 89636 65965 117559 118351 74441 101284 112172 33460 -14241 -20308 -76547 -108440
174a08440M4685P619l0202K0445J1563l7397O250L4128j6421n338M4562J9221
$$ -108440 -63755 -56136 -86338 -65893 -54330 -91727 -85477 -51349 -67770 -73108 -28546 -9325
186i325R704O2058M5112j2287J653P878l6301k5299J5095p140k0279R890r90k7857
$$ -9325 379 62437 107549 95262 96915 104793 68492 43193 58288 51148 30869 40759 39769 11912
200A1912p816n163m0270l5024j0226k0376j1064K7369K9302J4065K5310J9280
$$ 11912 4096 -1067 -41337 -76361 -86587 -106963 -118027 -90658 -61356 -47291 -21981 -2701
212b701n003K692J3812j997J86K3919K0713R574K2546K0489m773j7657k2200l1991
$$ -2701 -7704 -5012 8800 6803 6989 30908 51621 61195 83741 104230 99457 81800 59600 27609
226B7609k9817j8439j4803n255Q693K490p041J000r92j7087j7801l355J376O650
$$ 27609 -2208 -20647 -35450 -40705 -32012 -29522 -36563 -35563 -36555 -53642 -71443 -74798 -73422 -66772
240f6772K1789L0381L1173K7499J5048L827m63p222j4815r667M29K431L512P428
$$ -66772 -44983 -14602 16571 44070 59118 62945 62482 55260 40445 30778 31207 33638 37150 44578
254D4578M091o003j4218k4339k9798k4542j8398j2862Q94J5440J8482J5385J4325
$$ 44578 48669 42666 28448 4109 -25689 -50231 -68629 -81491 -80597 -65157 -46675 -31290 -16965
267a6965J0402J379m578n592j089Q593J3522J6401K3124K3596J0277k209p636
$$ -16965 -6563 -5184 -9762 -15354 -16443 -7850 5672 22073 45197 68793 79070 76861 69225
280F9225j5450k5480k4199j4909q428k570L431N928L645k437j0495j5362j3924
$$ 69225 53775 28295 4096 -10813 -19241 -21811 -18380 -12452 -8807 -11244 -21739 -37101 -51025
293e1025j2180o351N779J7278K2045K4007K4106J6193N531j116o826j0794p901
$$ -51025 -63205 -69556 -63777 -46499 -24454 -447 23659 39852 45383 44267 37441 26647 18746
306A8746j236M498P444R747P379J03j0426j7706k2600k3239k0058j1957l56Q266
$$ 18746 17510 22008 29452 39199 46578 46681 36255 18549 -4051 -27290 -47348 -59305 -59661 -51395
320e1395J2287J4232J3008O073j536n013n925l352J454R267J6794J8671J7369
$$ -51395 -39108 -24876 -11868 -5795 -7331 -12344 -18269 -21621 -20167 -10900 5894 24565 41934
333D1934J3283N155m667j2031j6526j6597j3681p538m23M462M837L327K08o199
$$ 41934 55217 60372 55705 43674 27148 10551 -3130 -10668 -11091 -6629 -1792 1535 1743 -4456
347d456j4201j4119j0075p605r67J0549J6673J6340J6039J3315N318j752n851
$$ -4456 -18657 -32776 -42851 -50456 -51423 -40874 -24201 -7861 8178 21493 26811 25059 19208
360A9208p022m716J05K748P264J1685O957j630l587p892j7658j7933j0126q402
$$ 19208 12186 7470 7575 10323 17587 29272 36229 34599 31012 23120 5462 -12471 -22597 -30999
374c0999n556N852J0332O412O314M450m711o206k678m842j055J1011J1280P985
$$ -30999 -36555 -30703 -20371 -13959 -7645 -3195 -7906 -14112 -16790 -21632 -22687 -11676 -396 7589
388G589J4754J2723q64k997j132j2942j4647p99j194m548P690R045n588l992M0
$$ 7589 22343 35066 34202 31205 30073 17131 2484 1685 491 -4057 3633 12678 7090 3098 3138
403C138j2362j4627j577m268p450R707J4537M550J1702J4480o331q803M383n528
$$ 3138 -9224 -23851 -25428 -29696 -37146 -27439 -12902 -8352 3350 17830 11499 2696 7079 1551
417A551j0476J1670J2335m680O241J4920o207q989L866j1903k2834k058R69q925
$$ 1551 -8925 2745 15080 10400 16641 31561 25354 16365 20231 8328 -14506 -16564 -15595 -24520
431b4520R958J8093n406l999R254r882j5497R057K889j4802Q988K0414k146P354
$$ -24520 -14562 3531 -1875 -5874 3380 -6502 -21999 -12942 -10053 -24855 -15867 4547 2401 9755
445I755K4472m031j9652K120n693k0539P384J7121r502L46J8048r081j3090J4487
$$ 9755 34227 30196 10544 12664 6971 -13568 -6184 10937 1435 1781 19829 10748 -2342 12145
459A2145o053l0374p82P455j6861Q191L5380J161r319J6067m429k5312Q642J2844
$$ 12145 6092 -24282 -25064 -17609 -34470 -26279 9101 10262 943 17010 12581 -12731 -4089 8755
473H755k0100p4K1776p786k669L2116M006k5875P56m175l3987p56K6797p589n674
$$ 8755 -11345 -11419 10357 2571 -98 32018 36024 10149 10905 6730 -27257 -28013 -1216 -8805 -14479
488a4479K5992k923k2270K0232J2760l0615o701J3561k1843o508M0558J3674j2149
$$ -14479 11513 8590 -13680 6552 19312 -11303 -18004 -4443 -26286 -32794 7764 21438 9289
501I289J8229J974l5906J2J9994k1735j0582K4832r711j8953L4167K1861k4638
$$ 9289 27518 29492 -6414 -6402 13592 -8143 -18725 6107 -3604 -22557 11610 33471 8833
514H833O05Q213m0092j8374L1249J704j1029K9965P633k8972J3853K5209k4033
$$ 8833 9438 17651 -22441 -40815 -9566 -7862 -18891 11074 18707 -10265 3588 28797 4764
527D764j0607J7639k5657k6059L4268K0806j3911K0652J6383l9034j5298K5002
$$ 4764 -5843 11796 -13861 -39920 -5652 15154 1243 21895 38278 -756 -16054 8948
539H948j3935j8790K4412m46k9992K0807L1656j3574J930J9582l1903l2325K1633
$$ 8948 -4987 -23777 635 189 -29803 -8996 22660 9086 11016 30598 -1305 -33630 -11997
552a1997O770j4432K6348J9642k9291j495K8390j3670j5443K0737j4552l8430
$$ -11997 -5227 -19659 6689 26331 -2960 -4455 23935 10265 -5178 15559 1007 -37423
564c7423J4826K4588j0611J4941K8926k4377k5029J7314m562k0257K0314J0691
$$ -37423 -22597 1991 -8620 6321 35247 10870 -14159 3155 -1407 -21664 -1350 9341
576I341k8902N364K9313p278l92K7452j5268l7955P125P760j8520J4686K7766
$$ 9341 -19561 -14197 15116 7838 7446 34898 19630 -18325 -11200 -3440 -21960 -7274 20492
589B0492j7639j3297K0821m166j6367J7679Q50l1704m4J8380p694Q692L2312o888
$$ 20492 2853 -10444 10377 6211 -10156 7523 8373 -23331 -23375 -4995 -12689 -3997 28315 21427
603B1427k3579Q656j44k0716J1264J7768j8206o673J9686l028o594K0857o05k8580
$$ 21427 -2152 6504 6360 -14356 -3092 14676 -3530 -10203 9483 6455 -139 20718 20113 -8467
617h467m227L286j5854N952K5117m005j0039J3881j053j4661J2147Q963j9312
$$ -8467 -12694 -9408 -25262 -19310 5807 1802 -8237 5644 4591 -10070 2077 11040 -8272
630h272m164J3095n779J267K5193M351j5222J646j659j8517O39J2689p879o077
$$ -8272 -12436 659 -5120 -3853 21340 25691 10469 12115 10456 -8061 -7422 5267 -2612 -8689
644h689J1002k704o817J1987L013j6122l653J358j2670J223K0027M632k502J1246
$$ -8689 2313 -391 -7208 4779 7792 -8330 -11983 -10625 -23295 -22072 -2045 2587 85 11331
658A1331J961j1275L170N774r051l440N761l482M6J4049L555p570P43m938j6708
$$ 11331 13292 2017 5187 10961 1910 -1530 4231 749 795 14844 18399 10829 11572 6634 -10074
673a0074m690N472m797j895R855J705l162P275L997p265k165P14p487J86J1487
$$ -10074 -14764 -9292 -14089 -15984 -6129 -4424 -7586 -311 3686 -3579 -5744 -5030 -12517 -12331 -844
688h44N336L900J0370J968o828o79j563r685l998K304m238p05Q625K671l586J132
$$ -844 4492 8392 18762 20730 13902 13223 11660 1975 -2023 281 -3957 -4662 3963 6634 3048 4180
704D180l148j1928o099j09l509R02R245N472L765P993L177l457J15j335o729r43
$$ 4180 1032 -10896 -16995 -17104 -20613 -19711 -10466 -4994 -1229 6764 9941 6484 6599 5264 -1465 -2408
720b408O352J966K752Q953L169m967k441m316j0637p563k511l610k72N483L386
$$ -2408 3944 5910 8662 17615 20784 15817 13376 9060 -1577 -9140 -11651 -15261 -15533 -10050 -6664
735f664J495M234n92n907k334q58m366J615Q361O327N299R163N233j957j831l118
$$ -6664 -5169 -935 -1527 -7434 -9768 -10626 -14992 -13377 -5016 1311 6610 15773 21006 19049 17218 14100
751A4100p408n403o53j511R36M556K011j432j021l902q856o226l357l573K84O313
$$ 14100 6692 1289 636 -875 61 4617 6628 5196 4175 273 -8583 -14809 -18166 -21739 -21455 -15142
767a5142O358M885O872M346j158j064j052l356j286K746L418M275N361L383n36
$$ -15142 -8784 -3899 2973 7319 6161 5097 4045 689 -597 2149 5567 9842 15203 18586 18050
782A8050k504n528p677o624m661l950q52L617L074J456K269R17l707l864j954
$$ 18050 15546 10018 2341 -4283 -8944 -12894 -13746 -10129 -7055 -5599 -3330 -2413 -6120 -9984 -11938
797a1938j131O63M173O359O746O546L836J636q62k778n390l560j544r70M04K941
$$ -11938 -13069 -12406 -8233 -1874 4872 11418 15254 16890 16028 13250 7860 4300 2756 1786 2190 5131
813E131J617p76k111l446n525o410m598j703J97K182M527N287M816K456R81P2
$$ 5131 6748 5972 3861 415 -5110 -11520 -16118 -17821 -17624 -15442 -10915 -5628 -812 1644 2625 2697
829B697j139j255J88K387L409L891L905K922L47k679m314n513n857m349k122j062
$$ 2697 1558 303 491 2878 6287 10178 14083 17005 17352 14673 10359 4846 -1011 -5360 -7482 -8544
845h544N68J541J175j60j191k150k762j737o31J853M678N012N335N730L927O20
$$ -8544 -7976 -6435 -5260 -5420 -6611 -8761 -11523 -13260 -13891 -12038 -7360 -2348 2987 8717 12644 13264
861A3264q62j014k490l086k85R94M74R65P28j411l267m140n860n034l077k393
$$ 13264 12402 11388 8898 5812 5527 6521 6995 7960 8688 7277 4010 -130 -5990 -11024 -14101 -16494
877a6494m27M202L801J576L011L341o69k193J754R73k06L930N521L385L888L118
$$ -16494 -16921 -12719 -8918 -7342 -4331 -990 -1659 -3852 -2098 -1125 -1331 2599 8120 11505 15393 18511
893A8511j481l279k914n485o055p64j010k789J278L058l016k316N75m552o359
$$ 18511 17030 13751 10837 5352 -703 -1467 -2477 -5266 -3988 -930 -3946 -6262 -5687 -10239 -16598
908a6598O25J463j029O001Q356K845K955O624n43l972K298j47n203J678N447k094
$$ -16598 -15973 -14510 -15539 -9538 -1182 1663 4618 11242 10699 6727 9025 8878 3675 5353 10800 8706
924H706J180N922l806p483r82n556j1127o10L184m966K88Q860K76k573O479R16
$$ 8706 9886 15808 12002 4519 3537 -2019 -13146 -13756 -10572 -15538 -15250 -6390 -6114 -8687 -2208 -1292
940a292q048J326M138l569L979J2711K078l25R090l28j0099J275J949j2184m306
$$ -1292 -9340 -8014 -3876 -7445 -3466 9245 11323 10998 20088 19760 9661 10936 12885 701 -3605
955c605O956m597m550R963J586j1425O35j01j2905k714R140l643j706J3951L561
$$ -3605 3351 -1246 -5796 4167 5753 -5672 -5037 -5138 -18043 -20757 -11617 -15260 -16966 -3015 546
970E46n000J1095Q242j1335j076Q050q642m783J5100L752q250Q140M087j5338
$$ 546 -4454 6641 14883 3548 2472 10522 1880 -2903 12197 15949 7699 15839 19926 4588
984D588l057O207j2803j0236Q008l200r587J1802R486j0025J865Q459j2413o755
$$ 4588 1531 7738 -5065 -15301 -7293 -10493 -20080 -8278 1208 -8817 -6952 1507 -10906 -17661
998a7661J3924N80p071J3991Q899r142O689J3896r528q013Q104q290j4108R589
$$ -17661 -3737 -3157 -10228 3763 12662 3520 10209 24105 14577 6564 14668 6378 -7730 1859
1012A859O516j0451L732R088j3636p266R700p121j2674Q927K336j2436Q557J6952
$$ 1859 8375 -2076 1656 10744 -2892 -10158 -458 -7579 -20253 -11326 -8990 -21426 -12869 4083
1026D083n533m56J3416n659j2604J0060N409r608O385J0977r235j903J2982n074
$$ 4083 -1450 -1906 11510 5851 -6753 3307 8716 -892 5493 16470 7235 5332 18314 13240
1040A3240j1212N819m169j7341K473R267q166n20J2932n735j0604R159K339j0999
$$ 13240 2028 7847 3678 -13663 -11190 -1923 -10089 -10609 2323 -3412 -14016 -4857 -2518 -13517
1054a3517M707Q619q452R05J5494P69k827J0758J19j3693J651N680q681j095R449
$$ -13517 -8810 -191 -8643 -7738 7756 8525 5698 16456 16575 2882 4533 10213 1532 437 9886
1069I886n359p796P695N8j0379K289J866j2590l537Q772j538j054J1081K798o608
$$ 9886 4527 -3269 4426 4484 -5895 -3606 -1740 -14330 -17867 -9095 -10633 -11687 -606 2192 -4416
1084d416M032M558n630J260P459l573k256Q179J942l539N290J432j0466m210J683
$$ -4416 -384 4174 -1456 -196 7263 3690 1434 9613 11555 8016 13306 14738 4272 62 1745
1099A745n867m035N211K17m429K082J930m124j64K065l788j892L930J659K174
$$ 1745 -4122 -8157 -2946 -2729 -7158 -5076 -3146 -7270 -7434 -5369 -9157 -11049 -7119 -5460 -3286
1114c286P431M277q93J171O72l126j459J542r43j560R11O94q31K73j320m110l611
$$ -3286 4145 8422 7529 8700 9372 6246 4787 6329 5386 3826 4737 5431 4600 4873 3553 -557 -4168
1131d168l849l473k90J419J182K722L206M24R62J744p36j002J611L81N33M287
$$ -4168 -8017 -11490 -11780 -10361 -9179 -6457 -3251 -2827 -1865 -121 -857 -1859 -248 133 666 4953
1147D953M019J210J883J015m086l534j081m916l520J778o1k376K418K359m436
$$ 4953 8972 10182 12065 13080 8994 5460 4379 -537 -4057 -2279 -2340 -4716 -2298 61 -4375
1162d375j773J614m131m104L260K010o14N981O286j25K227L414l286l350K973
$$ -4375 -6148 -4534 -8665 -12769 -9509 -7499 -8113 -2132 4154 4029 6256 9670 6384 3034 6007
1177F007j380l960M057L966l622R02M210n398o011N19l923p551K228K685k701
$$ 6007 4627 667 4724 8690 5068 5970 10180 4782 -1229 -710 -4633 -12184 -9956 -7271 -9972
1192i972L041O295k056j329M450k258m680L800K524l217M335Q372j169l7N709
$$ -9972 -6931 -636 -2692 -4021 429 -1829 -6509 -2709 -185 -3402 933 9305 8136 8099 13808
1207A3808k911p413Q58j169o671K15M876l250j377N271j620n564J474j138o988
$$ 13808 10897 3484 4342 3173 -3498 -3283 1593 -1657 -3034 2237 617 -4947 -3473 -4611 -11599
1222a1599O34M547j446K127Q269Q30j813N160K96n753L82L344m124n24O139O27
$$ -11599 -10965 -6418 -7864 -5737 2532 3362 1549 6709 7005 1252 1634 4978 854 330 6469 7096
1238G096k020L473n00o705k296o95n624j664L561o90p44N280J523k934J160J693
$$ 7096 5076 8549 8049 1344 -952 -1647 -7271 -8935 -5374 -6064 -6808 -1528 -5 -2939 -1779 -86
1254h6m936j238M560j36J10N687L350j194J472J405m156k414J90l054k293K855
$$ -86 -5022 -6260 -1700 -1836 -1726 3961 7311 6117 7589 8994 4838 2424 2614 -440 -2733 122
1270A22P62j631K429J084l895k366K92l260k309K375J584J24L589L584k24J20
$$ 122 884 -747 1682 2766 -1129 -3495 -3203 -6463 -8772 -6397 -4813 -4689 -1100 2484 2260 2380
1286B380J322j624k115P83L76o39K735J984m4L26L0k778k780j187k138k233J157
$$ 2380 3702 2078 -37 746 1122 483 3218 5202 5158 5484 5514 2736 -44 -1231 -3369 -5602 -4445
1303d445J482PJ144J971q66r87R4j036j653O96J635J501K197K232J015L97k51
$$ -4445 -2963 -2956 -1812 159 -707 -1694 -1600 -2636 -4289 -3593 -1958 -457 1740 3972 4987 5384 5133
1320E133k081j731p09j120p59R73J730K88m80J39r34k201j872j220k40L02J303
$$ 5133 3052 1321 612 -508 -1267 -294 1436 1724 1244 1383 449 -1752 -3624 -4844 -5084 -4782 -3479
1337c479J789K205J204L92n5n27j332j019L38M54Q00J440J744L71N0r08j741k280
$$ -3479 -1690 515 1719 2111 2056 1529 197 -822 -484 -30 770 2210 3954 4325 4375 3467 1726 -554
1355e54j755n35n13L24J288J388P48M03p53q80r84j404m40P44J382J198K284J864
$$ -554 -2309 -2844 -3357 -3033 -1745 -357 391 794 41 -839 -1823 -3227 -3667 -2923 -1541 -343 1941 3805
1373C805L14n02q42p73k285j187M28J01P94K009O87J41j026j192k038j784q20
$$ 3805 4119 3617 2775 2002 -283 -1470 -1042 -941 -147 1862 2549 2690 1664 472 -1566 -3350 -4170
1390d170p84J040K308R60J293K050K19j649j113k19k167n87J892J215J075K360
$$ -4170 -4954 -3914 -1606 -646 647 2697 2916 1267 154 -65 -2232 -2819 -927 288 1363 3723
1406C723R80j297l78j347k672j539N8j101L50L031J394l86J384J05k868j783L00
$$ 3723 4703 3406 3028 1681 -991 -2530 -2472 -3573 -3223 -192 1202 816 2200 2305 -563 -2346 -2046
1423b046j589l39K777J501K19K344J537k078m41m50l290j542J688L40J8L355J818
$$ -2046 -3635 -3974 -1197 304 523 2867 4404 2326 1885 1435 -1855 -3397 -1709 -1369 -1351 2004 3822
1440C822k233O59N95l426k069J095j469j374L397K588o47J703J644k798k516M43
$$ 3822 1589 2248 2843 -583 -2652 -1557 -3026 -4400 -1003 1585 938 2641 4285 1487 -1029 -586
1456e86j932j773K499J195r37K951K423j886m71J834l642l730J763Q80j518L576
$$ -586 -2518 -4291 -1792 -597 -1534 1417 3840 1954 1483 3317 -325 -4055 -2292 -1412 -2930 646
1472F46L286k006j9J896k700k490J557j779l050K817K327j339K491L472l643k746
$$ 646 3932 1926 1907 3803 1103 -1387 170 -1609 -4659 -1842 485 -854 1637 5109 1466 -1280
1488a280J396k008l449L124K158k454J786L764j307j55K680k557l884Q75M06k062
$$ -1280 116 -1892 -5341 -2217 -59 -2513 -727 3037 1730 1575 4255 1698 -2186 -1311 -905 -2967
1504b967L019L907j755m06K458k897k893K205j013m182J097K239j832J880M669
$$ -2967 52 3959 2204 1798 4256 1359 -1534 671 -342 -4524 -3427 -1188 -3020 -1140 3529
1519C529j382l130J149j753l008K503K577j757R05L259j417K37L693j674m167
$$ 3529 2147 -983 166 -1587 -4595 -2092 485 -1272 -367 2892 1475 1712 5405 3731 -436
1534d36O67m15l506K579M406j581j189K524k898k858K012m9l499O21J457j685
$$ -436 231 -184 -3690 -1111 3295 1714 525 3049 151 -2707 -695 -744 -4243 -3622 -2165 -3850
1550c850K012N075r39j817J945j927m094L065K640k489J448L186k083j049L809
$$ -3850 -1838 3237 2298 481 2426 499 -3595 -530 2110 -379 1069 4255 2172 1123 4932
1565D932j261l422M22j436m229J710L575j244L72L085l295k679K266q6l060J728
$$ 4932 3671 249 671 -765 -4994 -3284 291 -953 -581 2504 -791 -3470 -1204 -1290 -4350 -2622
1581b622J949k389J687N280l75j497K978k032m795J961J766k532J541K837k579
$$ -2622 -673 -3062 -1375 3905 3530 2033 5011 2979 -1816 145 1911 -621 920 3757 1178
1596A178j101L283j738l526J292j476m713K053L665j795J049M759k068l350L336
$$ 1178 77 3360 1622 -1904 -612 -2088 -6801 -4748 -1083 -2878 -1829 2930 862 -2488 848
1611H48K16l867J956K362k844J669M649r17j424L155k348n267J521P36m120J424
$$ 848 1064 -2803 -847 1515 -1329 340 4989 4072 2648 5803 3455 -1812 -291 445 -3675 -2251
1627b251L938k667j371M174o21m477J752J78m769J235M044j000Q95M902o73k554
$$ -2251 1687 -980 -2351 1823 1202 -3275 -1523 -1345 -6114 -4879 -835 -1835 -940 3962 3289 735
1643G35K955j08m628J374K067l658N04N311j342k410L526j495n767N94J365m326
$$ 735 3690 3582 -1046 328 2395 -1263 -759 4552 3210 800 4326 2831 -2936 -2342 -977 -5303
1659e303j03M324j538j029N218J30l477J946O69m376N60M400j608J93N241p5l253
$$ -5303 -5406 -1082 -2620 -3649 1569 1699 -1778 168 837 -3539 -2979 1421 -187 6 5247 5172 1919
1676A919L033M31n299p19J650l379j655M535K94k472K680L20m822J67J395k955
$$ 1919 4952 5383 84 -635 1015 -2364 -4019 516 810 -1662 1018 1338 -3484 -3317 -1922 -4877
1692d877m54M164l36j188N041K152l151J814J183m432j133L339p55j489L670N29
$$ -4877 -5331 -1167 -1503 -2691 2350 4502 1351 3165 4348 -84 -1217 2122 1367 -122 3548 4077
1708D077k832J265J138m465j421J076l081k091L654J067j407K519K119l415m32
$$ 4077 1245 2510 3648 -817 -2238 -1162 -4243 -6334 -2680 -1613 -3020 -501 1618 -1797 -2229
1723b229K273k085j148L344P96j145L175K665j896J04J213l168k408R93o09j722
$$ -2229 44 -2041 -3189 155 951 -194 2981 5646 3750 3854 5067 1899 -509 484 -125 -1847
1739a847K396M79k084N80J314k917j784J484j724k103K635J931p2K039K376j072
$$ -1847 549 1028 -1056 -476 838 -2079 -3863 -2379 -4103 -6206 -3571 -1640 -1712 327 2703 1631
1755A631p25J410j199q20J456N53j113J569J818j561J8K85k387l079K24l80k067
$$ 1631 906 2316 1117 297 1753 2306 1193 2762 4580 3019 3037 3322 935 -2144 -1920 -2300 -4367
1772d367J208J529o24K60J457q93r06P18o08o55J236J977O30J488K159n33q88
$$ -4367 -3159 -1630 -2254 -1994 -537 -1430 -2336 -1618 -2226 -2881 -1645 332 962 2450 4609 4076 3188
1789C188M30r54j665qK10j048K46J185n79o65k27j353j952o04k75r2O62J212R24
$$ 3188 3618 2664 999 991 1201 153 399 1584 1005 340 113 -1240 -3192 -3796 -4071 -4163 -3501 -2289 -1365
1808a365Q43J269p6l85P51l17p90N13J215N37N16J497p7q89r81r65j429j150m22
$$ -1365 -522 747 671 286 1037 720 -70 443 1658 2195 2711 4208 4131 3242 2261 1296 -133 -1283 -1705
1827a705m45K63L56L77L07K05j099p90o06J44k15J002J526J221J016R98R08n34
$$ -1705 -2150 -1887 -1531 -1154 -847 -642 -1741 -2531 -3137 -2993 -3208 -2206 -680 541 1557 2555 3463 2929
1845B929o40n38m62n40j05L81N16L90qk69q08j177j573j223l17k45K12J538Q30
$$ 2929 2289 1751 1289 749 644 1025 1541 1931 1923 1654 846 -331 -1904 -3127 -3444 -3689 -3477 -1939 -1109
1864a109Q17M03K4k11l81k52NK27R87J330J096Q12N5p14o85o71j676j073lm07
$$ -1109 -292 111 135 -76 -457 -709 -704 -477 510 1840 2936 3748 3803 3089 2404 1733 57 -1016 -1019 -1426
1884a426L34Q71M45o17R0k79j456j037q7J46K57J284J445J012J072L62m37k66
$$ -1426 -1092 -221 224 -393 -303 -582 -2038 -3075 -3162 -3016 -2759 -1475 -30 982 2054 2416 1979 1713
1902A713o28n66m12P50K76K66R29M96r71r94k27j789j677k43L15O2O34J539M9
$$ 1713 1085 519 107 857 1133 1399 2328 2824 1853 859 632 -1157 -2834 -3077 -2762 -2700 -2066 -527 -478
1921d78L50M24p57l96M81o82l03J552J156L81J516M54q25r26l67j105j315K53
$$ -478 -128 296 -461 -857 -376 -1058 -1361 191 1347 1728 3244 3698 2873 1947 1580 475 -840 -587
1939e87L46p10O62J044m35m36K72j722j605J55M4m8J470J849j56R97P66k51r20
$$ -587 -241 -951 -289 755 320 -116 156 -1566 -3171 -3016 -2972 -3020 -1550 299 143 1140 1906 1655 735
1958G35N31l64j101K31J169J89P54J144o49j868j18j165j615K24P7o38L76J250
$$ 735 1266 902 -199 32 1201 1390 2144 3288 2639 771 653 -512 -2127 -1903 -1826 -2464 -2088 -838
1976h38j80R0J471n51k285N94P74q28J299K135K72l6J025k08r16K34n14j578m07
$$ -838 -1018 -928 543 -8 -2293 -1699 -925 -1753 -454 1681 1953 1917 2942 2734 1818 2052 1538 -40 -447
1995d47N33p04M04J911l58j892j66q33j774N89R30m89M74J338J02K59J614J32
$$ -447 86 -618 -214 1697 1339 -553 -719 -1552 -3326 -2737 -1807 -2296 -1822 -484 -382 -123 1491 1623
2013A623q77m20k29q43J152J775J17R8M59p48j453J54j67j615m78p6p60N75J631
$$ 1623 746 326 97 -746 406 2181 2298 2396 2855 2107 654 808 641 -974 -1452 -1528 -2288 -1713 -82
2032h2Q6n01K8j044j079N90Q08o9Q27J110j94N10J805l45q15K49r81j695M11J337
$$ -82 4 -497 -469 -1513 -2592 -2002 -1194 -1263 -436 674 480 990 2795 2450 1635 1884 903 -792 -381 956
2052I56M7K19O92j187j066M6q62o44J08l23j010J373J532j19N24J273j758j236
$$ 956 1003 1222 1914 727 -339 -293 -1155 -1799 -1691 -2014 -3024 -1651 -119 -238 286 1559 -199 -1435
2070a435R24l5k58J206J243p63N47J637q47j063O31j546j959O37P82r59J048J571
$$ -1435 -511 -546 -804 402 1645 882 1429 3066 2219 1156 1787 241 -1718 -1081 -299 -1258 -210 1361
2088A361j308j256J311j121j669J533r8j660J568K433p71K91K179j191j943J171
$$ 1361 53 -1203 108 -1013 -2682 -1149 -1247 -2907 -1339 1094 323 614 2793 1602 -341 830
2104H30l11j692R14J634j442O79K337j327j816J306j012k910J045J444j987L07
$$ 830 519 -1173 -259 1375 -67 612 2949 1622 -194 1112 100 -2810 -1765 -321 -2308 -2001
2120b001L091j133j138K229j74k798R64Q59k252Q62L225p99o06K486o89k585J224
$$ -2001 1090 -43 -1181 1048 874 -1924 -960 -101 -2353 -1491 1734 935 329 2815 2126 -459 765
2137G65Q10l237L87J866j582m77L233L9k343Q67L24l076J91K285j548m41K827
$$ 765 1575 -1662 -1275 591 -991 -1468 1765 1804 -539 328 652 -2424 -2233 52 -1496 -1937 890
2154H90l84j439K487R50k739k00J119k506m26L655J58j739J972L04k970N75J909
$$ 890 506 -933 1554 2504 -235 -435 684 -1822 -2248 1407 1565 -174 1798 2102 -868 -293 1616
2171A616k357j324J889r92j322L081J492k082O67R92l103n17K625p88j440K393
$$ 1616 -741 -2065 -176 -1168 -2490 591 2083 1 668 1660 -1443 -1960 665 -123 -1563 830
2187H30M00k137J863K122k359q91J099j715j904K306J062j179J309J267k559m42
$$ 830 1230 -907 956 3078 719 -172 927 -788 -2692 -386 676 -503 806 2073 -486 -928
2203i28J904j407j457J916l24k074K067K154j409K73J486k031j819J569J88j143
$$ -928 976 -431 -1888 28 -296 -2370 -303 1851 442 715 2201 170 -1649 -80 108 -1035
2219a035J080J172j551J90J931p50j205P28j202k025J409J293p34P03J864j349
$$ -1035 45 1217 -334 -144 1787 1037 -168 560 -642 -2667 -1258 35 -699 4 1868 519
2235E19j000J206k66j565R21M31j105K81J645o4l87J421j099k138O20M22j244
$$ 519 -481 725 459 -1106 -185 246 -859 -578 1067 1003 616 2037 938 -1200 -580 -158 -1402
2252a402P81J079r90K11J144l18r53N93K40k086M54J154m10O29J192l48j037P03
$$ -1402 -621 458 -532 -321 823 505 -448 145 385 -1701 -1247 -93 -503 126 1318 970 -67 636
2270F36k63r23K67L50p54J29J160l37PQ69l29j498j28L81o97J85Q67K31PK44L43
$$ 636 373 -550 -283 67 -687 -558 602 265 272 1141 812 -686 -814 -433 -1130 -945 -78 153 160 404 747
2291G47l68J6k46m72l20J65L6M56R44P3l59j69J28j022k44l4r6k31J027L32j62
$$ 747 379 395 149 -323 -643 -478 -442 14 958 1031 672 503 631 -391 -635 -669 -765 -996 31 363 201
2312B01N46l17j52n89l15r0M2M55P1P64L96j73R7j23o42p59k29J21j5M95K95K50
$$ 201 747 430 278 -311 -626 -716 -674 -219 -148 616 1012 839 936 813 171 -588 -817 -696 -711 -216 79 329
2334C29J10k53o5l38l48l95P0J72M11L55L87N62k9l03j86l35o70j09J39L55K57
$$ 329 439 186 121 -217 -565 -960 -890 -718 -307 48 435 997 968 665 479 144 -526 -635 -496 -141 116
2355A16M56J53P6l16m32o48j82l95O7M35L54L08L76N35n01k47P3l31m26R6M72
$$ 116 572 725 801 485 53 -595 -777 -1172 -1105 -670 -316 -8 368 903 402 155 228 -103 -529 -433 39
2376C9L70M23L64k2L3n31q69k24m22L7P0Q4L32L40K18k37j78n52J3k07Q9j55N85
$$ 39 409 832 1196 1174 1207 676 -193 -417 -839 -802 -732 -648 -316 24 242 5 -173 -725 -712 -919 -830 -985 -400
2399d00L96O27M73L16l71l78k82k43j21r2K69L53M75j51j83k05n32n89m08j78
$$ -400 -4 623 1096 1412 1041 663 381 138 17 -75 194 547 1022 871 688 483 -49 -638 -1046 -1224
2419a224j49k2N43O13K32J56R3j1o63j76M10m4L08O00N45J67m7j40j55k30p49
$$ -1224 -1373 -1395 -852 -239 -7 149 242 231 -432 -608 -198 -242 66 666 1211 1378 1331 1191 1036 806 57
2440E7l28k24p5J50K43M61k61k36j77n61j42q8j10J31O92L00J53P98N96p41J06
$$ 57 -271 -495 -570 -420 -177 284 23 -213 -390 -951 -1093 -1181 -1291 -1160 -468 -168 -15 783 1379 638 744
2461G44l42k57l97Q12K83q5L81k00k46m36J62o78m26k76l01j28P43L74J59M4K05
$$ 744 402 145 -252 560 843 758 1139 939 693 257 419 -259 -685 -961 -1262 -1390 -647 -273 -114 -70 135
2482A35p75k98N05Q7k50R22L53j64M71N46l12n28K30q35o00K56L44k96L63J24
$$ 135 -640 -938 -433 -346 -596 326 679 515 986 1532 1220 692 922 87 -513 -257 87 -209 154 278
2502B78n71jL2o13o75N33J99n81O12R89j44O0Q79n01p43P12kp09P57K86k94K76
$$ 278 -293 -294 -262 -875 -1550 -1017 -818 -1399 -787 202 58 118 997 496 -247 465 463 -246 511 797 503 779
2524G79P72l21r21L76q13j199M38K71m63L68R36m09l43N69j05j024N96L63o47
$$ 779 1551 1230 309 685 -128 -1327 -889 -618 -1081 -713 223 -186 -529 40 -65 -1089 -493 -130 -777
$$ [...]
8191a62
##END NTUPLES=NMR FID
##END=
