##TITLE=1H_LR-748-CR3-20
 CDCl3
 8 sc, 
 5.05.2022
##JCAMPDX= 6.0         $$ Bruker NMR JCAMP-DX V2.0
##DATA TYPE= NMR FID
##DATA CLASS= NTUPLES
##ORIGIN= UXNMR, Bruker Analytische Messtechnik GmbH
##OWNER= root
$$ XWIN-NMR		Version 3.5
$$ Thu May  5 13:47:38 2022 Russian Standard Time (UT+4h)  she@DPX200
##.OBSERVE FREQUENCY= 200.1313499996
##.OBSERVE NUCLEUS= ^1H
##.DELAY= (6, 6)
##.ACQUISITION MODE= SIMULTANEOUS
##.ACQUISITION SCHEME= undefined
##.AVERAGES= 8
##.DIGITISER RES= 18
##SPECTROMETER/DATA SYSTEM= spect
##.PULSE SEQUENCE= zg30
##.SOLVENT NAME= CDCl3
##.SHIFT REFERENCE= (INTERNAL, CDCl3, 0, 15.7039)
##AUDIT TRAIL= $$ (NUMBER, WHEN, WHO, WHERE, WHAT)
$$ ##TITLE= Audit trail, XWIN-NMR		Version 3.5
$$ ##JCAMPDX= 5.01
$$ ##ORIGIN= Bruker BioSpin GmbH
$$ ##OWNER= she
$$ F:/spectra/data/she/nmr/H-F/1/audita.txt
$$ ##AUDIT TRAIL=  $$ (NUMBER, WHEN, WHO, WHERE, WHAT)
(   1,<2022-05-05 13:46:15.20 +0400>,<she>,<DPX200>,
      <created by zg, POWCHK disabled, PULCHK disabled
       configuration hash MD5:
       00 E9 B6 7A A2 85 ED C7 34 08 36 98 17 FE 4E 26
       data hash MD5: 16K
       46 22 F2 0D 0F FD AD F9 84 DD 87 C0 AA 1A BE 7C>)
$$ ##END=
$$ 
$$ hash MD5
$$ 4C E9 C2 60 A7 DC D9 B8 31 92 5F 3A 5C 3A 06 2F
##$RELAX= 
##$RELAX= 
##$RELAX= 
##$RELAX= 
##$RELAX= 
##$RELAX= 
$$ Bruker specific parameters
$$ --------------------------
##$DU= <F:/spectra>
##$EXPNO= 1
##$NAME= <H-F>
##$PROCNO= 1
##$TYPE= <nmr>
##$USER= <she>
##$AMP= (0..31)
100 100 100 100 100 100 100 100 100 100 100 100 100 100 100 100 100 100 
100 100 100 100 100 100 100 100 100 100 100 100 100 100 
##$AQSEQ= 0
##$AQ_mod= 1
##$AUNM= <au_zg>
##$AUTOPOS= <>
##$BF1= 200.13
##$BF2= 200.13
##$BF3= 200.13
##$BF4= 200.13
##$BF5= 200.13
##$BF6= 200.13
##$BF7= 200.13
##$BF8= 200.13
##$BYTORDA= 1
##$CFDGTYP= 0
##$CFRGTYP= 5
##$CHEMSTR= <none>
##$CNST= (0..31)
1 1 145 1 1 1 1 1 1 1 1 1 1 1 1 1 1 1 1 1 1 1 1 1 1 1 1 1 1 1 1 1 
##$CPDPRG= <>
##$CPDPRG1= <>
##$CPDPRG2= <>
##$CPDPRG3= <>
##$CPDPRG4= <mlev>
##$CPDPRG5= <mlev>
##$CPDPRG6= <mlev>
##$CPDPRG7= <mlev>
##$CPDPRG8= <mlev>
##$CPDPRGB= <>
##$CPDPRGT= <>
##$D= (0..31)
0 1.2 0 0 0 0 0 0 0 0.06 0 0.03 0 0 0 0 0.0002 0 0 0 0 0 0 0 0 0 0 0 0 
0 0 0 
##$DATE= 1651743974
##$DBL= (0..7)
120 120 120 120 120 120 120 120 
##$DBP= (0..7)
150 150 150 150 150 150 150 150 
##$DBP07= 0
##$DBPNAM0= <>
##$DBPNAM1= <>
##$DBPNAM2= <>
##$DBPNAM3= <>
##$DBPNAM4= <>
##$DBPNAM5= <>
##$DBPNAM6= <>
##$DBPNAM7= <>
##$DBPOAL= (0..7)
0.5 0.5 0.5 0.5 0.5 0.5 0.5 0.5 
##$DBPOFFS= (0..7)
0 0 0 0 0 0 0 0 
##$DE= 6
##$DECBNUC= <off>
##$DECIM= 32
##$DECNUC= <off>
##$DECSTAT= 4
##$DIGMOD= 1
##$DIGTYP= 9
##$DL= (0..7)
0 120 120 120 120 120 120 120 
##$DP= (0..7)
150 150 150 150 150 150 150 150 
##$DP07= 0
##$DPNAME0= <>
##$DPNAME1= <>
##$DPNAME2= <>
##$DPNAME3= <>
##$DPNAME4= <>
##$DPNAME5= <>
##$DPNAME6= <>
##$DPNAME7= <>
##$DPOAL= (0..7)
0.5 0.5 0.5 0.5 0.5 0.5 0.5 0.5 
##$DPOFFS= (0..7)
0 0 0 0 0 0 0 0 
##$DQDMODE= 0
##$DR= 18
##$DS= 0
$$ [...]
##$SUBNAM2= <"">
##$SUBNAM3= <"">
##$SUBNAM4= <"">
##$SUBNAM5= <"">
##$SUBNAM6= <"">
##$SUBNAM7= <"">
##$SUBNAM8= <"">
##$SUBNAM9= <"">
##$SW= 18.0517283424761
##$SWIBOX= (0..15)
0 0 2 0 0 0 0 0 0 0 0 0 0 0 0 0 
##$SW_h= 3612.71676300578
##$TD= 16384
##$TD0= 1
##$TE= 0
##$TE2= 300
##$TE3= 300
##$TEG= 300
##$TL= (0..7)
0 120 120 120 120 120 120 120 
##$TP= (0..7)
150 150 150 150 150 150 150 150 
##$TP07= 0
##$TPNAME0= <>
##$TPNAME1= <>
##$TPNAME2= <>
##$TPNAME3= <>
##$TPNAME4= <>
##$TPNAME5= <>
##$TPNAME6= <>
##$TPNAME7= <>
##$TPOAL= (0..7)
0.5 0.5 0.5 0.5 0.5 0.5 0.5 0.5 
##$TPOFFS= (0..7)
0 0 0 0 0 0 0 0 
##$TUNHIN= 0
##$TUNHOUT= 0
##$TUNXOUT= 0
##$USERA1= <user>
##$USERA2= <user>
##$USERA3= <user>
##$USERA4= <user>
##$USERA5= <user>
##$V9= 5
##$VALIST= <valist>
##$VCLIST= <CCCCCCCCCCCCCCC>
##$VD= 0
##$VDLIST= <DDDDDDDDDDDDDDD>
##$VPLIST= <PPPPPPPPPPPPPPP>
##$VTLIST= <TTTTTTTTTTTTTTT>
##$WBST= 1024
##$WBSW= 4
##$XGAIN= (0..3)
0 0 0 0 
##$XL= 0
##$YL= 0
##$YMAX_a= 211632
##$YMIN_a= -231694
##$ZGOPTNS= <>
##$ZL1= 120
##$ZL2= 120
##$ZL3= 120
##$ZL4= 120
##$ABSF1= 10
##$ABSF2= 0
##$ABSG= 5
##$ABSL= 3
##$ALPHA= 0
##$AQORDER= 0
##$ASSFAC= 0
##$ASSFACI= 0
##$ASSFACX= 0
##$ASSWID= 0
##$AUNMP= <proc_1d>
##$AZFE= 0.1
##$AZFW= 0.1
##$BCFW= 1
##$BC_mod= 2
##$BYTORDP= 1
##$COROFFS= 0
##$CY= 11.3945322036743
##$DATMOD= 1
##$DC= 2
##$DFILT= <>
##$DTYPP= 0
##$F1P= 2.36226072786647
##$F2P= -0.459571619588291
##$FCOR= 0.5
##$FTSIZE= 0
##$FT_mod= 4
##$GAMMA= 1
##$GB= 0.15
##$INTBC= 1
##$INTSCL= 1
##$ISEN= 128
##$LB= 0.24
##$LEV0= 0
##$LPBIN= 0
##$MAXI= 10000
##$MC2= 0
##$MEAN= 0
##$ME_mod= 0
##$MI= 1.114404
##$NCOEF= 0
##$NC_proc= 0
##$NLEV= 6
##$NOISF1= 3.799351
##$NOISF2= 2.8
##$NSP= 1
##$NTH_PI= 0
##$NZP= 0
##$OFFSET= 15.70392
##$PC= 1
##$PHC0= -18390.3
##$PHC1= 9.400749
##$PH_mod= 1
##$PKNL= yes
##$PPARMOD= 0
##$PSCAL= 0
##$PSIGN= 0
##$REVERSE= no
##$SF= 200.130013532006
##$SI= 16384
##$SIGF1= 3
##$SIGF2= 2
##$SINO= 400
##$SIOLD= 16384
##$SREGLST= <1H.CDCl3>
##$SSB= 0
##$STSI= 0
##$STSR= 0
##$SW_p= 3612.71676300578
##$SYMM= 0
##$S_DEV= 0
##$TDeff= 0
##$TDoff= 0
##$TI= <>
##$TILT= no
##$TM1= 0
##$TM2= 0
##$TOPLEV= 0
##$USERP1= <user>
##$USERP2= <user>
##$USERP3= <user>
##$USERP4= <user>
##$USERP5= <user>
##$WDW= 1
##$XDIM= 8192
##$YMAX_p= 0
##$YMIN_p= 0
$$ End of Bruker specific parameters
$$ ---------------------------------
##NTUPLES= NMR FID
##VAR_NAME=  TIME,          FID/REAL,        FID/IMAG
##SYMBOL=    X,             R,               I
##VAR_TYPE=  INDEPENDENT,   DEPENDENT,       DEPENDENT
##VAR_FORM=  AFFN,          ASDF,            ASDF
##VAR_DIM=   8192,          8192,            8192
##UNITS=     SECONDS,       ARBITRARY UNITS, ARBITRARY UNITS
##FACTOR=    0.0002768,     1,               1
##FIRST=     0,             0,               0
##LAST=      2.2672688,     0,               0
##MIN=       0,             -231694,         0
##MAX=       2.2672688,     211632,          0
$$ Real data points
##PAGE= N=1
##DATA TABLE= (X++(R..R)), XYDATA
0 0 0 0 0 0 0 0 0 0 0 0 0 8 -8 8 -8 16 -16 16 -24 31 -32 40 -48 56 -64 79 -89 104 -120 137 -159 180 -205
33 -205 232 -262 295 -331 371 -415 462 -516 573 -637 703 -779 859 -949 1047 -1154 1269 -1398
51 -1398 1542 -1699 1875 -2072 2294 -2545 2836 -3171 3567 -4042 4621 -5355 6307 -7606 9488
66 9488 -12480 17990 -31602 144404 142357 -9605 132683 36004 -28080 90691 110332 -51386
78 -51386 -26480 -298 -92363 -48475 64801 -86727 -204230 -105632 -118211 -211460 -49502
89 -49502 88270 -20697 -54297 42744 -6194 -26931 111785 117407 5839 64172 110324 20466
101 20466 76836 211632 119228 4637 40130 -18808 -131347 -49078 18468 -83576 -92017
112 -92017 -24445 -103214 -130803 3310 3800 -106380 -69317 -31049 -99143 -45978 86247 74495
124 74495 52559 116104 76454 5179 85813 127058 30544 27105 77330 -1235 -41222 50508
136 50508 51714 -34403 -33053 -41160 -121678 -109725 -43412 -69432 -72682 -6874 -31197 -75412 589
149 589 46812 -7029 3567 50475 7845 -5668 73684 93491 62556 88003 82568 15043 12123
162 12123 35783 -7334 -24913 3910 -29355 -69171 -27915 -9067 -50812 -45123 -26415 -73634
174 -73634 -89326 -37501 -22601 -25603 16584 35939 16906 34187 57021 37378 35466 54541
186 54541 28744 5636 37506 47915 23752 33410 40101 -2283 -30482 -26530 -41547 -58102 -45719
199 -45719 -43177 -51944 -32853 -14865 -23432 -14715 687 -16091 -26549 -6151 5005 9145 34909
212 34909 54401 49869 51292 56665 40284 23688 20799 6094 -11991 -9408 -5969 -9614 -4508 -2833
226 -2833 -15937 -25667 -31059 -45184 -52384 -40080 -32049 -30350 -12563 9511 15241 19217 26177 24428
240 24428 19333 15702 13053 17644 29454 32879 30507 36944 38056 19671 2173 -4339 -17154 -33734
254 -33734 -37939 -34780 -30425 -24370 -20765 -17607 -13365 -15227 -23637 -24244 -14600 -10539 -7322 9382 27037
269 27037 33082 36905 40344 36957 29836 20927 11776 6668 6598 5716 3549 5379 4284 -5291 -13870 -19848
285 -19848 -30848 -38645 -38279 -34796 -29232 -19132 -8653 -2121 2835 7308 6313 3944 5375 8680 13033
300 13033 20682 26636 31417 36176 34306 25693 16117 8242 -1737 -11932 -15499 -14417 -15300 -14994 -13221
315 -13221 -14427 -18516 -24230 -29080 -28493 -27428 -24280 -15445 -2449 9925 16449 21258 25863 24589 19237
330 19237 16316 14886 14496 15762 18441 21507 21512 17274 10110 894 -9129 -21026 -30351 -31614 -29804
345 -29804 -28408 -22263 -13888 -9723 -8443 -7628 -8266 -10334 -8628 -2970 3047 12023 22783 29409 33899
360 33899 36247 30358 21002 15509 8414 -1075 -4056 -971 -1986 -3336 -969 -4076 -13447 -18127 -23201
375 -23201 -32391 -33744 -29274 -25920 -17507 -2942 4742 7053 14854 17639 10113 9609 15295 11885 11840
390 11840 23047 25637 21588 25726 24788 10222 2323 -2435 -16957 -24804 -18559 -20565 -25757 -15121
404 -15121 -9600 -18977 -16109 -7949 -17309 -20589 -7118 -4617 -6464 11118 24373 19555 25834 34526
418 34526 20404 12746 21764 12912 -582 9022 11086 -3739 -667 8681 -7193 -17594 -9757 -21011
432 -21011 -37107 -23755 -15882 -26199 -14453 1800 -8377 -8669 11123 7618 -3245 12703 17791
445 17791 3381 15088 33565 21018 17963 32629 16915 -4993 5763 4960 -16566 -11472 -1309
458 -1309 -20768 -24985 -4709 -12939 -27091 -10141 -11154 -33380 -19290 2303 -7607 -1544 25347
471 25347 16785 1844 21664 26526 7116 16547 27126 2684 -479 21664 11594 -1672 15342
484 15342 7391 -25151 -20591 -8903 -28194 -26518 -3403 -15662 -29157 -4663 810 -14170 3021
497 3021 13662 -11751 -11400 14036 8934 6093 35094 34500 7998 17293 26051 2290 2817 19145
511 19145 -4282 -22511 -3218 -3593 -18709 -400 7410 -23138 -28916 -13011 -26434 -28617 1079
524 1079 722 -16556 2869 16212 2630 15643 35482 13432 -1777 14855 11277 -74 22879
537 22879 30728 4815 3080 10611 -10513 -15442 2333 -10632 -32847 -20493 -15130 -26419 -8908
550 -8908 11223 -5441 -13929 -635 -9452 -15929 9177 17046 2043 11092 22070 9561 15418
563 15418 34976 21268 2266 7780 343 -15701 -739 11321 -5790 -9582 -2982 -18853 -24640
576 -24640 -6573 -7522 -22495 -14783 -10140 -20670 -6641 16153 9491 4560 15076 5337 -3991 14140
590 14140 21972 10428 14034 18830 3810 2690 18155 10188 -3960 -284 -9291 -26352 -15854
603 -15854 -3367 -12790 -11388 -3004 -15388 -21563 -4663 -1218 -9056 1137 5074 -7285 996 19650
617 19650 14798 12855 22407 11667 -2287 8436 13724 3096 8028 12981 -4651 -10160 2503
630 2503 -4568 -14543 -5227 -10191 -26824 -17647 -4928 -11052 -5772 7818 -2558 -11093 3384 5080
644 5080 -3235 9238 16186 2070 5158 20188 13778 9620 19623 11033 -6634 -1382 1620 -10694
658 -10694 -5595 4996 -8454 -14676 -2183 -7188 -17500 -6594 -4392 -18545 -13062 253 -4403
671 -4403 -948 15604 11429 1527 11624 12563 -128 6668 15793 2963 1008 13072 7359 -311
685 -311 8872 6719 -10455 -9137 -5078 -16696 -15708 -2062 -6964 -12529 136 850 -8652 -1385 4857
700 4857 -5568 -5144 5797 2113 742 14380 15401 5854 11441 14133 2107 620 7424 -640
714 -640 -6514 1397 406 -8072 -2362 500 -10114 -10867 -5442 -12417 -15500 -5455 -4386 -7912 825
729 825 6593 1577 4151 10534 5179 2071 8940 7529 2200 8687 11062 4142 4763 7582 17 -4646
745 -4646 -2157 -5335 -11495 -7403 -5227 -9782 -6786 -2428 -6215 -6874 -2049 -3146 -5020 332 3046
760 3046 1833 5223 10267 7834 7375 10211 7302 3735 5485 4575 754 1408 2329 -1348 -3120 -2406
776 -2406 -5155 -8652 -7986 -8315 -10654 -8383 -5207 -5251 -3171 319 551 558 2924 3460 3529 5261 7290 7387
794 7387 8464 10011 8397 6539 5789 2864 -768 -2035 -3379 -5195 -5607 -5148 -5748 -6464 -6046 -6974 -7933
811 -7933 -7366 -6737 -6025 -3542 -541 2008 4777 6659 8144 8106 7780 7305 5941 5135 5177 4530 4243 4197 3218
830 3218 1430 -553 -3341 -6118 -8260 -9970 -10226 -9545 -8241 -6267 -4451 -2640 -1396 -697 -295 784
846 784 1657 3036 4989 6984 8913 10192 10710 10039 8744 6740 3579 995 -744 -2923 -4153 -4378
862 -4378 -5015 -5661 -6319 -6815 -8038 -8737 -8826 -8267 -7246 -4138 -1868 113 4007 5866 6702 7362 7720 6684
880 6684 6070 6574 6263 4819 5731 5195 2793 1895 603 -2882 -5265 -6129 -8127 -9658 -8120 -7245 -7537
897 -7537 -5905 -3863 -4603 -3580 -427 -509 -209 3371 4934 4493 7475 9608 8314 8040 8645 5828 2736
914 2736 4015 2748 -708 -147 -524 -5435 -5922 -4304 -7304 -9155 -6353 -7713 -9866 -5926 -2424 -3376
930 -3376 -235 4036 1373 1015 5874 5838 4275 8370 9364 4467 5507 8753 4520 2584 4888 111
946 111 -6608 -3971 -2903 -7242 -4967 -1457 -7417 -9258 -3916 -5410 -7472 -1383 -461 -5464 -2050 4629
962 4629 2492 4731 12166 8106 2303 6679 6410 1044 4998 8651 230 -2096 3202 -938 -5034
977 -5034 1843 -636 -10931 -8694 -5220 -10746 -7206 2718 -1689 -6091 942 1100 -3862 4302 9098
992 9098 31 98 7548 2204 2006 12662 11035 688 3081 3556 -6031 -3536 4821 -3011 -9075 -2299
1008 -2299 -5191 -10887 -1080 3637 -6613 -6067 -758 -7973 -7642 6184 5916 -1421 5384 7268 -2003
1023 -2003 4277 13684 4657 97 6578 126 -6945 4249 7868 -2642 -1617 2289 -9193 -11043
1037 -11043 1437 -1897 -9690 -2119 -2139 -11738 -3478 7179 471 -881 6828 39 -6431 5961
1051 5961 9905 1470 5998 9708 -1896 -1888 9489 4671 -2149 4025 105 -11643 -5457 2646 -5550
1066 -5550 -5428 2315 -6703 -12908 -1039 1399 -5520 1549 5391 -5353 -3413 8082 4714 1480
1080 1480 10705 6995 -4142 2414 8147 454 2270 8522 -2190 -8324 811 147 -6786 74 1378
1095 1378 -10421 -8951 101 -4697 -5516 3798 -471 -8705 -987 3453 -1652 3594 10300 1714 -1547
1110 -1547 7373 5121 -21 7858 7599 -3194 -1422 3968 -2364 -2338 4701 -864 -8583 -3162 -2956 -8906
1126 -8906 -4102 1250 -6055 -6549 999 -1000 -2843 5522 5290 -1513 1902 5575 716 2703 9689
1141 9689 4862 721 5817 3975 -1636 2715 3846 -4202 -5017 -1180 -5596 -6572 84 -1868 -6743
1156 -6743 -2976 -1458 -6378 -3423 1675 -2426 -2729 3369 2022 411 6103 7042 2220 4003 6419
1171 6419 1353 748 4983 1692 -1403 2519 1526 -3481 -990 -94 -5349 -5840 -2871 -5839 -6812 -2187
1187 -2187 -2072 -4581 -486 1916 -1537 509 3890 1153 570 4924 4009 1969 5470 6279 2069 2911
1203 2911 5024 337 -1042 1495 -1503 -4883 -2145 -2004 -5279 -3404 -1666 -4878 -5122 -1347 -2767
1218 -2767 -3846 482 692 -1746 1972 4265 1795 3391 5940 3565 2126 4701 3917 952 2721
1233 2721 3350 -825 -1013 790 -2133 -3466 -1618 -3429 -5890 -3637 -2969 -4906 -3108 -1038 -2275 -2607
1249 -2607 898 829 29 3154 4294 1985 3510 4957 2905 3152 4682 2983 431 1997 1109 -1599
1265 -1599 -907 -506 -3385 -3663 -2704 -4270 -5053 -2864 -2502 -3944 -1976 -218 -735 73 2482 2021 1789
1282 1789 3450 3721 2340 3792 4542 2783 2523 3081 1764 103 190 -469 -2630 -2941 -2444 -3988 -3438
1299 -3438 -2757 -3210 -3279 -2529 -2177 -2330 -1256 -119 2 705 2237 2917 3219 4437 4791 3728 4027 3162
1317 3162 1665 1325 1004 186 -785 -1030 -1230 -2210 -2592 -2864 -3817 -4089 -3571 -3754 -3547 -2157 -1338 -572 858
1336 858 1784 2096 2712 3190 3296 3087 3471 3158 3084 3022 2627 1963 1215 19 -796 -2298 -2740 -3640 -4228 -4084
1356 -4084 -3660 -3688 -2914 -2376 -2162 -1579 -919 -530 172 1132 2268 2396 3190 4352 4155 3910 4186 3289 2289
1375 2289 2053 1095 -187 -440 -975 -2162 -2543 -2650 -3073 -3799 -3576 -3665 -4336 -3171 -2123 -1925 -833 630
1393 630 1176 1350 3119 3497 3158 3767 4527 3228 3165 3618 2425 1560 1809 838 -1297 -1384 -1539 -3409 -3456
1412 -3456 -2620 -3846 -4717 -3155 -3068 -3904 -1825 -243 -1258 -371 1936 1397 1616 3792 3862 2302 3521
1429 3521 4220 2362 2781 3856 1391 -141 1133 -370 -2713 -1384 -1550 -4220 -3890 -2615 -3982 -4278
1445 -4278 -1213 -1647 -2882 -808 226 -1494 449 2902 1820 1544 4022 3835 2028 4253 4703 1552
1461 1552 1888 2428 -782 -1142 808 -711 -2921 -1749 -1842 -4238 -2797 -1135 -3479 -3780 -1608 -2316 -2747
1478 -2747 672 1978 258 1942 3076 1093 1716 3993 2642 1094 2912 2078 -183 1561 2663
1493 2663 5 -394 138 -2639 -3706 -1698 -2088 -3795 -2277 -1701 -3522 -1970 645 -794 -650 1069
1509 1069 173 -963 1467 2350 1766 2628 3712 2023 1543 3164 1873 152 1057 -194 -2318 -1004
1525 -1004 -606 -2070 -1634 -548 -2630 -3247 -1630 -1800 -2553 -723 -158 -1718 168 2053 987 1698 3583
1542 3583 1764 506 2425 1960 454 1917 2249 -547 -219 1224 -878 -1386 269 -1298 -4123 -2138
1558 -2138 -1218 -3255 -1533 638 -2201 -2068 1029 187 -1024 2502 2260 -649 1398 3363 782 1193
1574 1193 4483 1452 -690 2399 1452 -1418 826 1531 -2740 -2931 134 -2439 -3826 478 -551 -4523
1590 -4523 -996 541 -2738 -677 3049 -443 -1486 3100 1868 -878 3395 4503 -537 1370 4037
1605 4037 44 -654 3579 843 -3286 212 630 -4223 -1899 1722 -3198 -4115 337 -1780 -4878 258
1621 258 1018 -3431 -670 3301 -572 -554 5331 2562 -1027 3614 3691 -1254 1629 4377 -675 -1171 3618
1638 3618 39 -3483 1103 595 -5113 -2203 741 -4652 -4128 1170 -1753 -4143 1202 1243 -3224 446
1654 446 3530 -1292 -675 4805 1883 -665 4862 4397 -1072 2538 4528 -1383 -1024 2888 -1347 -4475
1670 -4475 634 -244 -4583 -1314 1030 -4427 -3741 821 -2397 -4143 1257 1047 -2831 1335 4306 155
1686 155 1135 5538 1423 -494 4016 3042 -916 2518 3583 -1356 -890 2530 -1220 -3138 531 -1006
1702 -1006 -5168 -2255 -626 -4515 -2633 958 -2014 -2978 1498 907 -1978 1856 3013 -292 1457
1717 1457 4681 2110 1171 4571 2888 -620 1815 2252 -1518 -623 1284 -2008 -3241 -480 -1482 -4098
1733 -4098 -1525 -519 -3835 -2654 231 -1752 -1625 1582 1045 -663 1762 2792 1138 2380 3910
1748 3910 1662 654 2719 1742 -95 1590 1282 -1315 -1104 -249 -2093 -2472 -370 -1998 -3326 -1972
1764 -1972 -1448 -2821 -1053 33 -869 -596 1213 901 641 2142 2529 1205 1991 2691 1388 941 2284
1781 2284 1323 52 496 -61 -1247 -1013 -885 -2148 -2561 -1909 -2381 -2684 -1278 -918 -1293 -680 213 -385
1799 -385 121 1047 1053 947 1581 2080 1846 2082 2289 1656 1188 1068 51 -628 -335 -894 -1486 -1171 -1088 -1613 -1644
1820 -1644 -1380 -1448 -1713 -1235 -1245 -1041 -430 511 701 1317 1782 1880 1427 1926 1799 1170 1229 1028 671 421 569
1841 569 -260 -185 -584 -1019 -1540 -1749 -1721 -2095 -1914 -1351 -1167 -664 -343 -155 210 308 740 703 1028 1549 1426
1862 1426 1620 2076 1596 1394 1191 829 221 -93 -359 -1162 -958 -1321 -1488 -1530 -1389 -1572 -1436 -1288 -1163 -1013
1882 -1013 -805 -285 -49 464 1219 1191 1315 1954 1786 1662 1459 1516 1196 850 592 347 23 -278 -595 -1314
1902 -1314 -1199 -1347 -1603 -1865 -1238 -1433 -1433 -1115 -572 -537 -138 416 287 913 1202 1413 1478 2271 1733 1729 1287 995
1924 995 580 623 734 -66 -360 -368 -1153 -1578 -1011 -1549 -2018 -1840 -1610 -1880 -1258 -430 -429 -151 353 139 168 1268
1946 1268 1653 1334 1734 1935 1305 1411 2324 1301 624 796 0 -1115 -849 -499 -1251 -1325 -590 -1782 -2134
1965 -2134 -975 -888 -1707 -818 -611 -1446 -591 1033 675 796 2334 1622 557 1533 2073 665 1422 1801
1983 1801 273 -630 597 388 -627 360 -270 -2367 -2028 -663 -2141 -2209 -115 -1196 -2158 -369 401
2000 401 -831 590 1987 -130 -404 1887 1394 390 2562 2870 41 873 2028 -103 -523 1493
2016 1493 -348 -2458 -558 -368 -2383 -730 907 -1891 -2344 -3 -969 -2217 843 692 -1271 -8
2032 -8 1875 -50 256 3151 1625 -430 1897 1742 -613 926 2428 -654 -936 1387 -701 -2201
2048 -2201 535 274 -2768 -1421 120 -2564 -1791 1088 -813 -1860 885 473 -1932 747 2537 -273
2064 -273 226 2893 511 -946 2559 1914 -1022 799 1876 -1279 -765 1824 -481 -2282 609 -436
2080 -436 -3051 -673 698 -2413 -1343 1303 -880 -1621 1572 929 -1374 1025 2465 -646 13 2878
2096 2878 495 -793 2670 1324 -1335 901 1286 -1823 -1046 1120 -1490 -2062 679 -541 -2418 -110
2112 -110 703 -2312 -1218 1238 -1299 -1516 1964 894 -563 1959 2168 -496 595 2434 -65 -542
2128 -542 1959 455 -1655 889 1256 -1277 -247 779 -2058 -2572 37 -1067 -2369 311 586 -1732
2144 -1732 -280 1584 -260 -94 1993 378 -949 1282 1870 -168 1075 2194 -82 -418 1667 -183
2160 -183 -1078 695 -119 -2235 -992 119 -1481 -869 636 -854 -1787 -169 -43 -1247 409 1551
2176 1551 -399 266 1794 731 559 2139 1518 -205 637 765 -355 184 1574 -59 -1196 -239 -605
2193 -605 -1669 -387 -43 -1797 -1410 -689 -985 -1013 785 476 -545 271 738 -38 867 2078 902 777
2211 777 1745 679 166 1100 1150 -380 -66 137 -1129 -1022 0 -804 -1439 -794 -1169 -1918 -844 -388 -789
2230 -789 -570 559 -333 -285 1183 1097 587 1109 1023 453 885 1660 1081 675 850 321 -528 -44 -2 -738 -607
2251 -607 -788 -1224 -1745 -560 -892 -896 -670 -536 -1250 -236 425 -64 358 1095 526 359 1315 1471 743 939
2271 939 1064 51 26 566 312 -76 182 -405 -1064 -587 -796 -1141 -1016 -694 -1171 -1110 -261 -217 -179 411 424
2292 424 48 515 572 540 657 1276 1052 728 781 910 615 523 489 -485 -476 -120 -624 -855 -632 -499 -751 -767 -449
2315 -449 -630 -677 -411 -535 -304 200 160 95 695 652 543 670 946 780 349 732 541 117 173 444 53 -31
2337 -31 -254 -710 -584 -652 -703 -1077 -678 -545 -604 -17 253 -27 125 355 38 194 515 870 565 574 599 630 405
2360 405 384 148 100 144 -68 -420 -318 -667 -563 -778 -575 -607 -634 -498 -277 -403 -74 347 326 190 449 476
2382 476 511 550 500 401 562 282 114 277 99 314 -25 -200 -259 -503 -493 -406 -660 -710 -244 -490 -331 28 -347
2405 -347 -55 -41 226 345 192 567 282 144 971 331 355 211 204 -253 -158 111 -34 -183 -167 -459 -508 -254
2427 -254 -344 -678 -683 -234 -416 -552 231 333 255 464 542 295 417 689 124 451 452 442 414 553 300 -389 75
2450 75 -94 -766 -687 -333 -751 -912 -333 -245 -631 -224 222 -506 -312 376 -5 79 706 458 213 721 978
2471 978 332 360 921 445 -228 494 -105 -559 73 118 -745 -696 33 -927 -994 -535 -371 -925 -68 410 -538
2492 -538 40 878 159 256 863 471 80 712 699 -75 1011 1079 412 -234 746 -212 -799 -46 28 -831 -405
2513 -405 -180 -976 -767 -243 -378 -936 -56 -117 -679 201 920 -216 182 1157 678 267 961 1086 78 643
2533 643 930 -105 33 597 -496 -545 208 -335 -1004 -224 -261 -1148 -656 73 -589 -703 21 -214 -628 447
2553 447 467 -384 442 946 264 252 1352 623 3 557 666 -490 -1 566 -480 -506 229 -781 -1140 -303
2573 -303 -182 -1160 -740 -171 -1008 -635 755 -21 -470 572 340 -481 345 1229 169 370 787 115 -51
2592 -51 974 525 -494 350 208 -1032 -833 198 -335 -747 383 -453 -1428 -39 128 -652 23 642
2610 642 -530 -558 782 528 51 1239 679 -483 154 1064 -7 23 1072 -91 -948 579 137 -846
2628 -846 15 200 -922 -935 -161 -413 -595 450 174 -808 128 871 -73 12 987 14 -393 741 601 -210
2648 -210 814 703 -381 -71 309 -428 -580 499 -25 -1155 -538 -10 -1056 23 671 -65 -584 175
2666 175 84 -26 532 940 -179 -145 1031 -47 177 1439 546 -690 252 65 -766 -20 345 -341 -793
2685 -793 -172 -796 -879 248 408 -866 -409 399 -588 -266 1269 488 -392 547 331 -100 418 1174 12
2704 12 -12 651 -365 -543 431 265 -436 -311 -207 -939 -642 370 -60 -495 -54 -319 -671 109 621 -97
2724 -97 231 584 291 95 931 701 121 227 392 -321 95 723 43 -204 261 -318 -862 -262 -242 -787 -505
2745 -505 -180 -724 -666 18 -1 -172 90 198 -249 308 895 401 153 475 337 188 257 629 115 120 327 -364
2767 -364 -455 -243 -281 -282 -253 -222 -768 -362 -88 -476 51 22 -38 -493 208 329 274 750 670 254 290 246 361 163
2791 163 314 165 -135 340 193 -349 -139 -189 -382 -519 -338 -377 -320 -340 -570 -336 -164 294 -44 -49 195 182
2813 182 -111 276 503 560 237 684 452 -30 223 102 -105 121 -122 -177 -324 148 -305 -133 -439 -129 -331
2834 -331 -431 -304 -291 -101 196 -55 -92 188 -55 299 451 193 89 318 225 345 171 282 146 -92 108
2855 108 -86 -158 -224 -278 -340 -195 -62 -82 -227 -29 -345 -149 -134 -291 -83 202 241 65 14 215 -38 51 44 42
2879 42 122 297 227 340 -4 209 -270 -190 -30 -103 -235 -412 9 16 -184 21 -55 -255 -48 85 -104 181 -8
2902 -8 -39 -2 305 206 -28 355 80 4 -91 -108 96 -28 42 -75 -218 21 -85 -388 42 -193 -129 -317 33
2925 33 187 28 216 -9 -52 98 251 128 365 398 92 -77 127 -27 10 -29 250 317 -282 -106 -250 -363
2947 -363 -121 -86 -84 184 209 -31 -83 119 -224 78 308 250 14 437 489 -20 258 151 -8 -55 21 -196 -20
2970 -20 -75 -90 -443 -18 137 -326 -274 -5 -205 -334 -371 -197 -41 -6 514 -20 28 230 251 300 474 331 235
2993 235 469 435 -52 -44 132 -206 -182 -45 -201 -457 -176 -95 -572 -201 -34 -396 -103 160 -191 -160 180 200
3015 200 165 311 366 -83 268 653 229 -138 368 100 -469 240 284 -83 -227 2 -510 -539 31 -82 -567
3036 -567 -340 -198 -475 56 414 -22 -132 446 123 -30 654 461 247 321 681 -8 -302 488 203 43
3056 43 295 150 -664 -390 1 -458 -433 -118 -374 -618 -311 146 -569 90 438 -388 10 327 379 100 1010
3077 1010 653 -251 355 519 268 235 881 -63 -587 -50 132 -623 -39 -136 -810 -753 -324 -424 -442 187 105
3098 105 -768 -202 46 -285 79 691 468 -123 484 379 205 1174 936 64 -152 203 -226 -183 532 376
3118 376 -540 -349 -22 -714 -297 176 35 -780 -328 -375 -320 685 600 269 -57 320 173 294 1038 573 56
3139 56 308 274 -200 317 458 252 -92 -300 -528 -417 28 172 -317 -313 -347 -596 -297 759 156 -191 128
3160 128 -243 -191 436 634 460 286 541 -127 -225 478 643 -218 12 -191 -591 -400 281 71 -229 -300 -795
3181 -795 -803 -170 240 174 61 30 -444 -171 420 478 203 278 224 -179 56 439 319 26 212 -238 -494 90
3203 90 5 -278 15 -149 -542 -323 1 -75 -6 -22 -294 -305 -218 342 117 227 614 63 -37 243 417 174
3225 174 165 164 -320 -599 145 34 -164 121 -235 -374 -417 -103 -303 -196 92 -223 -373 -246 -66 -32 413 342
3247 342 -135 113 89 0 204 471 388 13 57 -92 -102 -199 16 -698 -342 -274 -346 -410 -273 -71 -471 -148 -104
3270 -104 -467 -52 102 296 105 158 231 215 539 225 85 86 633 135 -85 409 152 47 -14 -247 -301 75
3292 75 -257 -523 -498 -503 -455 -259 -20 -122 -65 33 266 244 182 443 522 59 358 332 142 388 387 178 326 -43
3316 -43 50 -86 -140 -196 -302 -224 -113 -475 -435 -284 -71 -179 -136 -280 -280 -108 94 141 364 480 522 427 339 474
3340 474 362 367 66 197 160 299 -55 -72 -112 -113 -404 -218 -164 -201 -537 -479 -303 -22 -358 -158 -12 40 209 250
3364 250 -26 185 418 306 450 518 607 -57 183 -2 2 209 -52 -128 -213 -277 -78 -584 -329 -307 -505 -178 27
3387 27 -249 -101 277 -22 59 156 58 236 206 289 239 456 571 442 402 346 -6 -162 -235 -143 205 -349 3 -431
3411 -431 -124 -109 -349 -204 -143 -407 -55 43 9 254 134 586 -60 452 439 92 267 412 120 190 20 122
3433 122 -176 -190 -290 -373 -338 -144 -271 -122 -307 -67 21 -140 80 -249 60 125 97 99 242 435 360 518 202
3456 202 297 256 301 191 130 0 -32 45 -90 -73 -197 -110 64 -222 -182 -85 -391 -94 -88 9 -69 194 -24 254 72
3481 72 263 467 1 160 219 -28 -27 359 12 103 8 -155 -273 -448 -67 -353 -123 -292 -371 33 63 -134 -213
3504 -213 377 97 125 -25 188 68 315 452 198 207 194 -136 69 115 269 -24 -216 103 -359 -346 -203 -82
3526 -82 -440 -252 -101 -10 53 -115 33 -111 36 240 470 507 268 90 283 123 164 329 320 484 61 180
3548 180 -72 -360 158 -56 -368 -476 -264 -356 -286 168 -25 -176 -137 129 -107 227 453 17 -14 115 309
3569 309 491 480 473 282 6 144 -261 -318 184 -122 -452 -324 -288 -566 -320 -303 -380 -482 -147 -246 -206 357 438
3592 438 146 267 223 -76 227 645 432 239 302 135 -128 400 444 209 -287 -31 -308 -487 -6 -79 -296
3613 -296 -421 -251 -327 -326 240 -52 -185 199 151 -188 231 304 145 287 485 -4 -239 925 543 80 393
3634 393 36 -625 -246 257 -57 -108 -281 -376 -731 -54 119 -197 17 -208 -377 -44 222 96 368 340 103
3655 103 -99 361 410 442 528 182 59 -16 270 -28 -50 -8 98 -464 -452 -101 97 -175 -83 -359 -325 -316 -152 -117
3679 -117 225 382 -428 284 174 233 437 343 -28 -199 -179 179 204 100 106 -171 -361 -236 0 -124 -89 143
3701 143 -154 -298 11 -37 -33 279 5 -225 -63 240 282 370 453 68 -176 105 330 272 108 270 -67 -363
3723 -363 -305 -195 78 7 77 -251 -303 -324 -165 -123 -34 34 38 -222 376 -18 199 306 209 -169 -35 264 -6 93
3747 93 284 -6 -175 -125 29 -44 -59 -225 -121 -259 -304 -90 -152 38 -181 -118 -151 304 -170 159 -121 226 88
3770 88 78 85 204 237 213 -157 157 -105 -170 -36 -82 -227 8 -70 -272 -106 -261 33 -231 -108 -82 -180 1 40
3794 40 198 169 217 59 137 140 31 -118 345 83 86 125 8 -58 -51 0 22 -237 -354 -54 -121 -242 -185 -15 -77 8
3820 8 -164 157 172 56 30 258 -95 294 212 307 137 329 97 105 36 -60 -103 46 -209 -144 -47 -41 -354 -285 -51
3845 -51 -355 -124 -249 -107 -117 81 27 39 12 316 131 160 258 250 260 276 136 -13 -92 -9 -156 144 -242 -288 -375
3870 -375 -396 -427 -110 -271 -271 -136 -106 -332 81 46 -89 -11 109 349 42 273 439 375 304 420 -38 294 78
3893 78 75 -176 -107 198 -334 -244 -149 -227 -143 -220 -214 129 -87 -28 -31 17 -17 17 -80 -36 89 -17 413 186 86 242
3919 242 256 105 202 304 -58 -46 96 67 -108 -22 117 -238 -57 -20 132 -46 -123 43 130 195 79 133 302
3942 302 417 107 59 99 321 -1 183 222 239 27 117 150 195 -192 -162 144 -39 -246 -424 -52 -7 -90 -239
3965 -239 -94 -5 -89 -106 142 130 194 199 130 23 -76 57 23 36 5 31 -119 47 -91 134 12 -106 -226 -66
3989 -66 -112 -179 -342 -113 8 -26 45 64 44 244 182 -63 190 17 -147 53 148 -115 61 154 21 -53 -35 0
4013 0 102 -8 -217 -8 -186 -8 128 -127 -121 -46 40 -104 6 167 202 -18 49 -88 151 103 -132 154 27
4036 27 83 -31 -83 263 -177 159 -38 28 45 -116 171 -172 -180 101 -109 40 211 143 145 216 -6 376 282 107
4060 107 141 -33 18 -40 -32 316 28 -302 -84 -174 -251 -32 -56 -89 -286 -338 -224 -69 -31 115 -249 -152 8 -264
4084 -264 122 58 145 75 124 -23 -30 31 153 4 45 -3 -62 -245 287 92 -88 -363 -203 -2 -148 -172 -204 101
4108 101 84 64 -96 -122 -60 -17 6 61 100 -177 312 342 -72 249 29 63 -111 -101 360 -131 -132 -102 -214 -79 120
4133 120 -29 8 -264 -231 -190 1 -12 47 115 -63 126 159 303 152 184 396 91 40 -78 171 -152 384 -77
4156 -77 -106 -268 -200 -98 -1 -67 -194 -40 -142 -38 -229 -213 -256 -71 21 338 -8 121 113 -141 101 195 9 51
4180 51 100 141 -193 235 -68 -32 133 137 -63 -71 -310 -58 10 175 112 9 -233 -89 -86 -23 -100 96 69 -136 94
4205 94 200 236 -22 118 189 147 25 128 193 -257 199 92 -142 -194 27 -241 -95 -89 -544 -71 44 57 171
4228 171 -69 -85 -8 -113 140 192 49 -39 135 -62 116 -104 327 52 -73 135 -98 -8 -356 183 -30 -158
4250 -158 111 -77 92 -148 145 181 163 -32 -181 150 217 59 27 -203 78 142 -190 352 -108 42 -265 -142
4272 -142 125 166 -84 -214 -167 -309 -99 -18 -130 -162 46 -69 4 -71 264 4 167 130 76 -136 221 6 91
4295 91 -61 -28 57 133 76 -59 60 -226 59 -183 78 136 77 -45 -115 -28 51 50 9 167 237 325 191 211 228 119
4321 119 181 -8 41 -181 84 134 -9 -139 -169 -3 -61 -209 -210 -311 -260 -343 -142 7 61 -237 40 113 28 -9
4345 -9 116 149 127 191 126 147 36 -53 54 151 -214 -268 -61 -108 -1 -111 -179 93 -128 5 -190 -189 277 103 -9
4370 -9 21 49 -239 53 108 162 -125 147 147 -29 185 104 174 10 17 150 33 -122 10 79 -148 -213 -183 -242 -239 -34
4396 -34 74 50 18 34 207 -44 89 117 156 -34 329 61 -76 157 -247 58 -63 281 -81 65 -115 -256
4418 -256 -173 -175 -166 -175 186 -6 -115 -31 139 -278 116 -80 -186 -107 82 101 12 308 23 426 92 39 -66 -17
4442 -17 31 3 -99 -153 246 -263 -90 -245 84 33 46 10 -126 -87 61 71 -52 -171 -174 148 35 59 169 7
4466 7 44 37 -35 123 131 -34 -210 211 32 -246 181 14 121 -134 -108 -54 120 285 -76 101 126 135 140 170 51
4491 51 -149 27 41 -80 107 214 -204 -26 -103 -197 66 37 95 141 -20 83 -12 135 -191 3 -307 -152 51
4514 51 8 151 -146 -39 -225 330 142 -60 45 34 -155 58 28 281 -68 107 234 168 -56 3 160 20
4536 20 -24 -72 -52 315 169 84 134 -90 75 -45 32 338 161 -107 -169 -97 -6 133 123 -2 70 46 105 -213 -281
4561 -281 30 -102 -162 -43 -189 -246 32 128 114 91 7 -148 129 52 126 99 37 377 171 -62 99 201 -128
4584 -128 27 -104 12 45 -412 72 24 -80 21 -88 -34 128 206 -50 -62 -60 -223 81 198 64 82 -179 -39
4607 -39 157 236 208 285 -200 -88 118 81 -14 -17 -126 -192 59 104 132 0 -19 47 -59 54 142 28 -67 -139 -201 259
4633 259 149 115 -140 -74 217 -134 -27 210 -56 -42 -55 273 202 52 -75 -55 -258 151 -53 -238 217 204
4655 204 13 -177 273 -90 -50 113 32 -115 157 138 -18 110 85 113 208 223 -210 -233 117 49 -181 -113 -188 -356
4679 -356 -135 -170 -278 -414 19 -293 -334 -15 335 60 -22 114 -113 -16 131 226 100 -30 -11 -51 186 61
4701 61 -97 170 -54 29 -155 -89 23 -147 -13 -189 -182 -51 92 -1 189 -44 -13 4 89 51 24 51 -27 247
4725 247 -69 -73 321 130 60 67 -9 -89 -5 52 -43 73 69 -148 91 -84 -151 -54 -95 109 166 106 -98 -133 172 -15
4751 -15 193 -89 167 252 -94 -7 -201 16 -69 181 144 -31 -12 46 11 -91 281 68 102 -60 103 -124 47
4774 47 192 -196 -240 6 -30 37 -214 99 -148 196 -125 314 -228 203 132 222 -49 -101 102 -212 190 -146
4796 -146 -13 55 166 26 85 -218 -69 72 -109 -93 72 -198 19 58 -134 -49 37 243 -101 -181 -126 70 -104
4819 -104 -163 67 40 -92 -146 -22 40 48 -51 -108 174 -28 -125 -99 -92 98 -292 -206 154 277 36 55 -110 196 164
4844 164 73 -179 -88 -206 -93 -111 142 -196 -234 -128 -218 -86 -31 -64 -208 59 -167 99 -61 -46 90 158 136
4867 136 249 251 -17 182 299 34 -277 -82 166 -52 34 -254 -156 -141 -140 -131 -142 -23 -21 193 -38 -114 -355 142
4891 142 135 8 -4 173 224 -83 236 -3 25 -20 -89 -52 -85 16 79 -83 142 64 -134 -290 120 -44 -43 -178
4915 -178 21 76 -36 238 229 -23 -13 46 107 153 -11 93 -98 127 150 76 45 146 -103 -50 -231 -185 -229 13
4939 13 -130 106 -7 -231 -199 77 11 -140 109 -6 -29 171 239 198 75 -25 -121 -95 -36 -75 13 122 40 74
4963 74 123 -182 -84 -76 3 -100 -51 -132 -174 51 229 -193 -315 -1 45 -25 422 -149 1 -62 59 242 -198 -84
4987 -84 108 -97 -45 151 402 73 204 55 -85 -114 205 -76 -27 0 -92 -116 362 -9 -175 -133 14 -64 -92
5010 -92 147 43 0 52 1 25 9 144 106 -86 -7 82 157 -65 49 -101 85 -142 79 301 -135 57 -8 -221
5034 -221 220 134 -70 -52 111 -168 181 191 23 90 -81 -252 -48 288 227 14 177 -51 -141 137 141 58 -51
5057 -51 7 99 -113 19 16 32 31 166 -285 -22 -316 -169 -7 44 93 26 -98 -85 42 -41 57 164 -101 196 -25
5082 -25 -41 -161 161 89 226 -160 121 256 56 -108 0 -7 385 134 44 68 251 105 -134 261 181 -215 -12
5105 -12 -148 -282 26 46 -96 -124 -75 -254 -228 93 -50 -238 -34 44 153 15 7 34 -79 -42 164 28 73 -109
5129 -109 -48 -69 -105 -129 19 -81 189 173 -148 -79 106 -143 -89 192 5 116 -52 -8 -146 308 -142 44 -240
5152 -240 -83 -37 236 203 -9 -10 -92 162 -55 -124 -60 -77 27 -86 -69 17 -78 164 -43 222 -32 125 145 -137
5176 -137 127 183 279 85 -28 160 199 -33 150 20 -69 127 -61 -41 95 -83 67 39 -67 -99 93 63 52
5199 52 -115 -87 49 -200 -67 -59 -87 -73 -160 105 -191 93 69 280 -53 -212 204 -19 22 152 -96 -123 -84 33
5223 33 15 -95 30 -258 -62 -108 -108 -297 82 4 -174 89 21 25 -155 -55 86 -115 -3 -22 -63 -89 -48 62
5247 62 -104 306 163 -259 124 176 132 -76 -19 96 93 -120 7 -191 -147 -192 15 -33 -124 -8 23 60 -19 364
5271 364 29 39 221 -113 -34 19 -152 222 -309 -117 91 14 -118 -78 46 -128 -53 -70 -94 -157 -3 -22 -2 -30
5295 -30 -101 -67 -189 -139 63 81 26 162 313 302 -67 92 -258 54 327 -39 -205 -55 148 -17 144 -7
5317 -7 -230 0 -229 -319 -326 -188 109 -107 -155 -9 -134 89 -45 -50 106 80 139 -21 22 216 -158 -92 206 -85
5341 -85 110 146 69 102 -7 -101 -214 -40 61 29 -77 109 43 181 -17 -30 -133 -130 -111 58 54 163 21 -104
5365 -104 -288 19 -91 31 89 -37 -132 83 251 -25 -197 71 -77 50 -330 -3 -52 -189 88 -215 0
5386 0 -3 165 -109 107 72 -114 -81 -174 6 160 -75 34 32 54 -21 -146 -118 195 -57 31 46 17 -201 248 -12
5411 -12 -29 -19 -266 412 336 164 104 -29 205 -38 -177 -256 -45 27 214 168 194 -199 -165 33 60 -118 -305 36
5435 36 -18 118 167 -31 82 46 -13 239 43 33 -45 -1 -24 -55 91 129 -85 -113 -44 104 66 -50 135 -193 -121
5460 -121 -87 86 40 -265 -56 23 -37 185 -139 -209 34 -188 -61 94 -36 108 -186 -109 109 -90 -107 191
5482 191 5 -62 110 250 -66 39 -120 -191 85 117 96 -85 -12 14 232 -162 -61 87 -41 213 294 -78
5504 -78 185 -57 66 -185 -108 298 -179 179 -31 47 -164 -82 -84 -5 -63 78 178 -163 -84 -39 74 -100 193
5527 193 232 -217 64 -87 218 47 -87 -293 -209 -100 -44 172 136 91 -116 345 -10 67 -85 96 -182 -5
5549 -5 -155 35 -49 -248 -69 164 48 -138 138 35 146 62 -123 120 15 83 -58 -80 13 -125 81 102 195
5572 195 -78 52 -69 83 91 4 140 -119 211 -24 -13 27 -222 -29 -93 -179 -26 -24 -214 52 76 -79 -8 71
5596 71 9 113 -148 72 43 74 -29 -173 -56 -71 -155 35 11 184 -60 88 44 -7 -15 -189 133 87 159 -150
5620 -150 -1 -94 31 -90 113 151 -15 40 -189 14 -268 108 57 -176 -18 15 -115 -256 41 -216 -122 -69
5642 -69 -88 151 81 -133 -58 386 295 72 141 -11 235 -56 -86 146 30 69 -272 -6 -16 -251 -84 -57 31 132
5666 132 -19 56 21 -205 111 41 304 -186 37 -334 -46 -3 89 132 -65 -96 377 26 -5 143 134 198 159 39
5690 39 -199 -87 141 -129 -154 101 -94 -60 0 56 111 138 -65 31 -68 60 72 -46 -62 200 -86 -21 -68 279
5714 279 25 -55 -19 -274 70 -137 -33 8 35 68 -6 141 136 107 -35 -51 -188 -79 147 -1 7 -194 -34 -29 -198
5739 -198 -84 190 -83 -217 -259 71 -55 94 -66 77 -85 146 -6 -98 206 -113 -143 -144 176 -98 -59 -32
5761 -32 45 -25 15 83 -69 151 -135 144 -133 114 -40 -69 100 -114 147 -74 -77 -66 -238 -16 -68 -44 193 91
5785 91 -20 -183 70 15 99 -96 -42 154 -29 -55 -152 26 -168 -11 115 16 -3 4 -41 161 -54 76 -107 147
5809 147 215 124 -274 13 -216 71 10 96 -91 48 32 -17 -71 205 95 170 -49 -237 104 -16 -78 -13 82 -13
5833 -13 161 110 60 -69 -201 -185 -93 -13 23 -173 -80 96 66 123 227 -7 -140 203 -85 -74 108 -58 -120 -70
5857 -70 228 96 146 50 121 194 47 -48 -85 173 45 -369 57 -116 42 229 72 -93 -267 -216 -24 -125 199
5880 199 -159 115 -32 34 148 -113 20 128 -83 75 -77 37 101 123 -223 -159 132 -124 11 -97 41
5901 41 17 -76 -118 194 87 -85 96 257 -72 71 -108 -82 30 78 108 25 0 195 -102 -139 215 -88 72
5924 72 -148 -275 113 126 26 -66 28 91 -164 101 21 88 9 63 172 37 302 98 18 -38 -78 90 18 33 -165
5949 -165 125 18 122 -66 -96 -112 0 104 13 195 94 12 211 13 134 214 -133 114 -165 204 -37 -22
5971 -22 -63 -45 -146 72 -168 -184 24 -86 138 -88 -133 194 77 -81 83 60 -97 -124 -156 118 274 35 -242
5994 -242 18 59 119 -84 -210 -153 140 -81 -127 -106 -24 194 184 -107 -8 223 287 -61 -59 106 215 95 66 241
6018 241 107 146 -86 257 -238 -152 -81 -241 0 41 278 305 -120 74 -168 -288 211 -54 -81 241 -36 117
6040 117 43 57 -21 141 54 153 82 4 85 -64 -313 108 144 -108 92 42 -305 -18 76 -46 -55 -2 -26 352 109
6065 109 -71 -69 -44 24 47 -305 97 -128 97 317 -12 174 32 -287 -64 -11 -169 136 -76 -140 -66 -51 53
6088 53 -5 -105 139 -75 0 190 -157 41 423 115 -58 -106 21 267 -45 -202 126 -1 76 154 152 -156 200
6111 200 2 62 58 77 -177 -68 95 -167 -64 -38 -58 268 -14 -54 69 -5 -136 147 217 -7 397 68 -133
6134 -133 203 -180 -278 -19 253 -192 7 132 -117 -35 -280 -61 -24 48 -257 -58 -86 59 145 -189 -31 121
6156 121 174 -221 -50 3 17 160 165 62 -63 215 8 59 282 171 -133 136 266 168 -144 11 -37 340 -21
6179 -21 22 -69 -72 9 -82 184 178 300 -147 92 89 14 28 -68 -162 -12 -190 -296 -56 -142 3 22 188 -70 -146 -207
6205 -207 8 113 -74 123 256 -10 100 161 -115 -174 122 -50 223 -26 73 218 123 -78 -119 131 190 -224
6227 -224 46 227 -232 106 74 -36 -33 99 -72 -362 -22 -234 -283 44 321 -128 4 76 -106 -123 -2 32
6249 32 232 27 -114 98 143 150 -166 300 169 201 258 -46 92 72 -51 163 -2 45 76 99 -12 -47 254 -111
6273 -111 98 -57 -118 45 196 -157 -43 -165 -138 162 11 209 -54 -124 66 12 -157 -170 -47 -93 -63 24 -165
6296 -165 -62 74 350 -226 213 116 190 -64 -75 44 -286 -253 -93 60 62 202 -387 71 4 -117 31 -126
6318 -126 -111 64 48 52 -99 -165 -59 -106 116 143 -280 55 -117 83 -79 -23 50 78 -190 77 -152 -65 157 20
6342 20 90 80 184 265 -96 -193 9 -96 -55 -135 56 16 -34 -172 -125 -221 71 78 75 219 102 -58 -53 -56 207 217 25
6369 25 -210 -3 236 244 49 23 -34 238 164 -128 116 104 -96 -40 143 -38 -65 -119 62 66 -254 -51 46 122 98
6394 98 95 155 -159 49 111 56 -190 3 -8 -218 15 107 -69 -39 15 -219 -130 141 -32 -42 -117 -196 62 39 130
6419 130 188 21 34 -203 33 -213 240 362 -139 -42 55 87 -131 -24 -260 -132 -57 -44 66 49 -36 -46 24 124
6443 124 -118 307 -125 5 -206 -121 86 -149 -100 -48 -106 59 170 22 124 196 102 208 -25 134 -100 -192
6465 -192 -39 93 -22 -272 21 -221 37 -262 -106 149 43 -23 182 105 -24 -63 127 243 96 -125 147
6486 147 -248 208 98 36 128 -67 -76 -79 98 37 -145 -242 37 -73 193 -99 109 5 -96 -149 -301 73 -286
6509 -286 -128 51 17 101 82 28 -81 -97 -207 48 111 59 -6 1 132 156 268 36 -5 34 175 121 -13 113 -19
6534 -19 134 -26 10 25 -174 63 112 -34 130 81 26 7 -58 162 75 161 36 296 229 -160 103 41 -58 -356
6558 -356 168 -71 -47 -92 -138 -219 -142 -119 274 -88 -78 -196 138 -182 158 -4 -41 243 -5 -110 18 -229 128
6581 128 -120 127 268 88 11 3 27 -67 32 31 -130 85 76 -50 199 212 -120 -348 -142 98 -36 -33 139 -88
6605 -88 298 -104 64 70 79 134 -113 -250 30 -118 10 84 -40 -106 163 91 -63 -107 154 53 101 166 227 -239
6629 -239 -86 -197 1 156 -101 78 75 30 95 33 17 90 56 -159 63 93 11 -146 149 187 217 59 80 101 141
6654 141 -262 -179 52 122 36 210 38 -75 198 -75 171 151 -100 -1 169 -51 164 -208 43 -155 111 -195
6676 -195 121 72 -61 254 -173 -105 56 61 -32 158 77 69 -75 -149 -218 -23 -69 204 -104 -192 -187 79 -208 -291 67
6701 67 -147 144 79 -128 98 -292 -51 -201 29 23 50 169 -115 -219 315 -76 128 -133 72 234 -208 279
6723 279 -193 317 204 79 39 164 43 -174 61 12 -172 -62 75 145 -69 140 84 115 -46 -240 -98 137
6745 137 -111 -347 -242 -191 99 216 -7 -18 -29 97 295 107 -135 -37 -401 65 -174 -118 109 -173 36 -235
6767 -235 262 -226 108 -137 28 20 85 176 212 20 51 -2 -152 189 -39 22 -2 -30 35 -38 -99 -309 23 -84
6791 -84 31 72 -64 67 163 132 -81 39 137 -308 -19 130 -34 -131 -97 53 35 -171 -22 -59 -7 28 -351 -52
6815 -52 -291 31 159 168 219 32 -107 -141 -118 -144 -91 -38 116 -79 -81 -242 4 103 -6 105 95 -209 193 0
6839 0 44 -52 -46 7 30 -93 60 -107 15 70 -46 108 -69 -42 75 48 -252 -222 90 -97 204 197 -94 -205 37
6864 37 119 -5 -85 170 53 -73 84 64 40 -83 -53 -296 -132 -190 64 -100 -1 -131 -317 -117 -40 -162 14
6887 14 -106 16 -99 -100 139 184 -247 127 86 -7 -25 -138 -114 185 115 -281 -68 23 -75 63 -173 187 151 62
6911 62 -170 93 -93 -297 -89 53 89 -25 -230 21 364 83 99 -180 30 -197 -266 167 -88 65 68 -56
6933 -56 -69 115 14 29 -19 -224 112 -41 184 30 -221 -1 -70 -224 298 58 -165 -46 -62 -42 -207 32
6955 32 -2 -45 -225 -61 -138 121 136 26 28 -149 13 126 -205 112 81 81 60 -61 -20 53 38 178 -27 111 164
6980 164 -205 -109 139 -132 -145 139 236 43 -285 227 -32 31 87 -12 7 120 44 -75 44 2 -259 102 -35
7003 -35 28 -150 -154 -88 -124 -38 -110 135 7 169 -48 -26 96 44 45 -130 214 -259 45 106 53 252 -66 -39 42
7028 42 172 13 15 146 -15 38 -24 -47 35 -169 -130 14 -8 27 112 32 -53 -214 -76 63 -65 50 57 -124 -94
7053 -94 -86 105 86 13 -84 -193 103 -52 -2 1 155 36 314 120 -151 -10 -209 122 -123 -172 73 -247 -294 85
7077 85 -126 -39 -72 165 -69 147 -193 -32 79 27 -4 28 29 107 85 -7 -255 111 54 -13 -390 2 4 155 -4
7102 -4 253 62 -22 161 173 148 -2 94 -5 -20 34 -150 3 176 29 151 -179 69 -26 -165 -90 -340 130 47
7126 47 148 122 155 125 -35 36 -89 184 -92 -299 -230 71 -136 -76 -51 -15 71 -112 -153 126 76 85 -159 -133 114
7151 114 531 73 -103 -88 137 -104 235 36 67 242 -1 118 -294 -13 -45 194 138 -285 15 106 -83 66
7173 66 -15 -42 273 -155 -5 191 -322 -78 58 -148 -261 -101 -80 110 -49 121 -46 142 93 47 86 -90
7195 -90 -172 158 -66 135 23 110 -58 136 13 98 -195 -70 -187 -71 63 -436 109 153 129 -16 -57 -152 91
7218 91 150 -25 -205 -119 79 -92 92 -61 161 94 218 142 -432 -8 104 63 435 -168 -142 -50 -35 28 106 -27
7242 -27 -28 106 -108 3 131 262 220 -189 -124 -76 63 238 51 -10 185 5 72 -51 -73 -57 -225 116 -117
7265 -117 136 139 -186 172 92 -290 126 18 -25 275 -351 214 -43 -330 -28 -124 -3 -122 -83 -132 174 189 159
7288 159 12 -297 -5 -219 -114 117 -226 141 -168 -99 57 254 -122 117 -148 -131 -138 -70 -2 -158 -68 -100 -212
7311 -212 -106 -175 39 155 260 -107 -262 -10 -51 -98 200 -119 25 113 79 -232 62 -165 70 0 -75 -10 165
7334 165 -260 -98 202 2 16 85 -45 63 -1 307 -139 -67 124 -14 113 -271 -293 -3 -40 -43 31 -122 -119 12
7358 12 98 -29 33 -114 -45 86 32 -142 -150 153 -83 196 58 124 81 55 182 -11 -179 -5 70 -66 -58 17 251
7383 251 -138 20 -65 -141 -233 -80 -113 -220 -137 139 -294 127 -78 -172 118 173 -139 246 82 30 7 300 -133
7406 -133 -89 -181 -137 43 -200 129 -129 24 86 207 160 67 -94 18 91 250 -509 -203 309 -18 -104 244 -89
7429 -89 -55 -45 -71 -215 91 -56 97 -58 -79 -115 53 -4 -54 33 -158 -23 70 96 -395 123 -174 243 177 147
7453 147 -103 62 12 66 54 338 160 27 -97 106 346 251 218 -256 32 180 187 187 -22 -203 57 202 101
7476 101 -86 -30 -68 36 -234 20 -73 -133 -57 184 -31 -74 -117 230 -1 2 -69 101 196 19 -139 -123 180 16
7500 16 34 -44 148 -235 -26 -199 101 166 -166 -51 -193 38 166 92 36 -42 -262 39 -168 -265 -109 122 118
7523 118 102 92 23 -130 78 63 -115 -70 -39 -18 84 -59 127 8 -335 201 311 -19 98 -52 13 -11 155
7546 155 2 -36 1 12 -319 -47 -79 59 80 25 67 55 1 73 -155 17 230 125 55 -142 48 7 95 -344
7570 -344 253 -62 -196 192 47 -140 -151 249 -24 310 -112 68 117 -26 -106 -82 119 216 184 8 36 -200
7592 -200 34 17 204 51 -150 79 73 116 -349 7 91 -79 57 -102 140 198 -73 274 247 99 18 -13 -86
7615 -86 18 261 -66 68 -206 -81 134 -100 162 -89 174 111 157 -214 176 -58 -155 39 -59 -111 -10 -61
7637 -61 -20 218 -14 66 249 -88 -118 -198 -418 -126 -146 -2 59 -178 -51 -145 3 -121 0 21 267 -176 134
7660 134 43 -201 -144 115 -188 -8 42 70 52 -64 -43 105 -143 99 73 47 -8 13 83 -28 157 -111 108 -52
7684 -52 208 -184 -69 86 -152 -166 90 -19 100 -208 -55 29 -85 -81 -232 16 -11 19 117 -124 -96 -13 60 7
7708 7 173 142 87 230 -100 41 11 246 123 -319 -174 170 -146 -26 26 -118 -140 121 -173 143 -33 66 4
7731 4 103 -15 -131 386 39 -6 148 159 -48 288 71 -111 66 -77 -74 -156 16 -211 -50 -124 43 -127 -97
7754 -97 -36 137 -21 258 -90 -15 -162 70 175 -201 -195 221 116 -128 -55 -84 75 -202 171 -52 -35 -6 344
7777 344 -118 -109 152 63 -241 -12 95 -115 51 66 -172 299 43 121 56 -142 -198 -140 58 -217 42 286 -83
7800 -83 -145 220 -45 -188 -152 257 -38 -273 80 36 55 -159 199 140 179 127 -32 -349 -87 -110 108 150 -32
7823 -32 -172 -201 -44 -65 -164 -18 26 -100 141 -42 216 -5 5 -100 -163 124 157 10 -361 32 -48 169 304
7846 304 -91 6 154 33 15 -27 76 69 56 -19 -29 180 -127 -160 -110 148 -70 103 -143 -211 53 -114 -43 143
7870 143 -73 -284 94 -155 98 97 212 -85 -212 72 -136 78 155 -209 82 -199 225 -12 232 66 121
7891 121 154 79 -202 -25 20 -28 63 84 73 -74 -42 -22 -71 -41 -162 -124 -306 145 54 -135 60 176 -32 -27 125
7916 125 185 92 165 221 -186 255 -175 20 73 -191 29 -116 -12 38 -163 62 -124 -41 -41 -140 -112 -179 133 -72
7940 -72 -118 49 208 22 118 66 -89 -22 -63 -97 -116 76 -149 -83 -161 -167 135 -44 -58 -89 11 114 -86 65 73
7965 73 170 33 107 -41 141 92 22 -175 -186 78 -248 87 80 -13 19 -18 40 -296 -189 -119 -184 9 -152 100 72
7990 72 -144 21 147 -340 153 -340 -69 149 -28 7 -17 198 379 -184 -261 152 -14 -148 -105 -290 -131 -51
8012 -51 22 -30 -84 155 -35 -235 65 -127 0 154 -51 297 92 96 -55 -96 -5 100 46 -88 10 -289 -35
8035 -35 -97 185 -72 257 45 -37 13 175 33 40 105 63 -114 108 195 -94 334 106 179 -139 31 148 -96
8058 -96 -153 -138 -108 -56 -201 338 -248 21 -33 144 -368 30 -267 -146 231 38 -29 32 -50 -114 32 274 -53
8081 -53 120 119 -192 3 -325 -7 188 -216 -58 137 -34 -60 -188 -86 112 231 285 176 -147 191 -60 16
8103 16 -75 56 124 181 10 -13 17 -26 -281 -242 80 170 -184 119 -83 -137 -305 151 181 408 19 -287 -78 22
8127 22 -57 60 71 196 -86 -22 54 47 -118 -108 185 -129 -46 131 -1 -184 -13 -129 266 46 -80 41 43 -101
8151 -101 93 -8 203 -333 -14 -94 -135 -162 -25 -177 1 -122 57 -105 -70 92 -101 119 84 172 37 -43
8173 -43 71 190 149 170 -37 84 222 133 20 -49 33 261 130 -86 31 -71 -57 157
8191A57
$$ Imaginary data points
##PAGE= N=2
##DATA TABLE= (X++(I..I)), XYDATA
0 0 0 0 0 0 0 0 0 0 0 0 0 0 0 0 7 -8 8 -8 8 -14 16 -16 24 -24 30 -32 40 -46 52 -59 68 -78 87 -99 111 -126
36 -126 140 -158 176 -195 217 -241 268 -296 326 -362 395 -439 482 -533 585 -646 713 -787 869
55 869 -965 1073 -1197 1344 -1519 1732 -1994 2332 -2782 3412 -4360 5940 -9047 17417 -87715
70 -87715 -231694 -18710 12417 -44322 96287 176374 37847 51880 146838 87600 86290 178997
82 178997 43954 -106541 2107 50436 -58374 20768 118115 -46031 -156583 -65104 -86907
93 -86907 -148958 -41363 -12037 -130402 -87253 16959 -31213 4379 143957 72886 -56068
104 -56068 15582 57678 -3845 82153 179431 78209 27312 100709 42137 -31616 57123 47608
116 47608 -105622 -109289 -46266 -103940 -87680 25661 -7752 -91580 -50257 -49996 -106101 -25612
128 -25612 50997 -22812 -25192 71086 47842 13969 111947 135073 36354 24566 50572 -3949
140 -3949 349 71359 39209 -14509 16382 -10393 -81515 -41362 -5385 -80434 -100251 -44488
152 -44488 -64801 -83614 -3077 31335 -12350 841 21812 -18869 -4236 57789 47024 32601
164 32601 73864 66581 28795 61114 79405 20140 -4325 9901 -34003 -63397 -18881 -6586
176 -6586 -37616 -26870 -20097 -55419 -55828 -29273 -42694 -48136 -17179 -15272 -21350 24928 56185
189 56185 36541 41819 59524 30404 9241 31125 34366 21233 31217 34141 13649 11996 13945
202 13945 -13744 -32327 -31601 -53094 -69954 -48837 -32483 -33230 -16633 -630 -9707 -13500 -2551
215 -2551 -5414 -9582 6278 16383 17825 35345 52533 51403 50501 47159 27095 9473 2597 -9711
229 -9711 -18481 -10701 -7895 -17910 -16460 -9490 -20436 -34185 -35654 -39436 -42720 -36162 -25717 -9898
243 -9898 10418 21305 23017 30056 35400 23995 14553 20560 21713 15898 20340 29239 29998 25573 16272
258 16272 4210 -6180 -19299 -34608 -40270 -33092 -29484 -29692 -19529 -8868 -10703 -13807 -11810 -12872
272 -12872 -13984 -10085 -2403 8666 21780 31161 35486 39566 39527 29350 19160 14532 7196 1137
286 1137 1440 1573 -196 -1445 -4669 -13147 -23508 -29924 -35720 -39641 -36043 -28523 -19792 -8758 704
301 704 6839 11463 12654 10261 10551 13685 16343 19014 25819 33501 33684 29150 24149 16002 3940 -7402
317 -7402 -16887 -20384 -20896 -20788 -18244 -14354 -13478 -16425 -20176 -21496 -23579 -25994 -20719 -10654 -980 8724
333 8724 18040 25320 28950 26712 22373 18066 15252 12670 11443 14153 16831 14944 12506 9025 -1002
348 -1002 -13481 -22988 -30035 -34727 -34880 -29604 -22514 -15017 -6684 -3222 -3185 -1014 -2295 -4612 -357 5976
364 5976 10297 18935 30223 33847 31875 31180 26598 13935 5115 419 -8345 -10660 -6539 -7954 -9657
379 -9657 -6507 -10096 -19987 -23218 -24846 -32384 -30752 -17931 -13060 -8740 7273 16358 14555 18830 22350
394 22350 13818 11234 17173 14082 11720 22533 24899 15370 17067 15665 -2882 -11826 -9536 -22042
408 -22042 -32927 -23301 -19229 -25132 -15075 -4713 -13566 -13951 -3652 -10322 -14874 2796 8994 3422
422 3422 18611 30954 20597 22499 34624 21218 6182 13875 9158 -7643 1462 9760 -6852
435 -6852 -9556 138 -15906 -28837 -16154 -18831 -34226 -21765 -9383 -19900 -10397 13863 6441
448 6441 -498 17273 13902 -2194 14177 27566 11816 15526 31409 15988 4632 20724 13145
461 13145 -10495 -3907 -2586 -28041 -22456 -204 -13846 -22563 -3619 -11685 -32380 -15299 -1300
474 -1300 -17837 -10696 11495 -744 -2054 27947 27852 11345 25386 26113 -2077 2129 23738 8913
488 8913 958 19211 6924 -17227 -2863 2110 -23160 -21195 -10271 -33970 -38195 -7685 -5825
501 -5825 -15390 6860 11133 -14892 -6128 16106 2912 2654 26641 16321 18 24032 33618
514 33618 13429 19587 25613 -7104 -20458 -507 -7670 -19742 1224 -327 -26966 -17920 -1898
527 -1898 -18946 -18257 192 -16130 -31131 -5811 6912 -873 19041 32817 8428 4057 21824
540 21824 11565 4203 23651 17061 -6408 4427 16067 1137 3718 15485 -8904 -29921 -17967
553 -17967 -19793 -29573 -10126 -775 -19273 -15327 1648 -5780 -4490 15500 8103 -10174 2547
566 2547 12145 4668 19725 36158 18210 6897 16263 5985 -4261 10014 8677 -13055 -12149
579 -12149 -4882 -15882 -12022 4141 -8446 -24654 -16083 -17233 -25276 -6080 8069 -2960 -1019
592 -1019 11189 4590 4897 23402 20678 4523 9729 11310 -72 9585 23912 10749 873 5803
606 5803 -6149 -17620 -5035 -1832 -16681 -14526 -9223 -20535 -16403 1748 -3095 -12028 -2562 -4835
620 -4835 -13881 2053 16451 8794 11496 20953 9526 3927 18839 16552 2437 8338 7504 -8900
634 -8900 -4053 9629 -546 -7529 -453 -11431 -25577 -13223 -6752 -17300 -10023 371 -11003
647 -11003 -9708 8981 6428 -1029 9491 7767 -5364 3777 16882 9337 10916 21923 10183
660 10183 -1124 9614 6940 -8010 -2851 715 -14449 -13848 224 -5376 -10760 200 -4713 -19380
674 -19380 -11118 -3466 -13075 -7020 7646 881 -2086 13961 13954 4712 12999 15080 96 1275 11164
689 11164 3228 807 12777 7460 -5684 791 828 -13153 -11551 -4893 -15024 -17507 -4419 -4409 -8967
704 -8967 2341 5445 -5270 -1698 6099 -1630 -2099 9932 8110 3252 12783 15413 6454 8826 12022
719 12022 622 -3955 2601 -3010 -9201 -1669 -577 -8814 -5488 -1378 -9648 -11674 -5035 -8428 -11570
734 -11570 -3172 191 -3395 3831 9573 4325 4853 10513 6398 2304 7595 7745 2736 6090 8961
749 8961 2527 824 3043 -2845 -8111 -5308 -7243 -11601 -8155 -5290 -8140 -6329 -1594 -3602 -5132
764 -5132 -268 -55 -1595 3170 6628 5004 7305 10904 8747 6978 8102 6234 2449 2613 2291 -1009
780 -1009 -1486 -204 -3557 -5542 -5195 -7556 -9831 -9111 -8310 -8404 -6017 -2700 -1574 25 2781 3702 3053
797 3053 4592 5560 4988 6753 8044 8079 8305 8164 6454 3812 1800 -346 -3648 -5301 -6079 -7089 -6868
814 -6868 -6142 -6229 -6247 -6141 -6659 -6480 -5826 -4451 -2695 -343 3189 5239 7560 9436 9653 9018 8018 6232
832 6232 5106 3907 2992 2785 2108 1228 -124 -2155 -4056 -6373 -8994 -10328 -10724 -10086 -8551 -6139 -3839
849 -3839 -1365 225 1390 2403 2779 3705 4080 4910 7114 8097 8859 9927 9148 7601 5723 3384 324
866 324 -2322 -3737 -4861 -6165 -6107 -5750 -6699 -6412 -6186 -7527 -7479 -6526 -5847 -4046 -948 1702 3485 5809
884 5809 8077 7671 8086 8824 7083 5644 6486 5189 3467 3634 3289 -75 -1835 -3180 -6068 -8444 -7618
901 -7618 -8628 -10157 -7787 -6251 -6631 -4351 -943 -1253 -745 2032 2536 2351 6453 8358 7029 8087
917 8087 9550 6145 5111 6694 3716 14 1025 -493 -4726 -3732 -2101 -5630 -7159 -5067 -8352
932 -8352 -10666 -6168 -3992 -6219 -2207 1176 -1561 264 6211 5376 3556 7318 6491 2214 5711 9675
948 9675 5553 5537 7806 1334 -3417 295 -1288 -6415 -4341 -3695 -10206 -9113 -2429 -4891 -6458 -302
964 -302 -3060 -9183 -2674 2475 -1051 3483 9798 4313 1758 9525 8526 3431 8169 7345 -3199 -1890
980 -1890 4090 -980 -1864 4758 -1052 -9936 -4839 -3301 -9946 -5501 256 -8194 -10135 261 -208
995 -208 -2444 7298 7800 -2769 231 6673 1108 2847 12517 6619 -1402 5577 6354 -1756 3823 7492
1011 7492 -5645 -9330 -2449 -7053 -9497 1947 1711 -9358 -5550 -181 -7625 -4252 7127 168
1025 168 -6411 3176 3589 -1985 8494 14916 3344 1060 7468 -50 -3665 7969 6243 -5988
1039 -5988 -1659 1097 -8539 -4523 5694 -3059 -10258 -3125 -5917 -12367 -936 6068 -3631 -2459
1053 -2459 5137 -2458 -3224 10209 8666 -803 4848 6238 -3283 1685 12312 4060 -1516 5217 -1210
1068 -1210 -9702 338 4009 -6537 -5105 208 -9770 -10277 2072 409 -6472 465 872 -8501 -1711
1083 -1711 8674 2265 1088 9209 2638 -3642 6992 10025 1424 4516 7282 -3695 -4615 5327
1097 5327 791 -5378 859 -2101 -12509 -6106 1054 -5602 -4894 1926 -4236 -8981 804 3060 -2871
1112 -2871 3148 6699 -1954 -140 9065 5461 2913 9138 5223 -3438 1167 4806 -1889 -472 4461
1127 4461 -3233 -7260 -175 -1667 -6910 -1673 -1062 -8820 -6668 -565 -3547 -3090 4569 1901 -2797
1142 -2797 3077 5445 455 4124 7959 1576 392 6373 4090 1400 5844 4586 -2971 -1652 349
1157 349 -5323 -5260 -506 -4749 -7712 -2378 -2140 -5805 -1433 558 -4491 -3356 1598 -521 -879 5148
1173 5148 4685 1456 5408 7085 2398 3790 6307 1196 -539 3123 608 -2794 504 666 -4434
1188 -4434 -3082 -1078 -5550 -5967 -2465 -4802 -6278 -1159 -299 -2648 743 3114 249 1272 5112
1203 5112 2788 1437 5297 4495 1484 4905 5524 1371 1536 3168 -1261 -3362 -613 -2217 -5256 -3003
1219 -3003 -2586 -5845 -4080 -1348 -3719 -3890 -283 -1675 -2868 1185 2344 367 2661 5250 2908
1234 2908 2800 5855 4041 1946 4348 2900 -622 875 1321 -1669 -2134 -822 -3450 -5142 -3011 -3072
1250 -3072 -5046 -3188 -1893 -3515 -2415 276 -445 -513 2348 2621 1325 3220 4822 3028 3323 5083
1266 5083 2775 1070 2903 1717 -763 58 -119 -2879 -2664 -2010 -3467 -4266 -2952 -3489 -4602 -3104
1282 -3104 -1615 -2474 -683 1329 1026 1321 3369 3188 2619 3525 4057 2709 3069 3984 2487 1698 2037 410
1300 410 -1283 -1586 -2341 -3698 -3882 -3815 -4117 -4151 -2920 -2138 -2375 -1154 -404 -876 291 1477 1694 2238 3415
1319 3415 3587 3843 4289 4292 3004 2486 2032 470 -379 -1008 -1340 -1896 -2049 -2355 -3008 -3438 -3338 -3640 -3652 -3157
1339 -3157 -2428 -1988 -832 528 1161 2483 3153 3355 3443 3774 3268 3047 2953 2846 2182 1631 1312 306 -556
1358 -556 -1187 -2323 -3339 -4009 -4395 -4450 -4268 -3485 -2907 -2280 -1210 -514 -428 827 1051 1529 2698 3207 3390
1377 3390 3936 4406 4034 3389 3290 2513 954 489 -204 -1834 -2069 -2093 -3180 -3698 -3200 -3540 -4141 -3180 -2588
1396 -2588 -2732 -2144 -682 -517 -13 2022 2427 2785 4014 4060 3072 3324 4093 3039 1926 2655 1133 -288
1414 -288 -25 -534 -2419 -2495 -2328 -4113 -4516 -3133 -3542 -4001 -2144 -1254 -2588 -1327 1015 296 1370 3571
1432 3571 2702 1774 3857 4137 2569 3349 4264 1156 961 2152 460 -1107 60 -717 -3854 -3211 -2307
1449 -2307 -4447 -3877 -1666 -2680 -3755 -1033 -373 -1440 579 2296 47 785 2932 2132 2035 4699
1465 4699 4039 1899 2701 3424 694 701 1941 -850 -2783 -1121 -1845 -3639 -1566 -838 -3123 -3198 -1473
1482 -1473 -3102 -3036 -101 -244 -1445 873 2246 995 2595 4473 2523 1535 3385 1840 346 2628
1498 2628 2447 -280 183 735 -1343 -1975 -267 -2091 -3887 -2515 -3038 -4499 -1893 79 -1569 -742
1514 -742 892 -111 -388 2115 1899 625 2149 2681 610 2344 3917 2085 1388 2044 195 -1721
1530 -1721 -162 -476 -2556 -1555 -1054 -2984 -2554 -224 -1480 -2297 -329 -1602 -2720 -46 1081 -57
1546 -57 1468 2693 1095 1112 3604 2337 826 2575 1681 -848 479 1949 -771 -330 1164 -1804
1562 -1804 -3370 -697 -926 -3712 -1399 -714 -3627 -2325 985 -839 -968 2264 981 -1382 1991 3247
1578 3247 373 2053 3956 443 -212 3547 1537 -1167 2038 1304 -3196 -1423 1011 -3032 -2802 667
1594 667 -2385 -4787 -560 -269 -3621 -200 2183 -2156 -1311 3442 877 -668 3876 3199 -1177 2229
1610 2229 4706 267 700 4481 590 -2754 1582 358 -3824 -420 1067 -4465 -3424 1129 -2410
1625 -2410 -3934 1124 -429 -4449 -440 1904 -2341 -503 4861 822 -493 4930 3495 -833 3181
1640 3181 4333 -1654 -98 3882 -578 -2399 2815 566 -4360 -202 361 -5013 -3516 540 -3680
1655 -3680 -4714 1191 -178 -3839 1371 2906 -2191 293 4508 297 -780 4973 2705 -761 3661
1670 3661 4773 -628 1085 3745 -1591 -3247 1599 -1121 -4844 -144 112 -4753 -2555 1067 -3038
1685 -3038 -3955 703 -1246 -3939 1169 2543 -1307 1550 4950 788 594 4924 2549 -373 3118
1700 3118 3099 -1656 360 3123 -1203 -1786 1343 -1655 -4386 -1156 -848 -4825 -2232 -110 -3423 -2995
1716 -2995 1387 -70 -2019 2037 2318 -1230 1266 3781 959 1500 4430 1992 203 2985 2891 -701
1732 -701 609 1636 -2192 -2408 18 -1820 -3556 -952 -1362 -4128 -2345 -487 -2206 -1700 1002 -631
1748 -631 -1253 1531 2247 461 2543 3506 1157 1382 3374 2100 901 2409 1574 -1014 -194 416 -1600
1765 -1600 -1829 -433 -2080 -3109 -1548 -1465 -2584 -1107 -601 -1644 -1568 273 67 159 1957 2143 1261 2364
1783 2364 2839 1772 1563 2095 1103 331 868 441 -544 -62 -341 -1819 -1747 -1557 -2234 -2544 -1519 -1881 -1959
1802 -1959 -1093 -250 -641 305 807 625 690 1410 1402 1329 2132 1867 1815 1546 1673 1074 544 197 -412 -1178 -1057
1823 -1057 -1084 -1659 -1633 -1447 -1458 -1222 -1275 -1138 -1254 -660 -48 -61 481 911 1284 1615 2162 2158 1673 1481 1086 1127
1845 1127 489 499 72 -229 2 -574 -876 -1220 -1318 -1864 -1771 -1970 -1891 -1466 -1105 -477 -325 431 673 909 951
1866 951 1433 1264 1340 1685 1341 1389 1433 1423 717 557 202 -585 -852 -880 -1181 -1522 -1360 -1392 -1798 -1333 -1390 -1254
1888 -1254 -1021 -484 -494 19 541 577 1163 1509 1863 1420 1874 1745 1064 1210 946 671 381 300 -465 -638 -921
1909 -921 -1526 -1646 -1608 -1440 -1781 -1678 -1164 -1221 -727 -122 -379 -24 332 1028 854 1516 1877 1701 1721 1638 1596 1418
1931 1418 1340 826 37 -56 -173 -865 -1031 -484 -1064 -1688 -1438 -1855 -2189 -1257 -1000 -1110 -860 82 -34 172
1951 172 1283 1317 999 1215 1410 692 1164 2117 1602 1002 1585 656 -439 361 57 -1446 -1196 -961 -2067
1970 -2067 -1971 -878 -884 -1616 -687 -900 -1848 -831 639 -299 -43 1317 1023 370 2122 2661 1033 1756 1771
1989 1771 141 -404 1425 490 -647 693 89 -2046 -947 -159 -1924 -1954 -443 -2294 -2836 -348 95
2006 95 -1191 608 1440 -853 -116 2009 1062 359 2600 1652 -271 1411 2459 198 451 2250 -504
2023 -504 -1957 232 -220 -2327 -467 215 -2520 -1944 277 -1437 -1846 602 -500 -2331 49 1166
2039 1166 -681 630 2924 551 -218 2632 1342 -645 1830 2215 -997 -368 1654 -1085 -1675 1251
2055 1251 -28 -2745 -323 -45 -2642 -1223 996 -1489 -2023 762 -153 -2032 1344 2117 -1290 579
2071 579 2512 -150 -272 2822 1172 -1047 1641 1553 -1396 -112 1858 -1065 -1588 1037 -758 -2907
2087 -2907 -101 11 -2875 -907 1035 -1479 -1378 1698 114 -1158 1874 1681 -1460 642 2447 -237
2103 -237 -52 2788 981 -886 1916 1517 -1441 -103 1112 -1889 -1813 812 -1412 -2478 658 253
2119 253 -2202 -388 990 -1879 -1151 1662 -45 -645 1912 1386 -813 1637 2748 73 49 1764
2135 1764 -172 -1320 1167 912 -1462 169 880 -2072 -1553 453 -1043 -2110 -10 -688 -2230 -105
2151 -105 1084 -745 275 1661 -255 -538 1795 1507 -386 1574 1758 -495 516 2004 356 -300
2167 -300 824 -407 -2291 -650 -107 -1820 -1002 194 -1247 -1548 181 -408 -1254 618 418 -1124 -98
2184 -98 1534 351 673 2308 1103 -77 1407 1270 -109 790 1238 -599 -986 348 -636 -1211 146
2201 146 -319 -1956 -1145 -579 -1369 -863 342 -567 -903 669 702 -25 1044 1582 532 469 1273 677 383
2220 383 1588 840 -209 307 287 -762 -284 372 -1002 -1254 -831 -1217 -1665 -548 -393 -1143 -810 -314 -701
2239 -701 -46 876 557 426 912 979 367 1274 1625 922 651 975 219 121 651 196 -775 -727 -844 -1471 -1307
2260 -1307 -550 -1152 -1056 -542 -649 -920 -290 19 -411 202 336 215 555 1340 1328 895 1012 1006 416 701 693 17
2282 17 130 392 -652 -568 -282 -556 -988 -805 -974 -1177 -1323 -792 -884 -733 48 -71 -64 470 756 559 515 880
2304 880 311 679 991 984 880 611 684 162 -162 -7 -567 -955 -534 -638 -1075 -598 -573 -880 -565 -252 -626
2325 -626 -570 186 -145 -59 440 767 616 736 977 711 888 784 486 466 231 196 -101 -142 151 -178 -392 -79
2347 -79 -520 -670 -602 -656 -871 -535 -220 -273 -6 352 283 366 587 475 467 657 430 518 203 444 568 89 183
2370 183 11 -100 -205 -362 -453 -297 -288 -298 -393 -397 -610 -484 -192 -5 -89 -37 245 481 445 652 376 254 361
2393 361 625 285 561 435 197 -69 343 -43 -523 -465 -768 -607 -347 -333 -599 -358 -338 -112 -273 -27 -61
2414 -61 141 230 577 339 426 763 571 628 716 343 127 48 112 -300 -266 -96 -252 -608 -242 -376 -724 -654 -332
2437 -332 -707 -468 56 -76 -105 227 318 205 651 861 105 596 689 145 363 695 657 116 312 202 -465
2458 -465 -432 -344 -612 -826 -463 -599 -912 -51 -53 -664 -63 246 -399 -303 569 197 -12 872 668 322 861 1091
2480 1091 464 225 618 101 -694 347 -40 -489 -297 206 -668 -644 -36 -576 -782 -102 -615 -870 -196 486
2500 486 -279 102 1057 186 60 862 788 188 707 1097 -34 167 828 189 -277 332 -372 -1020 -189 -78
2520 -78 -1200 -547 124 -966 -907 13 -353 -1034 212 546 -490 265 955 81 501 1111 456 199 994
2539 994 744 -13 254 664 -363 -243 471 -233 -903 -65 -83 -1347 -347 -15 -942 -927 324 -374 -467 671
2559 671 447 -243 392 732 -34 572 1308 399 -48 939 406 -379 423 604 -740 -410 346 -599 -660 118
2579 118 -209 -1093 -356 -439 -1446 -484 398 -371 -427 750 339 -330 567 931 -266 376 1135 -243 -232 1018
2599 1018 460 -32 628 9 -906 -98 528 -497 -437 124 -989 -1221 292 230 -617 -33 131 -1051 -459
2618 -459 1054 90 -145 927 452 -389 468 1233 -61 154 730 -624 -778 669 324 -518 293 405
2636 405 -1025 -747 331 -547 -893 400 -280 -1064 218 772 136 310 958 -433 -412 641 323 37
2654 37 872 472 -685 -237 266 -292 -309 550 -600 -1289 -19 -178 -725 59 446 -448 -545 492 152 -392
2674 -392 866 683 -798 392 885 -91 311 1220 158 -341 381 -112 -347 69 291 -795 -680 83
2692 83 -551 -622 -50 -148 -1016 -366 134 -318 -110 951 307 -339 537 602 -45 994 895 -82 53 569 -184
2713 -184 -159 767 -73 -530 -365 -314 -1249 -107 370 -568 -775 -371 -461 -501 197 442 -333 -216 287 6 312
2734 312 1003 599 -6 698 108 -271 235 896 224 -27 50 -107 -610 -77 -174 -698 -487 -201 -781 -500 154
2755 154 -339 -276 1 -51 -79 288 549 31 250 837 110 200 790 680 458 295 347 -299 -385 3 -213 -336
2777 -336 -241 -417 -731 -442 -154 -509 -571 -309 -629 -392 225 320 31 273 405 87 707 785 364 416 397 309
2799 309 77 427 219 -110 58 -24 -346 -607 -178 -452 -568 -422 -462 -656 -334 -135 -410 9 326 -68 39
2820 39 149 293 77 415 302 96 410 318 298 -17 314 -104 -202 -347 -161 -246 -82 -192 -287 -184 -484 -329
2842 -329 -174 -108 17 -153 30 252 21 97 -64 60 160 203 261 234 79 377 165 191 57 130 130 60 -122
2865 -122 -174 -229 -80 -92 -358 -55 -197 67 -344 87 39 -21 206 -30 7 -155 93 86 206 159 131 129 -92 125
2889 125 0 230 -152 -205 -186 -112 -194 -84 -283 -136 -147 52 -64 -73 -8 -2 -96 -162 113 -13 -83 317 172 354
2913 354 245 19 52 119 26 -111 -14 -118 -175 -265 39 -35 -125 -205 -181 -188 108 -216 -285 -250 -86 81 56 296 113
2938 113 211 305 149 15 155 264 -70 -192 183 -75 163 2 -146 -110 -258 -11 -285 -362 -226 -341 -300 73
2960 73 22 32 321 261 -73 41 294 226 -114 179 118 -25 77 246 157 90 215 -141 -129 -218 -189 -561 -196 58
2984 58 -344 -412 374 -481 -386 -3 57 -225 129 561 97 165 732 147 111 357 333 -102 317 100 -159 -148 249
3007 249 -27 -387 42 -363 -409 -231 -209 -298 -329 75 -284 -177 413 213 -79 235 421 -127 529 711 320
3028 320 185 246 -56 -200 -22 531 -268 76 -66 -304 -333 -131 -383 -430 -160 -417 -579 -389 207 -262 -223
3049 -223 246 128 -213 467 432 2 525 704 68 -63 686 538 100 317 29 -784 -117 256 -471 -333
3069 -333 31 -632 -879 -215 -246 -483 -234 -180 -625 -180 351 70 148 639 418 -191 524 891 173 639 623
3090 623 -301 -343 449 41 -229 242 -51 -830 -476 -125 -281 -430 -305 -616 -786 -81 -122 -187 314 465 -94
3111 -94 -303 539 441 333 1076 323 -422 -16 351 89 308 645 -246 -617 -284 -125 -436 -16 246 -324 -1026
3132 -1026 -146 -438 -402 482 435 -719 -121 366 243 544 780 271 102 404 101 206 348 597 -294 -221
3152 -221 -26 -229 -189 313 176 -473 -362 -473 -706 41 226 -35 -336 20 -131 -116 608 612 -265 22 295
3173 295 95 81 948 461 -38 49 -212 -475 61 398 -97 -394 -460 -416 -754 294 93 -272 -121 -168 -320
3194 -320 472 480 103 103 198 -148 -228 379 574 544 111 421 -360 -60 292 49 -215 -88 -540 -615 -448 -25 -86
3217 -86 -404 211 -423 -335 273 268 16 363 515 73 161 578 663 204 488 72 -237 282 243 -59 -143 44 -413
3240 -413 -447 -169 -97 -469 -349 -362 -668 -227 75 311 -124 309 165 9 322 339 119 372 631 134 -78
3261 -78 247 464 21 142 -54 -305 -469 -173 -375 -173 -260 -510 -213 -256 -219 -105 120 61 -38 -115 188 179 104
3284 104 348 635 234 127 630 184 264 228 213 -56 36 107 -296 -313 -164 -188 -521 -139 -619 -284 -495 7
3306 7 -150 -232 60 61 138 232 204 -39 474 386 219 299 381 275 30 135 13 95 -90 -132 -460 -279 -196 -559 -339
3331 -339 -98 -358 -446 -247 -438 18 69 16 -148 93 28 327 270 -26 469 265 458 330 200 267 313 195
3353 195 2 -177 -227 -437 -99 -240 -541 -591 -238 -141 -120 -272 -324 -121 -298 -8 130 106 445 228 76 294
3375 294 459 161 163 528 49 232 59 132 -11 -176 -360 -188 -393 -266 -582 -499 -384 -317 -230 -207 -191 -316 32
3398 32 18 197 -98 275 134 286 426 364 238 361 400 143 -105 -277 -171 -133 -230 1 -356 -259 -380 -241
3420 -241 -202 -124 -236 -73 -275 -244 72 248 399 35 34 -52 -157 -45 -19 100 231 30 90 -79 59 18 88
3443 88 -283 -155 -200 -99 -38 -398 -401 7 -64 -287 167 -204 -130 -56 17 171 314 350 304 174 121 215 -128 208
3467 208 267 76 -209 72 275 -317 -143 -116 -54 -397 -136 -264 -434 169 -42 154 136 81 84 246 448 322
3489 322 115 192 80 140 323 312 199 -43 -95 -494 -16 118 -559 -344 -305 -305 -456 67 124 -142 -138 112 -54
3512 -54 -153 245 315 228 68 431 86 316 112 233 54 0 69 -198 -248 -137 -235 -5 -168 -563 -391 -98 -214
3535 -214 -317 -299 122 -110 14 161 -54 -90 329 343 210 185 356 170 421 341 97 46 35 39 -261 -14 -117
3558 -117 -583 -599 -234 -365 -77 -367 -158 -241 -147 5 -77 152 227 -154 127 284 87 453 580 350 268 449
3580 449 188 230 -11 112 -270 -481 -115 -252 -140 -57 -162 -513 -405 -8 -322 86 26 -260 -194 -48 242
3601 242 168 367 792 334 -104 234 195 113 432 366 -147 69 -125 -368 -413 -17 -43 -487 -593 -400 -329 29
3623 29 46 -519 -219 -128 -219 -114 426 355 -40 172 241 14 338 435 292 -96 342 -10 -338 214 278 -271 -437
3646 -437 -99 -561 -328 196 -157 -223 -292 -324 -434 -177 341 255 198 240 113 116 427 503 443 284 12 -166 81
3669 81 180 421 -6 -121 -148 -170 -164 95 -20 -197 -124 -390 -103 240 270 76 151 213 -268 50 257 396 171
3692 171 155 231 -295 193 493 141 273 -25 -281 -351 -99 -38 -113 -30 -335 -118 -319 -83 -215 132 -35 -215
3714 -215 -412 -77 130 230 40 177 31 -35 262 303 226 263 -65 -22 27 -80 66 -124 -92 -48 -181 -182 -17
3737 -17 158 -55 143 -222 -162 -113 328 82 24 232 91 246 -21 41 347 -88 -56 -126 -26 258 58 -36 -74
3760 -74 -123 -260 -273 -237 -227 -196 -164 -49 -207 -200 -109 -97 275 -96 -55 238 270 45 315 166 -297 117 250 114
3784 114 144 160 123 -21 -136 -143 -289 -276 -99 -156 -158 45 4 67 336 124 -100 35 280 156 32 110 285 110
3808 110 105 172 46 130 16 -15 265 -104 101 -25 -232 18 -204 24 -364 -35 -241 -190 -398 -29 52 12 -217
3831 -217 105 131 277 152 226 87 275 229 -98 396 -42 120 28 166 47 -107 -96 -86 -149 -300 -221 -180 -140
3854 -140 -18 -180 4 -10 -68 -111 -21 169 137 23 219 111 378 466 178 162 148 -95 -56 58 48 -172 3
3877 3 -337 67 -91 -161 -330 -91 -329 -367 7 -209 78 57 -248 48 29 414 521 184 290 275 14 25 23
3900 23 -85 146 99 -120 -244 -69 -482 -238 -303 -320 -85 -321 -316 -128 -165 -239 -208 66 327 66 163 254 33 104
3924 104 156 185 -1 89 366 90 -11 134 37 -13 48 -152 -454 -335 -373 -151 -329 -74 -53 -114 -52 55 30 194
3948 194 165 236 293 202 29 243 197 62 125 206 401 177 -80 174 -222 -15 -138 -120 -73 -116 45 -216 195
3971 195 -33 -225 -85 -84 254 110 -38 142 -87 -42 26 -9 18 202 66 118 -292 -113 -46 62 23 -175 -69
3994 -69 82 -89 -255 84 -195 -32 -130 -163 -87 -170 -117 107 -89 196 347 64 118 105 95 120 34 -113 -17 175
4018 175 127 -211 16 -304 -202 -216 -36 -407 -51 -25 -198 76 207 52 -211 -2 9 233 163 211 172 -21
4040 -21 251 88 65 24 66 -121 89 -272 29 -161 -171 71 -199 -404 -36 123 -111 16 3 0 -57 114 69
4063 69 -166 359 230 157 -64 179 102 72 200 -271 -170 -141 6 -228 -56 187 8 -170 49 -218 -98 86
4085 86 121 -147 37 32 -59 24 299 -24 42 -23 243 299 189 19 -163 103 -75 -65 37 214 54 -26 66 -202
4109 -202 -161 -123 -27 37 -165 -58 -151 -36 152 58 168 206 -8 106 171 231 437 119 -98 -201 107 41 143
4132 143 108 15 -11 -433 -338 142 42 -96 -66 -64 -287 -24 -112 -8 158 -260 -260 -140 13 43 -67 -19 142 115
4156 115 -64 248 432 119 36 -79 -94 24 296 -100 -76 -72 -8 -92 -97 -299 -104 -35 69 -102 -123 -71 295 129
4180 129 43 34 26 383 4 382 65 49 14 66 176 93 -52 -202 -128 163 -29 -302 -276 -135 20 32 -269 -169
4204 -169 -104 181 -44 20 -131 136 -323 119 -6 27 274 -202 88 -97 57 -60 93 -156 -126 -180 -29 -50
4226 -50 -148 -30 107 -284 -105 -86 96 131 5 -28 19 -33 -38 224 123 -57 191 69 -82 421 121 -111 -155
4249 -155 -101 -93 -215 59 -114 -114 -192 -36 -301 -28 41 -116 -50 70 -196 -8 235 234 118 188 -7 -84 213 -270
4273 -270 155 169 -49 267 94 133 -150 -85 78 82 -157 -16 187 168 -71 79 42 -107 226 81 93 -69 -26
4296 -26 -22 -44 111 23 -207 -59 104 109 -14 -22 17 -90 21 24 30 -92 -75 189 -116 -85 26 -71 -7 -67 245 -34
4322 -34 118 155 54 -30 -149 60 51 -75 5 -36 84 77 -14 -8 -21 -151 -169 164 -337 81 -36 19 288 -222 29
4347 29 -176 203 252 -60 -29 158 49 -110 181 -8 -36 39 99 -23 -318 -2 -226 77 -259 -33 -31 -226 -95
4370 -95 -260 -55 -191 8 -47 -31 39 -174 -62 353 307 36 33 62 262 -50 116 0 -7 36 -24 63 75 -167 153
4395 153 -201 -76 -94 -183 42 -153 -331 -229 39 134 -66 -196 -81 -200 62 210 29 203 -47 89 215
4416 215 208 381 214 27 15 2 -3 12 -112 -207 -16 -126 99 118 -51 40 106 72 -22 144 189 -2 71 379 233
4441 233 -18 -115 17 69 -118 -53 267 -128 170 -51 164 -284 -11 142 59 108 23 -110 105 -124 -226 86
4463 86 -327 -13 22 -31 36 -53 82 -30 196 222 272 27 38 124 77 -69 17 131 98 169 116 14 -171 11 -215
4488 -215 -110 -5 104 59 -60 -37 5 73 88 158 203 115 229 -95 93 -101 91 -66 -99 171 -18 -73 175
4511 175 -143 52 -23 -24 -9 -105 -16 127 194 53 38 -74 -29 26 0 69 137 -32 -125 -118 138 94 17 -171 34 36 74
4538 74 -153 -17 -304 -16 48 167 -145 -116 107 7 11 134 96 200 -133 198 33 186 -45 12 -21 57 -67
4561 -67 109 93 156 -34 -32 -64 -158 125 -71 -79 -190 -64 -202 -16 -310 -32 -95 21 -36 63 -82 53 181 -134
4585 -134 185 38 -131 -130 144 -226 52 51 -9 46 -275 -103 -110 -55 5 -209 142 -7 46 -129 117 -167 -35 -17
4609 -17 181 116 -74 225 166 14 39 207 -49 37 115 17 -154 -155 -95 -310 -123 -15 -33 -177 -118 -73 -15 103 -41
4634 -41 69 -18 179 -9 -414 39 42 152 14 202 38 -111 38 -50 46 178 193 107 -382 231 -266 -138 -72
4657 -72 -243 -47 7 221 -217 -175 20 -168 23 -8 54 8 169 23 141 80 57 175 -116 -262 6 105 59
4680 59 -77 -53 -49 176 -86 -46 -107 -199 122 -83 -17 -275 117 14 -346 -27 -138 -235 -148 272 -82 75 121 -252
4704 -252 18 -30 151 63 81 11 120 147 -36 -255 -65 -138 76 -177 -203 -256 -159 -292 114 -50 -1 103 42 125
4728 125 -164 19 133 -140 144 -131 -51 -40 282 86 27 123 -103 184 145 -55 -31 -57 -24 -75 -229 -182 -175 -39
4752 -39 68 -73 -167 -26 -148 -39 80 185 81 44 -69 -95 -212 -228 70 -221 79 -107 181 19 -71 113
4774 113 136 96 60 109 36 264 24 3 83 178 112 228 136 240 -59 115 -151 -169 -213 16 -336 -81 153 -200
4798 -200 -38 -197 -93 59 -8 23 -42 213 -28 -234 -90 257 92 60 -64 -137 82 268 -52 -102 154 -132
4820 -132 -142 38 137 1 -38 9 -82 -89 -260 14 -173 112 170 88 45 -26 95 359 297 155 16 79 132 145 146 5
4846 5 -98 -26 152 69 -55 88 160 -137 -17 1 -232 -196 36 45 -204 21 97 -198 82 70 65 30 -71 -125 -220
4871 -220 140 136 -10 -215 96 206 147 -117 124 -43 251 -34 -277 27 -56 -113 -245 1 -292 -36 -28 -243
4893 -243 135 74 110 118 0 232 -167 103 163 -20 142 12 79 -32 -96 -105 44 -60 89 -157 173 -232 -228 -127
4917 -127 -190 -134 -354 0 -71 88 -68 397 197 -160 -170 79 3 7 58 -89 297 -79 154 -41 -198 60 -122
4940 -122 152 -92 -141 -47 337 -220 -56 -149 -14 -84 48 4 -153 -19 -36 -98 166 283 16 -3 161 178 -165
4963 -165 120 22 151 70 134 104 -90 -17 22 -125 52 -86 43 -113 249 -14 -47 47 -165 -69 99 3 1 -27
4987 -27 22 88 58 105 -162 -161 -226 28 41 -304 -2 148 -24 -154 -95 -154 127 -145 -76 -170 132 33 -129 113 -200
5012 -200 17 -206 -98 -75 -60 -153 -127 -13 55 31 -182 205 197 -67 -10 104 124 17 101 216 -135 -425 387 154
5036 154 138 -78 127 98 276 0 -59 -15 67 17 272 -106 21 148 262 288 -98 -53 299 -73 -174 90 49
5059 49 89 -181 -196 10 -186 -86 -258 -210 -51 29 58 17 151 180 41 37 132 21 104 -69 41 50 30 49 -152
5084 -152 262 -174 86 -95 -86 -90 91 -9 36 -102 -276 18 237 167 -68 -116 80 -153 154 39 48 151 -35
5107 -35 65 261 284 -99 -55 69 203 243 -22 -158 -38 80 -16 -424 -47 -25 206 211 -87 -64 48 -19 76 -45
5131 -45 -80 131 -36 -111 35 -18 40 294 33 52 46 -57 89 51 -102 118 32 -105 153 -5 -86 -161 -26 27
5155 27 -39 -22 148 13 40 -1 -161 51 -11 53 256 -170 -158 -105 -64 -71 -130 212 -193 -57 96 -46 -62 -40 -128
5180 -128 -43 -140 182 142 -234 -149 -58 14 -64 46 227 20 97 -110 36 80 -15 236 92 235 4 -14 11 39
5204 39 -123 3 -108 -190 -8 -165 -408 -121 -85 -6 -237 340 140 -237 123 -184 -142 -3 169 182 121 157 23
5227 23 -118 101 142 -31 123 -23 8 -152 -72 36 30 49 -210 140 19 -67 68 114 -44 -20 -67 -280 216 -91
5251 -91 80 -4 163 -6 105 -123 -26 165 244 -152 -38 54 -159 232 168 -90 1 -23 -31 20 109 119 -291 -8
5275 -8 -148 -91 -77 -72 -25 -286 -2 14 -109 3 186 -55 175 101 18 -81 -298 190 121 60 24 -10 105 -141 -95
5300 -95 -99 44 39 89 -213 92 47 -61 91 9 110 25 94 -49 159 -106 201 17 169 25 -16 -47 -135 73
5324 73 35 -84 168 -60 60 -75 -186 -18 237 -170 152 172 -205 16 241 94 -42 34 219 135 98 148
5346 148 -44 84 276 84 -29 -150 22 -47 -92 134 88 -139 -38 281 114 -53 -151 86 -49 11 294 238
5368 238 -209 -35 60 243 -2 65 -189 68 -66 46 192 190 -45 -24 70 -46 32 152 81 -264 261 -14 148
5391 148 85 -8 -58 173 143 241 -211 57 -144 78 149 -72 -72 -76 70 -56 -345 166 232 -94 -323 10 264 63
5415 63 92 24 113 166 -98 175 -53 -186 -209 49 251 159 3 138 8 -66 281 -167 190 214 -111 101 -179
5438 -179 134 -158 48 7 -22 143 187 -58 -1 -167 9 139 139 131 123 -46 101 81 70 -1 14 5 -166 -121 -4 -178
5464 -178 -131 -16 50 154 -153 63 -162 120 -54 -81 -43 3 77 -84 -103 188 41 -144 75 2 167 -104 154
5487 154 33 -65 -13 133 -16 -159 -58 70 16 11 -54 -184 111 -70 121 86 132 -43 -224 282 209 124 -9
5510 -9 48 -44 111 -183 175 -81 232 90 48 147 43 9 74 100 -49 146 -219 -103 -137 282 -90 12 -49 -279
5534 -279 209 200 -54 -110 -197 -13 -156 170 100 -225 -103 88 -33 -62 -132 -33 143 -27 127 -3 30 -207 -106
5557 -106 -181 314 -268 26 -120 -118 152 -46 54 37 170 43 120 -252 115 -242 -132 54 19 13 160 11 -72
5580 -72 -238 105 262 -108 18 -99 -5 31 283 256 -161 23 64 81 48 245 -12 312 -17 -51 -245 -41 44
5603 44 -90 115 40 292 65 -39 -184 -232 274 141 -8 13 -119 -156 41 -103 10 -194 179 159 -228 124
5625 124 -34 -174 -120 -48 -6 -34 -198 107 -206 -86 155 -266 -71 39 232 -53 -55 -22 -195 71 39 24 -214
5648 -214 -5 1 -35 139 144 27 -145 82 92 -67 -76 -31 -99 -91 87 115 -70 -158 25 7 96 -87 167 123 -59 -123
5674 -123 -26 -178 159 10 141 -154 -9 -38 228 10 -54 49 114 198 -116 2 -60 149 180 152 56 112 -48
5697 -48 -89 -98 8 56 23 77 19 -63 -23 -132 132 28 -103 217 -23 278 92 8 88 33 -121 122 36 94 -132
5722 -132 -68 8 48 32 -71 159 67 37 80 -345 9 -77 143 287 89 83 -77 73 37 121 95 152 -114 197 -16
5747 -16 125 -95 -51 -22 -181 -56 58 -9 -8 -77 -34 27 14 349 132 12 186 277 317 -112 20 -16 118 35 -126
5772 -126 144 8 -112 -32 -176 53 -4 83 -23 -101 -44 30 177 80 -66 -150 146 -69 30 102 273 -172 64
5795 64 77 -127 35 -38 79 43 -16 -41 199 -73 138 -52 -6 158 285 38 115 8 70 10 79 367 -40 34
5819 34 37 -106 -30 72 -29 -35 4 -15 -106 -93 -33 73 -230 241 -263 54 172 189 198 232 6 -96 12 -112 -34
5844 -34 287 -114 246 2 -63 -51 113 -41 251 47 124 -161 -22 51 -150 -93 32 31 -40 -55 145 60 -3 33
5868 33 149 115 158 256 -13 3 -55 -109 -218 -142 -88 0 249 -4 -85 42 53 -126 73 62 -15 -94 -77 26 32 59
5894 59 208 351 63 -54 -62 76 109 82 203 -30 27 73 95 205 -100 8 105 312 68 -57 28 15 143 147
5918 147 -69 -43 -138 82 -34 -128 -153 -75 57 7 58 -26 -156 -83 -9 -5 63 96 -167 208 107 66 99 -11 122
5943 122 -60 -266 -193 -168 196 51 56 61 62 -128 258 -167 194 -1 -194 42 -82 -142 47 43 -127 -59 157 60
5967 60 132 55 9 -62 -55 -127 235 -101 -74 -55 142 -92 42 53 -24 -147 -264 -1 -169 168 -20 54 -117 -180 -118
5992 -118 120 -78 -6 101 -40 150 95 -264 -11 176 -156 -33 -132 -260 241 307 186 96 14 -91 114 -26
6014 -26 138 -206 -16 273 189 -109 101 130 -77 42 72 -76 -88 -60 88 94 168 46 130 -129 -161 14 116 150
6038 150 -112 -363 -32 -22 -67 -71 134 187 -35 -146 -100 19 37 -126 -26 186 17 51 -196 4 -2 -122 128
6061 128 259 72 -115 122 -7 -57 -118 259 39 -131 -23 158 10 2 -200 -115 5 -142 -31 -194 38 188
6083 188 101 -23 -215 355 -211 70 220 168 74 -104 -15 11 -19 -171 -189 74 -71 22 2 -174 18 -216 118
6106 118 90 84 96 -68 95 121 248 86 -51 -183 -162 -10 -283 230 -107 -255 -247 327 -132 135 66 -5 12 -176
6130 -176 65 -74 104 -194 -365 24 137 -97 143 112 -57 -13 -292 -110 69 77 -93 24 -143 -68 152 -60
6152 -60 -33 -164 -61 -82 116 -29 -66 152 203 -49 154 -109 -52 182 -23 125 34 28 68 45 226 -149 82 5
6176 5 145 -41 -117 -125 239 36 -145 -137 -89 25 136 24 18 -59 -98 157 95 -118 269 -52 190 92 -34 -61 95
6201 95 47 -27 204 -128 142 17 -14 168 -62 62 -137 73 -34 109 -1 -162 -74 -85 136 -97 -114 -33 33
6224 33 -458 182 -207 -66 -159 -14 -69 168 96 68 134 -27 34 -46 32 -48 59 114 -34 99 -1 -59 74 16
6248 16 48 88 128 -46 194 -83 58 -22 -152 111 -114 187 -132 74 -30 -11 -31 -239 -106 -75 -30 -49 113
6271 113 -139 -247 139 76 122 31 -272 -305 22 -11 -123 -239 91 10 -96 134 63 24 194 165 -196 88 121
6294 121 -103 153 8 60 24 39 -49 -28 -40 -7 96 -420 88 -398 28 -173 -13 39 72 83 135 -192 -74 -115
6318 -115 -137 37 117 245 238 -74 118 -168 -269 -26 206 -48 -192 -45 155 -18 -239 61 93 -3 182 -103
6340 -103 -31 150 207 -332 24 148 -182 59 -106 147 157 -94 272 -201 -55 279 -11 -111 -88 75 128 69
6362 69 -23 44 143 -106 99 44 47 -106 -188 -56 187 -96 183 140 23 120 -51 211 127 -63 -1 397 90 -147
6386 -147 -182 -184 -70 -23 -154 -224 -42 -246 56 5 -133 40 -69 124 -171 12 -125 -179 99 154 -23 -192 38
6409 38 84 103 160 78 -109 61 -84 96 -93 -18 -47 202 -41 209 -213 -232 -235 -82 122 112 -176 212 151 78
6433 78 -242 97 -230 123 -242 -135 -6 144 73 26 19 13 23 -1 291 -146 53 -57 -93 -166 35 -135 -47 8
6457 8 82 74 -103 -144 -95 -203 277 142 63 -220 49 41 123 94 102 -82 -23 45 60 130 40 226 -152 59 -283 -141
6483 -141 -38 178 -58 238 5 -36 142 -99 -162 55 113 -152 57 2 -123 19 -46 -94 -12 -256 26 -79
6505 -79 39 276 45 44 -98 49 -104 186 202 -41 -122 -83 194 -123 115 106 132 -65 -35 23 -271 -272 129 26
6529 26 26 25 125 -75 141 -67 -106 120 43 -61 -129 -136 -38 84 52 -152 -15 -114 -67 53 -35 2 12 111 -83 140
6555 140 32 166 204 3 17 -213 155 100 47 11 -15 -37 35 -266 37 -183 -166 -113 0 125 -52 172 -68
6578 -68 36 66 -90 -54 25 27 -179 233 -30 164 51 183 172 206 39 -355 -3 -52 -45 -23 108 -221 133 11
6602 11 -252 208 182 33 2 -184 7 -20 -103 -37 90 9 -50 22 -81 -123 318 210 84 -45 -167 127 16
6625 16 73 -147 -403 2 128 31 -159 -200 -7 77 165 11 -81 -251 12 102 163 -211 8 -266 -54 -35 -164
6648 -164 38 93 154 -54 -113 5 -107 44 148 -41 -15 -50 85 224 186 -186 265 -83 33 53 -29 -215 -88
6671 -88 1 126 -293 -54 -106 156 84 -120 63 -125 -162 -125 16 21 288 344 -75 -48 -172 -264 -58 -284 5 -54
6695 -54 -188 78 -65 -20 -11 59 -2 12 -17 239 -40 63 49 40 -43 163 -259 -8 -19 148 52 128 -137 384 97
6720 97 192 225 -139 -257 -57 68 -263 -17 -148 -89 -268 46 -300 72 245 -18 -48 -31 78 108 -9 328
6742 328 59 -193 50 169 196 43 156 25 25 2 -185 84 169 -103 -208 82 -7 43 -174 84 -164 -40
6764 -40 85 107 -126 -68 52 -5 -157 -54 -168 -82 -177 -4 151 -176 221 -298 -130 161 -173 -229 -278 -89 -239
6787 -239 -88 548 -50 1 45 -141 -87 -70 24 -54 93 5 40 -89 106 -65 -49 44 74 260 110 123 -2 -226
6811 -226 -20 211 -84 100 58 47 155 15 210 83 -296 19 -223 41 -92 18 243 -354 -33 -224 -185
6832 -185 -84 32 174 -76 -82 86 176 159 65 -7 -12 -319 -92 56 87 -29 33 -11 201 -76 -172 335 133 92
6856 92 -85 -190 253 -28 -185 -102 -178 -27 -183 159 -70 175 -38 65 42 79 125 154 5 -94 75 -113 189
6879 189 37 200 17 -197 122 -18 63 59 273 -14 -79 9 -269 -5 -53 -15 -151 -73 -38 158 -76 293 -78
6902 -78 104 69 112 -10 -104 42 168 56 -70 236 -131 255 -258 -16 -293 12 28 -33 -169 -169 -3 -99 -75
6925 -75 -98 9 137 -135 -149 173 70 -57 52 -56 -222 -24 178 12 82 -83 119 31 42 -125 -313 -215
6947 -215 -218 169 64 -147 142 66 276 17 -319 -117 -25 -233 181 181 -187 12 -189 -126 108 -256 36 187
6969 187 -146 -129 117 16 17 -7 -100 163 19 158 87 141 -46 -118 175 21 298 -96 -280 -50 94 21 -112
6992 -112 -2 139 41 -289 -4 -4 -123 -43 -86 -300 284 -274 -75 -1 213 16 -87 32 20 60 91 79 107 -246
7016 -246 100 110 -76 -16 7 45 -158 20 -22 -240 -119 190 -191 -79 5 -41 82 -120 -3 7 16 5 -165 5
7040 5 66 -81 59 362 -117 228 -114 -122 -144 231 -77 -47 -88 24 -79 96 -14 -214 16 9 197 -297 -12
7063 -12 -16 -80 28 163 -21 227 123 -49 -1 39 133 189 -64 -9 12 8 -242 121 178 125 81 -344 257 52 -130
7088 -130 49 -177 111 -188 -69 -69 -222 -198 -98 -66 -114 245 -129 33 100 -48 -284 236 -90 -45 -275 67
7110 67 24 20 184 -250 186 175 6 -32 -153 -178 -61 -7 -5 -83 100 198 -83 53 -26 -101 72 274 -16 -90 93
7135 93 -206 175 206 276 174 -188 -39 -174 39 242 -86 -8 214 89 246 -19 212 -42 -202 -16 65 104
7157 104 55 13 170 7 99 15 -92 0 92 141 -177 -133 73 128 83 -22 48 32 -9 86 159 284 162 127 245
7182 245 -123 -222 -257 30 -47 -79 120 110 -24 98 -153 -44 -38 255 -40 -187 290 -95 -47 -71 12 89 110 24
7206 24 99 -24 55 -236 26 12 53 -371 81 -136 116 222 92 66 81 80 22 -16 114 76 -152 135 -75 27
7230 27 -105 -120 -68 -267 -34 -170 55 28 -18 -34 106 -25 -100 91 65 -54 -13 -223 -79 33 131 136 88 28 151
7255 151 -179 39 6 74 -161 96 106 -297 -140 -172 -12 131 -107 419 345 -2 279 -21 -156 -133 58 6
7277 6 -97 -98 179 47 66 158 -238 46 103 -44 -165 69 -72 50 -106 -359 89 90 74 44 51 132 96 -241 84
7302 84 51 142 7 -133 -74 -50 71 111 -66 -22 -100 29 304 126 -6 -18 5 181 -260 -19 -351 -142 105
7325 105 -91 -118 -97 -59 -110 220 -93 -76 23 -21 173 110 45 -1 -209 90 73 -73 -71 -110 -245 -1 110 -21 -347
7350 -347 84 -70 -142 70 -21 53 -50 127 75 -124 184 -41 -60 3 -39 -194 -45 -127 140 -19 183 -8 184
7373 184 -162 -206 -125 27 -173 -32 122 40 102 -120 -35 95 -15 171 -187 -25 25 -4 -39 81 25 152 178
7396 178 265 219 200 -83 -137 -15 25 16 37 169 32 97 -110 172 -31 -38 -279 94 103 -97 -10 95 242 -37 62
7421 62 -149 -54 20 143 74 29 108 160 71 175 283 -92 305 86 47 35 -19 -88 -154 53 46 212 -87 123 2
7446 2 127 86 319 -223 -123 21 -23 32 -222 -64 -266 -107 -178 139 -5 -13 -13 202 267 -64 -5 128 -72 127
7470 127 56 -150 51 -33 -59 61 -76 132 72 -186 -86 -129 -137 -38 -166 -90 52 101 100 197 -36 -93 -61 84 161
7495 161 -110 -29 177 37 66 147 293 72 60 77 -24 322 8 110 -275 106 30 -104 8 12 80 106 27 -253
7519 -253 173 53 230 119 44 142 -15 34 133 110 169 353 -186 84 51 -171 145 178 -101 6 36 64 -35 176
7543 176 -165 183 -46 44 24 68 -101 14 88 177 108 144 147 -14 246 -100 200 -38 -183 -34 213 -27 81
7566 81 103 -52 0 -57 235 30 -53 99 -9 43 150 53 -193 10 -211 -76 150 121 -36 187 153 -40 -221
7589 -221 -118 -60 -85 107 -69 199 -334 18 -24 -221 -27 -159 -12 -20 227 -99 15 -99 -95 -87 -83 60 -280 157
7613 157 -31 -172 160 25 227 45 -120 56 -134 -80 -24 -28 11 174 173 103 -128 -19 58 103 144 56 -170 -153
7637 -153 -161 21 21 -204 -350 24 -264 148 -40 -81 52 -30 -18 229 92 163 366 -57 74 -405 -63 106 -6
7660 -6 0 2 132 -23 226 -174 -58 83 180 -293 -57 -236 -256 106 210 -137 64 -63 11 5 -94 -98 164 -199 3
7685 3 -106 -141 -98 146 -105 -209 -31 62 -35 222 193 16 92 244 -29 -16 -84 1 -19 -312 19 132 173 -48
7709 -48 -69 114 188 -127 64 -85 -8 60 190 89 168 136 -117 65 -52 167 -92 139 -56 -235 129 -58
7731 -58 1 17 91 -138 -16 -75 283 256 112 -88 -8 216 -86 79 -68 -107 4 -26 56 -123 -28 18 -27 -100 -199
7756 -199 -62 -164 -171 -94 61 -64 -258 24 -94 -242 -32 10 -134 152 -8 326 71 140 -32 -104 7 3 -29
7779 -29 31 -60 -204 19 -138 19 -25 -43 -231 149 -55 -239 81 -30 9 32 84 -67 -186 -148 -251 -147 -46
7802 -46 102 -60 -4 8 93 120 -26 -390 -15 78 42 -62 104 -117 87 23 -109 13 401 164 -21 2 45
7825 45 -57 40 203 -197 -54 19 -120 19 -90 -121 195 64 -79 -28 -150 -193 -22 -15 47 -64 397 -58 115
7848 115 -40 -145 -14 -116 -58 -104 307 -157 -93 40 -115 82 -20 50 -101 -14 -3 -84 113 13 -162 200
7870 200 205 72 -25 -180 96 -26 -25 253 171 -46 69 15 -166 -26 -181 144 262 -50 91 -4 -194 100 75
7893 75 -275 161 104 -51 -15 35 140 -8 84 125 118 47 34 121 -143 -112 139 -225 -36 -28 -5 130 -235 25 15
7918 15 99 127 -206 202 13 230 132 156 65 122 68 -109 121 -335 -15 23 -155 -110 50 84 203 -35 -306 -14
7942 -14 124 -108 -136 -204 330 10 -29 65 164 123 61 -49 94 95 -95 18 -84 -210 13 47 -124 -114 7 -47
7966 -47 -285 -25 -165 94 -221 -56 175 -9 -15 -145 -167 -79 195 62 118 51 94 46 -108 -70 -8 -79 -8 46 -38
7991 -38 226 -18 -125 -4 -79 -22 15 -85 -38 216 -86 -126 -23 -34 301 128 230 31 259 58 346 100
8013 100 -108 -116 30 197 44 56 -338 -239 -34 -27 84 47 14 77 39 96 130 209 -13 -194 -50 193 201 -100 299
8038 299 104 -82 -242 -168 67 63 76 89 -105 -143 17 -178 9 23 153 267 4 -297 -80 -18 10 -271 -5
8061 -5 -50 -179 -160 178 128 13 -242 -59 160 179 14 -161 -46 175 31 202 -5 104 57 -42 -19 -100 -5 -96
8085 -96 -37 51 -115 279 107 -108 123 -71 129 -104 266 -70 -23 -56 217 239 -98 -79 258 -101 -129 86 190
8108 190 40 78 176 51 -262 -181 310 145 358 44 -190 8 173 93 -245 51 216 133 68 123 -67 10 58
8131 58 -39 43 -219 -56 57 104 78 53 88 107 -112 -87 -135 -75 154 -156 208 115 -271 7 108 -10 145 -135
8155 -135 55 304 -22 78 136 -105 6 136 -192 -249 -11 56 84 183 -48 -31 -140 283 -116 -213 111 101 336
8178 336 -167 28 7 68 120 151 66 12 -245 -48 112 -10 -144
8191a44
##END NTUPLES=NMR FID
##END=
