##TITLE=1H_LR-748-CR3-15K
 CDCl3
 8 sc, 
 4.05.2022
##JCAMPDX= 6.0         $$ Bruker NMR JCAMP-DX V2.0
##DATA TYPE= NMR FID
##DATA CLASS= NTUPLES
##ORIGIN= UXNMR, Bruker Analytische Messtechnik GmbH
##OWNER= root
$$ XWIN-NMR		Version 3.5
$$ Wed May  4 10:41:02 2022 Russian Standard Time (UT+4h)  she@DPX200
##.OBSERVE FREQUENCY= 200.13135
##.OBSERVE NUCLEUS= ^1H
##.DELAY= (6, 6)
##.ACQUISITION MODE= SIMULTANEOUS
##.ACQUISITION SCHEME= undefined
##.AVERAGES= 8
##.DIGITISER RES= 18
##SPECTROMETER/DATA SYSTEM= spect
##.PULSE SEQUENCE= zg30
##.SOLVENT NAME= CDCl3
##.SHIFT REFERENCE= (INTERNAL, CDCl3, 0, 15.7039)
##AUDIT TRAIL= $$ (NUMBER, WHEN, WHO, WHERE, WHAT)
$$ ##TITLE= Audit trail, XWIN-NMR		Version 3.5
$$ ##JCAMPDX= 5.01
$$ ##ORIGIN= Bruker BioSpin GmbH
$$ ##OWNER= she
$$ F:/spectra/data/she/nmr/H-F/1/audita.txt
$$ ##AUDIT TRAIL=  $$ (NUMBER, WHEN, WHO, WHERE, WHAT)
(   1,<2022-05-04 10:39:45.96 +0400>,<she>,<DPX200>,
      <created by zg, POWCHK disabled, PULCHK disabled
       configuration hash MD5:
       00 E9 B6 7A A2 85 ED C7 34 08 36 98 17 FE 4E 26
       data hash MD5: 16K
       CE AE AF B0 0F 8A B9 53 7D A5 92 51 2C 25 E8 45>)
$$ ##END=
$$ 
$$ hash MD5
$$ 50 DF 1F 4D 8C FD 13 05 85 A3 1E 8F 08 CC C8 D8
##$RELAX= 
##$RELAX= 
##$RELAX= 
##$RELAX= 
##$RELAX= 
##$RELAX= 
$$ Bruker specific parameters
$$ --------------------------
##$DU= <F:/spectra>
##$EXPNO= 1
##$NAME= <H-F>
##$PROCNO= 1
##$TYPE= <nmr>
##$USER= <she>
##$AMP= (0..31)
100 100 100 100 100 100 100 100 100 100 100 100 100 100 100 100 100 100 
100 100 100 100 100 100 100 100 100 100 100 100 100 100 
##$AQSEQ= 0
##$AQ_mod= 1
##$AUNM= <au_zg>
##$AUTOPOS= <>
##$BF1= 200.13
##$BF2= 200.13
##$BF3= 200.13
##$BF4= 200.13
##$BF5= 200.13
##$BF6= 200.13
##$BF7= 200.13
##$BF8= 200.13
##$BYTORDA= 1
##$CFDGTYP= 0
##$CFRGTYP= 5
##$CHEMSTR= <none>
##$CNST= (0..31)
1 1 145 1 1 1 1 1 1 1 1 1 1 1 1 1 1 1 1 1 1 1 1 1 1 1 1 1 1 1 1 1 
##$CPDPRG= <>
##$CPDPRG1= <>
##$CPDPRG2= <>
##$CPDPRG3= <>
##$CPDPRG4= <mlev>
##$CPDPRG5= <mlev>
##$CPDPRG6= <mlev>
##$CPDPRG7= <mlev>
##$CPDPRG8= <mlev>
##$CPDPRGB= <>
##$CPDPRGT= <>
##$D= (0..31)
0 1.2 0 0 0 0 0 0 0 0.06 0 0.03 0 0 0 0 0.0002 0 0 0 0 0 0 0 0 0 0 0 0 
0 0 0 
##$DATE= 1651646385
##$DBL= (0..7)
120 120 120 120 120 120 120 120 
##$DBP= (0..7)
150 150 150 150 150 150 150 150 
##$DBP07= 0
##$DBPNAM0= <>
##$DBPNAM1= <>
##$DBPNAM2= <>
##$DBPNAM3= <>
##$DBPNAM4= <>
##$DBPNAM5= <>
##$DBPNAM6= <>
##$DBPNAM7= <>
##$DBPOAL= (0..7)
0.5 0.5 0.5 0.5 0.5 0.5 0.5 0.5 
##$DBPOFFS= (0..7)
0 0 0 0 0 0 0 0 
##$DE= 6
##$DECBNUC= <off>
##$DECIM= 32
##$DECNUC= <off>
##$DECSTAT= 4
##$DIGMOD= 1
##$DIGTYP= 9
##$DL= (0..7)
0 120 120 120 120 120 120 120 
##$DP= (0..7)
150 150 150 150 150 150 150 150 
##$DP07= 0
##$DPNAME0= <>
##$DPNAME1= <>
##$DPNAME2= <>
##$DPNAME3= <>
##$DPNAME4= <>
##$DPNAME5= <>
##$DPNAME6= <>
##$DPNAME7= <>
##$DPOAL= (0..7)
0.5 0.5 0.5 0.5 0.5 0.5 0.5 0.5 
##$DPOFFS= (0..7)
0 0 0 0 0 0 0 0 
##$DQDMODE= 0
##$DR= 18
##$DS= 0
##$DSLIST= <SSSSSSSSSSSSSSS>
$$ [...]
##$SUBNAM2= <"">
##$SUBNAM3= <"">
##$SUBNAM4= <"">
##$SUBNAM5= <"">
##$SUBNAM6= <"">
##$SUBNAM7= <"">
##$SUBNAM8= <"">
##$SUBNAM9= <"">
##$SW= 18.05172834244
##$SWIBOX= (0..15)
0 0 2 0 0 0 0 0 0 0 0 0 0 0 0 0 
##$SW_h= 3612.71676300578
##$TD= 16384
##$TD0= 1
##$TE= 0
##$TE2= 300
##$TE3= 300
##$TEG= 300
##$TL= (0..7)
0 120 120 120 120 120 120 120 
##$TP= (0..7)
150 150 150 150 150 150 150 150 
##$TP07= 0
##$TPNAME0= <>
##$TPNAME1= <>
##$TPNAME2= <>
##$TPNAME3= <>
##$TPNAME4= <>
##$TPNAME5= <>
##$TPNAME6= <>
##$TPNAME7= <>
##$TPOAL= (0..7)
0.5 0.5 0.5 0.5 0.5 0.5 0.5 0.5 
##$TPOFFS= (0..7)
0 0 0 0 0 0 0 0 
##$TUNHIN= 0
##$TUNHOUT= 0
##$TUNXOUT= 0
##$USERA1= <user>
##$USERA2= <user>
##$USERA3= <user>
##$USERA4= <user>
##$USERA5= <user>
##$V9= 5
##$VALIST= <valist>
##$VCLIST= <CCCCCCCCCCCCCCC>
##$VD= 0
##$VDLIST= <DDDDDDDDDDDDDDD>
##$VPLIST= <PPPPPPPPPPPPPPP>
##$VTLIST= <TTTTTTTTTTTTTTT>
##$WBST= 1024
##$WBSW= 4
##$XGAIN= (0..3)
0 0 0 0 
##$XL= 0
##$YL= 0
##$YMAX_a= 260398
##$YMIN_a= -241347
##$ZGOPTNS= <>
##$ZL1= 120
##$ZL2= 120
##$ZL3= 120
##$ZL4= 120
##$ABSF1= 10
##$ABSF2= 0
##$ABSG= 5
##$ABSL= 3
##$ALPHA= 0
##$AQORDER= 0
##$ASSFAC= 0
##$ASSFACI= 0
##$ASSFACX= 0
##$ASSWID= 0
##$AUNMP= <proc_1d>
##$AZFE= 0.1
##$AZFW= 0.1
##$BCFW= 1
##$BC_mod= 2
##$BYTORDP= 1
##$COROFFS= 0
##$CY= 11.3945322036743
##$DATMOD= 1
##$DC= 2
##$DFILT= <>
##$DTYPP= 0
##$F1P= 2.36226072786647
##$F2P= -0.459571619588291
##$FCOR= 0.5
##$FTSIZE= 0
##$FT_mod= 4
##$GAMMA= 1
##$GB= 0.15
##$INTBC= 1
##$INTSCL= 1
##$ISEN= 128
##$LB= 0.24
##$LEV0= 0
##$LPBIN= 0
##$MAXI= 10000
##$MC2= 0
##$MEAN= 0
##$ME_mod= 0
##$MI= 1.114404
##$NCOEF= 0
##$NC_proc= 0
##$NLEV= 6
##$NOISF1= 3.799351
##$NOISF2= 2.8
##$NSP= 1
##$NTH_PI= 0
##$NZP= 0
##$OFFSET= 15.70392
##$PC= 1
##$PHC0= -18387.5
##$PHC1= 6.000749
##$PH_mod= 1
##$PKNL= yes
##$PPARMOD= 0
##$PSCAL= 0
##$PSIGN= 0
##$REVERSE= no
##$SF= 200.130013532006
##$SI= 16384
##$SIGF1= 3
##$SIGF2= 2
##$SINO= 400
##$SIOLD= 16384
##$SREGLST= <1H.CDCl3>
##$SSB= 0
##$STSI= 0
##$STSR= 0
##$SW_p= 3612.71676300578
##$SYMM= 0
##$S_DEV= 0
##$TDeff= 0
##$TDoff= 0
##$TI= <>
##$TILT= no
##$TM1= 0
##$TM2= 0
##$TOPLEV= 0
##$USERP1= <user>
##$USERP2= <user>
##$USERP3= <user>
##$USERP4= <user>
##$USERP5= <user>
##$WDW= 1
##$XDIM= 8192
##$YMAX_p= 0
##$YMIN_p= 0
$$ End of Bruker specific parameters
$$ ---------------------------------
##NTUPLES= NMR FID
##VAR_NAME=  TIME,          FID/REAL,        FID/IMAG
##SYMBOL=    X,             R,               I
##VAR_TYPE=  INDEPENDENT,   DEPENDENT,       DEPENDENT
##VAR_FORM=  AFFN,          ASDF,            ASDF
##VAR_DIM=   8192,          8192,            8192
##UNITS=     SECONDS,       ARBITRARY UNITS, ARBITRARY UNITS
##FACTOR=    0.0002768,     1,               1
##FIRST=     0,             0,               0
##LAST=      2.2672688,     0,               0
##MIN=       0,             -241347,         0
##MAX=       2.2672688,     260398,          0
$$ Real data points
##PAGE= N=1
##DATA TABLE= (X++(R..R)), XYDATA
$$ [...]
2081c43n12k44m1R29N48M13j01n66j287j094p18k61k62J013J374R90J272J384
2099B494q4k56m90j187o02k21J87Q39R18R46L33k82r22j577j892q92m30m41Q79
2118b680J321R50Q36K54mq23q74l95o28O04J158J457J138R87O73o85p75j571j210
2137b67j348K0K3O24J190O88l0l96q22j355j439k37j33N71J681J717J333P48L58
2156B926n10j067q88q11l29J11J081J209M87P83p18j353j056j685j330p3Q9O47
2174b487R55J625O68N5O0o56o91q44L41J68O66J500J375N82L17n72j043j328j286
2193e95r62p41M65P04O83N75n3k00q75m60r75k99N1J050Q04J262J584N85K54l41
2213B516n18r35o19n18J05M97N50K82j11j21p88j222j117o84l41o3N6J239Q16
$$ plain form
2081 -343 -855 -1099 -1140 -211 337 750 649 83 -1204 -2298 -3016 -3277 -3539 -2526 -1152 -162 1110 2494
2099 2494 2410 2154 1664 477 -125 -346 -159 680 1598 2544 2877 2595 1673 96 -1796 -2688 -3118 -3559 -2680
2118 -2680 -1359 -409 427 681 677 -146 -1020 -1415 -2043 -1439 -281 1176 2314 3301 3974 3289 2514 943 -267
2137 -267 -1615 -1595 -1572 -948 242 930 900 504 -318 -1673 -3112 -3349 -3482 -2911 -1230 487 1820 2568 2926
2156 2926 2416 1349 461 -350 -679 -568 513 1722 2209 2992 2274 921 -135 -1820 -3150 -3223 -3134 -2487
2174 -2487 -1532 93 761 816 876 220 -471 -1315 -974 -806 -140 1360 2735 3317 3634 3062 2019 691 -595
2193 -595 -1557 -2298 -1833 -1129 -446 129 76 -124 -999 -1459 -2434 -2733 -2682 -1632 -828 434 2018 2603 2857 2516
2213 2516 1998 1063 444 -74 31 528 1078 1360 1249 1128 340 -882 -1999 -2683 -3024 -3087 -3031 -1792 -976
2232i76J049O90J56K6l63m98k61M94K66P74Q90M42L52j56o58j173j152q85q52
2251a835l63K1M43P33K79M53j87m56o76m31j91Q67M89J065R20J295N84P2j07p38
2271B237j043q43r5m30M2O75J16K67j97o68j136j050q77m68L1Q10R83J310P32
2290C96J060L73q98K27r09k61K46M60O66R12L82N45n85r56j336j464r62m46k15
2309b765L91P71Q05P88n1j41o89n53n13P4R50O02J388Q55J115K88k08r75p40j217
2329A75q57k42L84M49N61L50n6o75j195r70o92n21k5R32J323J242J123N40K24
2348B070m75o27n57l07P0N5Q94O54K97N79p12q46j318j377q10m34K52N28P41J055
2368b68N57j74j70n10o61j29L70N22P18J157Q78R27l09k22p70j268r66m06o12
$$ plain form
2232 -976 73 763 919 945 582 84 -177 317 583 1357 2247 2689 3041 2885 2227 1054 -98 -983 -1835
2251 -1835 -2198 -2177 -1734 -1001 -722 -269 -456 -912 -1588 -2019 -2210 -1343 -854 211 1131 2426 3010 3082 2975 2237
2271 2237 1194 351 256 -174 -132 543 659 926 729 61 -1075 -2125 -3002 -3470 -3439 -2629 -1646 -336 396
2290 396 1456 1829 931 1158 249 -12 234 694 1360 2272 2654 3199 2614 1658 322 -1142 -2104 -2550 -2765
2309 -2765 -2374 -1603 -798 -10 -61 -202 -891 -1444 -1957 -1883 -933 -331 1057 1912 3027 3315 3107 2132 1392 175
2329 175 -682 -924 -540 -91 470 820 764 89 -1106 -2076 -2768 -3289 -3314 -2382 -1059 183 1306 1846 2070
2348 2070 1595 968 411 104 174 229 1123 1777 2074 2653 1941 1095 -223 -1600 -2410 -2844 -2592 -2064 -1323 -268
2368 -268 289 115 -55 -565 -1226 -1355 -985 -463 255 1412 2290 3217 2908 2686 1916 648 -318 -724 -1336
2387a336L07M74L03M47j15n14m82p75o45m68L68N15J103J172Q28N31K19J51n58
2406A525n35l38q1K00R0N13O0n6k86q69p58p25q82n87k63N48M57P51R77J97K64
2427B02J05l19k59k38N91L96J016M08M71M50j67o11o78j032o04p09o06K53M07
2446i24L16J18K1l43n83j53o69N0J94P89R76Q11Q97R42P7k03n71m89o97k70k9
2467B60M17J32L79n6n32o90j140k80j072m58L69N60M65R66P56O79n2J48q29k10
2487a88j62M33N79O09J069P73o13k59n67j271j011q27j16l34L43N35K66M65q8
2506c64m68k99p14J96j76P96P80J257O91Q16J86l44q99o52q03l88L20J80L48K75
2526G38J74l32o33m96j108q78j60l2O55J109O90P51P02m9k85n48k15k82J22O71
$$ plain form
2387 -1336 -1029 -555 -252 195 80 -434 -916 -1691 -2336 -2804 -2436 -1921 -818 354 1182 1713 1932 2083 1525
2406 1525 990 652 571 771 861 1374 1434 1378 1092 223 -535 -1260 -2142 -2729 -2992 -2444 -1987 -1236 -259 -62 202
2427 202 307 -12 -271 -509 82 478 1494 1902 2373 2823 2656 2045 1367 335 -269 -978 -1584 -1331 -924
2446 -924 -608 -490 -469 -812 -1395 -1548 -2217 -2167 -1973 -1184 -208 603 1500 2442 2519 2316 1745 1256 559 289 260
2467 260 677 809 1188 1132 600 -90 -1230 -1510 -2582 -3040 -2671 -2111 -1646 -680 76 755 703 851 22 -188
2487 -188 -350 83 662 1271 2340 3113 2500 2241 1674 403 -608 -1435 -1551 -1885 -1542 -1007 -741 -276 -364
2506 -364 -832 -1131 -1845 -1649 -1825 -1029 -249 1008 1699 2515 2701 2357 1458 806 3 -385 -65 115 463 738
2526 738 912 580 -53 -549 -1657 -2535 -2695 -2727 -2072 -963 -273 478 1180 1131 846 298 83 -199 -77 594
2546E94O98N70K25J54o00o82p04j377q08j58J78K49Q10O20L22j72j70o34k14j12
2566a211pP22Q15R43O42M57N9j83j005n22m63n58k33L89j7QN57m06n51m12p58
2587a734m44l9L2P07O74R39J001j67K32J91n15j02k95J69J51L47L67J18p9j22
2607A431r24p99o88p39l67Q2K33M14L80L44M00p8J99l34j01jO28M24N86P57K36
2628B083Q5L28p30n63o07p14o30k7j31M11%K64j41m58m67o08K90n94O61N55N80
2649d13P36R92M60l6m9k68o54pj84k38L79N50O5m39j44n92m90r67p40j13j92P36
2671a608L87P18N67L44o2k31l49o2J20J60M67P43O39M77l04j26o06q01r16o55
2691a098n6j80M94L87N17j77j86l79k51n69j41K21M67Q09O01Q46O17j03l13m17
$$ plain form
2546 594 1292 1862 2087 2241 1641 959 255 -1122 -1930 -2088 -1910 -1661 -851 -231 91 -81 -251 -885 -1099 -1211
2566 -1211 -1218 -496 319 1262 1904 2361 2420 2237 1232 710 247 -311 -544 -155 -172 -164 393 -13 -564 -976 -1734
2587 -1734 -2178 -2217 -2185 -1478 -804 135 1136 969 1201 1392 877 775 480 649 800 1147 1514 1632 1553 1431
2607 1431 507 -292 -980 -1719 -2086 -2004 -1771 -1357 -977 -633 -233 -311 -112 -446 -547 -548 80 504 1090 1847 2083
2628 2083 2168 2496 1766 1203 596 -118 -748 -775 -906 -495 -495 -231 -372 -830 -1297 -1905 -1615 -2209 -1548 -993 -413
2649 -413 323 1315 1775 1739 1690 1422 768 761 577 339 718 1268 1333 894 750 158 -332 -1299 -2039 -2152 -2344 -1608
2671 -1608 -1221 -503 64 408 346 115 -234 -296 -176 -16 451 1194 1833 2310 2006 1880 1274 473 -443 -1098
2691 -1098 -1154 -1334 -840 -453 64 -113 -299 -678 -929 -1498 -1639 -1418 -951 -142 459 1305 1922 1819 1506 1089
2711A089n01p94NJ25K76O75k93K74l72p88n84o88l92l10M95M85N72L71R20K95
2731H60l40j47n04J96l92K27P72M79K90P82m94n61n56n66o66o10j41M4L49N35
2751d43J80m2R4j74l33l41j98L08O32N67O52N21L59Ol24l26o94m83l8M6K57qN7
2774B75K03n03n58m84l43n76K45J77N74K80O53N87L06P4j51l02j06r1J28K9N97
2795A014L23j62J51k43m58p06n17q03J05q5K37j18M89L82n8K50k54j55J98l04
2815g14O11M02M89N54J82J93j86j75m15o26l06k81o6N7J28n3r8r9J46n86n05k15
2837a563O4J57R0R04L91P85J40K24k45l83j27j77K5J62M65L16j81J81m35p50k31
2858a88j020j77k37J79J45O11L70K49R7k03J9m84K1R9J19Q30N33N45J93M6m61
$$ plain form
2711 1089 588 -206 -201 -76 200 875 582 856 484 -304 -888 -1576 -1968 -2278 -1783 -1298 -726 -355 565 860
2731 860 520 373 -131 65 -327 -100 672 1151 1441 2223 1729 1168 612 46 -620 -1230 -1371 -1327 -978 -443
2751 -443 -263 -305 -211 -385 -718 -1059 -1257 -949 -317 250 902 1423 1782 1788 1464 1138 444 -39 -77 -31 226 218 275
2774 275 478 -25 -583 -1067 -1410 -1986 -1741 -1564 -990 -710 -57 530 836 910 759 457 351 260 388 417 1014
2795 1014 1337 1175 1326 1083 625 -81 -598 -1401 -1296 -1381 -1144 -1262 -773 -391 -449 -199 -453 -608 -410 -714
2815 -714 -103 299 788 1342 1524 1717 1531 1356 941 315 9 -272 -338 -281 -153 -206 -304 -403 -257 -843 -1348 -1563
2837 -1563 -1499 -1342 -1252 -348 43 828 968 1192 947 564 437 260 285 447 912 1228 1047 1228 793 43 -188
2858 -188 -1208 -1385 -1622 -1443 -1298 -687 -317 -68 29 -174 -155 -639 -618 -519 -400 430 963 1508 1701 1747 1286
2879A286j51q09o89k05j02J37J62L94j20M5j42n93k44m89j69M62J89P20Q56N78
2899A116J76j33k91k36l72o72J79M31N2L68M51Ln19m47p74k55o08K05L0K30P17
2920c49N22L13l86N6k63j28j44K34j05O98N93L36J85K9n44o28m60q66J21m29L58
2941h57N55J58J27M1j74m59q0m56K66K14M64M19M82K91L23M8k53k77n01k38j70
2962g7K18J06J90L6n6l37j20o78l97m02R2K91L92J43M07L82J61MK19n17L33k59
2984A31K43NK32O76q7J70j94p20k87m54l18m21R3J70J36N6K83o6j48J69k85j00
3006g16p9L58M55L07O24J6J26K59k90m91l4l80l34J59km3K49j45j07m14m01k1
3028i04n10J35k7L67P82M89J90q9M58j42m23k16j23R1K35O34K67p6j85j84m58
$$ plain form
2879 1286 1135 326 -363 -568 -670 -533 -371 23 -97 -52 -194 -787 -1031 -1520 -1689 -1227 -1038 -318 538 1116
2899 1116 1292 1159 868 632 260 -412 -233 198 250 618 1069 1072 553 106 -668 -923 -1531 -1326 -1296 -1066 -349
2920 -349 173 486 100 156 -107 -235 -379 -145 -250 448 1041 1377 1562 1591 1047 419 -41 -907 -786 -1215 -857
2941 -857 -302 -144 -17 24 -150 -609 -689 -1145 -879 -665 -201 218 700 991 1314 1362 1109 832 331 93 -77
2962 -77 141 247 437 473 417 80 -40 -718 -1115 -1517 -1425 -1134 -742 -599 -192 190 351 355 574 57 390 131
2984 131 374 379 611 1287 1200 1370 1176 456 169 -285 -603 -1024 -931 -761 -625 -569 -286 -352 -500 -331 -616 -716
3006 -716 -795 -437 18 325 949 965 1091 1350 1060 569 535 155 -179 -20 -22 -65 184 39 -68 -482 -883 -904
3028 -904 -1414 -1279 -1306 -939 -157 332 522 433 891 749 326 110 -13 78 313 947 1214 1138 953 769 311
3049C11m18o00m38j90K84N02L1N34J69l92L34m36j83k43L28L74K70L11N31L13
3069A392p0k36l68n87l80l02R4J12K60J61L46k68k10m39l57N5m11J12N75M71L59
3090C09M38L94j74l41j80n56j66N08O1J98K12K03n6k39n09o37k17l34J61k5K04
3111g46N30K42O8R2J29l45j39j95r8N32K43N39Q5K10r7k46l09o86j24l92kM42
3133b67j94M68q7J7j69o17M2K18l50L87K70L68M09J46L32k45r8r8k22k47m2K46
3155B67Km3M15k88m22m33k2j55k00l02M4L39K23M45K38J72k75K74n3m39K99O6
3177A52L82J20k1L14O6k2l66l54l19m62k52j22q0M11J97J83k06J00k04j69J67
3198d85O2K98R3M76O2N21Pm6j23o08R1j40k68l7J49K8J04k3o1m66l03j65j47r0
$$ plain form
3049 311 -107 -707 -1145 -1335 -1051 -549 -518 16 185 -207 127 -309 -492 -735 -407 -33 237 548 1079 1392
3069 1392 1322 1086 718 131 -249 -551 -457 -345 -85 76 422 154 -56 -495 -852 -797 -1208 -1096 -521 -50 309
3090 309 747 1141 967 626 446 -110 -276 232 293 491 703 906 850 611 102 -535 -752 -1086 -925 -950 -746
3111 -746 -216 26 94 186 315 -30 -169 -364 -462 70 313 852 937 1147 1050 804 495 -191 -315 -707 -709 -267
3133 -267 -461 7 -80 -63 -232 -849 -807 -589 -939 -552 -282 86 495 641 973 728 630 532 310 63 21 267
3155 267 269 226 641 353 -69 -502 -524 -679 -879 -1181 -1137 -798 -575 -130 108 280 5 279 226 -213 86 152
3177 152 534 654 633 947 1013 991 625 271 -48 -510 -762 -884 -964 -553 -356 -173 -379 -279 -483 -652 -485
3198 -485 -423 -125 -32 444 506 1027 1034 988 865 257 348 208 -60 -97 52 80 184 161 100 -366 -669 -834 -981 -1071
3222a071L03L33J13L18K90L95j23j23Rn78J38K37n8K37K30J94O3l09m32m29m06
3243f69j71J92l8J78K74o0L72j1l20l3j22k12M01koO98P18j32j49k94n15l1o06
3266e38P6J26J14J01L86N3q3k31k57l92l08K27j88P68K57J80N07J65l63m05L7
3287B32l48k45L09K41MJ99R9%j48l54j81l54p2k01L47J46J17J98L30N6l87K80
3309B68k90jJ29Q4O2K05J23j13L47n73L1m17j53K4k64K86J45q5M8K30n07K14k01
3332d08j28L2Q5K29L04M55N4j8K64l66L0k26k17k57L31q0j30L66j95p9k84j27
3354c65K3j64k20n6J54J93M18K03k7L92r0k51j74L4N9j75M48J87J91k96j88J89
3376D85m68l84j7j94r9J25K22K09O5o1P6k93l3j85M13r8L02L14J27K85j23k47
$$ plain form
3222 -1071 -768 -435 -322 -4 286 681 558 435 444 -134 4 241 183 420 650 844 907 598 166 -263 -669
3243 -669 -840 -648 -686 -508 -234 -294 78 67 -253 -286 -408 -620 -219 -221 -227 471 1189 1057 908 614 99 68 -538
3266 -538 -462 -336 -222 -121 265 318 235 4 -253 -645 -953 -726 -914 -146 111 291 798 963 600 195 232
3287 232 -116 -361 -52 189 193 392 491 491 343 -11 -192 -546 -618 -819 -472 -326 -209 -11 319 375 -12 268
3309 268 -22 -23 106 190 252 457 580 467 814 241 272 -145 -298 -274 -538 -252 -107 -192 -144 86 -421 -207 -408
3332 -408 -536 -504 -419 -190 114 569 623 605 869 503 533 307 90 -167 164 84 -46 320 125 46 -238 -365
3354 -365 -342 -506 -726 -782 -628 -435 -17 186 159 551 461 210 36 70 129 -46 402 589 780 484 296 485
3376 485 17 -367 -384 -578 -677 -552 -330 -121 -56 -117 -41 -334 -367 -552 -139 -237 65 379 506 791 668 421
3398D21P4l51k84L3m11M04L5j59K57j14n1M4k40n4l78L00o8K14N05mK73L8J14
3421E98n36J80l68J43q1J36L51J6qp6j02l83l40r3k51K7R7J83L89K31J63J3j35
3444A54l16n1j43M83l97L3O09K37J45L1m55ml01n51K23MN4L28rj57L74j58l32
3467a99l80M0m7K09r8N79J74J66L3J18l69j42N4m10K61n1J59RO3J14k54l67j90
3490e28O9J9oL3l8N71k8J61J44q9k1l34r9n1O16r2O6L06r4q3p4m96N7p10L04k21
3516f18M64m8r3J3J27L6K8l87O0J89k39M40m5M36K50p4J23k75j20n4j35k35O4
3539i3L8P5Q6k08N6k51j76r8Q8k40O8K04L03K26l7L38n2k62M49m01P3j4J18j1
3563B79j6J89m3nj72ol08m13j72K59k2L51l5K1R9q6N5j92j79J38J52K45J14L95
$$ plain form
3398 421 495 144 -140 -107 -518 -114 -79 -238 19 -95 -146 -102 -342 -396 -774 -474 -542 -328 177 173 446 484 598
3421 598 62 242 -126 17 -64 72 423 439 431 355 253 -130 -470 -563 -814 -787 -690 -507 -118 113 276 289 154
3444 154 -162 -213 -356 127 -270 -237 372 609 754 785 330 326 25 -526 -303 -299 -245 83 74 -83 291 133 -199
3467 -199 -579 -539 -586 -377 -475 104 278 444 477 595 226 84 138 -272 -11 -62 97 106 169 283 29 -338 -528
3490 -528 -459 -440 -446 -413 -451 120 92 253 397 308 287 -47 -146 -197 419 327 393 699 605 522 448 -48 9 -701 -397 -618
3516 -618 -154 -202 -295 -282 -155 -119 -91 -478 -418 -229 -468 -28 -73 363 613 539 662 387 267 213 78 -157 -93
3539 -93 -55 20 106 -102 -46 -297 -473 -571 -483 -723 -655 -451 -148 78 41 379 327 65 514 113 186 172 290 279
3563 279 263 452 409 404 232 226 -82 -495 -667 -408 -430 -79 -114 -93 6 -80 -25 -217 -396 -258 -106 139 253 648
3587F48lM0k84N7k54K9l18k04K04k4O4K28j00m0k45Ql37K39o3j62K01Q9K69L57
3611C99K45j11n15j47K34n0j57K85R5j29K29J35j52j65m13j39k33p4L38j47O26
3632A54j79J35J92j78j25o2j59P5R6K77N0K30O9j35j2j26m87m9Q7k48J66K10J8
3655aP8L9Q7m97j10j16l8J11L22M5N22k7QO9m6k41j52j73R8R4L5L52l1j03n02
3680a77L14m48Q6l11k7J84J68L22j28K31j59J49l70J68Q8n9L25p2r7L97Q3l37
3702C30R7l44k60j33l5j6K13q3J76n0Q2K6o0p4Kj53K6K0K39L68K13j86K9o1j84
3727A82J7Mp7q1o3J44L2J84l48l19J07k32L6N7q2L0M17j16MK57RJ64k44J22k6
3752A78j8qJ93j98K34j58QR0n63K0j85Qk81J95M79j19P3J57n3j83k78K31j94L01
$$ plain form
3587 648 645 685 401 458 204 233 -85 -289 -85 -109 -45 183 83 43 -202 -194 -531 -292 -355 -517 -316 -227 42 399
3611 399 644 533 18 -129 105 55 -102 183 278 149 378 513 361 196 -217 -356 -589 -663 -325 -472 154
3632 154 -25 110 302 124 -1 -63 -222 -147 -51 226 276 506 575 440 428 302 -185 -234 -147 -395 -229 -19 -1
3655 -1 77 116 203 -294 -404 -520 -558 -447 -125 -80 442 415 423 492 446 205 53 -120 -22 72 107 459 428 325 -177
3680 -177 137 -311 -225 -536 -563 -379 -211 111 -17 214 55 204 -166 2 90 31 356 284 187 584 667 330
3702 330 427 83 -177 -310 -345 -361 -148 -231 -55 -105 -23 3 -57 -131 -129 -282 -256 -236 3 371 584 398 427 366 182
3727 182 199 203 126 45 -18 126 158 342 -6 -325 -218 -450 -414 -357 -439 -409 8 -108 -104 153 162 326 82 204 178
3752 178 160 152 345 147 381 223 231 321 -242 -222 -407 -399 -680 -485 -6 -125 -52 105 52 -131 -409 -178 -372 -71
3776g1O1J69K08p9K32p1l92K70o88K54j2Q8k31K90j76N64k69l88J11k08j04J60
3798b82o3J13K73j87L61J67k39j33J24k25J37k01J61J94oJ09j1j33N2m61j44K47
3820a47l45M48j18M7K26K01l21R7j61l37J79J28P8p1L67J16K14k99J38n66n5k61
3842d42K55o6L6K03K59l3k63l9j47k11K7M88l76M00LJ29o0K85j99j59J03k60M0
3865b7J09k05K04R0J66p5j18j26j63r7k3j10K3J10K77J93k9j88R5Rj13j81P5K22
3889A18N7J71m7O8Q2k46l18q6J18L8N7L6K9q1J32J8q1k90J16mj09N8J41q1J31
3914B7K31J02j63J43k50k68J76J70j23o1L1K75l38k5m3Pjk30J53j27K66K3K24
3937A99j93K29r6j66J51k10J12k68M89Po4M19k60Qk38J47k83r7m8J14O2q2r2L83
$$ plain form
3776 -71 -10 159 367 288 520 449 57 327 -361 -107 -119 -31 -262 28 -148 416 147 -241 -130 -338 -442 -282
3798 -282 -345 -232 41 -146 215 382 143 10 134 -91 46 -155 6 200 194 303 292 159 211 -250 -394 -147
3820 -147 -492 -44 -162 -115 111 312 -9 88 -73 -410 -231 -103 -25 -96 271 387 601 302 440 -126 -181 -442
3842 -442 -187 -253 -217 -14 245 212 -51 -90 -237 -448 -421 67 -309 91 94 223 163 448 249 90 193 -67 -27
3865 -27 82 -123 81 171 337 262 144 18 -145 -242 -265 -375 -352 -242 35 228 199 11 106 115 2 -179 -104 118
3889 118 175 346 299 367 449 203 -115 -201 -83 -45 12 48 77 -4 128 146 65 -225 -109 -113 -222 -164 -23 -104 27
3914 27 258 360 197 340 90 -178 -2 168 45 -16 15 290 -48 -73 -116 -109 -110 -340 -187 -314 -48 -25 199
3937 199 6 235 139 -27 124 -86 26 -242 247 254 190 609 349 357 119 266 -17 -114 -162 -48 14 -68 -160 223
3961B23k51P5k6P1l65m1M32j80J59n6qL51l30K18l52q6J42J7J6n3n4L32o5r0J4
3986I3j70O5k33Q0l02M46J01K5K27k76k79M30k94qj54K03J38L3K52j15j49l2j07
4009b6j75J50l43M66j38j11K79ko4q7K79l00k62M32j38M5r5J01L04j65K77k56
4031A71j20r7l57K20j10O36m56J89n2k8j90l2j24L3J70L37k14j89L11J0K20l30
4053bR5k7k03P3k3J07P2j46J9O2J89m43k62J09J72j74K37J31K19p4K39k55Q4m28
4077b29m6K59M3j64oK34J91j58K5K19l35m55K20J37j17K11Jj14k32M38k12Q0j91
4100b01P3k49L75j92J75J5K12j10J13k11O4K25j09k93J4K25k8R0n0L2j61p4r8
4123a63j10J25j39J43J39j98K11J55k78J05j01p9J71j64K75J82k61M0R4K01n4
$$ plain form
3961 223 -28 47 21 92 -273 -314 118 -62 97 41 33 384 54 272 -80 -166 -24 -7 9 -44 -98 234 169 79 93
3986 93 -77 -12 -245 -165 -467 -21 80 105 332 56 -223 207 -87 -95 -249 -46 92 125 377 262 113 81 -26
4009 -26 -201 -51 -394 72 -66 -177 102 100 36 -51 228 -72 -334 98 -40 5 -90 11 315 150 427 171
4031 171 51 -46 -403 -183 -293 343 -113 76 24 -4 -194 -226 -350 -317 -147 190 -24 -213 98 108 328 -2
4053 -2 93 66 -137 -64 -87 20 92 -54 -35 27 216 -227 -489 -380 -208 -382 -145 -14 205 131 370 115 199 -229
4077 -229 -275 -16 27 -137 -143 91 282 124 149 368 33 -422 -202 -65 -182 29 30 -84 -316 122 -90 -10 -201
4100 -201 -128 -377 -2 -194 -19 -4 208 98 211 0 64 289 180 -113 -99 126 98 188 138 170 9 -65 -163
4123 -163 -273 -148 -287 -144 -5 -203 8 163 -115 -10 -111 -190 -19 -183 92 274 13 53 147 348 294
4144B94m44K72k01n9K01j2j50K50k09P4l8q9j37R9j21p3K98P7j72M82j77K8J14
4167C07n11K26l8k49K48j05N4K52n4k16oO9p4j03rk6P9J99k00M67k87N8j74J44
4191E1k60K86lK1p1L0L04l27J6k5q3j58j0j1K96m0N4K36N1k98l06R0J17L7K6M3
4217F6J6K51j02j0o1qk49P7q3j4J22k15kJ94j56L14j25j08J44J09o13L72K39k7
4241A31q4m4L24j61j26J7J0k95P1P1J33J30J37j84K8o0o45N7K63j02J01J57K33
4264A62p4k20K09k70K30j65jK33m7j05kK59P0l41K51Ljl10q2Q8P2P8m18K70O0
4289e1J28k14Prj83K95M6j9K97k66Ko2K74r5J8k95J93j75n9L29k43J01J11o5j9
4314D6k04k08K15k42N10k04K85J18k4k09j14Q8J54l92J21J02k7J75K13l86K20
$$ plain form
4144 294 -150 122 -79 -138 63 51 -99 151 -58 16 -22 -111 -248 -149 -270 -343 -45 32 -140 342 165 193 307
4167 307 -204 22 -16 -265 -17 -122 -68 184 130 -86 -92 -23 -97 -200 -209 -235 -156 43 -157 310 23 81 -93 51
4191 51 -209 77 74 95 24 54 358 31 47 22 -61 -219 -229 -240 56 16 70 306 357 59 -247 -157 -40 -3 23 66
4217 66 82 333 231 221 160 152 -97 -20 -103 -117 5 -210 -212 -18 -174 140 15 -93 51 160 -453 -81 158 131
4241 131 47 3 327 166 40 57 67 -228 -157 -86 47 177 314 130 158 98 -547 -490 -227 -329 -228 -71 162
4264 162 88 -132 77 -193 37 -128 -129 104 57 -48 -50 209 279 -62 189 192 191 -119 -201 -113 -41 37 -381 -111 -51
4289 -51 77 -137 -130 -139 -322 -27 19 0 297 31 33 -29 245 150 168 -127 66 -109 -168 161 -82 19 130 65 46
4314 46 -158 -366 -151 -393 117 -87 198 316 292 83 -31 57 211 -181 -60 42 15 190 403 17 237
4335B37k41K09j35j35J56l40n3J66R7j01M21j04r2j71k60L34j78J3L89K10l55
4356F7n7J63k96J39K18l54j33K01K82n92K38K57QK4j06j88L19m87J54o6J46J40
4378G7J35N1j43N5q6j04j3r9L63j59J14J38j94N6k82kj96k80L15K75o4K3J64P4
4402B18j86%J55k94Q8n2K58K08k01j22M7o1k11J29j09j11J16K3j61L8N21m54j47
4425c08N01k84k21J69L3L19l57K35LN1K44j55k70j79J56qK4P4Q3j67K40R0l90
4448a17J64j45j05j28L8N4J28K58l1R3k13K15K3k59j17M09k73K44L6j73Q0J02
4470B83k69j82J44J82l27Q7n4M36j93j82o3Q0Q1k93L7k9J89L6J11j72K95K17j15
4493B99Ll15pk8j2k6J44l58M85l40L17j56o7j43l4K13j08Q6K5j08K90J4n1K2p
$$ plain form
4335 237 -4 205 70 -65 91 -249 -302 -136 -39 -140 281 177 85 -86 -346 -12 -190 -177 212 422 67
4356 67 10 173 -123 16 234 -120 -253 -52 230 -362 -124 133 141 165 59 -129 190 -297 -143 -209 -63 77
4378 77 212 263 120 175 89 -15 -28 -127 236 77 191 329 135 191 -91 -93 -289 -569 -254 21 -43 -20 144 218
4402 218 32 32 187 -107 -19 -71 187 395 194 72 119 58 -153 -24 -133 -244 -128 -105 -266 -228 293 -161 -308
4425 -308 193 -91 -312 -143 -110 209 -148 87 90 141 385 230 -40 -219 -63 -71 -47 27 110 -57 183 273 -117
4448 -117 47 -98 -203 -331 -293 -239 -111 147 116 209 -4 211 234 -25 -142 267 -6 238 274 101 181 283
4470 283 14 -168 -24 158 -169 -82 -136 300 107 -75 -138 -58 23 -270 -233 -262 -73 -37 74 -98 197 414 299
4493 299 302 -13 -20 -48 -60 -86 58 -300 185 -155 162 6 -61 -204 -238 -25 -133 -47 -22 -130 160 174 123 145 138
4518A38q4k10R7O1k14K95N8J17o4o4J72l38j57k2Pm2M00j21Q8j05J48l18J15n1
4542i4J36%R4p0j17J00P5J37k68J32j26J28k19J95k02mJ64O3r4n8j20q9J39j40
4566b38K34L9L19l63Q6L31j56l19M2M7j60o4J20N3o4L07l43J41r5r3J65m44L38
4589a17M2k1K06k07K44M5j81J48k51n2N2K12m3j27K31K06kk36lk11P0j5L7k17
4613a90Q0J72m10M20k76K16k19O2J0j38M10p9O7J99j81j09K10o9l2k99L22j83
4635a7J82L4k31j58J56l1o5Lm8l19K10K09J27R9j6q1J65j01j20J54k63M15k65
4658C9PN5J50k23l0L02q9m53N3n4K7k5J50N5l7L44n04M10k0k17k7J10N0J06j33
4683D6J78o0R%k0l82L21l14J63J97l2j30K16q0j05J02n56M18qK0j6K38j25O8O5
$$ plain form
4518 138 54 -156 -59 2 -212 83 141 258 194 130 302 -36 -193 -215 -208 -250 150 29 117 12 160 -158 -43 -94
4542 -94 42 42 136 66 -51 49 124 261 -7 125 -1 127 -92 103 -99 -103 61 124 30 -28 -148 -237 -98 -238
4566 -238 -4 35 354 -9 77 408 252 -67 -25 22 -138 -202 -82 -29 -93 214 -129 12 -83 -176 -11 -455 -117
4589 -117 -75 -96 110 -97 147 192 11 159 -92 -144 -92 120 77 -50 181 387 385 149 146 -65 5 -10 27 -190
4613 -190 -110 62 -348 72 -204 12 -207 -145 -135 -273 137 58 125 324 143 34 244 175 143 -156 166 -17
4635 -17 165 199 -32 -190 -34 -65 -130 -127 -175 -494 -284 -75 52 151 135 54 219 118 -2 152 -111 304 39
4658 39 46 101 251 28 -2 300 211 -242 -189 -243 -216 -241 -91 -36 -73 271 -233 177 157 -60 -87 23 73 179 46
4683 46 224 164 173 173 153 -229 92 -222 -59 138 106 -24 192 112 7 109 -447 -29 -37 -17 -33 205 80 148 213
4708B13n5k90q9J86j35K29o9p3L99l54J60j60J04qm48L04J20j24k61P06k78j20
4730d3M1j38J22qJ06j1r1j48K58J48k25J58o4l53j14K53R8J07j77L2J00J8l02
4753b33p9M04q2j09o6k8J41K53Q6m07L76q7j77J04m9K55j49k20K95k64K38l60
4775a58K18j54j55J65j7J22k25K57P2j31O0J0j20J64j30J30m2J16k10N42k77N8
4797B95Q4l34m3O4j18l9j90K16r4J63Mn3k5O7k58K06j25L17k7J4J76k95m5J58
4821A18j41j55K2o0O1k0O3K05j79K50j95j82k32K54J38N7o0Rj56L20j07N8j25
4844e7J45n2K27j78j80L22j11m0J99k2k96J25j19n2n6L4Pl1J87j07J89j3j99p4
4868a52K07j45N1K71k90J20J81m48L55l33L09k33K35n8Qj70M14j49l19K50j15
$$ plain form
4708 213 158 -132 -221 -35 -170 59 -10 -83 316 -38 122 -38 66 58 -390 -86 34 -90 -351 355 77 -43
4730 -43 -2 -140 -18 -26 80 69 -22 -170 88 236 11 169 105 -248 -362 -109 -11 96 -81 -49 51 69 -233
4753 -233 -312 92 10 -99 -165 -193 -52 201 287 -120 256 169 -8 96 47 302 153 -67 228 -36 202 -158
4775 -158 60 -94 -249 -84 -101 21 -204 53 125 -6 54 64 -56 108 -22 108 66 182 -28 514 237 295
4797 295 379 45 2 66 -52 -91 -281 -65 -159 4 8 -45 -70 -3 -261 -55 -180 137 110 124 300 5 -40 118
4821 118 -23 -178 -156 -216 -155 -175 -112 93 -86 164 -31 -213 -445 -191 -53 4 -56 -47 -203 117 10 68 -57
4844 -57 88 36 263 85 -95 227 116 76 275 253 -43 82 -37 -89 -145 -111 -104 -135 52 -55 134 121 -78 -152
4868 -152 55 -90 -39 232 -58 62 243 -205 150 -183 126 -107 128 70 78 -92 322 173 -146 104 -11
4889a1L9l5L7k11J60j59OK43J26m1K33m15J48J22j85j12J41K4j14OJ81J5l16M3
4913g5k15j5K84j52J5K03K25j25j6O0k24j32J71j82K14Q8k04L73k93K08j71l09
4935b72j5J70J44j92K35j99K42Lo3O8oj28j35o1p0J49K68j12J06r6l2J21j3j96
4959h4k1j1P3j72K27J90N0m17PK15j21j46J84j5m1j3Q6K0o8l7J79j12J01J55l51
4984a22K51M6P7k57K27k1q9o7k71L9J58p3Lj2n8J90J8m0k30K75j40j24K7J82J83
5009A72N6O7k29J45l54K69j49l03L13j52L55M3j84L44l34J7m2J02j36M9j39J60
5031G0l2o5J01O5j74k76J01J96N3M9j34L29o2k34P4j25J97j72j07k4J24K84L1
5054B69k93n2J51p9J9k11L26m16L65j91P3rl0K0K90n5k32J45j05j48k1J37K08
$$ plain form
4889 -11 28 -7 30 -181 -21 -180 -174 69 195 154 387 -28 120 242 57 -55 86 110 -4 2 183 198 -118 -75
4913 -75 -290 -305 -21 -173 -158 45 270 145 129 189 -35 -167 4 -178 36 124 -80 293 0 208 37 -272
4935 -272 -287 -117 27 -165 70 -129 113 116 53 121 115 -13 -148 -209 -279 -130 138 26 132 36 4 125 112 -84
4959 -84 -105 -116 -43 -215 12 202 252 -165 -158 57 -64 -210 -26 -41 -82 -95 -9 11 -57 -94 85 -27 74 229 -122
4984 -122 129 175 252 -5 222 201 112 45 -226 -187 -29 -102 -99 -111 -169 21 39 -1 -231 44 -96 -220 -193 -11 172
5009 172 228 295 66 211 -143 126 -23 -326 -13 -165 190 233 49 393 59 76 34 136 0 49 -90 70
5031 70 38 -27 74 139 -35 -311 -210 -14 39 88 -46 283 221 -13 61 -64 133 -39 -146 -170 -46 238 269
5054 269 -24 -76 75 -4 15 -196 130 -286 79 -112 -39 -48 -78 -58 232 177 -55 90 -15 -163 -184 -47 161
5077A61j45Q2J04k05J7l27J55mK5K3K45m0l31L74j68l0K68l98N8j1K19J63k47
5100a2l04L44P1j91Q7r3J20k8k22J57J18k2J84k1l03M61k13m00J88o3J56O4J59
5123B37qj19M6j6l17J36J2r5K46r9j06J99n6J6l91M80n17L23k87M60j07J39j56
5146B0K38l13j92J95J67l6L0l0j1j80K65j8k28p8p5J82l1p6m5K99j11%J97Q7l31
5171g5L00o4n0j88K46j42l4k7K14R1O5k39k21j37J26Q0L3k0q8J52J22k48J04j8
5195a8m0R7K8j8jp6j09K36J97k26j68K75m2r6k06K17J6j93Q3K98k51j46n8K37
5219C6L6k21P6k56M31j13J50l6kl24j22J36KO3J46L06j13k3j56M4K73n13O4M5
5243g1N8n1p4J14K21j08j14kJ4m4j7J15k2j22L03k77L71l29Q5j45P9j12K4j02
$$ plain form
5077 161 16 98 202 -3 14 -313 -158 -162 -137 -114 131 91 -240 134 -34 -64 204 -194 -136 -147 72 235 -12
5100 -12 -316 28 99 -92 -5 -98 22 -6 -228 -71 47 25 209 188 -115 346 133 -267 -79 -142 14 78 237
5123 237 229 110 156 140 -177 -41 -29 -124 122 23 -83 116 60 76 -315 165 -352 -29 -316 144 37 176 20
5146 20 258 -55 -247 -52 115 79 109 79 68 -112 153 135 -93 -171 -246 -64 -95 -171 -216 83 -28 -28 169 256 -75
5171 -75 225 161 111 -77 169 27 -7 -34 180 271 336 97 -124 -261 -135 -55 -22 -42 -130 22 144 -104 0 -18
5195 -18 -58 39 67 49 48 -28 -137 99 296 70 -98 177 135 39 -167 50 66 -127 -44 254 3 -143 -201 36
5219 36 72 -149 -73 -329 102 -11 139 103 101 -223 -345 -209 -207 -144 2 308 195 172 16 60 333 -180 -116 -71
5243 -71 -13 -64 -138 -24 197 89 -25 -27 -13 -57 -74 41 19 -103 200 -77 294 -35 50 -95 -16 -128 -104 -206
5267b06K76j30L00j33j36QK69j28j86o2m8J20O3M4O5J05L36n43K9k37J74j86L53
5290A47k88K82k74K25O6j03P4p1k25J34j04l9L07l2J56l50K70N4j46J36j9k83
5312h3M19o26L34j73n5K52K05l52j68J21J52Qm0q0k49O80l15M3j03K1k98K68j92
5335b31K53l03O07j16M7m5k45J96j83J67K3k67K34Q9R7o2J08l46j91J57k21k2
5357b54K36r2K31l16M55l12M3k87K32J8L21r4k32O5J79KJ05q6j91n5j7J87o6R3
5381A65j66j9K2K45j77rOo8PJ74m84J03K05R6pJ29j84k9L8L63n00l2K33j04J79
5406A86j19K9j74P4j57j72K43J53l13J08J59N6o2N2lk08J78J58l82J11j0RK55
5429A71j7k37J01j17K18Q7k79K43l56K23q6K8j82J16K83k84L79m35J09lL7j2J20
$$ plain form
5267 -206 70 -60 240 107 -29 -21 248 120 -66 -128 -176 -56 7 51 116 221 557 14 43 -194 -20 -206 147
5290 147 -141 141 -133 92 158 55 129 58 -167 -33 -137 -176 131 99 255 -95 175 229 83 219 200 -83
5312 -83 336 -290 44 -129 -184 68 273 -79 -247 -126 26 34 -6 -86 -335 345 30 73 -30 -9 -307 -39 -231
5335 -231 22 -281 326 210 257 212 -33 163 -20 147 170 -97 137 226 323 261 369 23 -168 -11 -232 -254
5357 -254 -18 -110 121 -195 260 -52 -9 -296 -64 -46 275 181 -51 14 193 195 300 214 23 -32 -49 138 72 165
5381 165 -1 -20 2 247 70 61 67 -1 6 180 -304 -201 4 100 93 222 38 9 47 410 -90 -122 111 7 186
5406 186 67 96 -78 -4 -161 -333 -90 63 -250 -142 17 73 11 63 60 -148 30 188 -194 -83 -93 -84 171
5429 171 154 -83 18 -99 119 206 -73 170 -186 37 -49 -21 -203 -87 196 -88 291 -144 -35 -38 -1 -13 107
5452A07M4j71l6J42j63L2p1J31J54j45n1R0j47J23k69J29J05N0Rl96M08j4R5J53
5476C09q1k55L0j24p6K78M5j40L49k7m16K14m5j50k8J96j35j17J74j68J35OJ25
5499I9Q5k51p1K22j70L74r4j07R6LR8l06k3j81P3Q9K03j70K04j89L4q0j0k0O6
5524b6j08J5M12l33J05J70Km09M15k79K9j7J34L9j88Q1q7R2O7j82p6j9r1J39j05
5549b20L71j9J83m12J84j66J74j62Rp8Q1L10q8l24M37j81N4k8k20K52k01r9J35
5572hJ05j25J25o7l1J20k14l2m7K7J93j52L22O4o9p5q4j08K35j82K3J3p1K06k62
5597i4N02m77N4l9j23M7j0j40J47K01J04j95J04q8k57n4K37J64j11J36J25k79
5619d6K9j11K75k20p1L2J04K15j65P6K34k10M8j28o3Q5k16q2K75Q2n2Om4j15k4
$$ plain form
5452 107 151 -20 -56 86 -77 -45 -116 15 169 24 -27 63 -84 39 -230 -101 4 54 63 -333 75 61 156 309
5476 309 228 -27 3 -121 -197 81 126 -14 335 308 -108 106 61 -89 -117 79 -56 -173 1 -167 -32 -26 99
5499 99 184 -67 -138 84 -86 288 194 87 183 186 284 -22 -45 -226 -153 -64 139 -31 173 -16 18 -62 -72 -92 -26
5524 -26 -134 -119 293 -40 65 235 237 -172 243 -36 -7 -24 110 149 -39 42 -45 47 114 -68 -144 -163 -254 -115 -220
5549 -220 151 132 315 -97 87 -79 95 -67 -58 -136 -55 255 167 -157 280 99 153 125 -95 157 -44 -143 -8
5572 -8 97 -28 97 30 -1 119 -95 -127 -174 -147 46 -106 216 280 211 136 52 -56 179 -3 20 33 -38 168 -94
5597 -94 408 -69 -15 -54 -177 -130 -140 -280 -133 68 172 -23 81 -7 -264 -318 -81 83 -28 108 233 -46
5619 -46 -17 -128 147 -73 -144 -112 -8 207 42 118 352 142 190 62 -1 84 -132 -214 61 143 91 97 53 -62 -86
5644h6K69j69K3Nl0lm84M76J38o9j27K02J7k60K3J35l20J55J58j03O0j73L06k47
5668a04l2J64J56k69K54j26j45Q1K47Rj14k13R0l3J2r3n8J00J07J9K50k7l60K59
5692A74k86J56q2O3J47p4L00k87n6K50j28o84N68k9r1J31k90M68k18n7R4l2N8
5715I5k50J14k74J92J19jJ2J13q3j8J80k60N6N1k3K6O5j43j50L40j48j26j0J76
5739E3k55k03N20k56K67k89J82P0N9j26o7K36p6p4J52J09j65k2R1N6j79q7r8m7
5763a49P5J65j4o3j54M5R6j64R5R4P2k02K49q3Q4k13J79j71m3L55n18K69L1o5
5787c0J24l1Mmo0K27l80M18n60K01k21JL76q4K14l5m62K14L89k71M7j1M0j81o8
5812a43J23r4J36k0k00K14j67K04j41J74k12R7P3M0o4NK0N0k03K5P2N7r3l5L56
$$ plain form
5644 -86 183 14 37 42 12 9 -475 1 139 70 -57 145 162 -98 -75 60 -260 -105 53 -50 10 -163 143 -104
5668 -104 -136 28 184 -85 169 43 -102 -21 226 235 121 -92 -2 -35 -23 -116 -174 -74 33 52 302 275 -85 174
5692 174 -112 44 -38 25 172 98 398 111 55 305 177 -507 61 32 -59 72 -218 250 32 -25 69 37 95
5715 95 -155 -41 -315 -123 -4 -5 7 120 37 19 199 -61 -5 46 23 49 114 -29 -179 161 13 -113 -123 53
5739 53 -202 -405 115 -141 126 -163 19 89 148 22 -45 191 115 41 193 302 137 115 206 262 83 -4 -102 -149
5763 -149 -74 91 77 14 -140 -95 1 -163 -68 26 98 -104 145 62 146 -67 112 -59 -102 253 -265 4 35 -30
5787 -30 94 63 67 63 3 230 -150 268 -292 -91 -312 -311 65 -19 195 160 -302 -88 301 30 77 66 106 -75 -143
5812 -143 -20 -114 22 2 -198 16 -151 53 -88 86 -126 -29 44 84 20 25 45 95 -108 -83 -11 46 -47 -82 274
5837B74l92L62j82J8j63j45K95l36M94j38j99p5K12r3O2k74L04j33J26K34K1j32
5859A40j06n5J34j21j17j37K45k0P3j17o7J82k01Q5nMk97J61N53l13k64M19q1
5882I5m2l94K22J19L1J8j34L21N6J4k28J04R5l38j0N4K1j18N9M1K7j04m5l56O06
5907A14k82J88o0k4J75M9j6J39k23j51Pj07K64k47K53Q2j30k6K25l80R1r9P2q8
5931a74j4J49L9O8n5K21j88r5K60j60k04PK24q1L7m9K20K4m09N79l15k45j19J06
5955a74M7O8j72K71m75M27j26j81J94j00K06j82K45R8J55k40n3J51k09KJ05k07
5977a50N41k78o0m0k2Q2q1j96Q1p1J25j8N9P1l14L96j47Pj09O4j08J07K00P9j63
6002E5j67M1J75K2j9k10M2j62K71k74%K57P5j62P6j0J48l61J10J49k22K66K28
$$ plain form
5837 274 -118 244 62 80 -83 -228 67 -269 225 87 -112 -187 25 -68 -6 -280 24 -109 17 251 272 140
5859 140 34 -21 113 -8 -125 -262 -17 -37 36 -81 -148 34 -167 -82 -87 -83 -380 -219 334 21 -243 176 95
5882 95 53 -341 -119 0 31 49 -85 236 292 306 78 182 277 -61 -71 -17 4 -114 -55 -14 13 -91 -136 -492 114
5907 114 -168 20 -40 -64 111 160 144 283 60 -91 -84 -191 73 -174 79 161 31 5 230 -150 -59 -158 -86 -174
5931 -174 -188 -39 0 68 13 234 46 -49 211 51 -153 -146 78 -3 34 -15 205 229 -180 399 84 -161 -280 -174
5955 -174 -127 -59 -231 40 -435 -8 -134 -315 -121 -221 -15 -197 48 146 301 61 8 159 -50 -48 57 -150
5977 -150 391 113 53 13 -9 73 -8 -204 -123 -194 -69 -87 -28 43 -271 125 -22 -15 -124 -60 -168 -61 139 218 55
6002 55 -112 -71 104 126 107 -103 -61 -223 48 -226 -226 31 106 -56 20 10 158 -203 -93 56 -166 100 328
6025C28l84K19r7l3K4j28O7k03J71k9j9J00J34j28j54J22k62J76L1j80M3J19O8
6048a5l1O4L98k39o2M1j88O4k5o4K21p7J91k01j29R0R9k03k66K53K25J5k43K2
6072f0J67k9J07l29k05L76m7l2J55m8L72M8l67j31n9PQ2k10n4J23O1J91j88jK2
6097d9J8k86J26J25M6mK75m5k19J41k7Q6nQ2r9k74K96k16J23l2M3k4o5l31q0J96
6123a99J44J91j58q6N9r1K41p8r6%J10q3L95k56L1j18K24r9qj87k3L9J43Pk26
6148a24k0j45J33p9K63k20J66p1n8J49L2k50M12j7j59q2M4J56k13M8j87L01R3
6171A72j55O9j83k5P9O9l14J75L1n7j24O0K47J81jr5J43k37R8j69K3O1JJ67r0
6196A26j29n6o8J00j36Ll3Q3M4M8P6N1J64l05q2K73J1M3j68J76k75J15m8K01J4
$$ plain form
6025 328 -56 163 66 33 57 -71 -4 -207 -36 -65 -84 16 150 22 -132 -10 -272 -96 -65 -245 -202 -83 -15
6048 -15 -46 18 416 177 115 156 -32 32 7 -57 164 87 278 77 -52 38 137 -66 -332 -79 146 161 -82 -60
6072 -60 107 78 185 -144 -349 27 -20 -52 103 55 427 475 108 -23 -82 -75 7 -203 -257 -134 -73 118 -70 -71 -49
6097 -49 -31 -317 -191 -66 -20 -24 251 206 -13 128 101 187 182 264 165 -109 187 -29 94 62 105 81 16 -315 -395 -199
6123 -199 -55 136 -22 -108 -49 -140 101 23 -73 -73 37 -46 349 93 124 6 230 131 123 -64 -87 -48 95 102 -124
6148 -124 -144 -289 -156 -235 28 -192 -26 -97 -155 -6 26 -224 188 171 12 -70 -26 130 -83 -35 -222 79 172
6171 172 17 86 -97 -122 -43 26 -288 -113 -82 -139 -263 -203 44 225 224 129 272 35 133 -36 -13 48 49 216 126
6196 126 -3 -59 -127 -27 -163 -160 -193 -110 -66 -18 58 109 273 -32 -114 159 170 213 45 221 -54 61 13 214 228
6221B28K3m81J18j50J69J97j02L2o8P1J55k96Jq6J43j85r9M29k8J07j50LL81m63
6245e1o1K34j13o2J78M7j56j8l15K06j31j43K61LLk11N91l85p3K71k14J54l25
6268c10M75j21MK12j72J96j4o5K7j26N4k16J53j37O6k4P1j15J28k30P2P1l2l9
6292g2o3J84j41K02n5j34k5pJ43j43J87l2O6P4O5j10o6Q5k77N4j13P1l6M6J19
6317B2k23K17q9L21k29p0o2j03K61R8m3o9N57l94K3j47j88P9m0o9k7j00L13L4
6341G2m8K1k49J19j87L61j95PK07O6j91n3nM81k13k27K8m5Mo3J19Q7R9q5j52j08
6367a50K93j89k38M16l41J74R7j19L9J69J50j4o0j25J17j88J73L6l4j59%K46m11
6390a18m9K69r2Pl91M64j16k10J47K18k57J58R8q8q9L7J4K57k19J29J27k57L1
$$ plain form
6221 228 251 -230 -112 -262 -93 104 2 34 -34 37 192 -104 -103 -189 -46 -231 -330 99 71 178 28 31 412 -51
6245 -51 -112 122 9 -53 125 172 16 -2 -317 -111 -242 -385 -124 -121 -118 -329 262 -123 -196 75 -139 15 -310
6268 -310 165 44 48 260 88 284 270 205 232 106 160 -56 97 -40 26 2 73 -42 86 -144 -72 -1 -33 -72
6292 -72 -135 49 -92 110 55 -79 -104 -111 32 -111 76 44 110 184 249 139 73 158 -119 -65 -178 -107 -143 -97 22
6317 22 -201 16 -73 248 19 -51 -113 -216 45 143 100 31 588 194 217 70 -118 -39 -79 -148 -175 -275 38 72
6341 72 24 45 -204 -85 -272 89 -106 -99 108 174 -17 -70 -75 406 193 -34 -6 -51 -47 -110 9 96 195 110 -42 -150
6367 -150 143 -46 -284 132 -209 -35 62 -57 -18 151 301 287 227 102 219 31 204 240 206 47 47 293 -118
6390 -118 -167 102 10 17 -374 90 -26 -236 -89 129 -128 30 128 40 -49 -12 2 259 40 169 296 39 70
6413G0N8k74J26m8J2J05Q4R0m58J28J51l0p8k38J19K30n7M6k3o5J59j07k7J61
6437A34j11N1j43K69j79K03j35P8k25j14K39j33j22K01J16k02n0oJ16L6N7j51
6459g1k3J32nJ00r0K14k21j51J25q9j01R6L1J94k74J34j44J82R3k40J53k47Q5
6482a17Q8J20j38J79j25k77L51J4J3j82J37l2J27l10P6M1J99qr5k5k1J36k20k37
6506c06K97j86J20P8j9K18j78m61L08J40k52K57j90L31k40K25K9j21j17L39k08
6527F4p1k0m0p0K83k90J67l04K61l21M09K6m54J50L35Nj11L2K1R3r9kl6J86k61
6552d7r1J09R7q1J53j70p7J17q6k8r4K92p8j80K86k17M03k51j48K47N3k71M01
6575C39l34L7K05k10N0j86L15q0k54m7j42M9M32l72J98l2J9J15j94nJ34M8J54
$$ plain form
6413 70 128 -146 -20 -68 -56 49 133 223 -235 -107 44 14 -64 -302 -183 47 -10 36 13 -52 107 0 -27 134
6437 134 23 74 -69 200 21 224 89 167 -58 -172 67 -66 -188 13 129 -73 -123 -129 -13 23 80 -71
6459 -71 -94 38 33 133 43 257 36 -115 10 -79 -180 -84 -53 141 -133 1 -143 39 132 -108 45 -202 -117
6482 -117 -29 91 -47 132 7 -270 81 95 108 -74 63 31 158 -152 -76 -35 164 156 61 36 15 151 -69 -306
6506 -306 -9 -195 -75 3 -16 202 24 -437 -129 11 -241 16 -174 157 -83 142 171 50 -67 272 64
6527 64 -7 -27 -67 -137 146 -144 23 -281 -20 -341 68 94 -360 -210 125 130 19 51 72 165 66 64 28 214 -47
6552 -47 -138 -29 68 -13 140 -30 -107 10 -76 -104 -198 94 16 -164 122 -95 308 57 -91 156 209 -62 339
6575 339 5 42 247 37 87 -99 216 136 -118 -165 -307 -258 174 -198 0 -32 -13 102 -92 -97 37 85 239
6598B39k34m5J5J98L44l78rr6J25k28r4L67j36k6r0J19l3j46OKj22K65k06k4R0
6623i7J51j34J82N5j95K18k15R7j47J18J29l73K02J23k1j65L5n0M1l0R8n4K36
6646B04l00R9k1M8J3j69LJ67R6p5J07j07J30j66Kj2r2J55J70k53RJ04J10k28k
6671hk7p8J14m6j45K58l4p9OJ21j41J57k67K18K1M1j39p0K50q4k01N2K25l03Q1
6696g8N1J17k05j2J26j56K59j21r6L21j79j0r7J55L3k19LO13l92L4j02p5o2J28
6720C6k27K64j02L2j79K69J2k90O5Q8N2l7p8j0J65m9K7l2J49j74J03O3%n6j05
6745a4K31l95K36N7m04J23J36l5J01k03j30L04k49J48J45o2K90l22p4Q7R7k32
6767a65J16K16j46j8O7j42j5l8k8m2J61j43K41j67M34n04J51n1K7N9j37K08k81
$$ plain form
6598 239 5 -40 -25 173 517 139 130 34 159 -69 -163 204 68 42 -48 71 38 -108 -102 -100 -222 43 -163 -187 -97
6623 -97 54 -80 102 157 -38 180 -35 62 -85 33 162 -211 -9 114 93 -72 -37 -87 -46 -76 22 -32 204
6646 204 -96 3 -18 30 43 -126 -123 44 140 65 172 65 195 29 31 19 -73 82 252 -1 8 112 222 -6 -8
6671 -8 -35 -113 1 -45 -190 68 34 -45 -39 82 -59 98 -169 49 70 111 -28 -98 152 68 -133 -81 144 -159 -78
6696 -78 -27 90 -115 -127 -1 -157 102 -19 -115 206 27 17 -80 75 108 -111 -108 505 113 147 45 -30 -92 36
6720 36 -191 73 -29 3 -176 93 105 -185 -120 -32 20 -17 -95 -105 60 11 38 6 155 -19 84 147 147 91 -14
6745 -14 217 -178 58 115 -289 -166 -30 -65 36 -167 -297 7 -242 -94 51 -11 279 -43 -117 -30 67 -165
6767 -165 -49 167 21 3 70 -72 -87 -125 -153 -195 -34 -177 64 -103 331 -173 -22 -73 -46 13 -124 84 -197
6790a97K93j09J50o7L4p6M1k79J12N7o4J00J34R9o1k54L2j02o9j2J23j03K59j16
6814g5J32j20J7p2J23m6r0K72k44M11r0j46O1k81L18k64L11j24k01M7K84l31J79
6837G1k2R8l40L19k19J39J4j72J72J6l5N2pj37K74n4p6n8j1J71n4l57L42P7k3
6862A80j99K52k54k00K07p4j5j53l6M12m69N20j2j59J31j96j91L07qj62J75m3
6884A3l8j26K95p3J38j05k23j60K92J70k30K89l13j57L36m34M16k12q6K31J49
6905A72k27R2J85j24j44J09l25K00J12q9o6l4J52L4l56J53K51k65J38l1J02J89
6927B28k20K31l63K05J52k31m2R2l9J57rj18j0q9L18j34k66J41j28L0J31K44n53
6950b73O8J54j58K71m1K92m42K73NM9j14P1r4r4O2k06K16j57O5r9R1J03k06r7
$$ plain form
6790 -197 96 -13 137 70 104 28 69 -210 -98 -41 -105 -5 129 228 167 -87 -55 -157 -226 -238 -115 -218 41 -75
6814 -75 57 -63 -46 -118 5 -41 -131 141 -103 308 218 72 133 -148 170 -94 217 93 -108 -61 223 -108 71
6837 71 49 147 -193 126 -93 46 60 -112 60 76 41 93 86 -51 223 169 93 35 24 195 141 -216 126 203 180
6862 180 -19 233 -21 -221 -14 -88 -103 -256 -292 120 -349 171 159 0 131 -65 -256 51 43 -119 56 13
6884 13 -25 -151 144 71 209 104 -119 -279 13 183 -47 242 -71 -228 108 -326 90 -122 -208 23 172
6905 172 -55 37 222 98 -46 63 -262 -62 50 -39 -105 -139 13 47 -309 -156 95 -170 -32 -63 39 228
6927 228 8 239 -124 81 233 2 -40 52 13 170 161 43 33 -56 262 128 -138 3 -125 -95 36 280 -273
6950 -273 -205 -51 -209 62 21 313 -129 144 149 198 84 155 61 -33 29 -177 39 -118 -53 -152 -61 42 -164 -261
6974b61M00k62R8k51J21L57k77K10p4j35L5q7K77j21J99m72M01j36P5L1o0k29
6996a61P6J72k18k50M21l44K95N3K59l60J76o8M1P9r0N2K2k29K94k90L31m46K05
7019B0L58l74j00j42J18K24j95m3O4qJ0k05J12J13p2K7L4K8P5r4J0j43J4P6K17
7044A24r2k06K36K52l46o9K38q0k1J40k50K56k26K1j77K42j77O3J21j06J13q8
7066c2K2J8l9J02j26k02M82m01Q1o2J55r7m6P8p4O6J13j66o1L11k49J35Q7k88
7090a93K75j8j37K85j39m68M42N9j08j21J58O8r0j47P5L68k84k54J72L4j04j29
7112b56K66M3j56K00k66J71J53n2Q0j30J17j42N7J02qJ05l03J67k13q0K61J90
7134C06k10j75L16j24J0k87P8L5K22k04J2J60j60K03n1j04l6K5n0J82k2%j62l2
$$ plain form
6974 -261 139 -123 -25 -276 -155 202 -75 135 61 -74 -39 -126 151 30 229 -243 158 22 97 128 68 -161
6996 -161 -85 87 -131 -381 40 -304 -9 44 303 -57 119 51 92 171 81 133 155 -74 220 -70 261 -185 20
7019 20 378 4 -96 -238 -120 104 -91 -134 -70 -78 -68 -273 -161 -48 -120 -93 -59 -31 44 -50 -40 -183 -169 -93 124
7044 124 32 -174 62 314 -32 -101 137 57 36 176 -74 182 -44 -23 -200 42 -135 -72 49 -57 56 -32
7066 -32 -10 8 -31 71 -55 -257 225 -176 -95 -157 -2 -99 -145 -67 -141 -75 38 -128 -189 122 -127 8 95 -193
7090 -193 82 64 -73 212 73 -395 47 106 -2 -123 35 103 13 -134 -59 309 25 -229 -57 -23 -127 -256
7112 -256 10 53 -103 97 -169 2 155 103 183 53 170 28 85 187 179 284 -19 148 -65 -145 116 306
7134 306 96 -79 237 113 123 -164 -86 -51 171 -33 -21 139 -21 182 131 27 -9 16 -34 148 126 126 -36 -68
7158f8P4j39NJ75j45J6l7%J67j98k1K28n4k25M48k45k9J26j34nJ70j80J72k23
7182a22K6J97l6J0j65L4L4j8k8O6k6J7j66L17k1k47J29J50O7j45q7j14J76j01
7206e3J46j91n8K44j7Rq8q0l4JJ00j79J85K4J99K1j33j03K85l15l9n3J82j1n6
7231a4M1J62k62K04q9J2J38k17m0J37M6J33k41k81K13jK07m90J7K78m8P6J24j91
7255h6j78K90j26K66l84J30k92L57O7K15j89k8K6k09J16J58m38K14K5M24j88j62
7277Hp1J54k34K93k01P0n8J50l0m0P5j73M6j32J70JJ6j68p8qN9J44K26l86K13
7302D6k2k8j58K02j94J04J78k92K42j82N0K90l79R5J5K77K1l62J16k03M05l57
7324a36M8J02J7J08n27L61r4R1J46j65J84m5J79j97j32N9j77Q8J69q6K68m34N2
$$ plain form
7158 -68 6 -133 -128 47 -98 -82 -119 -119 48 -150 -171 57 3 -222 226 -19 -48 78 -56 -61 109 -71 101 -122
7182 -122 -96 101 65 75 -90 -56 -22 -40 -68 -2 -28 -11 -177 140 119 -128 1 151 218 73 -14 -128 48 -53
7206 -53 93 -98 -156 88 71 80 -8 -88 -122 -121 -21 -200 -15 9 208 229 96 -7 278 -37 -76 -129 53 42 -14
7231 -14 27 189 -73 131 42 54 192 -25 -65 72 118 251 10 -271 -58 -59 148 -342 -325 -47 -95 -19 105 -86
7255 -86 -264 26 -100 166 -218 -88 -380 -23 44 259 70 42 68 -141 -25 133 -305 -91 -66 358 170 8
7277 8 -63 91 -143 150 -51 19 -39 111 81 41 116 -57 -11 -143 27 28 44 -124 -202 -210 -151 -7 219 -167 46
7302 46 24 -4 -162 40 -154 -50 128 -164 78 -104 -54 236 -143 -48 -33 244 265 -97 19 -184 221 -136
7324 -136 -88 14 31 139 -388 -27 -121 -30 116 -49 135 90 269 72 -60 -1 -178 -90 79 -7 261 -173 -121
7347a21J84j99K77j37l92J82K14m7J02l74K25J35j40m2j73L64l63L12j46K10O3
7368A34q8LK40l58K78m45K48N1n3K01m67J87L7J1r1r4j5J43j66K92M0k92K77j98
7392a25N4L9K3n0o8J41J57j12J07K6k90J77K8k68K98k0L2l22K07m3r4J96p2j46
7416a25o3L43j09J27k98M3Q7L30l93K23l77K58J4j42L6m5OJ98k64K6J33J32j0
7439A30j96k4j7j7K0J34J32q9J79l25J17k87J68J25j67K86l05j24M22j65K11l40
7461a32N8J36k10K3J91N2j29J15l14N04m55L5J99l15L63j11M6l16M34L14m82J04
7483A10k01n2P0J87J98k82m5K76j10p7n6r6L0k42J10N45k23j60l8J9Q2K29k64
7506A0L9n0O4M8o0l31L06%J18m1j5j84k9J84j0j09R2j02r7J57K0K9k2L0J62k94
$$ plain form
7347 -121 63 -136 141 4 -388 -206 8 -39 63 -311 -86 49 -91 -133 -306 58 -305 7 -139 71 134
7368 134 46 49 289 -69 209 -236 12 63 10 211 -256 -69 -32 -21 -112 -206 -221 -78 -244 48 88 -204 73 -125
7392 -125 -71 -32 -9 -59 -127 14 171 59 166 192 -98 79 107 -161 137 117 149 -173 34 -9 -103 93 21 -125
7416 -125 -188 155 46 173 -125 -82 5 335 -58 165 -212 46 60 -82 -46 -91 -85 113 -151 -125 8 140 130
7439 130 -66 -90 -107 -124 -104 30 162 73 252 -73 44 -243 -75 50 -117 169 -136 -260 162 -3 208 -132
7461 -132 -74 62 -148 -125 66 118 -11 104 -210 294 -161 -126 73 -242 121 10 56 -260 174 488 6 110
7483 110 -91 -143 -73 114 312 30 -15 261 151 74 18 -78 -48 -290 -180 365 142 -18 -56 -37 45 274 10
7506 10 49 -1 63 111 51 -280 26 26 144 103 88 -96 -125 59 49 -60 32 -70 -167 -10 10 39 17 47 209 -85
7532h5K51J00l07J17M5N1J64j95Q1J0j33R3j75q1O5O2k19O3o6R7p3L06k64J27
7556C4j20K0Q9k54K94J30j17J05k51l3K27r4R2q6P2j39L08k92k0q5J95j88K14
7579A01l88N4L27l88L54j81L60m06P1q5J52J03j31J51j1r5Q8J85k08r7J20k94
7601b18mL52l3k97L02J71j37O4l38k9j12L79J49k49J6j22K81l04J62j39J05K33
7623B32k98Q5J7L0K6o3K13k01K41j84j87j01K6q9J27q9K56J14o40M34q9N2L47
7646B59k49M8j93J47mo7m2Q7l46L87j80L28k65j99J49J46o7n3K18k77Q4K6M1Q6
7670F4k86K22R9j05l4O0K33l90M9O2N9O3K9k59J9q1n9K54j87n6J4K90J11j47L3
7695E7K7Q4q6l5R0l00K99j03N7J04k98J00J15j06j0P4j16j01J58l0o6rJ17k33
$$ plain form
7532 -85 166 266 -41 76 121 172 336 141 222 232 99 192 17 -64 1 63 -156 -93 -159 -62 -135 171 -93 34
7556 34 -86 -66 23 -231 63 193 76 181 -70 -103 124 30 122 36 108 -31 277 -15 -35 -120 75 -113 101
7579 101 -287 -233 94 -294 60 -121 239 -167 -96 -181 -29 74 -57 94 83 -12 76 261 53 -44 76 -218
7601 -218 -222 130 97 -200 102 273 136 200 -138 -167 -279 100 249 0 16 -106 175 -129 33 -106 -1 232
7623 232 -66 19 36 66 92 29 242 41 282 98 -89 -190 -164 -253 -126 -215 41 155 -485 -51 -140 -88 259
7646 259 10 58 -135 12 8 -59 -101 -14 -360 27 -153 175 -90 -289 -140 6 -61 -114 104 -173 -89 -63 -22 64
7670 64 -222 0 99 -6 -40 20 253 -137 -88 -26 33 96 125 -134 -115 -196 -255 -1 -188 -244 -230 60 171 24 57
7695 57 84 168 82 47 137 -163 136 33 90 194 -104 -4 111 5 -5 69 -47 -148 10 -20 -86 -95 22 -211
7719b11K9k3J44J13j04J5rJ30j43J71j10K98l01M2j07j10L42l4n00L97j09j69
7741b49K18l5LJ50O7Q3k27m6n0J62K27l91K18K6l51k1K02J88r4j64K9l6J77j87
7765a01L17l09j72L46k39Q9K00l12L26Nk39J21j76Q9k57M00k26J33n8J69j0j15
7787a9oP7K8m73N27k03p7l0J76J77j96q8k9J26Jj93K04r3K04J2q7J16l96K72l1
7812aj70R1K25j89k8J6K0K98j37k6k44K63q7o9J00K5P5k48K1K41j6q4Ll9j09N7
7838a2J8J85l49K12J17n06L54L3lk3j82J22k5j38J19j13jJ71K6o4P8J32q3J42
7862B10m00J33n9K25Q4m56M43o6K7no5k80K36l0K1j79j8M34l01j35P7PJ12K68
7886B83l39m6K23j86J40m2j37m4M97m00m6K40j82K77l25J45j11L2K36j86j49j11
$$ plain form
7719 -211 -182 -205 -61 52 -52 -37 -46 84 -59 112 2 300 -1 41 -66 -176 166 132 -368 29 -80 -249
7741 -249 -31 -66 -63 87 154 237 10 -36 -86 76 303 -88 130 156 -195 -216 -14 174 80 -84 -55 -91 86 -101
7765 -101 216 -93 -265 81 -158 -69 131 -181 145 150 -89 32 -144 -55 -312 88 -138 -5 -63 106 96 -19
7787 -19 -25 52 80 -393 134 -69 -146 -176 0 177 -19 -107 -136 -10 -9 -202 2 -91 113 125 38 154 -242 30 -1
7812 -1 -171 -80 145 -44 -72 -56 -36 262 125 99 -145 118 31 -38 62 87 162 -86 -65 176 160 76 79 40 -69 -12
7838 -12 6 191 -158 54 171 -335 19 52 49 26 -156 -34 -59 -197 -78 -191 -192 -21 5 -59 19 151 68 210
7862 210 -190 -57 -116 109 193 -263 180 114 141 136 71 -209 27 -3 18 -161 -179 255 -46 -181 -104 -97 15 283
7886 283 -56 -102 121 -65 75 33 -104 -148 349 -51 -97 143 -39 238 -87 58 -53 -21 215 29 -120 -231
7908b31K5L10M5m02N06j92J16J51o21q6M72p4%J01N3j52L6k46J24J49j4p5j30
7931a35M5m4K18k02n7r1K83p6j08Q0N9Jk28N07j89k49J80l17N12k90j6K07p7j90
7955a77Q1J36k05J58J8J1n6n6M3J63m04J88m01O14J7k97M13m81K37r0L8k3K7l80
7979d26M34rr1J1q1L74k75Kj6J73k60P3nJ33p9k43L71p8j77N7Q8J26J28j85j52
8004a07j8O7L48k73J57j86P5J22k78J87r1k16K38o0J48o3No5O3k89k8L74k7k51
8028a68K20O4j70J17J68l42K45o4k6q3l20J22J78k28K28K12k91j2J60j91P1K23
8050A13j09o0O0Q2R1l33L97j61k4M8j52K56r1J83k33m17L37K30l70n9N7J12l06
8073c49J83j21j20M02l4J48k58J57K4j10J59l2j46J08l52M82k8n5j65K61k89K81
$$ plain form
7908 -231 -206 104 149 -253 253 61 177 328 -293 -379 93 19 19 120 173 21 57 -189 -65 84 70 -5 -135
7931 -135 -90 -134 84 -118 -175 -266 17 -59 -167 -87 -28 -27 -255 252 63 -186 -6 -323 189 -101 -117 90 13 -177
7955 -177 -96 40 -165 -7 11 22 -34 -90 -47 116 -288 -100 -501 113 130 -167 246 -235 2 -88 -50 -73 -46 -426
7979 -426 8 -1 -92 -81 -162 212 -63 -61 -77 96 -164 -91 -96 37 -42 -285 86 8 -169 -112 -24 102 230 45 -107
8004 -107 -125 -58 290 17 174 -12 63 185 -93 94 3 -213 25 -35 113 50 55 -10 53 -236 -264 110 83 -168
8028 -168 52 116 -54 63 231 -111 134 70 44 -39 -359 -237 -59 -287 -59 153 -138 -150 10 -181 -110 113
8050 113 4 -56 4 86 177 -156 241 80 56 104 -48 208 117 300 67 -350 -13 217 -153 -212 -155 -43 -349
8073 -349 -166 -287 -407 -5 -39 109 -149 8 32 -78 81 49 -97 11 -341 141 113 58 -107 154 -135 146
8095A46j09k38L66l2j02o3o2k2K16o5k43Q1K13m0j6N2k00J89q8J24j95M0j90L37
8119I9k0k28J71j83j8K11L4N5j85J23K4j84PJ47l8J05j43l63K29L82j67J05j1
8142A52j05M1L6l7L1J3k11J91r1k1j1L5j48L35l65J27%J7J15K96l28Nj37k00O37
8167C77m05j04j32J32K58l27K38j96K58K1j11k1k42L38o0J42j00K19J6j5l5k98
8189d7k0K01
$$ plain form
8095 146 37 -201 165 133 31 -32 -94 -116 100 35 -208 -127 86 46 30 82 -118 71 -17 107 -88 -48 -238 99
8119 99 79 -149 22 -161 -179 32 66 121 -64 59 83 -101 -94 53 15 120 -23 -386 -157 225 58 163 152
8142 152 47 88 124 87 118 131 -80 111 20 -1 -12 23 -125 210 -155 -28 -28 -11 104 400 72 77 -60 -260 377
8167 377 -28 -132 -264 -132 126 -201 37 -159 99 120 9 -12 -254 84 24 166 66 285 301 286 251 -47
8189 -47 -67 134
8191A34
$$ Imaginary data points
##PAGE= N=2
##DATA TABLE= (X++(I..I)), XYDATA
0@%%%%%%%%%%%%%%%qJ6j6J6j6K4l2L2m0M8n5O3p2Q7r7J09j25J42j63J84k07K33
37A23k62K93l26L62m01M45m94N47o04O67p36Q10q94R88j085J194j318J457j614
56h48J790j993K227k501K833l236L740m395N281o559Q571j2230K1034q4194j05995
71a76475P1520M9327Q0379J15074R2559P307N009j9504p5524p8830l1867m5170
83f195l4902J9279K9375r220k336j2394o3394p0947k6249j8069o502M7538O7442
96h6574L7327M5537N7335J9738L93K2661K594k4543L636J9721k523P908K5264
109A28474j3219m0546k4904l8934o0582l1370j2661l1776j5587J7911R628Q187
121a05379L5794L0082J104R034J8769K00P746L7811K9721J6172K8132K0824q022
$$ plain form
0 0 0 0 0 0 0 0 0 0 0 0 0 0 0 0 0 -8 8 -8 8 -8 16 -16 16 -24 24 -31 32 -40 47 -50 59 -66 76 -87 97 -110 123
37 123 -139 154 -172 190 -211 234 -260 287 -317 350 -386 424 -470 518 -567 627 -691 766 -848
56 -848 942 -1051 1176 -1325 1508 -1728 2012 -2383 2898 -3661 4910 -7320 13714 -70480 -176475
71 -176475 -104955 -55628 24751 139825 232384 239691 244700 225196 149672 70842 38975 -6195
83 -6195 -41097 -21818 7557 -1663 -3999 -16393 -79787 -150734 -176983 -195052 -201554 -154016 -86574
96 -86574 -49247 -3710 53625 73363 73756 96417 99011 74468 78104 97825 95302 103210 128474
109 128474 115255 74709 49805 10871 -49711 -81081 -93742 -125518 -141105 -123194 -113566 -105379
121 -105379 -69585 -39503 -38399 -29365 -10596 -10396 -2650 35161 64882 81054 109186 130010 121988
134A21988p535l915l3183m5111k7614k9080l3717m660J2034n100l015N656j5450
147f8702k3879k096K468r61K2346L9844K9848L4043M3689K3455Q33k64j2767k8330
161E9527j5243k66m565j155Q223n003k3783k0781k3773l7745k8720j1315q202
174a12801J948K5229L0641K1813K6782K1962K522k568O026K277K652J7857J9725
187F4065R686J2229Q964r886k0700k2585l1053l7497k2848j2157r686N216J4589
200e1663O359K302J920k685r755j290Q288J0298J9824L1614L0060K3624K1053
213H9949P771j0774j6953j7921k3177j8782n267j645k010K577l95j3009j8017
226b7653j7849k2368j9146m518O522J4980K7516L2049K5325J7906J1639n62q916
$$ plain form
134 121988 114453 110538 77355 32244 4630 -24450 -58167 -62827 -50793 -55893 -58908 -53252 -68702
147 -68702 -92581 -94677 -92209 -93170 -70824 -30980 -1132 32911 76600 100055 100888 100624 87857 59527
161 59527 44284 44018 39453 38298 46521 41518 17735 -3046 -26819 -64564 -93284 -104599 -112801
174 -112801 -110853 -85624 -54983 -33170 -6388 15574 18096 15528 21554 23831 26483 44340 64065
187 64065 73751 85980 94944 85058 64358 41773 10720 -26777 -49625 -61782 -71468 -66252 -51663
200 -51663 -45304 -43002 -41082 -43767 -53522 -54812 -46524 -36226 -16402 15212 45272 68896 89949
213 89949 97720 86946 69993 52072 28895 10113 4846 3201 1191 3768 3373 -9636 -27653
226 -27653 -45502 -67870 -87016 -91534 -85012 -70032 -42516 -10467 14858 32764 44403 43841 34925
239C4925n613k492o10Q871J5757J1259N174j326j4016k7473l0285k8092k5384
252e9305j4139J588R303J4164J7286J1894K068k138n612o845j707R544J6924K2232
266A5257K7201K3635J2450J998p348j9285k3738j9718j5311q986J55N529M079
279d082R21m350j2665j7373j6371j2453n023P309J7683K2500K5169K2934J3865
292C8064M457k181p413r535n583R77N266Q601R258M158m303j1097j9067k3105
306a1503k1912j6346q875P22R330J2446J2641J1474O142k78l007l113j454M024
320i709J0821J5153J6106J5370R783J457o432j3205j7782j7856j3288q965k279
333b0826K798M297K506j35m311r001j0101p511l162L129J1306J6587J7708J7270
$$ plain form
239 34925 29312 26820 26210 35081 50838 62097 67271 65945 51929 24456 -5829 -33921 -59305
252 -59305 -73444 -71856 -62553 -48389 -31103 -19209 -17141 -19279 -24891 -31736 -33443 -23899 -6975 15257
266 15257 42458 66093 78543 80541 73193 53908 30170 10452 -4859 -13845 -13690 -8161 -4082
279 -4082 -3161 -7511 -20176 -37549 -53920 -66373 -71396 -64087 -46404 -23904 1265 24199 38064
292 38064 42521 40340 32927 23392 17809 18786 24052 32653 41911 46069 41766 30669 11602 -11503
306 -11503 -33415 -49761 -58636 -57914 -48584 -36138 -23497 -12023 -5881 -6159 -9166 -12279 -13733 -9709
320 -9709 1112 16265 32371 47741 57524 58981 52549 39344 21562 3706 -9582 -18547 -20826
333 -20826 -18028 -13731 -11225 -11360 -15671 -24672 -34773 -42284 -45446 -42317 -31011 -14424 3284 20554
347B0554J3342O479n21n041q357p967m598j057J287M057M279o56n228r544j4878
362g849j6807j3470r075l480M144J1166J3029J2748J1282N785J8k017l004k302
376A68K479P509J0477J1403J0741M666k847r417j4097j8013j6264j0109o148k89
390b9741N544P504M490J232j645o683q005m621m06M550J2554J7143J6634J4611
404C3161J0169J834n700r157j1128j1614n818K8K577M682N565M67p430j1143j4486
419a7993j6779j2070k818L104R663J6738J6627J1346P249K783n054o779l513j439
433A065L015J0451J3577Q704O287K66r887j6847j5357j5996j3939m680L252M400
447b5689P460R590L532l095m096p021r527j923O627R802J4867K0319J3879N699
$$ plain form
347 20554 33896 40375 39854 34813 26456 18489 13891 12834 14121 18178 22457 21801 16573 7029 -7849
362 -7849 -24656 -38126 -47201 -50681 -46537 -35371 -22342 -9594 1688 7473 7491 5474 2470 168
376 168 2647 10156 20633 32036 42777 47443 44596 35179 21082 3069 -13195 -23304 -29452 -29741
390 -29741 -24197 -16693 -12203 -10971 -12616 -19299 -27304 -31925 -32331 -27781 -15227 1916 18550 33161
404 33161 43330 45164 39464 30307 19179 7565 1747 1775 4352 9034 14599 15066 7636 -3507 -17993
419 -17993 -34772 -46842 -49660 -46556 -36893 -20155 -3528 7818 15067 17850 12796 6017 2504 1065
433 1065 4080 14531 28108 36812 43099 43365 33478 16631 1274 -14722 -28661 -33341 -30089 -25689
447 -25689 -18229 -8639 -5107 -8202 -12298 -19319 -28846 -30769 -24142 -14340 527 20846 34725 40424
461D0424K969m220j3254j1831p996q172l001O555O552J766K271l082j3867j5025
475a9911j0730j0583m818P540J1378J0092J4311J3911L378K07J030o369p885J512
489C063M629L570J0020J2184J812m129m419j2917j7937j0920o928q528l23Q396
503b2427M723M556R044J287p235l756k409n728L078J3857J0848R172J4243P684
517C6937l529k654l353j3302j1096k609m809m107O860N800l129j823k468j2955
531a6237j1591j439k114j694R753J2132N877J0391J3024K144k162J357n099r433
545D909N28N891J349M889Q703k652q012m765r695j5552q159l239p262J18J1645
560b1304P577M141R742K824p314l075J806k831K564J2647R463M257R919N570n523
$$ plain form
461 40424 43393 39173 25919 14088 6092 -2080 -5081 1474 8026 9792 12063 8981 -4886 -19911
475 -19911 -30641 -41224 -46042 -38502 -27124 -17032 -2721 11190 14568 14775 15805 9436 1551 3063
489 3063 7692 11262 21282 33466 35278 31149 26730 13813 -4124 -15044 -21972 -30500 -30823 -22427
503 -22427 -17704 -13148 -4104 -2817 -10052 -13808 -16217 -21945 -18867 -5010 5838 15010 29253 36937
517 36937 33408 30754 27401 14099 3003 394 -4415 -8522 -1662 4138 1009 -814 -3282 -16237
531 -16237 -27828 -29267 -31381 -33075 -23322 -11190 -5313 5078 18102 20246 18084 19441 14342 4909
545 4909 5437 11328 12677 17566 26269 23617 15605 10840 1145 -14407 -22566 -25805 -33067 -32949 -21304
560 -21304 -13727 -9586 156 2980 -4334 -7409 -5603 -8434 -5870 6777 16240 20497 30416 35986 30463
575C0463n157m525j4364j4145l474l045k787P315P314k672k752k73r045r531M30
590b6248J009m78J0060J5469Q607J0083J1898O67q061m405o525j0011o39P078
604H504J946K763N896k916j0639o884r280j5497q334R62O2N132J5333J1158L998
619B204N208J380p517n180K459L97L056J1633R765L527N568K111r271j1858r442
634D040j3415j1770l63L876J923O411P523k357n670k390o494p373J883O529O127
649a1520J1495J5764R094L782K729m853j1501p334l569m561N25P096K803n97O39
664I992m478j1714r371o741q491k748O205P533P875J1716Q664Q46m2j077m804
679C365l523L185L606L487Q052O810M73k227l841j0547j2612q164o068m880K783
$$ plain form
575 30463 25306 20781 6417 -7728 -11202 -14247 -17034 -9719 -2405 -5077 -7829 -8102 -17147 -26678 -26248
590 -26248 -25239 -25717 -15657 -188 8419 18502 30400 31067 23006 18601 12076 2065 1426 8504
604 8504 10450 13213 19109 16193 5554 -1330 -10610 -26107 -34441 -33479 -33417 -28285 -12952 -1794 2204
619 2204 7412 8792 1275 -3905 -1446 -1049 2007 13640 23405 26932 32500 34611 25340 13482 4040
634 4040 -9375 -21145 -21508 -17632 -15709 -9298 -1775 -4132 -9802 -12192 -18686 -26059 -24176 -17647 -11520
649 -11520 -25 15739 24833 28615 31344 26491 14990 7656 4087 -474 51 7147 9950 9353 9992
664 9992 5514 -6200 -15571 -22312 -30803 -33551 -27346 -19813 -11938 -222 8442 9288 9246 8169 3365
679 3365 -158 3027 6633 10120 18172 24982 25455 23228 19387 8840 -3772 -11936 -18004 -22884 -20101
694b0101O069L947L144L543j534n078k029j316j595L887Q402P694Q476R122L888
709B6519j633l059n264q766o352k324k107l87L544J607k033j638l640p129o582
724a9244k846j938J145O671Q902P390P903O029R59j934p62l496l808M78K619K417
740A0485L464L066j098m687n668q078j0083o641k956j123L204N974N211M359L734
755h37O78k250j527k31q6K798O896O288O590N157K372l235n139p755q418p404
771f103l867j048J094L463K625N97j303l153n655n120k426R08L980Q157R903Q387
787A0439O798M039j123m407m759m909l430k93K457L354L001J406k335n778p323
802b863r324p797m595p21L416O517Q016O767M541J539j217l278k946j105J764
$$ plain form
694 -20101 -14032 -10085 -6941 -3398 -4932 -10010 -12039 -13355 -14950 -11063 -2661 5033 13509 22631 26519
709 26519 24886 21827 16563 7797 1445 -879 -2986 -3373 171 1778 -255 -1893 -5533 -12662 -19244
724 -19244 -22090 -24028 -22883 -16212 -7310 80 7983 14012 14971 13037 12275 8779 4971 5449 8068 10485
740 10485 13949 17015 15917 11230 5562 -2516 -12599 -19240 -22196 -23319 -20115 -14141 -8930 -4571 -837
755 -837 -159 -2409 -3936 -4167 -4253 -1455 5441 11729 18319 23476 25848 22613 17474 9719 1301 -6103
771 -6103 -9970 -11018 -9924 -6461 -3836 -3239 -4542 -7695 -13350 -18470 -20896 -19988 -16008 -7851 2052 10439
787 10439 17237 21276 20153 15746 10987 6078 2648 2355 4812 8166 11167 12573 10238 4460 -2863
802 -2863 -12187 -19984 -24579 -25300 -21884 -15367 -7351 -584 3957 5496 4279 1001 -1945 -3050 -1286
817a286M366P086O696N558K276k606o309q700r125p620m160l90K364L890M418
832c542J926j180k996m393m630l039Q33M568P506Q689Q439N977K406j211m250
847A5103o019n304l176q18J555L162K407J847j519m704p041p277o349l786K71
862b1648L678O304P386O360M345J074j191k674k920j270R12L425N272M983L370
877A7406R07k521n302p270p456n646l778p70K371L514L245K527M50j042k923k381
893h669j793O00L179N074O037O829M787J878q55l137m482n665l736k331n47J239
909a592K215J350q13j675l779n308m416k224n14K105N180N544N796N143K916J42
925A0070j109k305k471j512J068J865J840K961J740j621l150m397o052o302l955
$$ plain form
817 -1286 3080 10166 16862 22420 24696 22090 15781 7081 -2044 -9664 -13824 -14214 -11850 -7960 -3542
832 -3542 -1616 -2796 -5792 -10185 -14815 -17854 -17021 -12453 -4947 3742 12181 18158 20564 19353 15103
847 15103 9084 3780 604 -214 1341 4503 6910 8757 7238 2534 -4507 -11784 -18133 -21919 -21648
862 -21648 -17970 -11666 -4280 2080 6425 7499 6308 3634 714 -556 356 3781 9053 14036 17406
877 17406 18313 15792 10490 3220 -4236 -9882 -13660 -14430 -12059 -8545 -5300 -2773 -2323 -3365 -6288 -8669
893 -8669 -10462 -9862 -6683 -1609 4428 11257 16044 17922 17067 13930 9448 3783 47 -2284 -2831 -1592
909 -1592 623 1973 1160 -515 -4294 -9602 -14018 -16242 -16756 -14651 -9471 -3927 1869 7012 9928 10070
925 10070 8961 6656 4185 2673 3741 5606 7446 10407 12147 10526 7376 2979 -3073 -9375 -13330
940a3330j767o43K702M665L526K949K347j64k646j205q27j63L112N661M621M602
956A3440M082N30l309m043n107o695m742j012l50J151L537K348j099j732k658
971e659n177l530k53N57K869P061O457N194M777K562k079l725k776l536k453J290
987A579L113J932K311J858k745n575n067o302o448k247J023J944N059P031M169
1002A635J019J497k239m656j398J143P24M373O873M545J849K300k171o346n822
1017C326m877o003l204K598K246K144L732Q60l006l126k353m323k072K757L593
1032g708L848P133O866K313J278l5m320o030k187j306r30L048M532O35m72m19
1048F246m478o907l769l899l970J377M706L614M469N992J967j774j007j433l279
$$ plain form
940 -13330 -15097 -15740 -13038 -8373 -4847 -1898 449 285 -2361 -3566 -4393 -4556 -1444 4217 8838 13440
956 13440 17522 18052 14743 10700 5593 -1102 -5844 -6856 -7206 -6055 -2518 -170 -1269 -3001 -5659
971 -5659 -10836 -14366 -14619 -14062 -11193 -4132 2325 7519 12296 14858 12779 9054 6278 2742 289 1579
987 1579 4692 6624 8935 10793 8048 2473 -2594 -8896 -15344 -17591 -16568 -14624 -9565 -2534 1635
1002 1635 2654 4151 1912 -2744 -4142 -2999 -2275 2098 8971 13516 15365 17665 15494 9148 3326
1017 3326 -1551 -7554 -10758 -8160 -5914 -3770 -38 822 -2184 -5310 -7663 -11986 -14058 -11301 -7708
1032 -7708 -3860 3273 10139 12452 13730 13695 9375 3345 1158 -148 -1078 1970 6502 7137 6665 6246
1048 6246 1768 -5139 -8908 -12807 -16777 -15400 -10694 -7080 -2611 3381 5348 3574 2567 1134 -2145
1063b145O2L456K283K577N157K258j179j703k732o716n408k454l248p92L530L045
1079d009O84J915N38k954k702k88j237q80M084M857L077N178M694J48j734j270
1095A0101m119n340j150L10q29J577K850j038k003m79l180n196k256j111j399
1110a3262J589N347L962L133M237J906j087r69m50k186p67K600J349O51L139J324
1126A0516k182j719l348o091n246j908j316l53K933L977J591J089J450j431k324
1141d362o1l38J17L485M895L495L878L541m76l323k827m177n028j909J31m13Q68
1158b504K848K61j698j161l156m358k547k02L41K882O355N007L573L176R71j931
1174G857k195j878k362o77K193K738J713K267K74k863m571m630n507m843p49J052
$$ plain form
1063 -2145 -2083 1373 3656 6233 11390 13648 12469 10766 8034 1318 -4090 -6544 -9792 -10584 -7054 -4009
1079 -4009 -3325 -1410 -872 -3826 -6528 -6816 -8053 -8933 -4849 8 3085 8263 12957 13105 11371 10101
1095 10101 5982 642 -508 -198 -1027 550 3400 2362 359 -120 -3300 -8496 -10752 -11863 -13262
1110 -13262 -11673 -6326 -2364 769 5006 6912 5825 4856 4406 2220 1453 4053 5402 6053 9192 10516
1126 10516 8334 6615 3267 -2824 -8070 -9978 -11294 -11647 -8714 -4737 -3146 -2057 -607 -2038 -4362
1141 -4362 -4423 -4761 -4644 -1159 3736 7231 11109 14650 14174 10851 8024 3847 -1181 -3090 -2959 -3372 -2504
1158 -2504 344 605 -1093 -2254 -5410 -9768 -12315 -12517 -12176 -9294 -2939 2068 5641 8817 9788 7857
1174 7857 5662 3784 1422 745 2938 5676 7389 9656 9930 7067 2496 -2134 -7641 -12484 -13233 -12181
1190a2181K135L686M536J976N45j60j946k832l80R61J830M278N541L691J738Q68
1206A4286k449m703m638l779l637j076J584J802J214K008j26k661l004l207l011
1221a1397j054K054L282M597N738M483J779M57j465l030l042j337j06O96K556
1236D211K491N10k50j901m146n122l849k950j800J172L633K637L902K757Q82j133
1252A044q26j102j478N75K369K883L199L411J722p80j793l371m507l967k240j389
1268f250J52J548J454J274K41r16k101k063j150o33J063L284L692M170L185K674
1284I624K57q30k081k686k060j118j07O10Q75R57n62j090k458l145l473k273j417
1301a0977J02K141K688L871K726K459R83m15o64p96q95O25J552K163J836K018
$$ plain form
1190 -12181 -10046 -6360 -1824 152 697 537 -1409 -4241 -4621 -3660 -1830 2448 7989 11680 13418 14286
1206 14286 11837 7134 2496 -1283 -4920 -5996 -4412 -2610 -1396 612 486 -2175 -5179 -8386 -11397
1221 -11397 -12451 -10397 -7115 -2518 3220 7703 9482 9939 8474 5444 2402 1065 959 1655 4211
1236 4211 6702 7212 6962 5061 915 -4207 -8056 -11006 -12806 -11634 -8001 -5364 -1462 1295 2177 1044
1252 1044 218 -884 -2362 -1787 582 3465 6664 10075 11797 11017 9224 5853 1346 -2621 -4861 -6250
1268 -6250 -6098 -4550 -3096 -1822 -1581 -2497 -4598 -6661 -7811 -8444 -7381 -4097 -405 3765 6950 9624
1284 9624 9881 9051 6970 4284 2224 1106 999 1609 2484 3441 2879 1789 -669 -3814 -7287 -9560 -10977
1301 -10977 -10875 -8734 -6046 -2175 551 3010 3993 3578 2914 2118 1223 1848 3400 5563 7399 9417
1317I417K99j386k494l838m209l449k081q09O54J818J856J338J018n29j196j341
1333d932q09J73J613L331L589L621L267J176q0j669l263l227k592j453m07L99
1349a263J609Q60k1j454k467l316k904j985p29K011L055M143M232L040J696J59
1365F666j446j990j466p64O83J951K293K215P82r77k440l903m319m009k790p81
1381a0295J227K321K845K288J876m19j327j443j453k08J036K559M228L903L159
1396A0297J430p45k225l840l826k993j846j41J464J604J206P32j238k415k952
1411e488k798j678k44K125L426M151L602L022J141k54j530k431j538n17J5J202
1427B206K279J978n2p25j965l885l715k821k456n05J345K437K501K773J547Q9
$$ plain form
1317 9417 9716 8330 5836 1998 -2211 -5660 -7741 -8550 -7896 -6078 -4222 -2884 -1866 -2395 -3591 -4932
1333 -4932 -5741 -5568 -3955 -624 2965 6586 9853 11029 10949 9280 6017 2790 198 -1255 -1662 -1263
1349 -1263 346 1206 1185 -269 -2736 -6052 -8956 -10941 -11670 -9659 -6604 -2461 1771 4811 6507 6666
1365 6666 5220 3230 1764 1000 1683 3634 5927 8142 8924 7947 5507 1604 -2715 -6724 -9514 -10295
1381 -10295 -9068 -6747 -3902 -1614 262 -157 -1484 -2927 -4380 -4588 -3552 -993 3235 7138 10297
1396 10297 11727 10982 8757 4917 1091 -1902 -3748 -3889 -2425 -821 385 1117 -121 -2536 -5488
1411 -5488 -8286 -9964 -10208 -8083 -4657 -506 3096 6118 7259 7005 5475 3044 1506 989 1004 2206
1427 2206 4485 6463 6411 5686 3721 -164 -3879 -6700 -9156 -9661 -8316 -5879 -3378 -605 942 1031
1443A031q00j196q44q36J567K183K184L018K789N20r76j856k935l284l275j235
1459c945p16K82J739R24N64k20j084k105j667o48nJ357K815L072K727K952J566
1476G608k24j038j192k158j492l40r0O47R83Q79q99j175j942l297k950j440q40
1493h960J00K075K978K116K488J718J20j344j37m30n27J065J933J470J578J990
1509H233m37j386k162k681l712k430q43r24P09K006J040N50K80k8j901j216J15
1526d787m90J455K929L344K742K465J593j037k117j897k845k034J5N47N40J195
1542A618J154j098j513j621l365l121j013K02J175K861M002K209J589J615j038
1557C656j906p64p43m64J262K350J871J277J197q82k726k549l396l631j477J47
$$ plain form
1443 1031 231 -965 -1809 -2645 -1078 1105 3289 6307 9096 9616 8640 6784 3849 565 -2710 -3945
1459 -3945 -4661 -4379 -2640 -1716 -1152 -1372 -2456 -4561 -6228 -6876 -6881 -5524 -2709 363 3090 6042 7608
1476 7608 7384 6346 5154 2996 1504 1164 1074 1721 2704 3583 2684 1509 -433 -3730 -6680 -8120 -8960
1493 -8960 -8860 -6785 -3807 -1691 797 2515 2635 1291 1154 724 197 1262 3195 4665 6243 8233
1509 8233 7796 6410 4248 1567 -2145 -4575 -5418 -6342 -5633 -3627 -2587 -2037 -1757 -1785 -3686 -4902 -4787
1526 -4787 -5277 -3822 -893 2451 5193 7658 9251 8214 6097 4200 1355 -679 -664 -117 423 1618
1542 1618 2772 1674 161 -1460 -4825 -7946 -8959 -8757 -7582 -4721 -719 1490 3079 4694 3656
1557 3656 1750 986 243 -221 1041 3391 5262 6539 7736 6854 4128 1579 -1817 -5448 -6925 -6778
1573f778J131J830K440J282m2k77j277k171j334P49J072K117M022L022J520J245
1589H551o61k829k865k044j646j124J566J258Q64Q54J36j677k562k044j950j941
1605h114M41K297K458K418L584J344J86o59j202k399m37J69K12J692K305J241
1621E536j18l76k032l446k762j804j862J4J994J869J595K004N42p05j512n72j017
1638b652j31J390K079J711K648J728J73j055j160k738k663j291n94l72J048J513
1654c66J75J06l35j564j391r98q94k15J112K562K093K142K118L80n10o85q19j877
1672A034o80N33J42O33J416N84j005j279j420l084j697q95k78L83J741K188J196
1689d88J269Q56o85o94l35m43l34J217J807J263J458J337l27j512j361k275k582
$$ plain form
1573 -6778 -5647 -3817 -1377 -95 -137 -414 -1691 -3862 -5196 -4447 -3375 -1258 2764 5786 7306 8551
1589 8551 7890 5061 2196 152 -1494 -2618 -1052 206 1070 1924 2060 383 -2179 -4223 -6173 -8114
1605 -8114 -7673 -5376 -2918 -500 3084 4428 4614 3955 2753 354 -83 86 298 1990 4295 5536
1621 5536 5418 5042 3010 -436 -3198 -5002 -6864 -6850 -4856 -2987 -1392 612 1154 449 -1063 -1635 -2652
1638 -2652 -2783 -1393 686 2397 5045 6773 6946 5891 4731 1993 -670 -1961 -2555 -2927 -1879 -366
1654 -366 -191 -85 -420 -1984 -3375 -4373 -5267 -5482 -4370 -1808 285 2427 4545 4925 4415 3730 2911 1034
1672 1034 354 887 1029 1662 3078 3662 2657 1378 -42 -3126 -4823 -5718 -5996 -5613 -3872 -1684 -488
1689 -488 781 1637 952 258 -77 -520 -854 363 2170 3433 4891 6228 5901 4389 3028 753 -1829
1706a829j558m11p8J026J334Q65L25j6j198j722p86n49K90J670K481K186K122
1723D152J605L22j383j490j258j854j017N56O70O57J484L03o32j733j641k798
1739d057j641m56N79R74K243K670J656Q05K18j131j470r37q42K05J490K230J839
1756D375J139M12j280j936k837k307j887o66M91J470J895J801N36n07q84j700
1772a885j203j127M81J342K119K786K119R69Nr56k055k196j583o72j73J238J143
1789C52J309P99m70j677j987j793j409p99P98J800J845K520J549N86k03j114j372
1806G34j319m43K64Q17J764J220J194l25q50j921k240j565j549n50P46J236J731
1823a056J357Q57m2p96j161p34o80K38Q16J526K160J445R16m35o98j410j981j358
$$ plain form
1706 -1829 -3387 -3798 -3876 -2850 -1516 -651 -326 -342 -1540 -3262 -4048 -4597 -4307 -2637 -156 2030 4152
1723 4152 5757 6079 4696 3206 1948 94 -923 -367 303 960 2444 2747 2115 382 -1259 -4057
1739 -4057 -5698 -6154 -5575 -4601 -2358 312 1968 2773 2991 1860 390 -547 -1389 -1184 306 2536 4375
1756 4375 5514 5926 4646 2710 -127 -2434 -4321 -4987 -4496 -3026 -1131 670 1206 699 -185 -1885
1772 -1885 -3088 -4215 -3734 -2392 -273 2513 4632 5601 5606 4650 2595 399 -1184 -1856 -2029 -791 352
1789 352 1661 2460 1990 313 -1674 -3467 -4876 -5675 -4877 -3077 -1232 1288 2837 3423 3220 2106 734
1806 734 -585 -1028 -764 53 1817 3037 4231 3906 3056 1135 -1105 -2670 -4219 -4769 -4023 -2787 -1056
1823 -1056 301 1158 1116 320 -841 -1575 -2255 -2017 -1201 325 2485 3930 4846 4411 3713 2303 322 -1036
1841a036j044k97N24J088P87O65m9j052q64j258j118k31J28J135J677K359Q96
1858B310R23M28m32j218j138p51k69J94P28R45P92Q6n29r18j693j898j201p06
1876d347l1O07J340J343J316Q44K4k88q41q54j84J77M80J794J604R31N66k80j214
1895B987j492j566j884p10j48N88R67Q78Q24k18m35j220j344p43N5J40J493J801
1913b7J566J928R02l49q93j255j409j202j78L93R56R73Q22M36r68j527j545j868
1931c245j277j97M64J367J933J733Q99J46N4j301j335n60KJ71J765J414J347P63
1949D143K24j052j686k140j692j252j17J001R46J408J051K77l77j266j284j118
1965b934p43J029R14J578K127J475P21j12j207j664j455j138l06K69J161J394
$$ plain form
1841 -1036 -2080 -2377 -1853 -765 22 687 638 -414 -1278 -2536 -3654 -3885 -3757 -2622 -945 1414 2310
1858 2310 3233 3661 3229 2011 873 122 -147 47 775 1720 2512 2598 2069 1151 -542 -2440 -3641 -4347
1876 -4347 -4378 -3771 -2431 -1088 228 1072 1096 808 -33 -887 -1071 -894 -414 1380 2984 3915 4481 4201 2987
1895 2987 1495 -71 -1955 -2665 -2813 -2225 -1258 -380 444 226 -209 -1429 -2773 -3516 -3461 -3321 -1828 -27
1913 -27 1539 3467 4369 4020 3127 1872 463 -739 -917 -524 432 1405 2227 2663 1695 168 -1377 -3245
1931 -3245 -4522 -4719 -4255 -2888 -955 778 1677 1823 1877 576 -759 -1319 -1317 -1146 619 2033 3380 4143
1949 4143 4367 3315 1629 -511 -2203 -3455 -3572 -2571 -1625 -217 834 1111 734 -532 -1816 -2934
1965 -2934 -3677 -2648 -1734 -156 1971 3446 4167 4055 2848 1184 -271 -1409 -1715 -1446 -285 1109
1981A109N99K28l92j516j793j270j141p7P69J731J311J509J558p0p65l87j435
1998c2r22J33M48Q63J091J517J67l90o39j495j720j325q10o56J252R89R69Q16
2016B56N91m30r13k03j060l82N2J699R05J409J367N11l41o92j391j147j104n29
2034a402O5L75P51O96j2l39k16j255j153l54k04j0J293J167J230J080O25J35o73
2053A799l21o83p40q9L43L59J035P16k54l54p26j448j482q07n93j20M48J293J217
2072d07K83N83k6o25l83l27k21K72J176R70J061J097K71l30j242p27j505j069
2090a149o48K07J94J035N15J18j67k31j464q86n29l65O24J216J598J524Q34O86
2108C112l16q56o81r22j270N84O43O65P51R97j48r37j411j247j710j048K77L35
$$ plain form
1981 1109 1708 1936 1544 28 -1765 -3035 -4176 -4253 -3484 -1753 -442 1067 2625 2555 1790 1403 -32
1998 -32 -954 -821 -373 490 1581 3098 3265 2875 2236 741 -979 -2304 -3114 -3770 -2518 -1529 -560 256
2016 256 847 417 -496 -699 -1759 -2141 -2089 -390 515 1924 3291 3802 3461 2769 1378 231 -873 -1402
2034 -1402 -1337 -962 -211 485 473 134 -82 -1337 -2490 -2844 -3048 -3058 -1765 -598 632 1712 2337 2472 1799
2053 1799 1478 795 55 -34 309 668 1703 2419 2165 1811 1085 -363 -1845 -2652 -3245 -3365 -2917 -1624 -407
2072 -407 -124 459 433 -192 -575 -902 -1123 -851 325 1295 2356 3453 3724 3394 2152 1425 -80 -1149
2090 -1149 -1797 -1590 -1396 -361 154 272 105 -126 -1590 -2476 -3005 -3370 -2746 -1530 68 1592 2426 3112
2108 3112 2796 1940 1259 337 -933 -349 294 959 1710 2707 2559 1622 211 -1036 -2746 -3794 -3517 -3182
2126c182R31J767J078L37K75k10j530n30l96J71M92J394J659P52O36Q4j266j416
2144A046j407j215q92L98Q15L56R83Q11j53j045p78j161n93r8N93J006J760J394
2162A820Q84M58mr78j508r55l41j52O03J045Q23J90j25n19j438j612j000o35j66
2181c610J015Q49J174J408R40l24l22r10n63m97N18M36O04J371R10L6m61m63j161
2200I50j797j063l24l59N33Q06N29Q08K23o90p32m39m31m04N74J421R44R89J516
2219C054L49n05o18n33j244m14k32m94N88P43j96n1j94o64j119r24o44k99L89
2238c008J145O19J259J007M54K00l68j78n10k28K51M55N02L74P10j6o24r26j160
2257d2j347p97m38k42M90P61O55K15L94j99l01l62J22k95L39J300Q39J153R01
$$ plain form
2126 -3182 -2251 -484 594 931 1206 996 -534 -1064 -1460 -1289 -797 597 2256 3008 3644 3728 2462 1046
2144 1046 -361 -1576 -2468 -2070 -1255 -899 84 895 742 -303 -1081 -2242 -2835 -2933 -2340 -1334 426 1820
2162 1820 2704 3162 3158 2180 672 -283 -624 -776 -173 872 1695 1885 1760 1241 -197 -1809 -2809 -3444 -3610
2181 -3610 -2595 -1746 -572 836 1776 1452 1130 220 -343 -840 -322 114 718 2089 2999 3035 2574 2111 950
2200 950 -847 -1910 -2234 -2593 -2060 -1254 -725 83 306 -384 -1116 -1555 -1986 -2390 -1816 -395 549 1538 3054
2219 3054 3403 2898 2280 1747 503 89 -143 -637 -49 694 498 447 253 -411 -1530 -2454 -3098 -3397 -3008
2238 -3008 -1863 -1244 15 1022 1476 1676 1308 1130 620 392 643 1098 1600 1974 2684 2668 2044 1118 -42
2257 -42 -1389 -2186 -2624 -2866 -2376 -1615 -960 -745 -351 -550 -851 -1213 -1091 -1386 -1047 253 1092 2245 3146
2276C146M21n18l11j164j040q61m04j25M22O65N2j51l11o02j217p37o11K04L72
2295b770J221J290J013Q74P82l29m44p09o38k39K10O55O16P87K34j10j062j210
2313A71j194j508l26k27N88O68Q74J012K05R0n17m86o08j17M83N71J206J270J043
2332C198L85k52j048j063j246o97o48JO68O45L73J86n75q25o95p12n74l54P76
2351b457J566J217J020R70M74n78o58r58l20l17LN12M71N68M22k26r54j015j300
2370a560o98o07l30O60R79R26Q08O07n0m28n44j47m81R12M28O77J281J93K19j23
2390B722r02r72j078r87m05p3M61J88N22Q2k51k52l80o22j79J97M31Q11R46R87
2410A246R41J55j23j8o72l90o94o9n7M2M66K14l21n69o30p91q56m99m0l8Q69R99
$$ plain form
2276 3146 3567 3049 2738 1574 534 -327 -731 -856 -434 231 283 132 -179 -781 -1998 -2735 -3346 -3142 -2770
2295 -2770 -1549 -259 754 1628 2410 2081 1637 928 290 51 261 916 1532 2319 2553 2443 1381 171
2313 171 -1023 -2531 -2857 -3084 -2496 -1828 -954 58 263 353 -164 -650 -1258 -1375 -892 -321 885 2155 3198
2332 3198 3583 3331 2283 1220 -26 -723 -1371 -1370 -702 -57 316 502 -73 -898 -1593 -2305 -2879 -3233 -2457
2351 -2457 -891 326 1346 2316 2790 2212 1554 596 276 -41 -38 474 945 1513 1935 1709 755 -260 -1560
2370 -1560 -2258 -2865 -3195 -2535 -1556 -630 178 785 735 307 -237 -384 -865 47 475 1152 2433 2626 2845 2722
2390 2722 1820 848 -230 -1217 -1622 -1695 -1234 -1046 -524 -442 -693 -945 -1325 -1947 -2126 -1929 -1498 -687 259 1246
2410 1246 2187 2342 2219 2201 1529 1139 445 376 319 361 827 1041 720 151 -479 -1270 -2126 -2625 -2665 -2703 -1834 -835
2432h35N71O10L45J6Q7k66j00j3K16K24P33N31N26k37k02r59r36r06q05l49q8
2453a837oN07M47L28k1l63l11k00j18j50P62O06J374Q18Q30j72M0m53o65p21p85
2474i0j33k1M11L59J58n45k83o81q87n35n70k2M57J049P76R70O59M58k41k60l41
2495F88l66R1k2N50R15M60J26j30j141o59j323r68n03j75L40O33N87Q70j2q9k89
2516d17r56n0m7N78N98J067R70O50M16j65q40q08q70o56J23k43N67J58L63j53
2536B85m58o28o43o84m69L9M15J043J263O22R14j15p1m11o10k29j44K99M15O95
2556A528n3N30m94r38j204o63n69n56P9O88K84P27N58J77l37q6l3l40K11K53N33
2577B95Q01O86N50K7l35l47r37r73n94k2O6k62N12M06q2p5q23l89k54l41N8P17
$$ plain form
2432 -835 -264 346 691 707 794 528 428 415 631 855 1588 2119 2645 2408 2206 1247 311 -595 -1400 -1749 -1837
2453 -1837 -1843 -1336 -889 -561 -582 -945 -1256 -1456 -1574 -1724 -962 -356 1018 1836 2666 2494 2534 2081 1416 695 -90
2474 -90 -223 -244 167 526 684 139 -144 -825 -1712 -2247 -2817 -2839 -2382 -1333 -557 413 1072 1530 1289 1029 688
2495 688 322 413 391 941 1856 2316 2442 2312 1171 512 -811 -1779 -2282 -2457 -2117 -1484 -897 -27 -39 -128 -417
2516 -417 -1373 -1423 -1470 -892 -294 773 1743 2393 2809 2644 1804 996 126 -530 -407 -650 -83 75 438 285
2536 285 -173 -801 -1444 -2128 -2597 -2558 -2143 -1100 163 785 1699 1584 1513 1102 492 263 119 418 833 1528
2556 1528 1475 2005 1511 573 -631 -1294 -1863 -2419 -2340 -1652 -1368 -641 -83 94 -243 -329 -362 -702 -491 -238 295
2577 295 1096 1782 2332 2359 2024 1677 740 -233 -827 -849 -783 -1045 -533 -127 -209 -284 -1107 -1496 -1750 -2091 -2033 -1316
2599a316L17J124P26P51M20j39k47n86k61m75L43j68N67R6J42n77m29o35q06o46
2619a799j81l61K26L66Q36J80O24K53m8J17J0j27N1K33P00L45L31O06l37k01m11
2640A413j081o40o13l00k09K40L77J37L40m67j50l84l95P0K99J89R97O49Q17P37
2660B026R7k16l64n13l39l34m62L55K54J67m4k44j53q43n59r12j93j31M97O83
2680a228Q56L75O62K24l75k47l5l61J54L98N92O91M42j1o22k76r86o83r70l68
2700a768K44J46Q88J3K87j08R0m42o68k05J59N97M88J076M11O89Q6k28n45n54
2720F56n03l21l45K65M56L27K28p00j13m94n73r19O9n1N00N90J102L29O39k57
2740H85J06j72q48M1l9J72Q42M41j99L39l96m59q33p66m42n01K59J89L50O27J68
$$ plain form
2599 -1316 -999 125 851 1602 2022 1883 1636 1050 789 314 657 489 1056 1152 1294 717 288 -347 -1153 -1799
2619 -1799 -1980 -2341 -2115 -1749 -913 -733 -109 144 96 213 223 96 147 380 1080 1425 1756 2362 2025 1824 1413
2640 1413 332 -308 -921 -1221 -1430 -1190 -813 -676 -336 -803 -953 -1337 -1732 -1662 -1363 -1174 -177 472 1289 2026
2660 2026 2123 1907 1543 1030 691 357 -105 250 504 671 627 383 230 -613 -1172 -2084 -2277 -2408 -1911 -1228
2680 -1228 -372 3 665 889 514 267 232 -129 25 423 1015 1706 2148 2137 1515 1239 253 -430 -1400 -1768
2700 -1768 -1524 -1378 -490 -477 -190 -298 -208 -650 -1318 -1523 -1364 -767 -279 797 1208 1897 1983 1755 1210 656
2720 656 153 -168 -513 -248 208 535 763 63 -50 -544 -1117 -2036 -1967 -2018 -1518 -928 174 503 1142 885
2740 885 991 819 -29 12 -27 145 987 1428 1229 1568 1172 713 -120 -886 -1328 -1829 -1570 -1381 -1031 -404 -236
2761b36m6%P0l37j19Q4K56O63P01O83K80l04k21j13r86k07m89j87J06J79m8O4
2783b07k2j57l84p01j35l6KO30N06N06L94P05R5m5l1m33j59J0LJ28K90K64l56
2806H67L8m92j69q68n14l22k04l0M75L10M05K00J95J12j42k16J31K13K3O54N32
2827A198K78L2L1N2p24o75l79l87j57l8J52K62n6J90l35n3l23m11j41K73L59N74
2849b78O30K76N71J27k99m2l41l65J30m30K84L88K94j09m05J99j195l90m91m12
2869a858K42K29N96M71K82M48j70j67k05R3l31r9O90M04N92L88j22J2p90o33m40
2890c68n55l83M68o7O62L30j00j9l05n71q3j79j41P54M97R10J63K41j5j97m01
2911F41m20km19L50l43P84l8K22l19n65m21o57j79k17J82L36N33Q25L0L42o7j09
$$ plain form
2761 -236 -282 -282 -212 -549 -668 -584 -328 335 1036 1719 1999 1695 1474 1361 375 168 -321 -508 -402 -223 -271 -207
2783 -207 -229 -386 -770 -1471 -1606 -1642 -1640 -1010 -504 2 396 1101 1196 1151 1120 687 528 538 541 669 959 1223 867
2806 867 905 413 244 -624 -1138 -1460 -1664 -1694 -1219 -909 -504 -304 -109 3 -139 -355 -224 -11 12 666 1198
2827 1198 1476 1508 1539 1591 867 192 -187 -574 -731 -769 -617 -355 -411 -221 -556 -609 -932 -1343 -1484 -1211 -852 -278
2849 -278 352 628 1199 1326 1027 985 644 279 409 -21 263 651 945 836 431 630 -565 -955 -1446 -1858
2869 -1858 -1616 -1387 -791 -320 -38 410 240 73 -132 -39 -370 -469 221 625 1217 1605 1483 1495 705 72 -368
2890 -368 -923 -1306 -838 -905 -243 87 -13 -32 -337 -908 -991 -1170 -1311 -557 -60 850 1013 1254 1239 1042 641
2911 641 221 219 -200 150 -193 591 553 775 456 -109 -530 -1187 -1366 -1583 -1401 -1065 -532 293 323 665 598 489
2933D89m15m4m5J10L01L22M94K31j06j81o17o95m51l09N3j48L12L36J41K8o6K3
2955b37k52j90k12L22L31L5P58L03K54K36j39k31n49l94j81k65L22K44l61K90
2975H4J62m92l62k43l95j89r7N21M55N33L89j6L38n0p1nj20j71J11L88p8M24N8
2998A174l63k36n21k78n40j71k12O5L10K06K89o0K59j8l50r7NK77M66J94N22K53
3020A174J32k53R3m62o9o12q2j85j84K71oL27j17l43l08k16k67m1o0L18N85L08
3042CM35N94k12P2l03k17k01J29J08n3M69j03L0j15j83q08j28p52j64L10K9O58
3064d02L40N9L34kl27j44k72q5L79L05J93Q05J63Nk52n50k16m98n26J21J05L08
3086a57l0K74r0l10k60j36j32J09k77M75M66M22L30L10P5k98j84o48N1j16K40
$$ plain form
2933 489 74 30 -15 95 396 718 1212 1443 1337 1156 539 -156 -607 -916 -863 -1011 -699 -363 -222 -194 -260 -237
2955 -237 -489 -679 -891 -569 -238 -203 555 858 1112 1348 1209 978 429 35 -146 -411 -89 155 -206 84
2975 84 246 -246 -608 -851 -1246 -1435 -1532 -1011 -556 -23 366 350 688 638 567 562 442 271 382 770 692 1116 1174
2998 1174 811 575 54 -224 -764 -935 -1147 -1082 -772 -566 -277 -337 -78 -96 -446 -543 -538 -261 205 399 921 1174
3020 1174 1306 1053 1146 684 615 3 -79 -264 -448 -177 -183 144 27 -316 -624 -840 -1107 -1148 -1208 -890 -305 3
3042 3 438 1032 820 892 589 372 171 300 408 355 824 721 751 636 453 -355 -483 -1235 -1399 -1089 -1060 -402
3064 -402 -62 -3 331 329 2 -142 -414 -499 -120 185 378 1183 1346 1351 1099 549 333 -165 -691 -570 -465 -157
3086 -157 -187 87 -3 -313 -573 -709 -841 -732 -1009 -534 -68 354 684 994 1069 771 587 -61 -10 -126 114
3107A14k6M10j03PN0m77lr37P3m04Q1M84K26P31K35l21L60k81n64M03j47K44J98
3130C53M86K8M15l86q0o29l82k50l64j71J79O9K36J29M5L91m29k95J31r0K67L84
3152C7K02K51M44j53J37j61j97j23j53m31j37M70k40J54p4J02m22j72j75l95r
3173a045m4L07L56J60O45nQ8K71l70j62k5l1K16o4N82n0j29j09k16j52o11l8m05
3196h31J85k07M13K1j07L33O7L1j49p7q2J92J15K96M44L00P0j2Q8q20nn16P8k23
3220c96n0K10J32K03j3N5n27n2k81j89N2K91M08J15M93K06q9N5m13j70j07J55
3242H8Q9J59M2P9K3J73o82m1m88k90lj69O00J61L25J25K00k08l63p5j95N2K49
3265a49M16J39J11M4M46m05q8n76m07K50l26K28j24N16K5Q1k06Rl14m01qN4M01
$$ plain form
3107 114 88 498 395 402 452 -25 -28 -965 -892 -1296 -1215 -731 -505 226 461 140 500 219 -345 58 -89 155 353
3130 353 839 867 1282 896 816 187 -195 -445 -809 -980 -801 -732 -496 -367 -322 69 -360 -655 -524 -614 -347 37
3152 37 239 490 934 781 918 757 560 437 284 -147 -284 186 -54 100 26 128 -294 -466 -641 -1036 -1045
3173 -1045 -1089 -782 -426 -266 379 374 462 733 363 201 176 145 361 297 879 829 700 591 375 223 -388 -426 -831
3196 -831 -646 -853 -440 -419 -526 -193 -126 -95 -244 -321 -403 -211 -96 200 644 944 1014 1002 1090 270 265 -251 -173 -396
3220 -396 -446 -236 -104 99 86 141 -386 -438 -719 -908 -856 -565 -157 -42 451 657 568 623 210 40 -67 88
3242 88 177 336 378 457 480 653 -29 -70 -558 -848 -851 -1020 -420 -259 66 191 391 183 -180 -255 -450 -398 -149
3265 -149 267 406 517 561 1007 602 514 -62 -469 -219 -545 -317 -441 75 100 181 -25 -16 -330 -731 -739 -685 -284
3288b84J49L25O14jj50l2j40o04K4R1j91K54q1L38N1j11l80j80k89j60j01O9K58
3311e31L82K35K21K38j14j18j38J3k78L37J8J78M8q2K80k76o24M7O0o17M3O6J55
3334d57K8M73k07Q4J19k06J26k98J31K77K57rM85j88K93n72L71n81L8Rj81j91
3356a99K17O1j07j77J88k48l76l11O8K89J47KK71M49K95k33K32J67l17j14l87
3377h3K83K78L00k24rj94j36j53k53k88n33L94J36K14P9J69J78k69J01J63n47
3398c94K48j82L29q2N59K11l7K5K4k91l26k38j78k6o1L64k0J51k41m6j16J03m47
3421f71k22J70L20K14K59N37j68P2j79k51M0j1j37p3n4M01K43l2j91l17k88j76
3443e14q4r3J43K63K75J57N5L69k83m4m17R9j12J45M9M31J58Nj72k93n0k73j44
$$ plain form
3288 -284 -135 190 804 803 653 621 481 -123 -99 -8 -199 55 -26 312 363 252 -128 -308 -597 -757 -858 -789 -531
3311 -531 -149 86 307 545 431 313 175 188 -90 247 265 443 491 409 689 413 -211 -164 -104 -721 -678 -612 -457
3334 -457 -429 44 -163 -79 40 -166 -40 -338 -207 70 327 318 803 615 908 336 707 126 164 173 -8 -199
3356 -199 18 79 -28 -205 -17 -265 -641 -952 -884 -595 -448 -446 -175 274 569 336 568 735 418 304 -83
3377 -83 200 478 778 554 545 351 215 62 -191 -479 -1012 -618 -482 -268 -189 -20 158 -111 -10 153 -394
3398 -394 -146 -328 1 -81 478 689 652 677 701 410 84 -154 -332 -358 -419 -55 -75 76 -165 -211 -327 -224 -671
3421 -671 -893 -723 -403 -189 70 607 439 511 332 81 121 110 -27 -100 -154 247 490 458 267 -50 -338 -514
3443 -514 -598 -691 -548 -285 -10 147 202 571 288 244 -173 -74 -186 -41 8 439 597 602 430 137 87 -186 -330
3466c30k16K55j07J16J48K71j14J28k97P4l16K68k48J83M35K08L42P6l61j52j46
3487B17o6l74N2J80r3LJ17k24P5p3l86N2j76K04lJ2K05L54J88J28j43j58q6K1
3511B6K6k18L45L09j03P8j24j30p2l07k91k32K08J1L5R5L98nj54k2M8j46l89N67
3535d7J80J04l5K58K04m1l95J86k16j41j81o5r4K83k1Q1K38n51k55J50k48K04
3557d02J53L2l9M37j76M94j05j35K6J23m40M5J36O3M5j39L94n28L25m03k9Jl66
3580d88m9j11K23J10K00R5J40l25J94j17k74J99Q5M81k2N3M21n5l97j51r7k33
3602a18q1o6M5L19q7K09j55j13k71j60L2m5K51MK27M60k53R1K43l37N1k55j05
3625a14K15L0J60%J15J06k63k47k06j34k05L60j65Q6K6L56NK35j92J60k66r2k16
$$ plain form
3466 -330 -546 -291 -398 -282 -134 137 23 151 -146 -72 -388 -120 -368 -185 250 458 800 876 515 363 217
3487 217 151 -223 -171 9 -84 -81 36 -188 -113 -186 -572 -520 -696 -492 -495 -483 -278 76 264 392 249 91 5 26
3511 26 52 -166 179 488 385 463 339 209 137 -170 -461 -693 -485 -474 -439 -344 54 49 -105 -127 -79 -225 -614 -47
3535 -47 133 237 202 460 664 623 228 414 198 57 -124 -189 -283 0 -21 60 298 -253 -508 -358 -606 -402
3557 -402 -249 -217 -256 181 5 499 394 259 285 408 -32 13 149 212 257 118 512 -16 309 -94 -123 -122 -488
3580 -488 -537 -648 -425 -315 -115 -20 120 -205 -11 -128 -402 -203 -118 363 341 394 815 760 363 212 115 -118
3602 -118 -199 -265 -220 99 12 221 66 -47 -318 -478 -446 -491 -240 -236 -9 451 198 289 532 195 246 -9 -114
3625 -114 101 131 291 291 406 512 249 2 -204 -338 -543 -183 -348 -262 -236 120 125 360 168 328 62 -30 -246
3648b46K08K58J67N6R5L1l28j69k77j1k45j19K65J64o2J67K18k98R0j89m5p7N
3671c42M71j98L29J84p5P5m5l75J2l64Q0N2L73R7k06kj8j05o82J60J18l8K23J3
3695b63L05J61K03k32L4P5j86j45K16K8j79K88M4J1p5j45j67p7l22k11J69q5J79
3718c74L49L7r2P1o8Jj68J11J63k04M80j7J55J4j10P7k13k36L4K60k73k99K25
3741g7q8j9M3j25J6O4k20k25L51K2J86LL05m4o4L16j40l9k28p8J02K6K62J75k38
3766B86Oln43J91k53J4k17J68J30l8K75RP2L1k55k23J08J24r7K36K09K54n7k17
3790B10Q3l42oj32J72j46j21K18o7K41j17j64Q4k05J8j88Q7L3M02K97m2k17J77
3813B75q6k87J97l22K56j43J87J34O6n1q5J01p32K35j48L67j66P7K43L0J34N1
$$ plain form
3648 -246 -38 220 387 443 538 569 241 72 -205 -216 -461 -580 -315 -151 -213 -46 172 -126 -36 -225 -270 -347 -342
3671 -342 129 -69 260 444 369 444 399 24 36 -328 -248 -196 177 274 68 66 48 -57 -739 -579 -461 -499 -276 -263
3695 -263 42 203 406 174 208 283 97 -48 168 196 17 305 349 360 285 140 -27 -104 -426 -637 -468 -553 -374
3718 -374 -25 12 -80 -9 -77 -76 -244 -133 30 -174 306 289 444 458 348 425 212 -24 10 270 -3 -302 -77
3741 -77 -165 -184 -141 -266 -250 -186 -406 -631 -280 -258 -72 -69 236 192 128 444 304 265 37 -41 61 87 349 524 286
3766 286 292 289 -254 -63 -316 -302 -519 -351 -221 -259 16 25 97 128 -127 -350 -242 -118 -215 21 230 484 427 210
3790 210 293 -49 -55 -187 -15 -161 -282 -64 -131 110 -7 -171 -87 -292 -274 -462 -375 -342 60 357 315 98 275
3813 275 189 -98 99 -223 33 -110 77 211 277 226 141 242 -490 -255 -403 -36 -202 -125 118 148 282 333
3835C33p8j26j58k24J46j55J58J44K01R3l36K41j30l24r1m9K6J70J04k5M09k99
3857C0L1Ll32o8p7M30P1k23L94K63k68Q7L4l16j56q6M0J97j5Q7n2K35k80J6l37
3882b92J03j78K21M1j74L77j53J39J59r8j92J77k5k93Q3K17J16o1RK31k54J24
3904B77n69R5J58j93j45K73K02l6K34j37L2j48k67J34J11j78M4P5M47j83J28k5
3926C29k45R4k11M6m9N4l5J59l43K37l43K08L5k56N0K8J21j73O4J98J32J05l3
3949A72r2j63j4l4n8L03J05k0n3J98k7j61k88K91m64P2J87j11J50j3J71J89l00
3972D0l13N4n2rN4J47J22J87o4N9j02J06r2j78j04J83k23K38J99k11K44j53j99
3995f7K7l82J20o0J31J09J30K38k8j07q3J99k65l86K56L39n1oL03j81k64rR1j89
$$ plain form
3835 333 255 129 -29 -253 -107 -262 -104 40 241 334 -2 239 109 -215 -306 -355 -329 -159 -55 -80 329 30
3857 30 61 64 -268 -336 -413 17 88 -135 259 522 254 341 375 59 -97 -183 -143 54 39 126 74 309 29 45 -292
3882 -292 -189 -367 -146 -105 -279 98 -55 84 243 145 -47 130 105 -188 -105 112 228 167 176 407 153 277
3904 277 -292 -197 -39 -232 -377 -104 98 62 296 159 191 43 -224 -90 21 -157 -113 -38 409 226 354 329
3926 329 84 178 -33 13 -36 18 -17 142 -201 36 -307 -99 -64 -320 -270 -242 -121 -294 -230 -32 100 205 172
3949 172 80 -83 -97 -131 -189 114 219 199 146 344 317 156 -132 159 -305 -233 -46 -157 -7 -20 151 340 40
3972 40 -273 -219 -271 -280 -226 -79 43 230 166 225 123 229 137 -41 -145 38 -185 53 252 41 285 132 -67
3995 -67 -40 -422 -302 -362 -231 -122 8 246 218 111 28 227 -38 -424 -168 171 120 114 417 236 -28 -37 54 -135
4019a35j92J22kK88p0J8L24p4j90k9k90r7J04K55J45o5O8J63n0j93q9j67j46J40
4043a62K93j64l6o1J92j17m5J81k41O2j24K10j7Q1j35j2O3M85k05j84k7M7m5O4
4067A03j63J49J68k03J3N9l67j69J89k94J05L52n4n0N81l17m9r7p8K22j30j04
4089a34K02J06M3Kp1m1J04l43oO1j95P0J95r2J22M7n0j47j94L98k51K7j26K75
4113BK95r9rN6J85n82L10m57J86J02j46N9M08j26q0j78j57J07J8J42j27M6K2m5
4137f8J01m1J16J96k82k71K94j13L0jJ72J19l04J85J5L1k55K22k55l2K04j93J89
4160E9M8n9l1Mq5j95L15k84KJ90p5M47J25k41J45m29J23l06J12J54m1l6q7J73
4184B8J07j76r9j42k0K43j5p7R7K82p1n9O4j87L40k00k38j8j8R7K19J39k47K35
$$ plain form
4019 -135 -327 -205 -207 81 11 29 353 279 89 60 -230 -327 -223 32 177 112 180 343 293 100 11 -156 -302 -162
4043 -162 131 -33 -69 -130 62 -55 -100 81 -160 -98 -222 -12 -29 52 -83 -95 -32 453 248 64 37 84 39 103
4067 103 -60 89 257 54 67 126 -241 -410 -221 -515 -410 -58 -112 -162 419 102 53 -44 -122 100 -30 -134
4089 -134 68 174 217 219 148 107 211 -132 -138 -77 -272 -202 -7 -99 23 70 20 -127 -321 77 -174 -147 -273 2
4113 2 297 198 189 245 430 -152 158 -299 -113 -11 -157 -98 310 184 104 -74 -231 -124 -106 36 -91 -45 -23 -68
4137 -68 33 -8 108 304 22 -249 45 -68 -38 -39 133 252 -52 133 148 179 -76 146 -109 -141 63 -130 59
4160 59 107 48 17 21 -64 -259 56 -228 -226 -36 -111 336 461 220 365 -64 59 -247 -135 19 -22 -58 -145 28
4184 28 135 -41 -140 -282 -302 -59 -74 -151 -54 228 157 98 162 -25 315 115 -123 -141 -159 -62 157 296 49 284
4208B84P2m79Lo1k95K23K2K48K40l0r8j06j20N1q8K85j73kN4K07J02J59o12L45
4232B31k56j56rKJ01K93j56L01o1l73J31l4j69%j11K46M2P1J28l8J11j79o2n0
4256CR7n5j56L39j35k12L03l00K6J14k26j1L1J00k10J66J77j73O1P3R5k08K32
4279A31P1j71K37j58K14Pj67j47K00k99J73q3k95N3J52m4J08J9J16j68j47J72
4301b6N7m48K62n3L05J23p5K0K2r4j42K90l48K07l43Q3J16LM1R7k7M3j92L3j06
4326a52J74n7K04o8P5j96J34N1m88L12k9Q2j0r9M15k96K96m23J36q5n9j02M2K86
4350A43k05K56k43J06l10K06j06n4Q2J52j67N7M47k00J39l29K15J64o24J61P5
4371c5RJ59j14k47J45K6n8J8q9J38k10n4L53P5M4R5L5j66q3k23K1L05o2m56L79
$$ plain form
4208 284 356 -123 -120 -181 -476 -253 -231 17 257 227 129 23 -97 -46 -134 151 -22 -24 30 237 339 498 -114 231
4232 231 -25 -181 -190 -188 -87 206 50 351 290 -83 48 14 -155 -155 -266 -20 22 93 221 183 294 115 53 3
4256 3 100 45 -111 228 93 -119 184 -116 -90 24 -202 -213 -182 -82 -292 -126 51 -122 -61 12 107 -101 131
4279 131 202 31 268 110 324 331 164 17 217 -82 91 8 -287 -234 -82 -126 -18 1 117 -51 -198 -26
4301 -26 31 -417 -155 -208 97 220 145 165 187 93 -49 241 -107 100 -243 -160 -44 -41 0 97 70 113 -79 -46 -152
4326 -152 22 -35 169 101 176 -20 114 165 -323 -11 -40 42 32 -67 348 52 348 -75 61 -24 -83 -185 -143 143
4350 143 -62 194 -49 57 -253 -47 -153 -207 -125 27 -140 -83 364 164 303 -26 189 353 -271 -110 -35
4371 -35 -26 133 19 -228 -83 -57 -115 -97 -186 -48 -258 -312 41 116 160 255 290 124 41 -182 -161 144 82 -374 5
4396EK03k1J84m57O2l20K86j5j14L10j69J81J72k81K05Nk31J4O3j09J32Mk2J73
4420B60q5j41n6j27l7K24k32J06k09L68qM23k65k55J60k88j75J58K35K59j28J06
4442B93K40k62k40K58q0j89J7j2l32L81l25J69j9J50k97k33J81O4J35k30L95J0
4464G4k2R5j32n5K16j66N8o9J05J8k03J47K08k7j61m43K04N4j13J82k36K58J18
4487A10R6j25j8q5R1k03P3j86J55j8K75J1O2k1j51j19J33j15K3J47k08K63k5o0
4511A05k25k4J90j44r9K9Q2J3kK0O7J07j92M25l09J31k74K72r1k46L67k38J64
4534A28j9o7p7n7j95j3J2K02R0J88j62j15K36%j47l2j85K47J39k62L61k7j59J78
4558B64m20K58k30K35l09k24K73K42k95K67P7j03J36m26k93N41K15J6k24O7L76
$$ plain form
4396 5 208 187 371 -86 -24 -344 -58 -73 -187 123 -46 135 307 26 231 236 5 19 82 -27 105 109 87 260
4420 260 175 34 -22 -149 -186 38 -194 -88 -297 71 63 486 221 -34 126 -162 -337 -179 56 315 187 293
4442 293 533 271 31 289 209 20 37 25 -307 74 -251 -82 -101 49 -248 -481 -300 -236 -101 -331 64 74
4464 74 52 147 15 -40 176 10 68 -1 104 122 -81 66 274 247 86 -357 -153 -99 -212 -30 -266 -8 110
4487 110 206 81 63 -22 69 -134 -61 -247 -92 -110 165 176 238 217 66 -53 80 -35 -12 135 -73 190 165 105
4511 105 -120 -144 46 -98 -197 -168 -86 -73 -75 -55 12 119 -73 352 43 174 -100 172 81 -165 202 -36 128
4534 128 109 42 -35 -92 -287 -300 -288 -86 4 192 30 -85 151 151 4 -28 -213 34 173 -89 272 245 86 264
4558 264 -156 102 -128 107 -202 -426 -153 89 -206 61 138 35 171 -255 -548 -7 208 224 0 67 443
4579D43l51M2J52k46j57R1J97n6k73J56J19k04O8m8j84N6J3j07P8m9M46j83k3
4602b0J27k17L71j96j83l0mK75rJ77j77j13L2j94j75K85m6k1q7KM2NJ50L5P6m5
4628F0j20j31k7L21P2j1K17j90o2l4Ql77L56k4o0m9K36k68q5J16nK8k97j46L41
4653a31K1k5J77M5k2m1J01M7K7J5p2j83J87k05N5J12J63l15P0J40k2l27M05l61
4677a39J34m7J07J52O6k99M3l0k19P7O5k2J55J03P5J2k77j33J93q9J35n3j16j70
4701b77N3K99K01m59J36j30L24J0o53M35k13L84l12M37k9k28R5J10k27J80k10
4722g4K05J4p3J68j09r6j09m7K4J22k37p5M06l40M05Kk24mm6J25l95K75R4NQ0
4747I6j87R6K32l61J96l42J13MJ41J8r7m7O8K67l27J59j48k43L01J04j17JJ13
$$ plain form
4579 443 92 134 286 40 -117 -26 171 115 -158 -2 117 -87 -19 -67 -251 -195 -182 -289 -211 -260 186 3 -20
4602 -20 107 -110 261 65 -118 -148 -152 123 114 291 114 1 33 -161 -336 -51 -97 -118 -205 -203 -161 -156 -6 29 105 60
4628 60 -60 -191 -218 103 175 164 381 191 129 95 103 -274 82 58 -2 -51 185 -83 -168 -52 -57 -29 -326 -472 -131
4653 -131 -110 -135 42 87 65 24 125 172 199 214 142 -41 146 -59 -4 108 271 -44 26 166 144 -183 222 -139
4677 -139 -5 -52 55 207 273 -26 17 -13 -232 -155 -90 -112 43 146 221 233 -44 -177 16 -73 62 9 -107 -277
4701 -277 -224 75 276 -183 -47 -177 147 157 -496 -61 -274 110 -202 235 206 -22 73 183 -44 136 -74
4722 -74 131 145 72 240 131 35 -74 -121 -97 25 -212 -287 119 -221 184 186 -38 -42 -88 37 -358 -83 11 16 96
4747 96 -91 5 237 -124 72 -270 -157 -153 -12 6 -91 -138 -70 197 -130 29 -119 -362 -61 43 -74 -73 40
4770D0L07k55J57j60l05J15Q6J01j43J65k41m0J74j62l7n0L8P7k76L25J95Q7k72
4793g4R2J83N8k46q1JM2J70n2K39k31J18N5l09j63R2j25J9J71J64j80K32o9n2
4817E4j83J08L06j79r5q7J7n5J72J78L7j56Ql09K20J32m73N52k91K7j17J5K88
4840A69k20j42l5J05J22q5m4J89J92q8j61K4r7K46k52K49j37j24N0Q2O8k98L28
4863A41j66N7j88j8q7R1L12j76R6j78L3K18k67r6K58r3J13J81j29j95P1j08J66
4886C6L91m00j8k56J84J59j54J80j80j56L91j86o2J86j45k05J11L94j94J54j89
4907D1L7J35p9m49K17J0R6j07K6p1j5L41j6k75j64K5LJ61J75k05J60K21k53O2
4931G6J10j57q9k29J82M06j87O8j05J17O2p2l82J91j41n6j82K99K9p3Q9Q7J13
$$ plain form
4770 40 347 92 249 89 -216 -101 -15 86 -57 108 -133 -173 1 -161 -198 -248 -210 -133 -409 -84 111 198 -74
4793 -74 18 201 259 13 -68 -67 -25 145 93 332 101 219 274 -35 -198 -106 -231 -212 -41 123 -57 175 106 54
4817 54 -129 -21 285 106 11 -76 -59 -114 58 236 273 117 125 -184 36 168 -305 247 -44 -17 -134 -119 169
4840 169 -51 -193 -228 -123 -1 -86 -130 59 251 163 2 26 -71 175 -77 172 35 -89 -39 43 111 -187 141
4863 141 -25 32 -156 -174 -261 -170 142 -34 62 -116 -83 135 -132 -228 30 -63 50 231 102 -93 -22 -130 36
4886 36 427 27 9 -247 -63 96 -58 122 -58 -214 177 -9 -71 115 -30 -235 -124 270 76 230 41
4907 41 78 213 134 -315 -98 -88 8 -99 -73 -144 -159 182 166 -109 -273 -248 -245 -84 91 -114 46 267 14 76
4931 76 186 29 -60 -289 -107 299 112 180 75 192 254 182 -200 -9 -150 -206 -388 -89 -60 -133 -44 43 156
4954A56l00L6J24k14K82J41k35K19l70K49J06q7M9m92K27O4K33k28k08L98j47
4975CJ62m3k93R0k62L37K72m53M30k15K04Qk66R9k00j99M50k63K57O3j67M5K30
4998B89k40j9K8n9j14m4N6k8j84M31J14j42K04o46O5L42k19K94k80K27J97N5q0
5021B47l62p0J43j11J84j35K29j51j62L33k84K50k49K17l48p7L98k0pm9J75j29
5043B2p9R8K95m47J37O7p5j04L57l48K75n2k40J44j79J09J25j45J26q5jK3Q3l30
5067b24O4j03K84j10J97K1j13QK46n3j05l46J22L71k41J24j51k28J98J73oj15
5089A3J9j79K48k52j6R4q6J00K08Kj2o1o5j66N4j9J11L27l25j18P1R3Lj58J31
5114A7j24K45m7N6j74N7j53O0J91j85J16j04j40M19k58J0l8L73j41j12r7J06O3
$$ plain form
4954 156 -144 -108 16 -198 84 225 -10 209 -161 88 194 107 156 -336 -109 -45 188 -40 -248 150 3
4975 3 165 122 -171 -81 -343 -6 266 -187 243 28 232 240 -26 73 -127 -326 124 -139 118 181 14 59 289
4998 289 49 30 58 -1 -115 -159 -103 -131 -315 116 230 88 292 -354 -289 53 -166 128 -152 75 272 327 247
5021 247 -115 -185 -42 -153 31 -104 125 -26 -188 145 -139 111 -138 79 -269 -346 52 32 25 -24 151 22
5043 22 -57 41 336 -111 26 93 18 -86 271 -77 198 146 -94 50 -129 -20 105 -40 86 1 0 23 106 -224
5067 -224 -160 -263 21 -89 108 129 16 24 270 217 112 -234 -112 259 18 142 -9 -237 -39 134 128 13
5089 13 32 -147 101 -151 -167 -73 -159 -59 149 151 139 78 13 -153 -99 -118 -7 320 -5 -123 -52 41 44 -114 17
5114 17 -107 138 91 147 -27 30 -123 -63 128 -57 59 -45 -185 234 -24 -14 -52 321 180 68 -29 77 140
5137A40k65J71k31K71M7o0J0k12K47k53L7N0K95l87o9R4K40O5j03j38J40j74J90
5160A05j50m5J70k56J31kJ57J01j43k62J51j27j44J63m9J29MK09k02p5J45Q3j54
5183f1jM8P1K8k7J03J8k35J4K65k21j10j3L26k71J15J61k5j47J4r6O9l09K57j24
5208a51m8K30j16K04j27J16l4j16k47L04m8J54L1l25J51k83L44j41J8m0j80JL20
5231A7m4J10J81j19q6k25N00n66j62K64J24j08L19k87J00J79l87K1K00k42K81
5252G0R3j72J05J2j19R0m1k60K12j06O1l41M72Q3j68JJ97k96M85k06r9N6p8m1
5276A0M9O9O6Mj36l9p7k3q1kn6R0J70O4l14J40P5n4J66R1p4r1QN5k04j6K63p5
5304G8k30r2L06o4j60R8J12M45m97J19m0m4k7l2j23M24k44p9M1J76M2j51m6J53
$$ plain form
5137 140 -125 46 -185 86 133 73 83 -129 118 -135 -98 -48 247 -140 -209 -115 125 190 87 -51 89 -85 105
5160 105 -45 -90 80 -176 -45 -47 110 211 68 -194 -43 -170 -314 -151 -200 -71 -67 142 -60 -135 10 93 -61
5183 -61 -62 -14 57 85 58 161 179 -56 -42 223 2 -108 -121 205 -66 49 210 185 38 52 -44 25 -284 -27 -151
5208 -151 -199 31 -85 119 -8 108 74 -42 -289 15 -33 121 152 -173 -22 -305 39 -102 -84 -124 -304 -303 17
5231 17 -27 83 264 145 59 -166 334 -232 -394 -130 -6 -114 205 -82 18 197 -190 -169 31 -211 70
5252 70 163 -9 96 108 -11 79 38 -222 -10 -116 -55 -396 76 159 -9 -8 189 -107 378 172 73 129 51 10
5276 10 59 128 194 198 62 23 -54 -77 -158 -160 -216 -126 44 108 -206 -66 9 -45 121 212 138 47 55 110 -94 -110 153 78
5304 78 -152 -244 62 -2 -162 -64 48 493 -4 115 75 31 4 -28 -151 273 29 -50 -9 167 209 58 12 165
5328A65n0n11L39j4j27L47k25J50j02J66k52lK97j96j79P1N34k75M6k11l0k55
$$ plain form
5328 165 115 -396 -57 -71 -198 149 -76 74 -28 138 -114 -117 180 -16 -195 -124 410 135 181 -30 -60 -315
$$ [...]
8191E2
##END NTUPLES=NMR FID
##END=
