##TITLE=1H_LR-748-C1-PE
 CDCl3
 8 sc, 
 18.03.2022
##JCAMPDX= 6.0         $$ Bruker NMR JCAMP-DX V2.0
##DATA TYPE= NMR FID
##DATA CLASS= NTUPLES
##ORIGIN= UXNMR, Bruker Analytische Messtechnik GmbH
##OWNER= root
$$ XWIN-NMR		Version 3.5
$$ Fri Mar 18 13:23:20 2022 Russian Standard Time (UT+4h)  she@DPX200
##.OBSERVE FREQUENCY= 200.131346
##.OBSERVE NUCLEUS= ^1H
##.DELAY= (6, 6)
##.ACQUISITION MODE= SIMULTANEOUS
##.ACQUISITION SCHEME= undefined
##.AVERAGES= 8
##.DIGITISER RES= 18
##SPECTROMETER/DATA SYSTEM= spect
##.PULSE SEQUENCE= zg30
##.SOLVENT NAME= CDCl3
##.SHIFT REFERENCE= (INTERNAL, CDCl3, 0, 15.7039)
##AUDIT TRAIL= $$ (NUMBER, WHEN, WHO, WHERE, WHAT)
$$ ##TITLE= Audit trail, XWIN-NMR		Version 3.5
$$ ##JCAMPDX= 5.01
$$ ##ORIGIN= Bruker BioSpin GmbH
$$ ##OWNER= she
$$ F:/spectra/data/she/nmr/H-F/1/audita.txt
$$ ##AUDIT TRAIL=  $$ (NUMBER, WHEN, WHO, WHERE, WHAT)
(   1,<2022-03-18 13:21:58.43 +0400>,<she>,<DPX200>,
      <created by zg, POWCHK disabled, PULCHK disabled
       configuration hash MD5:
       00 E9 B6 7A A2 85 ED C7 34 08 36 98 17 FE 4E 26
       data hash MD5: 16K
       7D 8F D8 AF 51 2E C5 A4 83 D4 56 7C 2B 4B 4B 28>)
$$ ##END=
$$ 
$$ hash MD5
$$ 60 F2 1D A5 3F 9E F2 51 61 F1 49 98 02 F6 95 EE
##$RELAX= 
##$RELAX= 
##$RELAX= 
##$RELAX= 
##$RELAX= 
##$RELAX= 
$$ Bruker specific parameters
$$ --------------------------
##$DU= <F:/spectra>
##$EXPNO= 1
##$NAME= <H-F>
##$PROCNO= 1
##$TYPE= <nmr>
##$USER= <she>
##$AMP= (0..31)
100 100 100 100 100 100 100 100 100 100 100 100 100 100 100 100 100 100 
100 100 100 100 100 100 100 100 100 100 100 100 100 100 
##$AQSEQ= 0
##$AQ_mod= 1
##$AUNM= <au_zg>
##$AUTOPOS= <>
##$BF1= 200.13
##$BF2= 200.13
##$BF3= 200.13
##$BF4= 200.13
##$BF5= 200.13
##$BF6= 200.13
##$BF7= 200.13
##$BF8= 200.13
##$BYTORDA= 1
##$CFDGTYP= 0
##$CFRGTYP= 5
##$CHEMSTR= <none>
##$CNST= (0..31)
1 1 145 1 1 1 1 1 1 1 1 1 1 1 1 1 1 1 1 1 1 1 1 1 1 1 1 1 1 1 1 1 
##$CPDPRG= <>
##$CPDPRG1= <>
##$CPDPRG2= <>
##$CPDPRG3= <>
##$CPDPRG4= <mlev>
##$CPDPRG5= <mlev>
##$CPDPRG6= <mlev>
##$CPDPRG7= <mlev>
##$CPDPRG8= <mlev>
##$CPDPRGB= <>
##$CPDPRGT= <>
##$D= (0..31)
0 1.2 0 0 0 0 0 0 0 0.06 0 0.03 0 0 0 0 0.0002 0 0 0 0 0 0 0 0 0 0 0 0 
0 0 0 
##$DATE= 1647595317
##$DBL= (0..7)
120 120 120 120 120 120 120 120 
##$DBP= (0..7)
150 150 150 150 150 150 150 150 
##$DBP07= 0
##$DBPNAM0= <>
##$DBPNAM1= <>
##$DBPNAM2= <>
##$DBPNAM3= <>
##$DBPNAM4= <>
##$DBPNAM5= <>
##$DBPNAM6= <>
##$DBPNAM7= <>
##$DBPOAL= (0..7)
0.5 0.5 0.5 0.5 0.5 0.5 0.5 0.5 
##$DBPOFFS= (0..7)
0 0 0 0 0 0 0 0 
##$DE= 6
##$DECBNUC= <off>
##$DECIM= 32
##$DECNUC= <off>
##$DECSTAT= 4
##$DIGMOD= 1
##$DIGTYP= 9
##$DL= (0..7)
0 120 120 120 120 120 120 120 
##$DP= (0..7)
150 150 150 150 150 150 150 150 
##$DP07= 0
##$DPNAME0= <>
##$DPNAME1= <>
##$DPNAME2= <>
##$DPNAME3= <>
##$DPNAME4= <>
##$DPNAME5= <>
##$DPNAME6= <>
##$DPNAME7= <>
##$DPOAL= (0..7)
0.5 0.5 0.5 0.5 0.5 0.5 0.5 0.5 
##$DPOFFS= (0..7)
0 0 0 0 0 0 0 0 
##$DQDMODE= 0
##$DR= 18
##$DS= 0
##$DSLIST= <SSSSSSSSSSSSSSS>
$$ [...]
##$SUBNAM2= <"">
##$SUBNAM3= <"">
##$SUBNAM4= <"">
##$SUBNAM5= <"">
##$SUBNAM6= <"">
##$SUBNAM7= <"">
##$SUBNAM8= <"">
##$SUBNAM9= <"">
##$SW= 18.0517287032376
##$SWIBOX= (0..15)
0 0 2 0 0 0 0 0 0 0 0 0 0 0 0 0 
##$SW_h= 3612.71676300578
##$TD= 16384
##$TD0= 1
##$TE= 0
##$TE2= 300
##$TE3= 300
##$TEG= 300
##$TL= (0..7)
0 120 120 120 120 120 120 120 
##$TP= (0..7)
150 150 150 150 150 150 150 150 
##$TP07= 0
##$TPNAME0= <>
##$TPNAME1= <>
##$TPNAME2= <>
##$TPNAME3= <>
##$TPNAME4= <>
##$TPNAME5= <>
##$TPNAME6= <>
##$TPNAME7= <>
##$TPOAL= (0..7)
0.5 0.5 0.5 0.5 0.5 0.5 0.5 0.5 
##$TPOFFS= (0..7)
0 0 0 0 0 0 0 0 
##$TUNHIN= 0
##$TUNHOUT= 0
##$TUNXOUT= 0
##$USERA1= <user>
##$USERA2= <user>
##$USERA3= <user>
##$USERA4= <user>
##$USERA5= <user>
##$V9= 5
##$VALIST= <valist>
##$VCLIST= <CCCCCCCCCCCCCCC>
##$VD= 0
##$VDLIST= <DDDDDDDDDDDDDDD>
##$VPLIST= <PPPPPPPPPPPPPPP>
##$VTLIST= <TTTTTTTTTTTTTTT>
##$WBST= 1024
##$WBSW= 4
##$XGAIN= (0..3)
0 0 0 0 
##$XL= 0
##$YL= 0
##$YMAX_a= 361516
##$YMIN_a= -382914
##$ZGOPTNS= <>
##$ZL1= 120
##$ZL2= 120
##$ZL3= 120
##$ZL4= 120
##$ABSF1= 10
##$ABSF2= 0
##$ABSG= 5
##$ABSL= 3
##$ALPHA= 0
##$AQORDER= 0
##$ASSFAC= 0
##$ASSFACI= 0
##$ASSFACX= 0
##$ASSWID= 0
##$AUNMP= <proc_1d>
##$AZFE= 0.1
##$AZFW= 0.1
##$BCFW= 1
##$BC_mod= 2
##$BYTORDP= 1
##$COROFFS= 0
##$CY= 11.3945322036743
##$DATMOD= 1
##$DC= 2
##$DFILT= <>
##$DTYPP= 0
##$F1P= 2.36226072786647
##$F2P= -0.459571619588291
##$FCOR= 0.5
##$FTSIZE= 0
##$FT_mod= 4
##$GAMMA= 1
##$GB= 0.15
##$INTBC= 1
##$INTSCL= 1
##$ISEN= 128
##$LB= 0.24
##$LEV0= 0
##$LPBIN= 0
##$MAXI= 10000
##$MC2= 0
##$MEAN= 0
##$ME_mod= 0
##$MI= 1.114404
##$NCOEF= 0
##$NC_proc= 0
##$NLEV= 6
##$NOISF1= 3.799351
##$NOISF2= 2.8
##$NSP= 1
##$NTH_PI= 0
##$NZP= 0
##$OFFSET= 15.70392
##$PC= 1
##$PHC0= -17307.93
##$PHC1= 10.40078
##$PH_mod= 1
##$PKNL= yes
##$PPARMOD= 0
##$PSCAL= 0
##$PSIGN= 0
##$REVERSE= no
##$SF= 200.130013532006
##$SI= 16384
##$SIGF1= 3
##$SIGF2= 2
##$SINO= 400
##$SIOLD= 16384
##$SREGLST= <1H.CDCl3>
##$SSB= 0
##$STSI= 0
##$STSR= 0
##$SW_p= 3612.71676300578
##$SYMM= 0
##$S_DEV= 0
##$TDeff= 0
##$TDoff= 0
##$TI= <>
##$TILT= no
##$TM1= 0
##$TM2= 0
##$TOPLEV= 0
##$USERP1= <user>
##$USERP2= <user>
##$USERP3= <user>
##$USERP4= <user>
##$USERP5= <user>
##$WDW= 1
##$XDIM= 8192
##$YMAX_p= 0
##$YMIN_p= 0
$$ End of Bruker specific parameters
$$ ---------------------------------
##NTUPLES= NMR FID
##VAR_NAME=  TIME,          FID/REAL,        FID/IMAG
##SYMBOL=    X,             R,               I
##VAR_TYPE=  INDEPENDENT,   DEPENDENT,       DEPENDENT
##VAR_FORM=  AFFN,          ASDF,            ASDF
##VAR_DIM=   8192,          8192,            8192
##UNITS=     SECONDS,       ARBITRARY UNITS, ARBITRARY UNITS
##FACTOR=    0.0002768,     1,               1
##FIRST=     0,             0,               0
##LAST=      2.2672688,     0,               0
##MIN=       0,             -382914,         0
##MAX=       2.2672688,     361516,          0
$$ Real data points
##PAGE= N=1
##DATA TABLE= (X++(R..R)), XYDATA
$$ [...]
1775d7j25k95qJ34k82J12L95k77N64K19j72P37N8k11Nj73m10j59j34j22K14Q9
$$ -47 -172 -467 -475 -341 -623 -511 -116 -393 171 390 218 955 1013 802 807 634 224 65 -69 -191 23 112
1797A12J17k69rJ70m21l37j45P5l82O30K18j7M47J94k24K00k73Q3j7K70j12L18
$$ 112 229 -40 -49 121 -300 -637 -782 -707 -1089 -459 -241 -258 189 383 159 359 86 169 152 422 310 628
1819F28p4J41q4Jl03j93m31n48K95m45M41M4P7O6J64O0k35J90j49K91K01L32m0
$$ 628 554 695 611 612 309 116 -315 -863 -568 -1013 -572 -528 -451 -385 -221 -161 -396 -206 -355 -64 137 469 429
1842D29J06J89J97j65k88k06N0l02k77P7L44k70L38k15j44j88j91J00l20J89j45
$$ 429 535 724 921 756 468 262 312 10 -267 -190 154 -116 222 7 -137 -325 -516 -416 -736 -547 -692
1863f92L83o0M77L87l14K57o1r8P1j09p1J50P3J78j18j18k01q6l89j88Kj75R4
$$ -692 -309 -369 108 495 181 438 377 279 350 241 170 320 393 571 453 335 134 48 -341 -529 -527 -702 -608
1886f08J96O8jK57j42j14m0L86j37K45j91M28J51L8J61j98R4j41m04k24m5K07
$$ -608 -412 -344 -345 -88 -230 -344 -384 2 -135 110 -81 347 498 536 697 499 593 452 48 -176 -221 -14
1908a4M7j34Q4r0k13J15o4l69l5J72l0J29K33L38N0N1n5j58J30qk54M4M73k39
$$ -14 33 -101 -17 -107 -320 -205 -269 -638 -673 -501 -531 -402 -169 169 219 270 215 57 187 179 -75 -31 442 203
1932B03p9K79j78pj43m10m17L17j3LJ61J55kk07L07j48K02r5O3j34J35K78N7L82
$$ 203 124 403 225 218 75 -335 -752 -435 -448 -445 -284 -129 -131 -338 -31 -179 23 -72 -9 -143 -8 270 327 709
1956G09q0l0j99j12J5m62j83J80P1j92M79n5k14L92n47m54K74j31Q8Q5J46O06
$$ 709 629 599 400 288 303 -159 -342 -162 -91 -283 196 141 -73 319 -228 -682 -408 -539 -451 -366 -220 386
1978C86k73M89k8m81J14J80l81j15N49k64j04L36l0k90j24K7n02J49Q0n14k5M71
$$ 386 113 602 574 93 207 387 6 -109 440 176 72 408 378 88 -36 -9 -511 -362 -282 -796 -821 -350
2000c50L22j64M14n2l05O0R1mk15N04J62l00L02L80n13k12j23Ll00R6o4j81L17
$$ -350 -28 -192 222 170 -135 -75 16 12 -203 301 463 163 465 845 332 120 -3 0 -300 -204 -268 -449 -132
2023a32J85j22R4j82p0K1K7K2n8J06J42K81J51M12n16m3k22jj81K60n5k88K85
$$ -132 53 -69 25 -157 -227 -206 -179 -157 -215 -109 33 314 465 877 361 318 96 95 -86 174 119 -169 116
2046A16P8l22j24L11l00k89K33k86j57O42m3K18k8J12j31J31r9K12j87ON0l0M5
$$ 116 194 -128 -252 59 -241 -530 -297 -583 -740 -98 -141 77 49 161 30 161 62 274 87 93 143 113 158
2069A58N35m00R9P9n08r4j75J92l21L36k16K49j85J22N9k42J74J67k82K28J77
$$ 158 693 293 392 471 -37 -131 -306 -114 -435 -99 -315 -66 -251 -129 -70 -312 -138 29 -253 -25 152
2090A52j7l5L44Mk87L12m60r7q6L30k13P9K68n41o4L06j9l57K94J15n26L94j57
$$ 152 135 100 444 448 161 473 13 -84 -170 160 -53 26 294 -247 -311 -5 -24 -381 -87 28 -498 -104 -261
2113b61j08m1Q07k90j89M15l04k61L17M97m54p6L26k79j67L74m3p13L53R2k90
$$ -261 -369 -410 397 107 -82 333 29 -232 85 582 128 52 378 99 -68 306 263 -450 -97 -5 -295
2134b95j94M83N5K5q6Ol91P7K23N9k31M78j40l8N04M0m93k30J40r1k20O88j95
$$ -295 -489 -6 49 74 -12 -6 -397 -320 -97 -38 -269 209 69 31 535 575 82 -148 -8 -99 -319 369 174
2157A74l13K14j0rl11M87k51l77K96n4j32L08o7k4J7L73k88P3J79l33j56k6M24
$$ 174 -139 75 65 56 -255 232 -19 -396 -100 -154 -286 22 -45 -69 -52 321 33 106 285 -48 -204 -230 194
2180A94k91R2P16j73n44Qk49k60K72K24j65MK94p8r1J51J88n47M26k88k35l4M75
$$ 194 -97 -5 711 538 -6 2 -247 -507 -235 -11 -176 -172 122 44 -47 104 292 -255 171 -117 -352 -386 89
2203H9n0K38K15k77l15K46q0l00L50k61k33K95L67j59l8L3k0m32j7L40j21O5N4
$$ 89 39 277 492 215 -100 146 66 -234 116 -145 -378 -83 284 125 87 120 100 -332 -349 -9 -130 -65 -11
2226a1P3OJ66k24J70l7k06p8k12L06Q9m5K34r5k34l4K47q9l97L80j13l01O7N63
$$ -11 62 68 234 10 180 143 -63 -141 -353 -47 42 -3 231 136 -98 -132 115 26 -371 9 -104 -405 -338 225
2250B25l23L48j54M0ok52K3K69J01k74r8J24R4J12j67J11k40n5k8R6n5J57K4l03
$$ 225 -98 250 96 136 130 -122 -99 170 271 -3 -101 23 117 229 62 173 -67 -122 -150 -54 -109 48 72 -231
2274b31K87J60q2o0lk44K3O7L49k41J52k73K56qk66Q7o1j27J07K45j33j50PK28
$$ -231 56 216 134 74 71 -173 -150 -83 266 25 177 -96 160 152 -114 -27 -88 -215 -108 137 4 -146 -139 89
2298H9j14J47k93J56p3N4J7K05j05j05J30m3l3Q3J72j69j30m0R3rM2J23l05j03
$$ 89 -25 122 -171 -15 -88 -34 -17 188 83 -22 108 65 32 115 287 118 -12 -52 41 32 74 197 -108 -211
2322b11K02j78J0j33J50J22rK73j20P4m9k14M54n18r4J52N6K45N8j51j91N3k9
$$ -211 -9 -187 -177 -310 -160 -38 -47 226 106 180 131 -83 371 -147 -241 -89 -33 212 270 119 -72 -19 -48
2345d8K67m20K24k81J48K15N3q5R6q6j5O6j94p9K58j65m9L69k27J31j96J63o4
$$ -48 219 -201 23 -258 -110 105 158 73 169 83 68 134 -60 -139 119 -46 -95 274 47 178 -18 145 81
2368H1j90pM9J68o9k36M47k92J42k00K24j61k75L58J8Nj52J99k87m2Q7L2N2j46
$$ 81 -109 -116 -67 101 32 -204 243 -49 93 -107 117 -44 -319 39 57 62 -90 109 -178 -220 -133 -101 -49 -195
2392a95M6l3J16m1L97l70L26j06j11p1L0l09K72J05l80M39J25J1q7J8k06J07j04
$$ -195 -149 -182 -66 -107 290 -80 246 140 29 -42 -12 -321 -49 56 -324 115 240 251 164 182 -24 83 -21
2415b1N8k0J95o5j59J86K8p5m9j91K23j14k41J23r0K69l6j5p6K0n7J73k77J80
$$ -21 37 17 212 147 -12 174 202 127 78 -113 110 -4 -245 -122 -212 57 21 6 -70 -50 -107 66 -211 -31
2439c1J78J3m77N63k55J54P2k37P0j92J03L3J19q1q7J45j90J63J06k32r2OP0J09
$$ -31 147 160 -317 246 -9 145 217 -20 50 -142 -39 -6 113 32 -55 90 -100 63 169 -63 -155 -149 -79 30
2463C0K5J2K8j05K83L0l59J21j66O1P1Q9K4M8J8k09J57R1k81k57K4k2k6K59R4
$$ 30 55 67 95 -10 273 303 -56 65 -101 -40 31 120 144 192 210 1 158 249 -32 -289 -265 -287 -313 -54 40
2488D0o0mj57K89j51j18J71l38M02j48J22j05J82J02k65j03J83p5m7P7K67j33
$$ 40 -20 -24 -181 108 -43 -161 10 -328 74 -74 48 -57 125 227 -38 -141 42 -33 -80 -3 264 131
2510A31j52K54j86k02lJ82m83N50o1k02J56O7N3k23J88j37K08k67qJ8J33M9J74
$$ 131 -21 233 47 -155 -158 24 -459 91 30 -172 -16 51 104 -119 69 -68 140 -127 -135 -117 16 65 239
2533B39k55O5J09k76k5j14K8O6J11N2p1oJ87k54J19n7j61NK35J66k4j21O3rq2
$$ 239 -16 49 158 -118 -143 -257 -229 -163 -52 0 -71 -77 110 -144 -25 -82 -243 -238 -3 163 139 18 81 72 -10
2558a0J60m09K30K53p66N58J49l14K44j3m6M2l03J10J22j57R5P9j94M24k41R7
$$ -10 150 -259 -29 224 -542 16 165 -149 95 82 36 78 -225 -115 7 -150 -55 24 -170 254 13 110
2580A10n7r3m3j28M10j83q6K29M2l05J0L33k20L4k65K46j87R1J28k70r0L13r6
$$ 110 53 -40 -83 -211 199 16 -70 159 201 -104 -94 239 19 53 -212 34 -153 -62 66 -204 -294 19 -77
2603g7J11J28k79P2K5j12M5P8K12j09k55Q7L4%K4j08o1J64j08n8O1l3Lq1K13k6
$$ -77 34 162 -117 -45 -20 -132 -87 -9 203 94 -161 -74 -40 -40 -16 -124 -185 -21 -129 -187 -126 -159 -156 -237 -24 -50
2629e0l8r8K29m2P6m1j39M32j62K7l2j88j0r1L7J82Jj11P8k60K17j93J28k94K47
$$ -50 -88 -186 43 1 77 36 -103 329 167 194 162 -26 -36 -127 -90 92 93 -18 60 -200 17 -176 -48 -342 -95
2654i5J06q9K9k5L8R9l9L54l98K04j69j52K98j73M0J1k2J69k48m9L71j89k30o8
$$ -95 11 -78 -49 -74 -36 63 24 378 -20 184 15 -137 161 -12 28 39 17 186 -62 -111 260 71 -159 -227
2678b27K03J4Pj6k32N9P0K65m40O03j73J09k1J04k30J97k86J88k04j03K59o8k93
$$ -227 -24 -10 -3 -19 -251 -192 -122 143 -297 306 133 242 221 325 95 292 6 194 -10 -113 146 78 -215
2701b15J97J74k77j8o3M1L63j87j94J73M9o6J75j02k65M32Kk46r4L86j80j80K35
$$ -215 -18 156 -121 -139 -202 -161 202 15 -179 -6 43 -23 152 50 -215 217 219 -27 -121 265 85 -95 140
2724A40j05k1J87l09M70l08k2j94L89l74R4j12J44K44j85l55L45J75k74J71J01
$$ 140 35 14 201 -108 362 54 32 -162 227 -147 -53 -165 -21 223 38 -317 28 203 -71 100 201
2745B01j33k87J82M8Q8L9l08J29L02k96j06L2J93j68J07J04l05K14j63J18k4n7
$$ 201 68 -219 -37 11 99 138 -170 -41 261 -35 -141 -109 84 -84 23 127 -178 36 -127 -9 -33 -90
2767i0P3j15J46J13l1j1k17J48R1j56K4J74K8K78n06j5J29n0k18o1L81k84K73
$$ -90 -17 -132 14 127 96 85 -132 16 107 -49 -25 149 177 455 -51 -66 63 13 -205 -266 115 -169 104
2790A04k70J93q0L7K83j95J81m11q8J99n5K79j49l5K03o9K9k22k56K40j2K10p8
$$ 104 -166 27 -53 -16 267 72 253 -158 -246 -47 -102 177 28 -7 196 127 156 -66 -322 -82 -94 116 38
2813C8o5Q2J8k74J78kj18J98J53m12J5K24j02k10J59L54l99J33q7j0J38j20J11
$$ 38 -27 55 73 -201 -23 -25 -143 55 208 -204 -189 35 -67 -277 -118 236 -163 -30 -117 -127 11 -109 2
2836Br2K11J5k19J16k42J18J20k24K37l36K75Nj63K51O5j31j33K14O9P7k03J96
$$ 2 -90 121 136 -83 33 -209 -91 29 -195 42 -294 -19 -14 -177 74 139 8 -125 89 158 235 32 228
2859B28j00j89J88o7j2j55Q5J0l20K76N8j14J30J20l03K14K40q4r1p7J3p8j51
$$ 228 128 -61 127 60 48 -107 -22 -12 -332 -56 2 -112 18 138 -165 49 289 205 114 37 50 -28 -179
2882a79M25k86Q0JK28l76K13j61pK35k24j35M6K07k5m6j93K15l04L11j28Q0r4
$$ -179 246 -40 40 41 269 -107 106 -55 -62 173 -51 -186 -140 67 42 -4 -197 18 -286 25 -103 -23 -117
2905a17mJ55k65P3K20O0l14N46m21l3J64p8k71J54K32j26N7J00j53P0j1J18n2
$$ -117 -121 34 -231 -158 62 122 -192 354 -67 -100 64 -14 -285 -131 101 -25 32 132 -21 49 38 156 104
2928A04j17J67l32L10O3rj01q0p5O5J6R4r6l13L62lq9J7J28j04r2R2p0N7K24k03
$$ 104 -13 154 -178 132 195 186 85 5 -70 -5 11 105 9 -304 58 55 -34 -17 111 7 -85 7 -63 -6 218 15
2954A5r5K90k75j20J98K5K4J83j10k39L57l35J79j22J99j9l52L68q7j14J88m04
$$ 15 -80 210 -65 -185 13 38 62 245 135 -104 253 -82 97 -25 174 155 -197 171 84 -30 158 -246
2976b46M06j75j1j92J31J94k78J92r0J80j33k27K36K5k55K93k32K86m0j73K13
$$ -246 160 -15 -26 -218 -87 107 -171 21 -69 111 -22 -249 -13 12 -243 50 -182 104 64 -109 104
2997A04k7r9R9J0m7k10j22L62q7O2O1j29j08J28o0J94J26k29l7p0p1J35J14o9
$$ 104 77 -22 77 87 40 -170 -292 70 -17 45 106 -23 -131 -3 -63 131 257 28 -9 -79 -150 -15 99 30
3021C0n7R6O0l5l7k57K18OMJ97q3r4J39k84L1O8j70N0J4K54l12M63k65r2J56k06
$$ 30 -27 69 129 94 57 -200 18 24 28 225 142 48 187 -97 -66 2 -168 -118 -104 150 -162 301 36 -56 100 -106
3047a06O9J63k27J54k83K28L11k58J44k46j79m1J23K65j08P4j43L5j07K86j66
$$ -106 -37 126 -101 53 -230 -2 309 51 195 -51 -230 -271 -148 117 9 83 -60 -25 -132 154 -12
3068a2o3n0J88J00k70m1J4J57J9j7O4n1r6j81J23K86k00j25K6J37k16M12k92M2
$$ -12 -75 -125 63 163 -107 -148 -134 23 42 25 89 38 -58 -239 -116 170 -30 -155 -129 8 -208 204 -88 -46
3092d6jJ60k04O6j66K55K7j14L3rJ19J30k42j04r8K72k0l1k28J25L1M6l17K55
$$ -46 -47 113 -91 -25 -191 64 91 -23 10 1 120 250 8 -96 -194 78 58 27 -201 -76 -45 1 -316 -61
3116f1P7o8j36K32Nj31K34l54M1OJ43K27m90L74k17L44k59%L2J30j9l83J30K16
$$ -61 16 -52 -188 44 49 -82 152 -202 -161 -155 -12 215 -275 99 -118 226 -33 -33 -1 129 110 -273 -143 73
3140G3j69J51m81N41j14Q5J36j94k17J51N1l09K22m1pJ82j23j85M60q6j14l85
$$ 73 -96 55 -426 115 1 86 222 28 -189 -38 13 -296 -74 -115 -122 60 -63 -248 212 126 12 -373
3162c73L73n2K28j4k02J62J6k84R3j6l54J62J41L9P9j92J33O7j3J71j62O6j57
$$ -373 0 -52 176 162 -40 122 138 -146 -53 -69 -423 -261 -120 -81 -2 -194 -61 6 -7 164 2 68 -89
3185h9N9J03k17K90O3l88K79l3k20O3J44k42K61J17N5m42J32k3j07K25K03j27
$$ -89 -30 73 -144 146 209 -179 100 67 -153 -90 54 -188 73 190 245 -197 -65 -88 -195 30 233 106
3207A06j32J0K21r2q1j54Q2j03M7J32j35K58rj73k9j26R9K56o1j36J49M0j97J0
$$ 106 -26 -16 205 113 32 -122 -40 -143 -96 36 -99 159 150 -23 -52 -178 -79 177 116 -20 129 169 -28 -18
3231a8N1P9l44K66j40J00j45L0J09L8j17K36k01r1O3K97m43L07N4n3r8k2k35J93
$$ -18 33 112 -232 34 -106 -6 -151 -121 -12 26 -91 145 -56 -147 -84 213 -230 77 131 78 -20 -42 -277 -84
3255h4J93j26K9l10K51O0j2J4L6j81l9M65j42Jl13k8K39k00K82k62L07l29N1%
$$ -84 109 -17 12 -298 -47 13 1 15 51 -130 -169 296 154 155 -158 -186 53 -147 135 -127 180 -149 -98 -98
3279i8L37k22J5J27j98J30l2Q9m4j58J5J19l5J02l88K97k2j91K70j33P9K9j73
$$ -98 239 17 32 159 -39 91 59 148 104 -54 -39 80 45 147 -241 56 34 -157 113 -20 59 88 -85
3302h5M6nJ61J44k39j33r8N7Q9N7j81lP9L50k39j23L21k69n1j06J15K27o5K7r4
$$ -85 -39 -44 117 261 22 -111 -209 -152 -63 -6 -187 -190 -111 239 0 -123 198 -71 -122 -228 -113 114 49 76 -18
3327a8J31j26k87J83k48K68K14k24J65L5k05n1KL19l0o8K96l70l7L8L2O4j07L74
$$ -18 113 -13 -300 -117 -365 -97 117 -107 58 93 -112 -163 -161 158 128 60 356 -14 -51 -13 19 83 -24 350
3351C50l97M9q2J46j65J57k34K05j51J00J69p2l5or1M7j40K87L1l18L37j51q0
$$ 350 -47 2 -80 66 -99 58 -176 29 -122 -22 147 75 40 34 -57 -10 -150 137 168 -150 187 36 -44
3374d4J92o4k8j00Q2o9l3L48k42J40l74K18j55j6J54n5MR5k9J04m5o2j00N1J83
$$ -44 148 84 56 -44 38 -31 -64 284 42 182 -192 26 -129 -145 9 -46 -42 53 24 128 83 21 -79 -28 155
3399A55j67r2QK24o3N9j69n9J38j0j26J69k22Q2K80l06L76l75o7J58PJ56j47j7
$$ 155 -12 -104 -96 128 65 124 -45 -104 34 24 -102 67 -155 -73 207 -99 277 -98 -165 -7 0 156 9 -8
3423hq9K58j87j41K65P8j41N1k12J31L8K02k16q4J47m5L9j1j20K2P2q5QP0J45
$$ -8 -97 161 -26 -167 98 176 35 86 -126 5 43 245 29 -55 92 47 86 75 -45 -23 49 -36 -28 42 187
3448A87j68j35j34P5M59k66k01K19p1m1K85k48J45k02J19J53k40M6j70K67j17
$$ 187 19 -116 -250 -175 284 18 -183 36 -35 -76 209 -39 106 -96 23 176 -64 -18 -188 79 -38
3469c8l65M46l6q2R0j23j6J8K15k49J91j90PJ18K7j52K81j36k6j1J3J69l25K14
$$ -38 -403 43 7 -75 15 -108 -124 -106 109 -140 51 -139 -132 -14 13 -139 142 6 -20 -31 -18 151 -174 40
3493D0n7K10k23K15k85K75j31p4L21k28O9k98L84k58j10K25n9k60L03j58J3J18
$$ 40 -17 193 -30 185 -100 175 44 -30 291 63 132 -166 218 -40 -150 75 16 -244 59 -99 -86 32
3515C2k0Q5n5j35J59J06J43r3k08R5k2j39L14l47j3K85l10J96n1j18J12M4j44
$$ 32 12 97 42 -93 66 172 315 222 14 109 87 -52 262 -85 -98 187 -123 73 22 -96 16 60 -84
3538h4M8q9J38k6K3j23M3J50J81l68j19L72m48L15J56k10j3J70q2J64j42p1K6
$$ -84 -36 -125 13 -13 10 -113 -70 80 261 -107 -226 146 -302 13 169 -41 -54 116 34 198 56 -15 11
3561A1J37k12k2M9M1JP0m6j64L32m01K48j6j4n4J35k37J19M9k28K51j86J11K71
$$ 11 148 -64 -86 -37 4 5 75 29 -135 197 -204 44 28 14 -40 95 -142 -23 26 -202 49 -137 -26 245
3585B45j76j14j1K18l26N71o12K66p1j4J37k02M44j55l57j00K10Q3p8N2J38j73
$$ 245 69 -45 -56 162 -164 407 -205 61 -10 -24 113 -89 355 200 -157 -257 -47 36 -42 10 148 -25
3607b5J37O1k58J14K01l60P9j26J22J62P2n9pj46K25l5l21J69j42K57L3k73K7
$$ -25 112 173 -85 29 230 -130 -51 -177 -55 107 179 120 113 -33 192 157 -164 5 -137 120 153 -120 -93
3630i3J78j04l3N6L1l4p5N1j2j59K04K34%j54r4j40J82j13K20M5L2j35p5j54K25
$$ -93 85 -19 -52 4 35 1 -74 -23 -35 -194 10 244 244 90 -4 -144 38 -75 145 190 222 87 12 -142 83
3655H3L2k95%O01k35j06j82j90L18k60J99J33l48J03J59n9J53L2j87K70R9l28
$$ 83 115 -180 -180 421 186 80 -102 -292 26 -234 -35 98 -250 -147 12 -47 106 138 -49 221 320 -8
3677hl7J59j85J80kM7n9rL01m56J44J49l90J79J2j43Q6J57N6n44K84K38m08K07
$$ -8 -45 114 -71 109 107 154 95 86 387 -69 75 224 -166 13 25 -118 -32 125 181 -363 -79 159 -249 -42
3701d2k57K0K31k52L45J75k26m6j98M79k37k53M88m20O2m6J02j81K28N7j80J68
$$ -42 -299 -279 -48 -300 45 220 -6 -52 -250 229 -8 -261 227 -193 -131 -177 -75 -256 -28 29 -151 17
3723A7p0N3j28L16k13R2j1j5m9j2J1L3J86kl26R4M8N5p1R1J6m7p9j70L36m20K62
$$ 17 -53 0 -128 188 -25 67 56 41 -8 -20 -9 24 210 208 -118 -24 24 79 8 99 115 68 -11 -181 155 -265 -3
3750cJ08k26j1KJ38R8l63L02j72L74k94L82k06j77m2J2r2K61j37K05q6j96K08
$$ -3 105 -121 -132 -130 8 106 -257 45 -127 247 -47 335 129 -48 -90 -78 -170 91 -46 159 73 -123 85
3773H5o5K4r7J17l92L80p8K8j03K41j90m1Q2L4J88l25L1J39j67K44k57o2K01L4
$$ 85 20 44 -53 64 -328 52 -26 2 -101 140 -50 -91 -9 25 213 -112 -81 58 -109 135 -122 -184 17 51
3797E1R6j87n3R2RL5J2j11J33j01j19K26m0J21j5k45P6J53j03L54m64R2N9o0j35
$$ 51 147 -40 -93 -1 8 43 55 -56 77 -24 -143 83 43 164 149 -96 -20 133 30 384 -80 12 71 11 -124
3822a24M9P7M4l3J8J58k26L0Q8j89J06J3J09kj92p3K81l25J94J27k52J44j64K23
$$ -124 -75 2 46 13 31 189 -37 -7 81 -108 -2 11 120 118 -74 -147 134 -191 3 130 -122 22 -142 81
3846H1n3l6j13J67k98P1J76J20m5nj83J26j77N8k50J63K64j20k76K96J00K4j28
$$ 81 28 -8 -121 46 -252 -181 -5 115 70 65 -118 8 -169 -111 -361 -198 66 -54 -330 -34 66 90 -38
3869c8R0j78P5J13K04k46m31N62k55m9O5P0R8j0m2j22l2J45L4P3l2Q2k53M5o7
$$ -38 52 -126 -51 62 266 20 -411 151 -104 -153 -88 -18 80 70 28 -94 -126 19 53 126 94 176 -77 -32 -99
3894i9j36n7K65l9K13P0k17R0j76R8j8J30j17L09k36N1p4Qk69L42l56M07r8l19
$$ -99 -235 -292 -27 -66 147 217 0 90 -86 12 -6 124 7 316 80 131 57 65 -204 138 -218 189 91 -228
3918b28M6O6J55m2K80j94m7k22kM01l64K19M4p1k34K57j6J5l18L04J02k39j20
$$ -228 -182 -116 39 -3 277 83 36 -186 -188 213 -151 68 112 41 -193 64 48 63 -255 49 151 -88 -208
3941b08M05q8p5j43J95k33K68j66R9k29J68P1l13K25j69K79j11K9M9j42m6j4N6
$$ -208 197 109 34 -109 86 -147 121 -45 54 -175 -7 64 -249 -24 -193 86 -25 4 53 -89 -135 -149 -93
3964i3R2l8K9k14J46r3J49R5j0j49J91k2j18q1Q7K6o7m3O9J35k94L02j80p5N2
$$ -93 -1 -39 -10 -224 -78 -171 -22 73 63 -86 105 83 -35 -116 -29 -3 -70 -113 -44 91 -203 99 -81 -156 -104
3989a04mN7J52j99j05rJ86l2J05J8o3J56j21L9o8J28k73L7NJ68J27j48m8k9j1
$$ -104 -108 -51 101 -98 -203 -212 -26 -58 47 65 2 158 37 76 8 136 -137 -100 -95 73 200 52 4 -25 -36
4014c6J05oj50O0OM2k48J34J30j28M0N4m7J57n3Q9J06l02j4K86l43J37o3J32m22
$$ -36 69 63 -87 -27 -21 21 -227 -93 37 -91 -51 3 -44 113 60 149 255 -47 -61 225 -118 19 -44 88 -334
4039c34K50J50J06m13K39J59k30J07k75M46l42L41l41K29k18P8L31k71J1J18k21
$$ -334 -84 66 172 -241 -2 157 -73 34 -241 205 -137 204 -137 92 -126 -48 283 12 23 141 -80
4060h0J11J13K0k97J96k34J14J27q2J45l09L47j42q1L1J39l92M57l13o2J92O4
$$ -80 31 144 164 -133 63 -171 -57 70 -12 133 -176 171 29 -52 -21 118 -274 183 -130 -192 0 64
4082F4k44K37k98K19j01J84k44L02j32k17J10J44k8r3p5J28R8R1p7k33L3j68K58
$$ 64 -180 57 -241 -22 -123 61 -183 119 -13 -230 -120 24 -4 -97 -172 -44 54 145 68 -165 -132 -300 -42
4105d2O9J49l57J46K58k74j4J41J40l85K18k02K71r0j74K47O3P8k72N5L3k47J09
$$ -42 27 176 -181 -35 223 -51 -65 76 216 -169 49 -153 118 28 -146 101 164 242 -30 25 58 -189 -80
4128h0o2J2K66Pk63l9K14M3o3Jk57L41J19m40J98n4K97n00M17k97O1K10k50m3
$$ -80 -142 -130 136 143 -120 -159 55 98 35 36 -221 120 239 -201 -3 -57 240 -260 157 -140 -79 131 -119 -162
4152a62J26J13l24K54r5M6o2qJ39m7J48j54J18k31L1M4J4J5J75k19j99L57k45
$$ -162 -36 77 -247 7 -88 -42 -104 -112 27 -20 128 -26 92 -139 -108 -64 -50 -35 140 -79 -278 79 -166
4175a66K10p7l7pO7O5J34k30K4rO9k76M07l80q3K10J30J9o8m3K7p9J58n6J67j31
$$ -166 44 -33 -70 -77 -10 55 189 -41 -17 -26 43 -233 174 -206 -289 -79 51 70 2 -41 -14 -93 65 9 176 45
4201D5j01k7K30j66P3P3k9J18l25J89j11L2J1O8k24L83m18J49l5K84n46L77j81
$$ 45 -56 -83 147 -19 54 127 98 216 -109 80 -31 1 12 80 -144 239 -179 -30 -65 219 -327 50 -131
4224a31P1N0j35L37j33M5j85K88j35L2j65J25Q4k40J32L8k20K54J46j43l29J35
$$ -131 -60 -10 -145 192 59 104 -81 207 72 104 -61 64 148 -92 40 78 -142 112 258 115 -214 -79
4246g9q4J11K7O2K17l77N9J02l2J55j10j48J51j00q3J00j16M9J02K76m21K30k4
$$ -79 -163 -52 -25 37 254 -123 -64 38 6 161 51 -97 54 -46 -129 -29 -145 -96 6 282 -139 91 67
4269F7l2j93j1P3J06k81L73j34K66m01K33m9j58K26k08K20K3j21K28k03p2r2P7
$$ 67 35 -158 -169 -96 10 -271 102 -32 234 -167 66 17 -141 85 -123 97 120 -1 227 24 -48 -140 -63
4292f3J28k55J61KO6o4p9J25j54J77K43k39L6k34K51j75Q1l9j42LL05j25p7K48
$$ -63 65 -190 -29 -27 39 -25 -104 21 -133 44 287 48 84 -150 101 -74 7 -32 -174 -171 134 9 -68 180
4316A80k53l9J34M2p8k08K51r0P1M2j20K42k32J58j32R3l1j96L11j31R4KJ41q9
$$ 180 -73 -112 22 64 -14 -222 29 -61 10 52 -68 174 -58 100 -32 61 30 -166 145 14 108 110 251 162
4340A62j47J78l20J2K72lr5j43J51Q0k58K06K7j94J03Q8L1Rk40K39j53k12J30
$$ 162 15 193 -127 -115 157 154 59 -84 67 147 -111 95 122 -72 31 119 150 159 -81 158 5 -207 -77
4363g7p4J41k00j33O34m23K1K52k32J56j22N6J31k05q9J16M9j38J16Q6p9J8l7
$$ -77 -151 -10 -210 -343 291 -132 -111 141 -91 65 -57 -1 130 -75 -164 -48 1 -137 -21 65 -14 4 -33
4386c3q3M00n76K17J48l09M31Q0l13L0K45j67J8P3j90m6J30J18j54L2J00j36q2
$$ -33 -116 284 -292 -75 73 -236 195 275 -38 -8 237 70 88 161 -29 -75 55 173 19 51 151 15 -67
4409f7K40m48J38J27k07K7K04j90K89k90Q8J39N8N2l64O2l7L51j89j12lN4P6L80
$$ -67 173 -275 -137 -10 -217 -190 14 -176 113 -177 -89 50 108 160 -204 -142 -179 172 -17 -129 -132 -78 -2 378
4433C78m92N9j77L90k82K87j8J43m93M28l19k5J17J27J3j99K64k21P0j17K69k23
$$ 378 -114 -55 -232 158 -124 163 145 288 -205 223 -96 -121 -4 123 136 -63 201 -20 50 -67 202 -21
4455b1L1l2KrM0j03J15J86l65P7M4K54m9k76N4J05k56L28j16J00l3k50R2K40j07
$$ -21 10 -22 -20 -29 11 -92 23 209 -156 -79 -35 219 170 -106 -52 53 -203 125 9 109 76 -174 -82 158 51
4480E1r5J63j07J16k52Q0o6p7J87j12O2N3M8JN6j59l4j36K13pj13l8L46Pl47K49
$$ 51 -44 119 12 128 -124 -44 -110 -187 0 -112 -50 3 51 52 108 -51 -85 -221 -8 -15 -128 -166 180 187 -160 89
4506H9j41J8K06j66q1J56l52L50k9m0m0P5j91J98k36J00q5N4J1J69j41K00K4m01
$$ 89 -52 -34 172 6 -75 81 -271 79 50 10 -30 45 -146 52 -184 -84 -169 -115 -104 65 -76 124 148 -253
4530b53K90J06j36j28o5J85o0J55l1Q7k39J32q7n4K73k38j78L27k79n1L53Mq5
$$ -253 37 143 7 -121 -186 -1 -61 94 63 150 -89 43 -44 -98 175 -63 -241 86 -193 -244 109 113 28
4553B8J11q5m8l4J39j39J7k41L16q1J61k89K46o5k18M24k61l8K00j73K00k00O
$$ 28 139 54 6 -28 111 -28 -11 -252 64 -17 144 -145 101 36 -182 242 -19 -57 143 -30 170 -30 -24
4576b4N7J8k6ok88K34OM5R6o5J2J15k00m7Q6L4j51N4k00K55K5k05K00K9M8l53
$$ -24 33 51 25 19 -269 -35 -29 16 112 47 59 174 -26 -73 13 47 -104 -50 -250 5 30 -175 25 54 102 -251
4602b51M03k02L3p4Q7O6r5K28j72lP3j88j4L21k17j0j43L28r7J07q2k4K47m42
$$ -251 152 -50 -17 -91 -4 62 -33 195 23 20 93 -95 -109 212 -5 -15 -158 170 73 180 98 74 321 -121
4626a21j84L45m3o4Jm2K84j90K31n9l60R6K14k30J20J18j8r0O8m2j54L06j95J80
$$ -121 -305 40 -3 -67 -66 -108 176 -14 217 158 -202 -106 108 -122 -2 116 98 8 76 34 -120 186 -9 171
4650A71k04N0m2J08n1k31K58r6q3L1L0K93ml52J57j68J97k6j7J04o4k74J01n4
$$ 171 -33 17 -25 83 32 -199 59 -37 -120 -89 -59 234 230 -122 35 -133 64 38 21 125 61 -213 -112 -166
4674a66L02p2k71M1KJ87L4Rl9pr6J29j57J29L9j84j44L25Km5j2r2j5l3J60k32
$$ -166 136 64 -207 -166 -164 23 57 66 27 20 -76 53 -104 25 64 -120 -264 61 63 18 6 -86 -101 -134 26 -206
4700b06K26J3j46J12J50q2O7k39km1J30J73n3j05k6L7q3R3k1K9J68j72j25K23
$$ -206 20 33 -113 -1 149 67 134 -105 -107 -148 -18 155 102 -3 -29 8 -75 18 -3 26 194 22 -103 120
4724A20k04M9K25m28O7k5%J68k27J60m9J45Nk7K1k88J33K39p8K8o3m6J93j32Q0
$$ 120 -84 -35 190 -238 -171 -196 -196 -28 -255 -95 -144 1 6 -21 0 -288 -155 84 6 34 -29 -75 118 -14 66
4749F6J68k61M3L5J0k56K71o8l2k47L85l15J19J52o5p8m7J80l3n3k51O2K51Q2
$$ 66 234 -27 16 51 61 -195 76 8 -24 -271 114 -201 -82 70 5 -73 -120 60 27 -26 -277 -215 36 118
4773A18j70J66r5Q8r3P2r9j88RL77k32j1K08l97J47l8K58j56o1J36lk15L74k0
$$ 118 -52 114 19 107 14 86 -13 -201 -192 185 -47 -58 150 -247 -100 -138 120 -36 -97 39 36 -179 195 175
4797A75m71K13J96n5n0k32L06oQ3m6r0j44L07l86K36O6j01Q9j97k7O0P6j62P1
$$ 175 -296 -83 113 58 8 -224 82 76 159 113 23 -121 186 -200 36 102 1 90 -107 -134 -74 2 -160 -89
4821h9J05J14K1oj42j65J92k00J48M6k59L23k1L7k00L2K23k22J85j96L6P6l7j22
$$ -89 16 130 151 145 3 -162 30 -170 -22 24 -235 88 67 104 -96 -64 159 -63 122 -74 -38 38 1 -121
4845a21L04J34k15k13N8J18R6l83K73j23O1O2j13r7J86P4k65L00l91M02o8r1K47
$$ -121 183 317 102 -111 -53 65 161 -222 51 -72 -11 51 -62 -159 27 101 -164 136 -255 147 79 -12 235
4868B35k99r7J24j63J12NJ94l99K67r4Q8j3O6J21j96K35k58J91k50K99nn6K2j1
$$ 235 -64 -161 -37 -200 -88 -83 111 -288 -21 -115 -27 -40 26 147 -49 186 -72 119 -131 168 163 107 129 118
4892A18j63J68o3j6n4oJ10j32K05k92L13l08K57R1m77K55Ok16K30l0%j94O1n3
$$ 118 -45 123 60 44 -10 -16 94 -38 167 -125 188 -120 137 228 -249 6 12 -204 26 -4 -4 -198 -137 -190
4916a90K19m8j52J52J03k13M2M4l5M7Q0j05K06j65j88K84N5k66K19M5k48K19p8
$$ -190 29 -19 -171 -19 84 -129 -87 -43 -78 -31 49 -56 150 -15 -203 81 136 -130 89 134 -114 105 27
4939B7K28m01J16J21k01J79j91Lj6O9L29m48J36j30K75K1J19l73K3L0j07O7o5
$$ 27 255 -146 -30 91 -110 69 -122 -119 -135 -66 263 -185 -49 -179 96 117 236 -137 -114 -84 -191 -124 -189
4962a89J68j36J62K68m23L73k38M2K17n55K49J82j08r0K89l96K35j8N4k3j86J98
$$ -189 -21 -157 5 273 -150 223 -15 27 244 -311 -62 120 12 -78 211 -185 50 32 86 63 -123 75
4984G5j23q1q3J06P4J08j06k6J00p3J51k57N0K9Q1j85K7M4K7K02L9m64L40j77
$$ 75 -48 -129 -212 -106 -32 76 -30 -56 44 -29 122 -135 -85 -56 25 -160 -133 -89 -62 140 179 -285 55 -122
5008a22L04j62J74j83p8n1L12k71nq7L06%j87j9j10K71j01O8j82J55p6j1R9l1
$$ -122 182 20 194 11 -67 -118 194 -77 -82 -169 137 137 -50 -69 -179 92 -9 59 -123 32 -44 -55 44 13
5032A3J62k20J02N1j9k01K10n8J95j71j62L9J95j71j24K97j3j46J69j99Q6Q6O2
$$ 13 175 -45 57 108 89 -112 98 40 235 64 -98 -59 136 -35 -159 138 125 -21 148 -51 35 121 183
5055A83k17j5J47N5k14J66l38K67l0j12K60j9l0l0op0q6Q7P6j50J34LL2k30P8
$$ 183 -34 -49 98 153 -61 105 -233 34 4 -108 152 133 103 73 67 -3 -89 -2 74 -76 58 61 93 -137 -59
5080e9J21j02J18K00l09k47M13K0m92L62l9Nm9J27j66m4K27j41j2J20j2J26m29
$$ -59 62 -40 78 278 -31 -278 135 155 -337 25 -14 -9 -58 69 -97 -141 86 -55 -67 53 41 167 -262
5103b62L16j02K11k72j78L54j23L32k48Jk41L38j50J05k38O2J89Q2j01jlj42J46
$$ -262 54 -48 163 -109 -287 67 -56 276 28 29 -212 126 -24 81 -157 -95 94 176 75 74 71 -71 75
5126G5k55L03j69o1K4l7L97n5j45k53Q1K13j13o6K13k19J87l99M64m25R5K36J7
$$ 75 -180 123 -46 -107 -83 -120 277 222 77 -176 -95 118 5 -61 152 -67 120 -279 185 -240 -145 91 108
5149A08O7k14j09Q8J8m2J86P5j94M8L5J20j5K6k66J51j47l6P2k09J14O5J88k36
$$ 108 175 -39 -148 -60 -42 -84 102 177 -17 31 66 186 171 197 -69 82 -65 -101 -29 -238 -124 -59 129 -107
5173a07J86j69L54l78K63j68M2J06l02L74k48o2j0n1K05p5P4q8o3m4P4K60j84
$$ -107 79 -90 264 -114 149 -19 23 129 -173 201 -47 -109 -119 -170 35 -40 34 -54 -117 -161 -87 173 -11
5196a1n5QP8J67m74L41j94J36P6q1J50l67J75N5j43J30P8R3j17R4k89J25r4K5
$$ -11 -66 -58 20 187 -287 54 -140 -4 72 -9 141 -226 -51 4 -139 -9 69 162 45 139 -150 -25 -119 -94
5220i4n0J35J34k28O9rK21k40J04k02J61q9J47j42j04j4J87Q3n6K22j16j45n2
$$ -94 -144 -9 125 -103 -34 -43 178 -62 42 -160 1 -88 59 -83 -187 -201 -14 69 13 235 119 -26 -78
5243g8p9J54n6J54J04k35m3K04k84m2J19K10Nj85j39L0p4K00j24O3L8P5M7k66
$$ -78 -157 -3 -59 95 199 -36 -79 125 -159 -201 -82 128 133 -52 -191 -161 -235 -35 -159 -96 -58 17 64 -202
5267b02L12j83J17K15m94R7K03l7j56L5J08q5M8J97m20L63r4k49L12k24L99k05
$$ -202 110 -73 44 259 -235 -138 65 28 -128 -93 15 -70 -22 175 -245 118 24 -225 87 -137 262 57
5289E7L8mj26m6R1j84K17l2J87j89J52k91M2o3J77Q6M3k04p3RJ66R7l10Q2P5n1
$$ 57 95 91 -35 -81 10 -174 43 11 198 9 161 -130 -88 -151 26 112 155 -49 -122 -113 53 150 -160 -78 -3 -54
5315e4J34o8r5K4j09K75k8j03N3j86L18m52K16J28j06K40k26j3p2j07K11J74l42
$$ -54 80 12 -83 -59 -168 107 79 -24 29 -157 161 -291 -75 53 -53 187 -39 -52 -124 -231 -20 154 -188
5338a88K83j09M5M7j12J40j6k60K9n5J54m1L00k82r8L96k55P0L1o1n8Q9k42K37
$$ -188 95 -14 31 78 -34 106 90 -170 -141 -196 -42 -83 217 -65 -163 233 -22 48 79 18 -40 49 -193 44
5362D4k18Q3j36L09j47Q8j03O1j0n0J98k57q4M19j59r7L11j38k51P0J0R6N1k81
$$ 44 -174 -91 -227 82 -65 23 -80 -19 -29 -79 119 -138 -222 197 38 -59 252 114 -137 -67 -57 39 90 -191
5386a91L47m43K19J54j13K0nK49m36l6K45J3M8K4J81j51j42K20k4R9j99k30J73
$$ -191 156 -287 -68 86 -27 -7 -12 237 -199 -235 10 23 71 95 276 125 -17 203 179 278 79 -151 22
5409B2O5l32J47J81j8k31K00r0JL34n94J40K73J6j07q4J85J50l42L1J05k9j54
$$ 22 87 -245 -98 83 65 -166 34 -56 -55 279 -315 -175 98 114 7 -77 108 258 -84 -53 52 23 -131
5432a31K51k99J9M24n14J66J63k41K91k79K49q6j67J94k5O2j36l0K61l85K56K22
$$ -131 120 -179 -160 264 -250 -84 79 -162 129 -150 99 13 -154 40 15 77 -59 -89 172 -213 43 265
5454B65k69Q5j26K70j88N1l82M92j55J16jj97L7M1k66J2J41J37J22k92J02O0P7
$$ 265 -4 81 -45 225 37 88 -294 198 43 159 158 -39 -2 39 -227 -215 -74 63 185 -107 -5 55 132
5477A32l0l61L21j40J64P5j7RJ6k57J92k35J92k35Q4M25k10k14M7K8l4m0J40P5
$$ 132 102 -259 62 -78 86 161 144 153 169 -88 104 -131 61 -174 -90 335 125 -89 -42 -14 -48 -88 52 127
5501A27j2q0l1Q7k34J47J33q6o5k2J14p0K6j49j9J04p6J89j54M5r3M0p3J61J42
$$ 127 115 35 4 91 -143 4 137 51 -14 -36 78 8 34 -115 -134 -30 -106 83 -71 -26 -119 -79 -152 9 151
5526A51k21k25L52m3O4r0J81l23Q2k3J38m4qL1R7j81K27o3k70K60o4P4j71J14
$$ 151 -70 -295 57 14 78 -12 169 -154 -72 -95 43 -1 -9 22 119 -62 165 102 -168 92 28 102 -69 45
5550D5m9r9K26k47J97P7j03lR8j01P1J3P0l88K26l7M7j26Q2r6J08k32J41Q4l5
$$ 45 -4 -103 123 -124 73 150 47 44 142 41 112 125 195 -193 33 -4 43 -83 -1 -97 11 -221 -80 4 -31
5575c1o1K78n4j58J7Q8n4k07K27J79j70J4k69J29J16j8r0M3j39M2L00q4j63J94
$$ -31 -92 186 132 -26 -9 79 25 -182 45 224 54 68 -201 -72 44 26 -64 -21 -160 -118 182 98 -65 129
5599A29p7OJ24k37l1J58k32J61K42j98m0n1P4k31M07ok61J00K58k74j76J63j19
$$ 129 52 58 182 -55 -86 72 -160 1 243 45 5 -46 28 -203 204 198 -63 37 295 21 -155 8 -111
5622a11J15M5J21l10j23J28OL78m61J68K1l4K42j76L1P7l16Q8J55j82P4k92L40
$$ -111 4 49 170 -140 -263 -135 -129 249 -212 -44 -23 -57 185 9 40 117 -199 -111 44 -138 -64 -356 -16
5645a6n8jK06K25m05K60j56k08L91j16o4j4J39k73J65k02L96k83M2j50J31J66
$$ -16 -74 -75 131 356 -49 211 55 -153 238 122 58 44 183 -90 75 -127 269 -14 28 -122 9 175
5667A75p2J65k29O2j65J91j68j11L20k69L1J30p8M1j67R4o2M5KL15k77J57j44
$$ 175 103 268 39 101 -64 127 -41 -152 168 -101 -70 60 -18 23 -144 -50 -112 -67 -65 250 -27 130 -14
5690a4n6K03j58J8P0k25OL39j80rj26P5M6K51m36rJ45K61l19J02L3K6l13L21j01
$$ -14 -70 133 -25 -7 63 -162 -156 183 3 -6 -132 -57 -11 240 -196 -205 -60 201 -118 -16 17 43 -270 51 -50
5715e0K0P5j72J59K6j20m0L8K7o4J57j3p3j89J66J33j40l6J17j03K04r6J00l41
$$ -50 -30 45 -127 32 58 -62 -102 -64 -37 -101 56 43 -30 -219 -53 80 -60 -96 21 -82 122 26 126 -215
5739b15K25J45k28R2J6j86K58LK3J17r3n1j50N7J00k58j6N8L7L94j80j51N4K87
$$ -215 10 155 -73 19 35 -151 107 110 133 250 157 106 -44 13 113 -145 -161 -103 -66 328 148 -3 51 338
5763C38l22n1L1j83L28j64J33j89K09J8k23J63p4%j01J06N5l57L14K0Q5p0k65
$$ 338 16 -35 -4 -187 141 -23 110 -79 130 148 -75 88 14 14 -87 19 74 -283 31 51 136 66 -199
5786a99K10J16j31o1Q7%p0N0J25K2j32O6Nl37J46K45j52l7m8J65l66J07L01n0
$$ -199 11 127 -4 -65 22 22 -48 2 127 149 17 83 88 -249 -103 142 -10 -47 -95 70 -296 -189 112 62
5810F2m6J3p8j86J1L18J4M9K1O7k76o5K07q8k8l0r6J18J60K8j00o6pk6J13j20
$$ 62 16 29 -49 -235 -224 94 108 157 178 245 -31 -96 111 23 -5 -35 -131 -13 147 175 75 9 2 -24 89 -31
5836c1K2J67k69J34J93pk60J27J75k65n6R0O4k2Kq9m3k8K0M1KL05m45O3o9j38
$$ -31 -9 158 -111 23 216 209 -51 76 251 -14 -70 20 84 62 64 -25 -68 -96 -76 -35 -33 272 -173 -110 -179 -317
5862c17L76r1P8k77K00J12k25J07n7k0O2K54k76J77M8k15K73j49k98K56j15K05
$$ -317 59 -32 46 -231 -31 81 -144 -37 -94 -114 -52 202 -74 103 151 -64 209 60 -238 18 -97 108
5884A08j82O0K04k69L7pj17N0j12K10J53k93J64R6k07O1p4l4J24lj38l4J20OQ1
$$ 108 -74 -14 190 -79 -42 -49 -166 -116 -228 -18 135 -158 6 102 -105 -44 -118 -152 -28 -31 -169 -203 -83 -77 4
5909Dl9m8L3O1Q7j95OM1Qk69K8L11K68k63m1j50K72l7o6KO6K0j60J56k68K13K
$$ 4 -35 -83 -50 11 98 -97 -91 -50 -42 -311 -283 28 296 33 -8 -158 114 77 11 13 79 99 -61 95 -173 40 42
5936D2O8k05n2K44n0o8n5m3J73L29l28m8l4n9K2O3K49j59r9L8Q5j05j31On1pK56
$$ 42 110 -95 -147 97 47 -21 -76 -119 54 383 55 7 -27 -86 -64 -1 248 89 -10 28 113 8 -123 -117 -168 -175 81
5963H1j07n7O7j35r5L28r5J5J44j60k30L48q9O8qk27J42Q1Q9k53nm8N5J90M0N4
$$ 81 -26 -83 -16 -151 -246 82 -13 2 146 -14 -244 104 15 83 75 -152 -10 71 160 -93 -98 -146 -91 99 139 193
5989A93j65M2j31J15j09J11J10l35N9J50Q3m40L36qJ51l28m5J70K48k01p8K11
$$ 193 28 70 -61 54 -55 56 166 -169 -110 40 123 -317 19 11 162 -166 -211 -41 207 6 -72 139
6011A39k15L09j49j76K26n5lj41J95l9o5k6k96L61k75K03Q8J73k31P9k15Q0K96
$$ 139 -76 233 84 -92 134 79 76 -65 130 91 26 0 -296 65 -210 -7 81 254 23 102 -113 -33 263
6034B63j07m24L35j26j90J17K0J27k39L10j39J25r3m0L43j78L6r6P3O9j60j6o6
$$ 263 156 -268 67 -59 -249 -132 -112 15 -224 86 -53 72 -21 -61 282 104 140 44 117 186 26 10 -56
6057e6J13j60Qo2K31j24P7p2L0J9L0J14p4L1J8J07j70K10l35K44j04j7j48j22
$$ -56 57 -103 -95 -157 74 -50 27 -45 -15 4 34 148 74 105 123 230 60 270 -65 179 75 58 -90 -212
6081b12J05q5K81K35m40o8L56j92j6n0L9l9K12j59O0l8L3J65j02j1j73L8R6J24
$$ -212 -107 -192 89 324 -116 -184 172 -20 -36 -86 -47 -86 126 -33 27 -11 22 187 85 74 -99 -61 35 159
6105A59j46Oj34O6j56K13K3K55j84J07k53J11J9k54K30l4L7Q1n3J13k23N2J05
$$ 159 13 19 -115 -49 -205 8 31 286 102 209 -44 67 86 -168 62 28 65 146 93 206 -17 35 140
6128A40j22K8N7J11l57J29m83L69K41k72M5J36J38K5n1j77J28r1J79k92R4j04
$$ 140 18 46 103 214 -143 -14 -497 -128 113 -159 -114 22 160 185 134 -43 85 -6 173 -119 -25 -129
6150a29J88J85j40K89m32j38J96q7K16j48o2J81j60J83l09J98n6j17Q5N0k46L15
$$ -129 59 244 104 393 -39 -177 19 -68 148 0 -62 119 -41 142 -167 31 -25 -142 -57 -7 -253 62
6172F2k0K57k58O3l0o8n7J67p2j62Q2lJ01M9J39l28J87k10k3J0N3J19j9K11m21
$$ 62 42 299 41 104 74 6 -51 116 44 -118 -36 -39 62 111 250 -78 109 -101 -124 -114 -61 58 39 250 -171
6197a71J23J28j57L2j14J28J3O3J64om21q6K66M9J4j01J38k7p4k3R3J75k40j35
$$ -171 -48 80 -77 -45 -159 -31 -18 45 209 203 -218 -304 -38 11 25 -76 62 35 -39 -62 31 206 -34 -169
6221a69J33J47J2l15J30J23o7J3L2L7l46M17m7j85j26K75j55k8n7L98m28K96J10
$$ -169 -36 111 123 -192 -62 61 -6 7 39 76 -270 147 100 -85 -211 64 -91 -119 -176 222 -206 90 200
6244B00j81K7k05j9k25M57k00l08L41P1J50q3r4K76k72J49l4j45L3J10j8j49J9
$$ 200 19 46 -159 -178 -403 54 -146 -454 -113 -42 108 25 -69 207 -65 84 50 -95 -62 48 30 -119 -100
6267a00J77M4o5K0o5j59K17k47J75j08J33j79K95p4R8j08j8j25J54k26J72K41
$$ -100 77 121 56 76 11 -148 69 -178 -3 -111 22 -157 138 64 162 54 36 -89 65 -161 11 252
6289B52k42J15m32K10O7K21l59K21k88J92J32N6L4j76r4N1P7k45J71j4Q0l2m7
$$ 252 10 125 -307 -97 -30 191 -168 53 -235 -43 89 145 179 3 -91 -40 37 -208 -37 -51 29 -3 -50
6312e0J22j4J15j26M0j70O1m1K13j17m31N07m4K4k07K38k06J57l8q7Nl2n8k7r0
$$ -50 72 58 173 47 87 -83 -22 -63 150 33 -398 109 65 89 -118 120 -86 71 33 -54 -49 -81 -139 -166 -256
6337b56J99O5J39j9j36J1j98rN1N35m89R4j11J47M1J22k2o8k84J80j81J64o4J59
$$ -256 -57 8 147 128 -8 3 -195 -204 -153 382 -107 -13 -124 23 64 186 164 96 -188 -8 -189 -25 -89 70
6361G0k97K65J2M3k92K61j38j33J25k7J10k77J65J8J38J97l31K9Q0K50k24q7L
$$ 70 -227 38 50 93 -199 62 -76 -209 -84 -111 -1 -278 -113 -95 43 240 -91 -62 18 268 44 -43 -40
6384d0K06N6j71r2r7R4R2m7j34L56p5k11j56L13l30L49j21M2J03j57J16j65Q5
$$ -40 166 222 51 -41 -138 -44 48 1 -133 223 148 -63 -219 94 -236 113 -8 34 137 -20 96 -69 16
6407A6J16J86j12m4j15N9j34P0j0j03J63J57j88J01j36K6r7j31K51l4K3l1j35
$$ 16 132 318 206 162 47 106 -28 42 32 -71 92 249 61 162 26 52 -45 -176 75 41 64 33 -102
6430a02J65k49J35J06k59K41K4j21L37l12J77j10k30K81j63n7J8L9Q8l0j0J8R5
$$ -102 63 -186 -51 55 -204 37 61 -60 277 -35 142 32 -198 83 -80 -137 -119 -80 8 -22 -32 -14 81
6453H1j77R8j94J43k02M05j93K73j09k55J15j6m5k9K41o4k80L15r1m3J62j69K14
$$ 81 -96 2 -192 -49 -251 154 -39 234 125 -130 -15 -31 -76 -105 136 72 -208 107 16 -27 135 -34 180
6476A80m25L34p4J34k39jQ0P3k87K22K80k51LL4q5L08k99J24l89J05M45k75j13
$$ 180 -245 89 15 149 -90 -91 -11 62 -225 -3 277 26 29 63 -22 286 -13 111 -278 -173 272 -3 -116
6499a16L4R2q4L2K8J93j68N8R0k79J09M9J24k16j2L3J0%l8J78j28L0k07J17J99
$$ -116 -82 10 -74 -42 -14 179 11 69 159 -120 -11 38 162 -54 -66 -33 -23 -23 -61 117 -11 19 -188 -71 128
6524A28k92M4K39l7o5r4k18J31K87r9M4k7r4R5j06K12j13p8j38K22Lk01M13j21
$$ 128 -164 -120 119 82 17 -77 -295 -164 123 24 68 41 -53 42 -64 148 35 -43 -181 41 44 -157 256 135
6548A35k7j05p1Rj16K53o9r4K41P3l74K81r7l83J89J13j38J07J42m0J32k44K51
$$ 135 108 3 -68 -59 -175 78 9 -85 156 229 -145 136 39 -344 -155 -42 -180 -73 69 29 161 -83 168
6571A68k15L6K30k48K16j95O3Q8k21RL6k00K57J66j1m06L64k5l23J01J10N3j87
$$ 168 -47 -11 219 -29 187 -8 55 143 -78 -69 -33 -233 24 190 179 -227 137 112 -211 -110 0 53 -134
6594a34L36k99L8J06l8n6J36J66l00J25J34l14J69Q1j05n9J11rl62J75J53Q7j27
$$ -134 202 -97 -59 47 9 -47 89 255 -45 80 214 -100 69 150 45 -14 97 88 -274 -99 54 141 14
6617A4mk5L4R1J48k48j31Q2M4m4J05K5j97j29k1J69K28k20P6Rk6J37k04J95r6
$$ 14 10 -15 19 110 258 10 -121 -39 5 -39 66 91 -106 -235 -256 -87 141 -79 -3 6 -20 117 -87 108 12
6642A2J87k04k19K15L5j20k1K1j9K12j25n3o1j41L12ql1o0l1O7K51o6j43J5m8
$$ 12 199 -5 -224 -9 26 -94 -115 -94 -113 99 -26 -79 -140 -281 31 23 -8 -68 -99 -32 219 153 10 25 -23
6667b3K16r7j62J83k79Q5L64m49K15p2q5K28j40J05p1P5j99j50OK67k7J19K9j59
$$ -23 193 96 -66 117 -162 -77 287 -162 53 -19 -104 124 -16 89 18 93 -106 -256 -250 17 -10 109 138 -21
6691b1k7J57J42k09K2j54N9J1K3J03K7l25J75K42k14j05M0p6K0j0J65j38N6N9
$$ -21 -48 109 251 42 64 -90 -31 -20 3 106 133 -192 -17 225 11 -94 -54 -130 -110 -120 45 -93 -37 22
6715B2J12n7p6o4O4j89J32N4j9n9rM6R8n2k05K44j17Q2K00k99J97pj14J93j67
$$ 22 134 77 1 -63 1 -188 -56 -2 -21 -80 -89 -43 55 3 -202 42 -75 7 207 -92 105 98 -16 177 10
6740A0l95M11j42K92k04N0R2l64Q6J09p6K46M2k31J62k25L47l19K33Pj80j19K17
$$ 10 -385 26 -116 176 -28 22 114 -250 -164 -55 -131 115 157 -74 88 -137 210 -109 124 131 -49 -168 49
6763D9k4J05k86p0J57l9n8K73l4j46M2nJ56k72M01m87K90R9l51M27l47J96Q3o2
$$ 49 25 130 -156 -226 -69 -108 -166 107 73 -73 -31 -36 120 -152 249 -238 52 151 -200 227 -120 76 159 97
6787I7m8J12J10j93k26K51j95K48k21K5M9j56Q3J8K42j49l7K5r0k2K03j24K19
$$ 97 49 161 271 78 -148 103 -92 156 -65 -40 9 -147 -64 -46 196 47 10 35 -55 -77 126 2 221
6810B21n6l64J41n7J90kj30K59m50K75NrP0K34k20j90P1J49j67j49J36l6k3R6
$$ 221 165 -199 -58 -115 75 73 -57 202 -248 27 32 23 93 327 107 -83 -12 137 -30 -179 -43 -79 -102 -6
6834fn0L9q7L91k59l27L03o4K85Pm49J91Q1J6k08R5R6k70L99m04K44j67P8L3J39
$$ -6 -56 -17 -104 287 28 -299 4 -60 225 232 -217 -26 55 71 -137 -42 54 -216 183 -221 23 -144 -66 -33 106
6859A06j51R4n3j00J71l48L91j00j34L39k69M0j4PJ3q3K99m27J87k9M47l66R7
$$ 106 -45 49 -4 -104 67 -281 110 10 -124 215 -54 -14 -28 -21 -8 -91 208 -219 -32 -61 386 20 117
6882A17j87rL77k67P6r8j61J76L40m11K87l40J66Rj78P7J11k15L29l36j35M38
$$ 117 -70 -79 298 31 107 9 -152 24 364 -47 240 -100 66 75 -103 -26 85 -130 199 -137 -272 166
6904A66P7l00k20K06k3j30J78J11k42K92M1j76j89O09n16L21m3k40l7J40Q1o4
$$ 166 243 -57 -277 -71 -94 -224 -46 65 -177 115 156 -20 -209 400 -116 205 162 -78 -115 25 106 42
6926D2j70M1R7l2J69k12J99k02J6m7L35l38M16l04J65l20K91j36j71O9J67k46
$$ 42 -128 -87 10 -22 147 -65 134 -68 -52 -99 236 -102 314 10 175 -145 146 10 -161 -92 75 -171
6948a71J77M6K9j85j69J73R5J06ll5j85K34j66n8J08r8K6J25n4r4L16J7j17r8
$$ -171 6 52 81 -104 -273 -100 -5 101 98 63 -122 112 -54 -112 -4 -102 -76 49 -5 -99 217 234 117 19
6972A9j01j0J17kl7J79j23j11J23j42j36K35R1k13J92k17l0M02k55K67r6K6j49
$$ 19 -82 -92 25 23 -14 165 42 -69 54 -88 -224 11 102 -111 81 -136 -166 236 -19 248 152 178 29
6995B9k66L26j3q5J71K1j9k18P5j1l9Q0m8j21R7p7K90m70L47o7r8J20j14J33R7
$$ 29 -237 89 76 -9 162 183 164 -54 21 10 -29 51 3 -118 -21 -98 192 -278 69 2 -96 24 -90 43 140
7020A40k84J4J95j63lr5J04L22l98J80J43l06R7J56j16J31l05J33L1J06J03m1
$$ 140 -144 -130 65 -98 -101 -196 -92 230 -168 12 155 -151 -54 102 -14 117 -188 -55 -24 82 185 144
7042A44m9k52J06j30J24o2Q7j2o2p8K67j40J79n1j7j37J47j05o1K32j98J39R3
$$ 144 95 -157 -51 -181 -57 -119 -32 -44 -106 -184 83 -57 122 71 54 -83 64 -41 -102 130 -68 71 164
7065A64k60R0p8K26j73k7p3K92l08L31j96oo2J72N2j91k2K31k42J19o3j05M82
$$ 164 -96 -6 -84 142 -31 -58 -131 161 -147 184 -12 -18 -80 92 144 -47 -69 162 -80 39 -24 -129 353
7088C53k29j3k82M06l85J81j7J47j78l2j56R6L90j25j47j59J16R2P2j33r1J14
$$ 353 124 111 -171 235 -150 31 14 161 -17 -49 -205 -109 281 156 9 -150 -34 58 130 -3 -94 20
7110B0Q3p8J28k85L78R0k61j43R2P1q3k06K91j11J8P4q8K9j4O8p0j40K92j38m2
$$ 20 103 25 153 -132 246 336 75 -68 24 95 12 -194 97 -14 4 78 -10 19 5 73 3 -137 155 17 -25
7135b5j06K04j57j34J97k25K8K47nr4R5q8J56j89J21j25K07j76L8J90k62J62k9
$$ -25 -131 73 -84 -218 -21 -246 -218 29 24 -70 25 -63 93 -96 25 -100 107 -69 -31 159 -103 59 30
7158C0J1P7j75q3J27M9m8Nj90M58k57r9R8j18J62j9l02J5K06j5m9M7J1Q3J18L5
$$ 30 41 118 -57 -140 -13 36 -12 -7 -197 261 4 -95 3 -115 47 28 -274 -259 -53 -68 -117 -70 -59 24 142 177
7184A77j52j58J23n9L47j15o9k34J10j49Q7m4J71j15J54k1r1R2j46J39j06NK52
$$ 177 25 -133 -10 -69 278 163 94 -140 -30 -179 -92 -136 35 -80 74 53 -38 54 -92 47 -59 -54 198
7207A98l71K02mN0j61j00J0L54P7p0k79kP0LK1k8o1J9R0j95J07N2J44l05J07P7
$$ 198 -173 29 25 75 -86 -186 -176 178 255 185 -94 -96 -26 -23 -2 -30 -91 -72 18 -177 -70 -18 126 -179 -72 5
7233EL1Mj16O7P6j15P7J5l4J13Lo6K3j34L2k4J3K7R2l1L4j59O0K7J82l30J16j39
$$ 5 36 40 -76 -9 67 -48 29 44 10 123 126 60 83 -51 -19 -43 -30 -3 89 58 92 -67 -7 20 202 -128 -12 -151
7261a51K05j42J3p4j34K52K3L33m01J46k4j7K04l12K54n7k06J01L5L4J6j93m2
$$ -151 54 -88 -75 -149 -283 -31 -8 325 -76 70 46 29 233 -79 175 118 -88 13 48 82 98 -95 -137
7284a37K20J1k14j54J94p3K11j29K85m73N14k00J13K24n39L18N6k30n8j21R8K03
$$ -137 83 94 -120 -274 -80 -153 58 -71 214 -259 255 55 168 392 -147 171 227 -3 -61 -182 -84 119
7306A19k01J83j65J34J28q0k50J43J14k00j03N7J62O9p8M1l03L18j70r4L09Q7
$$ 119 -82 101 -64 70 198 118 -132 11 125 -75 -178 -121 41 110 32 73 -230 88 -82 -176 133 220
7328B20j85R6q2L7k8M5j76J62K6l43J37M07l53L2N8O7k78J81J57p7j3l78M01j52
$$ 220 35 131 49 86 58 103 -73 89 115 -228 -91 316 -37 -5 53 120 -158 23 180 103 90 -288 113 -39
7352c9K9rm9J68L0o8r5J36M9l74L78N9k88J96j34j89K51K5P5q2j87J39M2O7j70
$$ -39 -10 -19 -68 100 130 62 -33 103 152 -222 156 215 -73 123 -11 -200 51 76 151 69 -118 21 63 130 -40
7377d0K26j74p2k2O8J13M7l10J52N9K1Ll1J90Ml25J13p8p4K14j40r9J23Q2j94
$$ -40 186 12 -60 -82 -14 99 146 -164 -12 47 68 71 40 230 234 -91 22 -56 -130 84 -56 -155 -32 50 -144
7402a44J91n5N0Mj69L45j42l15K29m5Qp0J05k26L75N6l92K24j13j06J06j33K53
$$ -144 47 -8 42 46 -123 222 80 -235 -6 -51 -43 -113 -8 -234 141 197 -195 29 -84 -190 -84 -217 36
7425C6J2L1k22K26n3qk21M5L6J46j30K26j26J7l6L8J61m78M14J04j47r2R0N5j74
$$ 36 48 79 -143 83 30 22 -199 -154 -118 28 -102 124 -2 15 -21 17 178 -300 114 218 71 -21 69 124 -50
7450e0JK73k20L2o8K61l02J43j89KK5J41l2Q5m04L99j37J49K6k32K37j77L35m81
$$ -50 -49 224 4 36 -32 229 -73 70 -119 -117 -92 49 17 102 -302 97 -40 109 135 -97 140 -37 298 -183
7474a83MR0J2J01J02k18M3O2j95J46p8l3J13J9J4k5nn5q5J55J56j87L28k69q9
$$ -183 -179 -89 -77 24 126 -92 -49 13 -182 -36 -114 -147 -34 -15 -1 -26 -31 -86 -171 -16 140 -47 281 12 -77
7499g7J20K11j97P1l59L41N7j8l02J94m1r6J97l29J05J70l6j68OL22j03j65k21
$$ -77 43 254 57 128 -231 110 167 149 -153 41 0 -96 101 -228 -123 47 11 -157 -151 171 68 -97 -318
7522c18L81k9J66j49kj35L45m02L0J38j02J23j52K6K13j66J3o4k9K00j27l5M8
$$ -318 63 34 200 51 49 -86 259 -143 -113 25 -77 46 -106 -80 133 -33 -20 -84 -113 87 -40 -75 -27
7545b7k13K49R1j84M7j20K7p3K76m1pr6K30o4K2k39J72j13Q5l3N8j75K1R5J00
$$ -27 -240 9 100 -84 -37 -157 -130 -203 73 32 25 -71 159 95 117 -122 50 -63 22 -11 47 -128 -107 -12 88
7570H8k49L42j54j83K24K7n4J96j64j28qJ25J40j42M9j66J71j80L06n06K98J97
$$ 88 -161 181 27 -156 68 95 41 237 73 -55 -63 62 202 60 109 -57 114 -66 240 -266 32 229
7592B29j23j89k11L5L95n3m9n9r5L5K22m6MJ39k76J0o2M8J87j75J46L5k60J93
$$ 229 106 -83 -294 -259 136 83 34 -25 -120 -85 137 91 95 234 -42 -32 -94 -46 141 -34 112 147 -113 80
7616H0k5j26R6J13l19k5J04K57j86m9n9l3J11J16r0Q5J49q6l8J4P4l28J49J54
$$ 80 55 -71 25 138 -181 -206 -102 155 -31 -80 -139 -172 -61 55 -35 50 199 113 75 89 163 -165 -16 138
7640A38M7k23J81j68K93l65K39R5j27j08L0j90L18k06O4R9l08J81q9LK63o5j58
$$ 138 185 -38 143 -25 268 -97 142 237 110 2 32 -158 160 -46 18 117 -191 -10 -99 -96 167 102 -56
7663e6Q2k10J98O2p6J35k40R5l3J01j68J12K68r5k26j6J18j09J33J21K4k83Q3
$$ -56 26 -184 14 76 0 135 -105 -10 -43 58 -110 2 270 175 -51 -67 51 -58 75 196 220 -63 20
7686B0l70M34k33m1OJ91l4Q5M9k03Q4J01j39J75l04J40Q9j10J11k40J90P5L6k66
$$ 20 -350 84 -149 -190 -184 7 -27 58 107 -96 -12 89 -50 125 -179 -39 50 -60 51 -189 1 76 112 -154
7710a54K95l72J48P5o1K0j47J48L19m44K01p7J85J44k60M2l55L18j70J06J53j69
$$ -154 141 -231 -83 -8 -69 -49 -196 -48 271 -173 28 -49 136 280 20 62 -293 25 -145 -39 114 -55
7732e5k4K19j89j34K0N7J94j67K86k49n1J67m8n5qk24J97J1Q5K31qk87k25J58
$$ -55 -79 140 -49 -183 -163 -106 88 -79 207 -42 -93 74 26 -29 -37 -261 -64 -53 32 263 255 -32 -257 -99
7756i9p3j15J97n6ON2K70k06R1j00j74K00j21M3j49K30k10J71J76k60J96jj11
$$ -99 -172 -287 -90 -146 -140 -88 182 -24 67 -33 -207 -7 -128 -85 -234 -4 -214 -43 133 -127 69 68 -43
7779d3M9O7o5j05P2j20J30N2p2O5j11R9q8q6k9o4J07J75n9jO9J92l5j22j98J13
$$ -43 6 73 8 -97 -25 -145 -15 37 -35 30 -81 18 -70 -156 -185 -249 -142 33 -26 -27 42 234 199 77 -121 -8
7805h%k09L30k61J91p5q8pL02l22K43o5j41P3J33p2k32j15N29l40K14P4j86kP6
$$ -8 -8 -217 113 -148 43 -32 -120 -127 175 -147 96 31 -110 -37 96 24 -208 -323 206 -134 80 154 -32 -34 42
7830D2q5j18K33k21J93lL2j81LJ74L7j00J31Rm15K46j00K29R1k0J8j76p7j29J51
$$ 42 -43 -161 72 -149 44 41 73 -108 -105 69 106 6 137 146 -269 -23 -123 106 197 177 195 19 -58 -187 -36
7855c6L45l81J86L8k01J35j64j34M0K87j56P2k38J30j28O3J32J42O6J2k53J86
$$ -36 309 -72 114 152 -49 86 -78 -212 -172 115 -41 31 -207 -77 -205 -142 -10 132 198 210 -43 143
7877A43j37j55K65j17J13p4J04l08K3J88Lj97K43k34O8l6L70j80J09k36o9J48
$$ 143 6 -149 116 -1 112 38 142 -166 -143 45 48 -149 94 -140 -72 -108 262 82 191 -45 -114 34
7899C4J10j15O2M3Q9k63J29m4m3j68J19r6R8R4K0k68K89n8J69j08j30Lp7L13k72
$$ 34 144 29 91 134 223 -40 89 45 2 -166 -47 -143 -45 49 69 -199 90 32 201 93 -37 -34 -111 202 -70
7924g0q9N7P4L7Q5l2j08n5K46p2K02Q9n40L5K5J84K9j40p1J13K19j92j18j63J90
$$ -70 -159 -102 -28 9 94 62 -46 -101 145 73 275 364 -176 -141 -116 68 97 -43 -114 -1 218 26 -92 -255 -65
7949f5k0L22j91j7p8j93K65L89n30J76op3m0j44L77j66j13Q2n4P9P8J47l17J82
$$ -65 -85 237 46 29 -49 -242 23 412 -118 58 52 -21 -61 -205 172 6 -107 -25 -79 0 78 225 -92 90
7973I0l8p2J03l7Q2l11L58k28J46N0r1J53r7k29K31J20k59K53j67j15l6N4k08
$$ 90 52 -20 83 46 128 -183 175 -53 93 143 52 205 108 -121 110 230 -29 224 57 -58 -94 -40 -248
7996b48J6L99j44K9R8j87r0J31J03J20k65k3P2K92l84J9J57r0j21L6K4M0R0o0
$$ -248 -232 167 23 52 150 -37 -127 4 107 227 -38 -61 11 303 -81 -62 95 5 -116 -80 -56 -16 74 14
8020A4q9J83l92K28q9K33J9L0n8j13m4L9J07J7j18m9Q8J08K2O0m8j14j20Lj96
$$ 14 -75 108 -284 -56 -145 88 107 137 79 -34 -78 -39 68 85 -33 -82 6 114 136 196 148 34 -86 -83 -279
8045b79L34k51O9J20O4P0j81j35J52J63K1q1q8Q9q5r8J94j20J87q9J17j87L3J0
$$ -279 55 -196 -127 -7 57 127 -54 -189 -37 126 147 66 -22 67 -18 -116 78 -42 145 56 173 -14 19 29
8069B9r3R3j40nj27K25j74L33k01M41m67k46N04j75J0N0pk33J12qJ64J88q7l44
$$ 29 -64 29 -111 -116 -243 -18 -192 141 -60 381 -86 -332 172 -3 7 57 50 -183 -71 -79 85 273 186 -158
8093a58K53j41j27K32r0O2j28o0J17o6J29K1m3m3n1J46q1k10L38j30J26j00L1
$$ -158 95 -46 -173 59 -31 31 -97 -157 -40 -106 23 44 1 -42 -93 53 -28 -238 100 -30 96 -4 27
8116B7k1p3%J48p8O2J2m5K1j55J32j87O7J50j21J42j75j91K30L19k96K17p0j22
$$ 27 6 -67 -67 81 3 65 77 32 53 -102 30 -157 -90 60 -61 81 -94 -285 -55 264 -32 185 115 -7
8140gO0J42k55l1mK53l99K05OP8k9j43K25nJ68k72L6J26l40K05j92L51l18M77
$$ -7 53 195 -60 -91 -95 158 -241 -36 -30 48 19 -124 101 96 264 -8 28 154 -186 19 -173 178 -140 337
8164C37l98k2K1j98K28J13M1l39J77L43j97l28J7R8K71k80n3K70k17j9K18j20
$$ 337 -61 -83 -62 -260 -32 81 122 -217 -40 303 106 -222 -205 -107 164 -116 -169 101 -116 -135 83 -37
8186c7J82r3p4J03k48
$$ -37 145 52 -22 81 -167
8191a67
$$ Imaginary data points
##PAGE= N=2
##DATA TABLE= (X++(I..I)), XYDATA
0@%%%%%%%%%%%qQqJ6j6J6k4L2l2M0m8N6o7P5q8J04j20J40j61J84k10K36k66L03
$$ 0 0 0 0 0 0 0 0 0 0 0 0 -8 0 -8 8 -8 8 -16 16 -16 24 -24 32 -35 40 -48 56 -64 76 -85 99 -111 125 -141 162
35A62l43L85m32M81n35N95o62P36q15Q99r93J097j210J334j467J616j782J964
$$ 162 -181 204 -228 253 -282 313 -349 387 -428 471 -522 575 -635 699 -768 848 -934 1030
53A030k165K393k651K944l284L677m139M698n385O251p386Q943j1218J4864k1634
$$ 1030 -1135 1258 -1393 1551 -1733 1944 -2195 2503 -2882 3369 -4017 4926 -6292 8572 -13062
68a3062L8281j52984k31675K75746P5322k5080K38794J56174j76375R723J25383
$$ -13062 25219 -127765 -359440 -83694 -8372 -33452 205342 361516 185141 194864 320247
79C20247j28571q4994J13485j60116k60035R3912J07493j30831P1705J71101j71189
$$ 320247 191676 106682 220167 60051 -199984 -106072 1421 -129410 -57705 113396 -57793
90e7793k00038Q0405j1660r5708J47918J16737j19850M7456J94914j7802M70J94437
$$ -57793 -257831 -177426 -189086 -284794 -136876 -20139 -139989 -92533 102381 84579 85049 279486
102B79486k4213k21047Q253P5259r0756M4083J60961p4434j29578M8579m5158
$$ 279486 255273 34226 42479 117738 26982 71065 232026 157592 28014 76593 31435
113C1435j40820N0511L7123j78050o6775J02167k4344j4475J72631O5372r8802
$$ 31435 -109385 -58874 -21751 -199801 -266576 -164409 -188753 -203228 -30597 34775 -64027
124f4027K6305O2732o9015K3868J34907j6300n4167R2814L4280o7596N2266O0324
$$ -64027 -37722 25010 -44005 -20137 114770 98470 44303 137117 171397 103801 156067 216391
136B16391j11684q8215J1875p0537p2053O6355K5340p5891O910L5023o6080j7026
$$ 216391 104707 16492 28367 -42170 -114223 -47868 -22528 -98419 -91509 -56486 -122566 -139592
148a39592P6551r992n2275M6424L8270j5093O8279R7465l269q445L6223l2149
$$ -139592 -63041 -73033 -125308 -78884 -40614 -55707 12572 110037 106768 98323 134546 102397
160A02397n2571L2695J6220n2923o938K0790m0534k5432K8503k2135o2221j5545
$$ 102397 49826 82521 98741 45818 38880 59670 19136 -6296 22207 72 -62149 -77694
172g7694j8020m4581J3035N1053P690Q936M3441J1188r737K9916K5235j4412L737
$$ -77694 -95714 -140295 -127260 -76207 -68517 -59581 -16140 -4952 -14689 15227 40462 26050 29787
185B9787K2752k635N969L6441J1865j8412q953k0451m6504k8197p275j9913j5573
$$ 29787 52539 49904 55873 92314 104179 85767 76814 56363 9859 -18338 -25613 -45526 -61099
198f1099O349P00o316J0246J0387q688o860K884j987N376K5679L1256K7575K5125
$$ -61099 -54750 -54050 -60366 -50120 -39733 -48421 -55281 -52397 -54384 -49008 -23329 7927 35502 60627
212F0627J5763J707k333o480j6812j7949j0491p917p408j078N389k16j3312j9133
$$ 60627 76390 78097 75764 69284 52472 34523 24032 16115 8707 7629 13018 12802 -510 -19643
226a9643j8652j9397j9374p538Q302J3902J7091K1993K3152J8134J0651N19m880
$$ -19643 -38295 -57692 -77066 -84604 -76302 -62400 -45309 -23316 -164 17970 28621 29140 24260
239B4260q53K38k575O301J8601J2863Q61J95n700k0893k6242k2731k1801j5409
$$ 24260 23407 23645 21070 27371 45972 58835 59696 59891 54191 33298 7056 -15675 -37476 -52885
253e2885l601J693P545J6880J1871l96p10N23q609q659N706J3948J4919K0391
$$ -52885 -56486 -54793 -47248 -30368 -18497 -18893 -19603 -19080 -27689 -36348 -30642 -16694 -1775 18616
267A8616K2542J6430Q957J79j2664j7110j4455j6843j4662p80N795J557J803L207
$$ 18616 41158 57588 66545 66724 54060 36950 22495 5652 -9010 -9790 -3995 -2438 -635 2572
281B572m992j4149j4607j3223j1641l213O971J4053K0830K2216J6069R625M720
$$ 2572 -2420 -16569 -31176 -44399 -56040 -59253 -52282 -38229 -17399 4817 20886 30511 35231
294C5231l536r319p652m022j138L969R661Q791L976m44p619j4724j8659j7644
$$ 35231 31695 22376 14724 10702 9564 13533 23194 31985 35961 35517 27898 13174 -5485 -23129
308b3129j4175q534k52O557J2107J3671R928M781k56m667o772m850R62O920J0957
$$ -23129 -37304 -45838 -46090 -39533 -27426 -13755 -3827 954 698 -3969 -10741 -15591 -14629 -7709 3248
323C248J4475J4122R964L098m458j0130j3055j3592j1192o078n51L270L780L693
$$ 3248 17723 31845 41809 44907 40449 30319 17264 3672 -7520 -13598 -14149 -10879 -7099 -3406
337c406K831k294o662q914q491n660o88N026J0815J4800J4011Q703N702J026n669
$$ -3406 -575 -2869 -9531 -18445 -26936 -32596 -33284 -28258 -17443 -2643 11368 20071 25773 26799 21130
352B1130r262n826k360j773L163P463M599J264j646o492r701r289r884q642p46
$$ 21130 11868 6042 3682 1909 5072 12535 17134 18398 16752 10260 559 -8730 -18614 -27256 -28002
367b8002M938L662O814J1594M710r11Q41j435p421l243L236K559O113J1735O511
$$ -28002 -23064 -19402 -12588 -994 3716 2805 3646 2211 -5210 -8453 -5217 -2658 3455 15190 21701
382B1701J003J850m840j2703p424k148p336l500P188L522q86N911K222q203m967
$$ 21701 22704 24554 19714 7011 -413 -2561 -9897 -13397 -6209 -2687 -3573 2338 4560 -3643 -8610
397h610j197q095l098Q679M844J514J2342R111l634J327M190r645j0101K017j505
$$ -8610 -9807 -17902 -21000 -12321 -7477 -5963 6379 15490 11856 13183 17373 7728 -2373 -356 -1861
412a861l861J0064R178l302L33K220j2774j1167K385m215q286Q132Q546l032O177
$$ -1861 -5722 4342 13520 10218 10551 12771 -3 -11170 -8785 -13000 -21286 -13154 -4608 -7640 -1463
427a463J3248l352p297K974o148j1360N532Q013k066P301J2143m853m790P531
$$ -1463 11785 8433 1136 4110 -2038 -13398 -7866 147 -1919 5382 17525 12672 7882 15413
441A5413o367j4905K43l1j1774M207J6677J801p55Q706n126j5941J292J232r805
$$ 15413 9046 -5859 -5616 -5647 -17421 -13214 3463 5264 4509 13215 8089 -7852 -6560 -5328 -15133
456a5133K949J0815l752P15J7268M297q244L473k986j9883m621R222j438K220
$$ -15133 -12184 -1369 -5121 -4406 12862 17159 8915 12388 9402 -10481 -15102 -5880 -7318 -5098
470e098J4864M91q136O900K650j3101k050K301j4133o639J4652Q166R45J2912
$$ -5098 9766 10257 2121 9021 11671 -1430 -3480 -1179 -15312 -21951 -7299 867 1812 14724
484A4724M109j5008n271K160r025k594R508l381o581J2266R960l169N683M519
$$ 14724 18833 3825 -1446 714 -8311 -10905 -1397 -4778 -11359 907 10867 7698 13381 17900
498A7900j6948j4573K339j274p81J4845O995o185L632N552p237j028N786j1879
$$ 17900 952 -13621 -11282 -12556 -13337 1508 8503 2318 5950 11502 4265 3237 9023 -2856
512b856j4770M173M562O95J4279J3035p797p402n46q954n429P930L09q319M336
$$ -2856 -17626 -13453 -8891 -8196 6083 19118 11321 3919 3373 -5581 -11010 -3080 -2771 -11090 -6754
527f754O674m30Q882J2198p143j2642l291p274o026J0377J0327k573J706M173
$$ -6754 -80 -510 8372 20570 13427 785 -2506 -9780 -15806 -5429 4898 2325 4031 8204
541H204o053o34P459m140j1867k110l531n220J0970J5292J138j240J228r478p452
$$ 8204 2151 1517 8976 4836 -7031 -9141 -12672 -17892 -6922 8370 9508 8268 9496 18 -7434
556g434O063J827n332L021J987n250O402J3578o27n554o07j0601j3040M217P958
$$ -7434 -1371 456 -4876 -1855 132 -5118 1284 14862 14235 8681 8074 -2527 -15567 -11350 -3392
571c392r53M682M971o955k584Q745r98o043K615m087j1925N414J3201J984L715
$$ -3392 -4345 337 5308 -1647 -4231 4514 3516 -2527 88 -3999 -15924 -10510 2691 4675 8390
586H390Q001p320j1257L750J298n977M077L289r712l98J1512o59k937O426o406
$$ 8390 16391 9071 -2186 1564 2862 -3115 962 4251 -5461 -5859 5653 4994 2057 8483 2077
601B077j6590O68O754l871N505J2134m525o019Q535J357p260N777K756j3354j229
$$ 2077 -14513 -13845 -7091 -10962 -5457 6677 2152 -3867 4668 6025 -1235 4542 7298 -6056 -7285
616g285J0726j197Q30J2894j837j4013O23J419j1039J466Q971p319n510J0482
$$ -7285 3441 2244 3074 15968 14131 118 741 2160 -8879 -7413 1558 -5761 -11271 -789
630g89J382n813Q912L530j4607l517P594n274j89J6073K599p663O251M106j0424
$$ -789 593 -5220 3692 7222 -7385 -10902 -3308 -8582 -8771 7302 9901 2238 8489 12595 2171
645B171P71P225j0174p423Q742j503o056J1396O738j1856k913M088j0359o662
$$ 2171 2942 10167 -7 -7430 1312 -191 -6247 5149 11887 31 -2882 1206 -9153 -15815
659a5815R486Q38o440Q953O931n498M457R544q121p373O399l032p767R525Q478
$$ -15815 -6329 -5491 -11931 -2978 3953 -1545 2912 12456 4335 -3038 3361 329 -7438 2087 10565
674A0565o038J927P008p665o842N173m115j1343L648L080o965M464J1213l511
$$ 10565 4527 6454 13462 5797 -1045 4128 13 -11330 -7682 -4602 -11567 -7103 4110 599
688E99l842O294l491r838L934M146n278M047J0205q27n33Q904j967q229R97j81
$$ 599 -3243 3051 -440 -10278 -6344 -2198 -7476 -3429 6776 5949 5416 14320 12353 4124 5121 4940
704D940r563l71P188k795j404O967l19o946R09l03q282j823M042k397O51R272
$$ 4940 -4623 -4994 2194 -601 -2005 4962 4643 -2303 -1394 -1697 -9979 -11802 -7760 -10157 -9506 -234
720b34L261j272N002K167o499j607K840l523k313O048K109j314L260K089n145
$$ -234 3027 1755 6757 8924 2425 818 3658 135 -2178 3870 5979 4665 7925 10014 4869
735D869l160o37o364m083K237n78j082M667M284j381N62K104l183l244J471L57
$$ 4869 1709 1072 -5292 -9375 -7138 -7716 -8798 -4131 153 -1228 -666 1438 -1745 -4989 -3518 -3161
751c161q34M294M591J207K487K482k531l319r31l304l938RJ582o49J308K436q97
$$ -3161 -3995 299 4890 6097 8584 11066 8535 5216 4285 981 -2957 -2948 -1366 -2015 -707 1729 832
768H32j871j101k238l071q83P98p4K976M640J910J942K206%k383q69o44j241K93
$$ 832 -1039 -2140 -4378 -7449 -8332 -7534 -7608 -4632 8 1918 3860 6066 6066 3683 2814 2170 929 1222
786A222J690J309R85O81q75k244k065k903l603j262m2K36J180K421J803Q20J53
$$ 1222 2912 4221 5206 5887 5012 2768 703 -2200 -5803 -7065 -7107 -6871 -5691 -3270 -1467 -647 -494
803d94k56m09o51l75R39J931K244K054K044J062o22j564k165k078j917k079k69
$$ -494 -750 -1159 -1810 -2185 -1246 685 2929 4983 7027 8089 7467 5903 3738 1660 -257 -2336 -2605
820b605M02N58M02M98l72j273j587j587n72p5P16J900L137K420J767J052K10o31
$$ -2605 -2203 -1645 -1243 -745 -1117 -2390 -3977 -5564 -6136 -6211 -5495 -3595 -458 1962 3729 4781 4991 4360
838D360j104j089m73K64N43Q79Q15L53p67j740k310k489j973j669o66Q86J427
$$ 4360 3256 2167 1694 1958 2501 3380 4195 4548 3781 2041 -269 -2758 -4731 -6400 -7066 -6180 -4753
855d753J482J345J614O37o84p32k53L91K72J506K338J924J272O14J08j479k309
$$ -4753 -3271 -1926 -312 325 -359 -1091 -1344 -953 -681 825 3163 5087 6359 6973 7081 5602 3293
872C293k554j926j080o79M0Q39J144J5r22n11r49j882j049Q04P12J462K496K851
$$ 3293 739 -1187 -2267 -2946 -2906 -2067 -923 -908 -1830 -2341 -3290 -5172 -6221 -5417 -4705 -3243 -747 2104
890B104J806J522M07j097r15r10j624n65J323N07j56R70L73k247j865j196l099
$$ 2104 3910 5432 5839 4742 3827 2917 1293 728 2051 2558 2402 3372 3745 1498 -367 -1563 -4662
907d662k392L12J64M89K633K552L53Q85J369j359j303J597l86j028K437K882M1
$$ -4662 -7054 -6742 -6578 -6089 -3456 -904 -551 334 1703 344 -959 638 252 -776 1661 4543 4584
924D584J335J935k015k393p90k785l570N29R57j998P19L021j057j358J761r66
$$ 4584 5919 7854 5839 3446 2656 -129 -3699 -3170 -2213 -4211 -3492 -471 -1528 -2886 -1125 -2091
940b091l694P08J645j574K638N092O14K56L447p68l531J124N16m179o19L148j836
$$ -2091 -5785 -5077 -3432 -5006 -2368 2724 3338 3594 7041 6273 2742 3866 4382 203 -416 2732 896
957H96j504L971K27m458ml01n436q24L393j240q80M725J604k993L893L447l791
$$ 896 -608 3363 3590 -868 -872 -1173 -6609 -7433 -4040 -5280 -6160 -1435 169 -2824 1069 4516 725
974G25j333L385k589k065N455K221k730K390K342n718j990L273l718m376K948
$$ 725 -608 2777 188 -1877 3578 5799 3069 5459 7801 2083 93 3366 -352 -4728 -1780
989a780l36m632K867M895l368q74L687l352m084M669J648k924L933M548l495L53
$$ -1780 -2116 -6748 -3881 1014 -2354 -3228 459 -2893 -6977 -2308 -660 -3584 349 4897 1402 1755
1005A755N800k132m034L129o97o214J373M520l205p97M429l431n150L144L36n348
$$ 1755 7555 5423 1389 4518 3821 -2393 -1020 3500 295 -502 3927 496 -4654 -1510 -1174 -6522
1021f522J806L325m426k81O739K71k335M509J176o035J037M298l017J3N355j455
$$ -6522 -4716 -1391 -5817 -6098 641 912 -1423 3086 4262 -1773 -736 3562 545 558 5913 4458
1037D458m007L504R96m648N45J795o006k690M265l80k600M313J462m872L87L405
$$ 4458 451 3955 4951 303 848 2643 -3363 -6053 -1788 -2168 -4768 -455 1007 -3865 -3478 -73
1053g3k817p06M690r71k893M281K832j902J865L025m340l035K462j471k326K862
$$ -73 -2890 -3596 1094 123 -2770 1511 4343 2441 4306 7331 2991 -44 2418 947 -1379 1483
1069A483J072l922K57K299k976j179K238k105l571J840J955j024K606L833j281
$$ 1483 2555 -1367 -1110 1189 -1787 -2966 -728 -2833 -6404 -4564 -2609 -3633 -1027 2806 1525
1084A525j604K304k58j968K216P78k206N46J998q60L93J723j996l637m05m28k279
$$ 1525 -79 2225 1967 -1 2215 2993 787 1333 3331 2471 2864 4587 2591 -1046 -1451 -1879 -4158
1101d158M45K209r70j00J359L81m83Q49J54j562J09J104L50J366K603O36l43J02
$$ -4158 -3713 -1504 -2474 -2574 -1215 -834 -1317 -468 -314 -1876 -1767 -663 -313 1053 3656 4292 3949 4051
1119D051o10j607o81n40r78n78qM5K28P20m17j050n53j455p67N39O07P89J882
$$ 4051 3441 1834 1153 613 -365 -943 -951 -906 -678 42 -375 -1425 -1978 -3433 -4200 -3661 -3054 -2265 -383
1138c83J088M31J279J026j025l37Oj480n73J312J183q68J018P9j863j154R1j821
$$ -383 705 1136 2415 3441 2416 2079 2085 605 32 1344 2527 1659 2677 2756 893 -261 -170 -1991
1156a991j665P73n55q04K024J559m64M72J895j578j047J493P5q85J649J975o39
$$ -1991 -3656 -2883 -3438 -4242 -2218 -659 -1123 -651 1244 -334 -1381 112 187 -698 951 2926 2287
1173B287Q75J529j548j176K02j542k610P18R96k156O22J877r19j384J399l27k529
$$ 2287 3162 4691 3143 1967 2169 627 -1983 -1265 -269 -2425 -1803 74 -845 -2229 -830 -1157 -3686
1190c686P93J402j582J544K860j62J15K188j96j987N02P14k351M5J835j105o13
$$ -3686 -2893 -1491 -3073 -1529 1331 1169 1284 3472 3276 1289 1791 2505 154 199 2034 929 316
1207C16J653l89k418K10J01k564l85J694j062l89K521P48j159J327J115j482m04
$$ 316 1969 1580 -838 -628 -527 -3091 -3476 -1782 -2844 -3233 -712 36 -1123 204 1319 -163 -567
1224e67J833p84n17K197M32j205J462M13j965r25P86j762j684J419L0j636J213
$$ -567 1266 482 -35 2162 2594 1389 2851 3264 1299 374 1160 -602 -2286 -867 -837 -2473 -1260
1241a260J467j410r3M64j120p58J212N16k90J544J625q70O82J322q10j302KJ68
$$ -1260 207 -1203 -1296 -832 -1952 -2710 -1498 -982 -1272 272 1897 1027 1709 3031 2221 919 921 1089
1259A089j243K29J138p65k14P41r53j194M39o43j481N02O76j88Q59J422L4l08
$$ 1089 -154 75 1213 448 234 975 22 -1172 -733 -1376 -2857 -2355 -1679 -1867 -1008 414 448 140
1277A40O37k4r22J97M20q0M18Q24M73l59P1k10j315l83m06q75k65M54J4J94N29
$$ 140 777 753 -169 28 448 368 786 1610 2083 1724 1795 1585 270 -113 -519 -1394 -1659 -1205 -1191 -997 -468
1298d68M56n37J26k89l97q1K02P06M97Q02O06j5K50J28j005p92l10k21j38L20
$$ -468 -12 -549 -423 -712 -1109 -1190 -988 -282 215 1017 1623 1608 1858 1986 981 189 -121 -342 -480 -160
1318a60L76M1L97k56n40m06n29m86j48K4M35M71R61M82M65j17j58l10m02m57K66
$$ -160 216 257 654 398 -142 -548 -1077 -1563 -1711 -1687 -1252 -781 180 662 1127 1010 852 542 140 -317 -51
1339e1K09K65N48J8M25l74m84p27m63m63o83K58K26M39N67M22K43Nl67l66j03
$$ -51 158 423 971 989 1414 1040 556 -171 -634 -1097 -1780 -1522 -1296 -857 -290 132 375 380 13 -353 -456
1360d56l10M31p7N07J063K2K41k99k63o10n17k81k52k19N14jM24L57k14l29j65
$$ -456 -766 -335 -412 95 1158 1180 1421 1122 859 249 -268 -549 -801 -1020 -506 -507 -83 274 60 -269 -434
1381d34k72n12n4J65Q24L33M86L53L05l7m89l69l64k5o18K01O19L58j73L23q3
$$ -434 -706 -1218 -1272 -1107 -283 50 536 889 1194 1157 668 299 -65 -90 -708 -507 112 470 297 620 537
1402E37p00l12j24m58k15M30L97Q8P13L72l64O5j11k67l63j81K46R7N39M20M06
$$ 537 -163 -475 -599 -1057 -1272 -842 -445 -357 356 728 364 429 318 51 -312 -493 -247 -150 389 809 1215
1423A215k29p9o43m28m72k36k63M16N17J32O4L71K3n40j7k95m80L55M91L3N55
$$ 1215 986 907 264 -164 -636 -872 -1135 -719 -202 -70 -6 365 388 -152 -169 -464 -944 -589 -98 -65 490
1444D90K73k0j35k7k21k90j00l09j90K10L59M30k9R3p30q9k94k24J50L32J16r
$$ 490 763 743 608 581 360 70 -30 -339 -529 -319 40 470 441 534 -196 -285 -579 -803 -653 -321 -205 -214
1466b14M64K82n3J59l9q75k50J86k32K53P33L9k04K39k02m63k97M22l49n58N73
$$ -214 250 532 479 638 599 -276 -526 -340 -572 -319 414 453 249 488 286 -177 -474 -52 -401 -959 -386
1487c86J05K09R20K73n70k67k76n53lN60M03p78P82O2m83K21N81o59q17J12k70
$$ -386 -281 -72 848 1121 551 284 8 -545 -548 12 415 -363 419 481 -2 219 800 141 -676 -564 -834
1508h34n62R83J042k81J03M90q70m78R15j40j104P08J84l73L88J055r3q21L42
$$ -834 -1396 -413 629 348 451 941 71 -407 508 368 -736 -28 156 -217 171 1226 1133 312 654
1527F54j119q70P43M40o48L97P26q09l1J220j94r39J97J5j110M59J490j38k9J230
$$ 654 -465 -1335 -592 -152 -800 -403 323 -486 -517 703 509 -430 -233 -218 -1328 -869 621 483 454 1684
1547A684r30q03N58J61j055l27R39j317p3J625J22o70N83k80j545K86Q66p41k96
$$ 1684 754 -49 509 670 -385 -712 227 -1090 -1163 462 584 -86 497 217 -1328 -1042 -176 -917 -1213
1566a213J702Jj265J435O71r74J22P49j782o38J396M19r63J559L32j733N6J033
$$ -1213 489 490 -775 660 1331 357 479 1228 -554 -1192 204 623 -340 1219 1551 -182 -126 907
1584I07j418r17J404p27j128J321J059j275Q00J163j590n41J009Q3r23J062R36
$$ 907 -511 -1428 -24 -751 -1879 -558 501 -774 26 1189 -401 -942 67 150 -773 289 1225
1601A225j321Q27J237j126n33J244p98j907R52M90j429O91J536j494o03J216n12
$$ 1225 -96 731 1968 842 309 1553 755 -1152 -200 290 -1139 -448 1088 -406 -1009 207 -305
1618c05j080Q33P80j771O56J636o52l64K057m12j460P25N03j330J45J154r13m75
$$ -305 -1385 -552 228 -1543 -887 749 97 -267 1790 1378 -82 643 1146 -184 -39 1115 202 -273
1636b73J415l78j474Q78M94j944O3J299j360j01J582j49r67J271M40j182J21R72
$$ -273 1142 764 -710 168 662 -1282 -1219 80 -1280 -1381 201 52 -915 356 796 -386 -265 707
1654G07r24k73J339lq25J343L31j393j18N69q36p15O73k45r02R45P70r76Q6O73
$$ 707 -217 -490 849 846 21 1364 1695 302 184 753 -83 -798 -125 -370 -1272 -327 443 -533 -447 226
1674B26r45n17Q16O2n67J139N96p29O15Q47r09m30N07m18q36O62O21n11p6P34
$$ 226 -719 -1236 -420 -358 -925 214 810 81 696 1543 634 204 711 293 -543 119 740 229 153 887
1694H87r64n09M20l34o90L36N08p32L25P29J00ON72k17l17L8L50l01J44L48m13
$$ 887 -77 -586 -166 -500 -1190 -854 -346 -1078 -753 -24 76 82 654 437 120 158 508 207 351 699 286
1715B86K65N47m10n73J34m56m14k05N21l37j58O55j44l46L71l4k36rN10l83L0
$$ 286 551 1098 688 115 249 -207 -621 -826 -305 -642 -800 -145 -289 -635 -264 -298 -534 -543 -33 -416 -386
1736c86R44R9K59M5P9m13m70M4j29l09K64p8j22L79Pl93j18p2n24j70q1M30J12
$$ -386 558 657 916 961 1040 627 157 201 72 -237 27 -51 -173 206 213 -180 -298 -370 -894 -1064 -1145 -715 -603
1759f03M31L40J12K99j88j15J73k93J8j0J59M39k02L41j09k18n84k90l93j29K56
$$ -603 -172 168 280 579 391 276 449 156 174 164 323 762 560 901 792 574 -10 -300 -693 -822 -566
1780e66k07k11N52J28L26k45J70k35J52r0L2L31L59J39M4K15O5L2l13m11o0k44
$$ -566 -773 -984 -432 -304 22 -223 -53 -288 -136 -226 -194 137 496 635 679 894 959 991 678 267 207 -37
1802c7j23j33M4J82N9j04j30q7k87j50J92p7L46r0K05L34L42l1Q8j19j3l9l67
$$ -37 -160 -293 -249 -67 -8 -112 -242 -329 -616 -766 -574 -651 -305 -395 -190 144 486 455 543 424 411 372 5
1825EK37K74%J14o8j80j53o75j85J05l66K03j14K07K29R6J58rL7N3j07K1P4j1
$$ 5 242 516 516 630 562 382 229 -446 -631 -526 -892 -689 -803 -596 -367 -271 -113 -122 -85 -32 -139 -118 -44 -55
1849e5L69K61K37j53K26k10j94l09m39R2j06J88j01j8O1o8l0k72j35L7l1j65O26
$$ -55 314 575 812 659 885 675 481 172 -267 -175 -281 -93 -194 -212 -151 -219 -249 -521 -656 -619 -650 -815 -189
1872a89J92K19K69MJ42l11M3j79K3k1J41J2N3l09K75m87l0J27l45l96L90p9k61
$$ -189 3 222 491 495 637 326 369 190 213 192 333 345 398 89 364 -123 -153 -26 -371 -767 -377 -456 -717
1895g17K84J69K21K20k67o8J64mL9J46m5J19K99KP7j69k24j43n53J91K44Rm36
$$ -717 -433 -264 -43 177 -90 -158 6 2 41 187 142 261 560 562 639 470 246 103 -450 -259 -15 -6 -442
1918d42P6L12j97J16k93J9LP0K3P2L97QP1J80O1l49J43r6o0j37M04O8k20j70K21
$$ -442 -366 -54 -251 -135 -428 -409 -406 -336 -313 -241 156 164 235 415 476 127 270 174 114 -23 381 449 229 59 280
1943B80j01m15K15l02n39K26K88j88K88M03j72J13L67n65J58J08j31j59L65L76
$$ 280 179 -236 -21 -323 -862 -636 -348 -536 -248 155 -17 96 463 -102 56 164 33 -126 239 615
1963F15j04n2L79l19m93L4j51l65K9K95k46K63M56l90k20L4Jk63%o3K15O0M72
$$ 615 511 459 838 519 26 60 -91 -456 -427 -132 -378 -115 341 -49 -269 -235 -234 -497 -497 -560 -345 -285 187
1986A87L25j38J59J1m72q2L74k41j62J79N5j75J56Q7j88m04R8k55n03J023m71
$$ 187 512 374 533 544 72 -10 364 123 -39 140 195 20 176 263 75 -329 -231 -486 -989 34 -437
2007d37J17M42L32m11PL67l50j3O3j61j56L75K09L7j31K09j14l28k47r6j42J42
$$ -437 -320 122 454 43 50 417 67 54 117 -44 -200 175 384 421 290 499 385 57 -190 -286 -428 -286
2029b86%j91K22L72J11n00K27p5l82L29R1k15J78O18k89L21L8N5k23m8j84l80
$$ -286 -286 -477 -255 117 228 -272 -45 -120 -502 -173 -82 -297 -119 499 210 531 569 624 401 353 169 -211
2051b11K35J44k89J45K67j81q1k79N3l26L28j04J9J09K07L8j09J88L3j28Q5k52
$$ -211 24 168 -121 24 291 110 29 -250 -197 -523 -195 -299 -280 -171 36 74 -35 153 186 58 143 -109
2073a09K72PJ34j01j9M3j32k52L56k38k87q8L12l10M60N1k38J13Oj61j11K30j98
$$ -109 163 170 304 203 184 227 95 -157 199 -39 -326 -414 -102 -412 48 99 -139 -26 -20 -181 -292 -62 -260
2096b60L99k32K98k74K73L64l86l27L82k9m92M46K0n19L64MR9l53K52j93l19K15
$$ -260 139 -93 205 -69 204 568 182 -145 237 208 -284 162 182 -337 27 31 130 -223 29 -164 -483 -268
2118b68j11M4J25J43K0j47K70L28k95jQ5l49j17P21k13j25L62j18n85J16K3l87
$$ -268 -379 -335 -210 -67 -47 -194 76 404 109 108 193 -156 -273 448 235 110 472 354 -231 -115 -92 -479
2140d79J32M16j50k04K09J89r0j23L02k86k66N37o1k83M03J19j87J17k5j80%O6
$$ -479 -347 69 -81 -285 -76 113 23 -100 202 -84 -350 187 126 -157 246 365 178 295 270 90 90 156
2162A56q7n28N45K5k03L90Q6l81j83L13l27n9K66j18k15L89n5J65K7J7m6j95P0
$$ 156 69 -459 86 111 -92 298 384 3 -180 133 -194 -253 13 -105 -320 69 14 179 206 223 177 -18 52
2185E2q7k11J66M41l08N9K75l20q0l9L00n62J5O8j52K83L36K47p19L38j90Q1R9
$$ 52 -35 -246 -80 361 53 112 387 67 -13 -52 248 -314 -299 -231 -383 -100 236 483 -236 102 -88 -7 92
2208I2J68l75P9K83l10N6M15p8k99j21l26J54o8M67j84M3K5Lj81J09Q5l8r5J56
$$ 92 260 -115 -36 247 -63 -7 408 330 31 -90 -416 -262 -330 137 -47 -4 21 24 -157 -48 37 -1 -96 60
2232F0j83K39J24J02j17J2j21l46K12J16k15j1k06N67l87J35J69R4k32q7k22j56
$$ 60 -123 116 240 342 225 237 116 -230 -18 98 -117 -128 -334 233 -154 -19 150 244 12 -75 -297 -453
2254d53L58R8J79j8j52j24L74k2p3l04m0JO0m4K94M0m5k10K3j01K7l4J12R0l47
$$ -453 -95 3 182 164 12 -112 262 240 167 -137 -177 -176 -116 -160 134 174 129 -81 -58 -159 -132 -166 -54 36 -311
2279c11L16J89j90r3K62j56J70m15j57K49J36r9L46j49J42k45K48l59J15Q1k54
$$ -311 5 194 4 -89 173 17 187 -228 -385 -136 0 -99 247 98 240 -5 243 -116 -1 80 -174
2300a74J2R1J6m8K10j15j19K47k72r9L31J36l78K78J34l51K64M9j88m3P9j00K43
$$ -174 -162 -71 -55 -103 107 -8 -127 120 -152 -251 80 216 -162 116 250 -101 163 212 24 -19 60 -40 203
2323B03p5n1k41J92j20P2%j15J55Q7k31m0J84J07j39J04l16L78k61Q9o2J25N0
$$ 203 128 77 -164 28 -92 -20 -20 -135 20 107 -124 -164 20 127 -12 92 -224 154 -107 -18 -80 45 95
2346I5j92L38m9l2N4j46l27J81K08k12j13p3K37k9j7L98k42m1j33k3j6K58m8P8
$$ 95 -97 241 192 160 214 68 -259 -78 130 -82 -195 -268 -31 -60 -77 321 79 38 -95 -118 -134 124 76 154
2370A54o2J91j29J28o5k59L5J69n5J5k02R0OQ1O0m5l20N9L06k9l66J71J22L9j54
$$ 154 92 283 154 282 217 -42 -7 162 107 122 -80 10 16 97 157 112 -208 -149 157 128 -238 -67 55 94 -60
2395f0j7K15j28m0j99K23p9k71N23j40R2N1j67n5K06j45j17K38l06N6K25J01k00
$$ -60 -77 138 10 -30 -229 -6 -85 -356 167 27 119 170 3 -52 154 9 -108 130 -176 -120 105 206 6
2418Fp5J44N9l65J22j97L57Qk54K23J57j68Q8k03o2r3j9K52j66r8K07J45Mj06
$$ 6 -69 75 134 -231 -109 -306 51 59 -195 28 185 17 105 -98 -160 -253 -272 -20 -186 -284 -77 68 72 -34
2442c4j34J57J40j98l2O7K6J49J32j92l7L0k14J76J4l4k16J20Q8J38k86J85j31
$$ -34 -168 -11 129 -69 -101 -34 -8 141 273 81 44 74 -140 36 50 16 -200 -80 8 146 -140 45 -86
2465h6j57K78k21M5K06L1p4p1O8J98r0k5L13m71n4J32p4L7L40m1k44q9J71k87
$$ -86 -243 35 -186 -141 65 96 22 -49 19 217 127 102 415 -56 -110 22 -52 -15 325 284 40 -49 122 -165
2489a65L05l33o3K55P4k2l58J29Q3R9nJ20j42M6k99M58m9k49J52J5L42k43r4k0
$$ -165 140 -193 -256 -1 73 51 -307 -178 -95 4 -1 119 -23 23 -276 182 133 -116 36 51 393 150 56 36
2513C6Qk12J27j11K17j15J8R3L0j85J78j96N0K54l24J01J31J69L0j09k8j29O7
$$ 36 44 -168 -41 -152 65 -50 -32 61 91 -94 84 -112 -62 192 -132 -31 100 269 299 190 162 33 100
2536A00j26L80k87N4R2L0l10j2l8k40J69J43k45J08J68j54K53m8j92L1J43J1l8
$$ 100 -26 354 67 121 213 243 -67 -79 -117 -357 -188 -45 -290 -182 -14 -168 85 37 -155 -124 19 30 -8
2559hj45K93k42p2J3L71j05J23j03k03K86l2k19p8Q7o4M1J57p8j85MJ80k2j22
$$ -8 -153 140 -102 -174 -161 210 105 228 125 -78 208 176 -43 -121 -34 -98 -57 100 22 -163 -159 21 -1 -123
2583a23O6k6J22J03J5k8J78p0j35j56m7K16l31J84K69j77k36l0J29j63K32k65
$$ -123 -57 -83 39 142 157 129 307 237 102 -54 -101 115 -216 -32 237 60 -176 -206 -77 -240 -8 -273
2605b73J2K19l0M3N2N27l45l26J6K34k39j06L70q3k14K43J9k12J82k02K0m8j48
$$ -273 -261 -42 -72 -29 23 550 205 -121 -105 129 -110 -216 154 71 -143 100 119 -93 89 -113 -93 -141 -289
2628b89M25l70M55j27n5J15k66N8m3J18j80K15r1j3q9M36j90K4j76K40m39J45
$$ -289 136 -234 221 94 39 154 -112 -54 -97 21 -159 56 -35 -48 -137 299 109 133 -43 197 -242 -97
2650i7J71k79K94K9j64N5p1J46l2l25J88k45L51k62K85K65k29M9Mj40J24m9N1
$$ -97 74 -205 89 118 -46 9 -62 84 52 -273 -85 -330 21 -241 44 309 80 129 133 -7 117 68 119
2673A19O2k35P3J58p2%r4k31n7k1K29P4q4J90j59j63K16J52j68j22J17Ml5J22
$$ 119 181 -54 19 177 105 105 11 -220 -277 -298 -69 5 -79 111 -48 -211 5 157 -11 -133 -16 -12 -47 75
2697G5r2J95j34m6j4o1K05j23K08k52J07k40K6n8J11K41l78L48m2k45J1rL1Q5
$$ 75 -17 178 44 -2 -16 -77 128 5 213 -39 68 -172 -146 -204 -93 148 -230 118 76 -169 -158 -167 -136 -51
2721e1j79J63j19K38K3J67j37K8r9j84L8J61j28J61m66L48nj7K20j77o3j61K38
$$ -51 -230 -67 -186 52 75 242 105 133 34 -150 -112 49 -79 82 -384 -36 -41 -58 162 -15 -78 -239 -1
2744ak28K33J54k77l5K57k15Q1l35M78J74k16J15j25k41J09O5j57Q5K9O6j68J11
$$ -1 -229 4 158 -119 -154 103 -112 -31 -366 112 286 70 185 60 -181 -72 -7 -164 -79 -50 16 -152 -41
2767d1J67j02K13k21j12j88J14N7N0K2P6j70J99L67n20J35J89j85K87k80k03K51
$$ -41 126 24 237 16 -96 -284 -170 -113 -63 -41 35 -135 64 431 -89 46 235 50 337 57 -146 105
2789A05k13J77K4j64J01j55j24K29R5k0k50L24p4%J3J41l70J43J34j11M7j28J06
$$ 105 -108 69 93 -71 30 -125 -249 -20 75 55 -195 129 55 55 68 209 -161 -18 116 5 52 -76 30
2812C0kJ35J38l93R5j40J8k40L48J34m2l1q6k59L44J99l14l33L95L1N0K71n41
$$ 30 28 163 301 -92 3 -137 -119 -359 -11 123 81 50 -36 -295 49 248 -66 -399 -4 27 77 348 -193
2835a93L16J53j35j00P2J47k12j8n8k5J19r6q3J87o5J16q2j64J24J1j74J16J53
$$ -193 123 276 141 41 113 260 48 30 -28 -53 66 -30 -113 74 9 125 43 -121 3 14 -160 -44 109
2858A09N9o6J29j12Mk17o1K23k08K91R2l67jP6POp1L43l9k89J19o3k23L18M9P8
$$ 109 168 102 231 119 123 -94 -155 68 -140 151 243 -124 -125 -49 -42 -36 -107 236 197 -92 27 -36 -259 59 108 186
2884A86j58j72P1K83m5o5r9J34J1n3J51j16o2k09L41l07J6p4J27M1r5mJ47No9
$$ 186 28 -144 -73 210 165 100 1 135 146 93 244 128 66 -143 198 -109 -93 -167 -40 1 -94 -98 49 54 -15
2909a5O4k31R0O4K1J94k51j06L11j1o1k18L13j80J64j78J21k76L20j54k8L6o6
$$ -15 49 -182 -92 -28 -7 187 -64 -170 141 130 69 -149 164 -16 148 -30 91 -185 135 -19 -47 -11 -77
2932g7K7N3J46r1Rk3K59k24J28j79l2p1P4j36J75jp6J98p1l8Mn9L2k49J10P7m46
$$ -77 -50 3 149 58 67 44 303 79 207 28 -4 -75 -1 -137 38 37 -39 159 88 50 54 -5 27 -222 -112 -35 -481
2959d81L86P8j69L15J12k1Qk05j22P1qn4K49l41K65k26J61J07O7k16JP4P6M6k35
$$ -481 -95 -17 -186 129 241 220 228 23 -99 -28 -36 -90 159 -182 83 -143 18 125 192 -24 -23 51 127 173 -62
2984f2L7J62k22O2J05k5j78q7n2J62O8J66O8k80J7P4Q0k68O4L36k45J19J64k14
$$ -62 -25 137 -85 -23 82 57 -121 -208 -260 -98 -30 136 204 -76 -59 15 95 -173 -109 227 -18 101 265 51
3008E1j80j9K55l15L01k33N2O6J87l54J90j8j23J99N4k46J64Oj46J4K72l25K52
$$ 51 -129 -148 107 -208 93 -140 -88 -22 165 -189 1 -17 -140 59 113 -133 31 37 -109 -95 177 -148 104
3031A04p4R7K5j93j57R8L8J27j88J12J67l44J53Q1p7Pj51K84R3j54m2j40K56l54
$$ 104 30 127 152 -41 -198 -100 -62 65 -123 -11 156 -188 -35 46 -31 -24 -175 109 202 48 6 -134 122 -232
3055b32M15Q9J3l75O4j21J20j67K69J23l80L04l7l48M84j19p1K35l41M7L9l9J34
$$ -232 183 272 285 -90 -26 -147 -27 -194 75 198 -182 122 85 -263 221 102 31 266 -75 -28 11 -28 106
3078A06p4r4q0M33k84o8pm0R3l5QO7K85l40J38j0QPk9o4j10O3J29J65k40Q5j8
$$ 106 32 -62 -142 291 7 -61 -68 -108 -15 -50 -42 25 310 -30 108 98 106 113 84 20 -90 -27 102 267 27 112 94
3105I4N8r1P8nn1j7K0m2j06l6K38j67J05n4j94L7M58k48l43K54q0K7l1L48k44
$$ 94 152 61 139 134 83 66 86 44 -62 -98 140 -27 78 24 -170 -133 325 77 -266 -12 -92 -65 -96 252 8
3130Hk67L24L04p76L99m8J59p8K7j77M0J29Q4k3j97J86j62N2o6O4j23K08j18o3
$$ 8 -259 65 369 -407 -8 -56 103 25 52 -125 -85 44 128 105 -92 94 -68 -16 -82 -18 -141 67 -51 -114
3154a14Q1j60p0N51j62l47K47R0o7l2J19q6p8L3j60J12Q2J7j2j4n7j67L30k14
$$ -114 -33 -193 -263 288 126 -221 26 116 49 17 136 50 -28 5 -155 -43 39 56 44 30 -27 -194 136 -78
3178g8J5q3j19L19k68kL61j13r7o7k9P7J59j89k8J91m49L53NnJ87k07J41j94J34
$$ -78 -63 -146 -265 54 -214 -216 145 32 -65 -132 -161 -84 75 -114 -142 49 -400 -47 -42 -47 140 -67 74 -120 14
3203A4Q1j09ll3KK55q8m7j21J17m8J25o8J51K2m02Q1qJ14r9jJ35j03J68j96o0
$$ 14 95 -14 -17 -50 -48 207 119 72 -49 68 20 145 77 228 250 -152 -71 -79 35 -64 -65 70 -33 135 -61 -121
3229a21P5R9j02n6Q3%m9K33q3m1j8j58J66Q6l85K18J97o7P2k73J13K15k62J73
$$ -121 -46 53 -49 -105 -22 -22 -71 162 79 38 20 -138 28 114 -271 -53 144 77 149 -124 -11 204 -58 115
3253A15m1k0o3J13K8J2Q9j14m1k09J23r2k2K61j11j35J03l8mj78J95K23j15p8
$$ 115 74 54 -9 104 132 144 233 119 78 -131 -8 -100 -122 139 28 -107 -4 -42 -46 -224 -29 194 79 1
3277AJ65r4q2R2o6l5j03K28l1P7j60Nj55J14K02j33J92j99k21pK7K8k1K36o5J11
$$ 1 166 72 -10 82 16 -19 -122 106 75 152 -8 -3 -158 -44 158 25 217 18 -203 -210 -183 -155 -176 60 -5 106
3303A06n5j83K70j91j1K88k41L2N4op7J09o0j26J51l26L31L8j95Q6M1R1q4o0J69
$$ 106 51 -132 138 -53 -64 224 -17 15 69 63 -14 95 35 -91 60 -266 65 103 -92 -6 35 126 42 -18 151
3328A51k77k2K70k12J72k42J75r0N7J17j31J55k58P3O8M9J26j73k01L75o7j18
$$ 151 -126 -148 122 -90 82 -160 15 -75 -18 99 -32 123 -135 -62 6 55 181 8 -193 182 115 -3
3350ck4j50Q4K7J46j23J37k43L38j67J47j60p5Oj48K54M3k4K66k91j42R2j07j2
$$ -3 -27 -177 -93 -66 80 -43 94 -149 189 22 169 9 -66 -60 -208 46 89 65 331 40 -102 -10 -117 -129
3374a29R2J14k2KK01r3o3J82o40L30J44j49O3J0jl9O2j74O6J94k65j06K71J20
$$ -129 -37 77 55 57 258 165 102 284 -356 -26 118 -31 32 42 41 2 64 -110 -44 150 -115 -221 50 170
3398A70%q9j13O5j22K43J8p4m0or5J15j42J60k09K41l56L34k12J07J33l57K85
$$ 170 170 81 -32 33 -89 154 172 98 58 52 -43 72 -70 90 -119 122 -234 100 -112 -5 128 -229 56
3421E6K6J9j63k34N63k86KM5k78J49Q9K08k28O5J05j25O8K41n33L47k40K90k21
$$ 56 82 101 -62 -296 267 -19 -17 28 -250 -101 -12 196 -32 33 138 13 81 322 -211 136 -104 186 -35
3444c5OJ20l9p4j36J70K1M1j17J96q6p3J23K25l22J85l35J09j05J31oK28k87m
$$ -35 -29 91 52 -22 -158 12 33 74 -43 153 67 -6 117 342 20 205 -130 -21 -126 5 -1 227 -60 -64
3468f4J17j39R4k1O0j50J2J09O2j65P7j79K71J45j54m9k2j76M4L79k90Q6p8r2
$$ -64 53 -86 8 -13 47 -103 -91 18 80 -85 -8 -187 84 229 75 26 4 -172 -128 251 -39 47 -31 -123
3492a23J92%n8r4o3K68j40J50j9k43K56J57l24N6k6k4J44l45m9L16QJ08j45j32
$$ -123 69 69 11 -83 -146 122 -18 132 113 -130 126 283 -41 15 -11 -35 109 -236 -285 31 39 147 2 -130
3516a30J06J70j50j21J58K16l09M5J60m85M15J72q6J40k73q4N4j25l4P2PJ50j7
$$ -130 -24 146 -4 -125 33 249 -60 -15 145 -340 75 247 161 301 28 -56 -2 -127 -161 -89 -82 68 51
3539E1M4k83J27K07j50K4M0j68JM6Q0J9J14O3O6k35o3o5J19k84K15J9J98oj53
$$ 51 95 -188 -61 146 -4 20 60 -108 -107 -61 19 38 152 215 281 46 -17 -82 37 -247 -32 -13 185 179 26
3564B6k77L22k5L0k67l2M02o4q4j6M7J55l80Q8L76l65J17k10J10J7k2R0n8J12
$$ 26 -251 71 46 76 -191 -223 179 115 31 15 62 217 -163 -75 301 -64 53 -157 -47 -30 -52 38 -20 92
3588I2J2j72J32m4k6Lk3R0k34L04L0r5N5Q0k48Rk17M06J25k90n2K7j24K6j43L07
$$ 92 104 -68 64 20 -6 -3 -26 64 -170 134 164 69 124 204 -44 -35 -252 154 279 -11 -63 -36 -160 -134 -277 30
3614C0j13N9j87M55l59r3L50j65k42o2K29L42k86o9M5J13j88J59j33J45k7kl0
$$ 30 -83 -24 -211 244 -115 -208 142 -23 -265 -327 -98 244 -42 -111 -66 47 -141 18 -115 30 3 1 -29
3637b9R6j72O2J27l4J78k55M2j84J84J49j40k5J34o9k07K95j45k07K42Q9j69Q6
$$ -29 67 -105 -43 84 50 228 -27 15 -169 15 164 24 -1 133 64 -143 152 7 -200 42 131 -38 48
3660D8j42J56K83k81Q7p4R2o3j65J2M8K99j12j08j41K01k49Q3m2k3J10j6n2L2
$$ 48 -94 62 345 64 151 77 169 106 -59 -47 1 300 188 80 -61 140 -109 -26 -68 -91 19 3 -49 -17
3684a7j23R3o3J68O7j76N6j18l2P6rlK61k36O6J0J55l66o3K02J45n5M4k79O9R0
$$ -17 -140 -47 -110 58 125 -51 5 -113 -145 -69 -78 -81 180 -56 10 20 175 -191 -254 -52 93 38 82 -197 -128 -38
3710c8j9J28J85j31l12M49k37L8k36J82P0l9j68K70r3k20o2J81KJ67k1j32K35
$$ -38 -57 71 256 125 -187 262 25 63 -173 9 79 40 -128 142 49 -171 -233 -52 -50 117 96 -36 199
3733A99l01j2N5p6J58r2J28j58p0R4J15L5j95P2K61k46l7P2J81o4j42k20K36l9
$$ 199 -102 -114 -59 -135 23 -69 59 -99 -169 -75 40 75 -120 -48 213 -33 -70 2 183 119 -23 -243 -7 -46
3757d6j5J13j93J33l1k01J68L7j66K38k9m2M9K7j71N0J6JJ18m6Q1k98J33j45L13
$$ -46 -61 52 -141 -8 -39 -240 -72 -35 -201 37 8 -34 15 42 -129 -79 -63 -62 56 10 91 -207 -74 -219 94
3782I4O3l01L8K70j22j8l14M84j31k46K83j30j37R3P7J50k51NM7J46l5K2n4N5
$$ 94 157 -144 -106 164 42 24 -290 194 63 -183 100 -30 -167 -74 3 153 -98 -93 -46 100 65 87 33 88
3806H8l7j42Q6l4K8J57j48mRJ54j84J7Nok4k65K06J87J1j70O6K09l04L77l52j12
$$ 88 51 -91 -5 -39 -11 146 -2 -6 3 157 -27 -10 -5 -11 -35 -300 -94 93 104 -66 0 209 -95 282 -70 -182
3832a82M09l00P7KP4m1L1N3k17J82l4l4j40q5M61m10L28m38K74n4j14K74MK30
$$ -182 227 -73 4 6 80 39 70 123 -94 88 54 20 -120 -205 256 -154 174 -264 10 -44 -158 116 120 350
3856C50m96K39j51j85J89j8J98J9j98L2P6p7J25r3k4j07M6M9K79k42j32K93j8
$$ 350 -146 93 -58 -243 -54 -72 126 145 -53 -21 55 -22 103 10 -14 -121 -75 -26 253 11 -121 172 154
3879A54j05p1l3J55k1l23J40M9J7j31Q2P4j22J34J44j31K01k18O5oj12J67k60
$$ 154 49 -22 -55 100 79 -244 -104 -55 -38 -169 -87 -13 -135 -1 143 12 213 -5 60 54 -58 109 -151
3902a51PR4J86j64p2K06LP6k03L1K5O9j15K0m4J10j15N2N6k49J48K00j3J0j82
$$ -151 -144 -50 136 -28 -100 106 109 185 -18 13 38 107 -8 12 -32 78 -37 15 71 -178 -30 170 157 167 -15
3927a5r0n4N30l21o9K1K05N8m84K58K0j1l0n8P9J58j92Nj6M3j19J94j1o1J30P7
$$ -15 -105 -159 371 50 -19 2 207 265 -219 39 59 48 18 -40 39 197 5 10 -6 37 -82 112 101 40 170 247
3953B47k58J02q9Ml6K44j86K3q0k6J27j69j4L92k74P8k53o5J97l36O39k02k03
$$ 247 -11 91 2 6 -30 214 28 51 -29 -55 72 -97 -111 281 7 85 -168 -233 -36 -372 267 65 -138
3976a38l7L09k06J87k63J44Q3j00L3r1K65Rj52Q6k5j00j8L0l7j88N57l54J00O5
$$ -138 -175 134 -72 115 -148 -4 79 -21 12 -79 186 195 43 129 104 4 -14 16 -21 -209 348 -6 94 159
4000A59j96K3j12Q8K02l07q6J65M5Jj94R4L87k48O6j0n3k21L39l15L10k55J43
$$ 159 -37 -14 -126 -38 164 -143 -229 -64 -19 -18 -212 -118 269 21 87 77 24 -197 142 -173 137 -118 25
4023B5k8J00k27L23j66k8k11N1J70M8kj94K17j57J47Q7q8j41o8K22k94K10J7J79
$$ 25 -3 97 -130 193 27 -1 -212 -161 9 57 55 -139 78 -79 68 155 67 -74 -142 80 -214 -4 13 192
4047A92j88Q0k83M75n57L64j81J04J06Mq6L4k18p7L21p4M5k26K82q3r9J57j12
$$ 192 4 84 -199 276 -281 83 -98 6 112 116 30 64 -154 -231 90 16 61 -165 117 34 -65 92 -20
4070b0R9j21J69p4j39Q4K7R9j48j09K37l05L92r6j20P7j72K26j81P9Oj20M37k71
$$ -20 79 -42 127 53 -86 -2 25 124 -24 -133 104 -201 191 95 -25 52 -120 106 -75 4 10 -110 327 56
4094E6j65J22OK30k53j47Q2n4J01K70j68m2j79J28J48j08j51J94k2k5k21L96j17
$$ 56 -109 13 19 249 -4 -151 -69 -123 -22 248 80 38 -141 -13 135 27 -124 70 48 23 -198 198 81
4117H1P0j87J18Rj60K00M4nr3mQk53J06N6J53j97%J34n9L7L4J91k41j1j48N7J04
$$ 81 151 -36 82 91 -69 131 175 170 77 73 81 -172 -66 -10 143 -54 -54 80 21 58 92 283 42 31 -117 -60 44
4144D4o1M6P1J5k02J96k15K68j7p1k32l6L89l08L40k42q4j55L33O4j88k21K71
$$ 44 -17 29 100 115 -87 109 -106 162 145 74 -158 -194 195 -113 227 -15 -99 -254 79 143 -45 -266 5
4167EJ72Kk55K66r4j55l7J39J40j75j7Q9k68J71R8M0j90J7j07L30j74j4JL1j57
$$ 5 177 179 -76 190 96 -59 -96 43 183 8 -9 80 -188 -17 81 121 -69 -52 -159 171 -3 -17 -16 15 -142
4192a42O1J60j99K36j96K95j61m9n4K03n8k62K64p9N9m02M25K75n47M4K69p2J61
$$ -142 -81 79 -120 116 -80 215 54 5 -49 154 96 -166 98 19 78 -324 101 376 -171 -127 142 70 231
4215B31j67q3P5m5n1m1J39q5J01k40K63r5m0q1K07k83p5K71J27r7q1q5J80n2k51
$$ 231 64 -19 56 11 -40 -81 58 -27 74 -166 97 2 -38 -119 88 -195 -270 1 128 31 -50 -135 45 -7 -258
4240b58L31nk19L1J73j04k0J0J72k57J72j03j09K89j92K32J05j45Rl01L54k90
$$ -258 73 68 -151 -120 53 -51 -71 -61 111 -146 26 -77 -186 103 -89 143 248 103 112 -189 165 -125
4262a25M6l9N2K23k45Q3R2j8J33k74J31o3k4M4j2k21L3J32J36o4K6J90k51l4m2
$$ -125 -79 -118 -66 157 -88 -5 87 69 202 -72 59 -4 -28 16 4 -217 -184 -52 84 20 46 236 -15 -49 -91
4287i1J58k22J16K82l94Q1M0j87L86j83Q6K09k24j97J87lJ07j10k77J00K84P1
$$ -91 67 -155 -39 243 -151 -70 -30 -217 169 -14 72 281 57 -140 47 44 151 41 -236 -136 148 219
4309B19j16N7p4k66Q9K02j45K11j76M6r5K39j01P9j88J00j38K68k16J26L2k42
$$ 219 103 160 86 -180 -91 111 -34 177 1 47 -48 191 90 169 -19 81 -57 211 -5 121 153 -89
4331h9J48j31L70k42j31J17J80j95p5J54r7J51j96n7L3j73K67M2j2N4k60J74J15
$$ -89 59 -72 298 56 -75 42 222 27 -48 106 9 160 -36 -93 -60 -233 34 76 64 118 -142 32 147
4354A47l07J28j60l1N48l50J15j31j1k6R2jO6L02o21L44o5J04j40j41M37k92K22
$$ 147 -160 -32 -192 -223 325 -25 90 -41 -52 -78 14 13 79 381 -240 104 39 143 3 -138 299 7 229
4377B29j40j47m3P3K56l37P7J37l29K57j63J34K54l84J81r8R3k10K90j36M3J15
$$ 229 89 -58 -101 -28 228 -109 -32 105 -224 33 -130 4 258 -126 55 -43 50 -160 130 -6 37 152
4399A52m2k81J93j93J65J22q0J9j86kN8K49r6P3k37Kr9K09r7j07L19J0k39l5J25
$$ 152 110 -171 22 -171 -6 116 36 55 -131 -133 -75 174 78 151 -86 -84 -183 26 -71 -178 141 151 -88 -123 2
4424Bk58L78J21J5o7o3j73J58o6k2J11k04J20J11Kk16K52l17J08L2P4j8k09k3
$$ 2 -256 122 243 258 191 128 -45 113 47 25 136 -68 52 163 165 -51 201 -116 -8 24 98 80 -129 -152
4448a52M33m00J00p6Q2N8j86p5K34O0J04P9m27L25n6k36K01J60k92n9q6J84q5
$$ -152 281 -119 -19 -95 -13 45 -141 -216 18 78 182 261 -166 159 103 -133 68 228 -64 -123 -209 -25 -110
4471a10j12K30J97r9l24J99K49k69j53O1O0R6l34M10j20J17p0j13kO9j25Q9L6
$$ -110 -222 8 205 106 -218 -19 230 -39 -192 -131 -71 25 -309 101 -19 98 28 -85 -87 -18 -143 -54 -18
4494a8J31j19K39m23J95j21J87j99J69j49m2J1J86j74K13Q9j88j11K47q1j28M8
$$ -18 113 -6 233 -190 5 -116 71 -128 41 -108 -150 -139 47 -127 86 175 -13 -124 123 42 -86 -38
4516c8R6q3l2m4J14Ok92R0K84o6J64k04J35j97k2O3J10j16K47j02j29o0L2k0P6
$$ -38 58 -25 -57 -101 13 19 -273 -183 101 35 199 -5 130 -67 -89 -26 84 -32 215 113 -16 -76 -44 -64 12
4541A2r3n6Q3n9M2J06j33J20k6KK35j56J11j49K31k11R2Ol10K15l82K68O2jM0
$$ 12 -81 -137 -54 -113 -71 35 -98 22 -4 -2 233 77 188 39 270 59 151 157 -153 62 -320 -52 10 9 49
4566D9j62L6J59L2J92j65J23k06j6k72J27J38R3l97L32Ml77J54K61k34p9K7L74
$$ 49 -113 -77 82 114 306 141 264 58 42 -230 -103 35 128 -269 63 67 -310 -156 105 -129 -208 -181 193
4589A93l49L19m60L90Kk94K21l7Pk1k1n5J19Mk29K41j13J09O5k54L03l55J73j37
$$ 193 -156 163 -297 93 95 -199 22 -15 -8 -29 -50 -105 14 18 -211 30 -83 26 91 -163 140 -215 -42 -179
4613a79M09k14j22Q1Oj5K27m31K29K30K4j21k69K99j07k9j35QJ76j51J19m1P1
$$ -179 230 16 -106 -25 -19 -34 193 -238 -9 221 245 124 -145 154 47 18 -117 -109 67 -84 35 -6 65
4636F5n3nM5j6m7q3q6QO7R8o9J55l6L2l7q6k62L93N2q0N0r2L4j62J80j56K6J83
$$ 65 12 7 52 36 -11 -94 -180 -172 -105 -7 -76 79 43 75 38 -48 -310 83 135 55 105 13 47 -115 65 -91 -65 118
4664A18j09N6k12K40Qk60K89k32K63l30K47j06j9K09j05j6n5R4N3p7L5j14p1M1
$$ 118 9 65 -147 93 101 -159 130 -102 161 -169 78 -28 -47 162 57 41 -14 80 133 56 91 -23 -94 -53
4688e3NJ73m6k06j15K33k1J82M6k07J43j70L1P8k6n1K40l66J54O9r5l1n0J33K8
$$ -53 -48 125 79 -127 -242 -9 -30 152 198 -9 134 -36 -5 73 47 -4 236 -130 24 93 -2 -33 -83 50 78
4713G8J28k47p9M05k20j30J31k03L5J8M0K23k6k3k04m6K34k41J38Q0l79N18mk99
$$ 78 206 -41 -120 285 65 -65 66 -137 -102 -84 -44 179 153 130 -74 -120 114 -127 11 91 -288 230 226 -73
4737g3J69J40k24j12J25K24k30RO2l44L91l27J35J15P3l20P1J13k1J54R0r9j50
$$ -73 96 236 12 -100 25 249 19 28 90 -254 137 -190 -55 60 133 -187 -116 -3 -24 130 220 121 -29
4760b9j6J93k34k9K6P7R3K0J09k25K6k8K02j47j21l5J70p8K89k17k2J45k89K40
$$ -29 -45 148 -86 -115 -89 -12 81 101 210 -15 11 -17 185 38 -83 -118 52 -26 263 46 24 169 -120 120
4784A20J3k08J4J18%k7r9oJ88j06j6o4n1J70J21j03L2j0k09J38k13J48J08m4q1
$$ 120 133 -75 -61 57 57 30 -69 -75 113 7 -9 -73 -124 46 167 64 96 86 -123 15 -198 -50 58 14 -67
4809f7J47lj42J42J10j42k46L25k41K16j35J17j92L71j17k49J37j39O2J9pj52
$$ -67 80 77 -65 77 187 45 -201 124 -117 99 -36 81 -111 260 143 -106 31 -108 -46 -27 -34 -186
4831a86m0L85k09J87Q5j79k29K05J67k25Q6j17r6J57r7J27l5R0j94k66M26j77
$$ -186 -226 159 -50 137 222 43 -186 19 186 -39 47 -70 -166 -9 -106 21 -14 76 -118 -384 42 -135
4853a35M45l60J01n0j46K17J40l05j14K64kk06M7p2J43j28L5J31K29M7l37J60
$$ -135 310 -50 51 1 -145 72 212 -93 -207 57 55 -151 -104 -176 -33 -161 -126 5 234 281 -56 104
4875A04q5k01L11j0J45m17K73R5k50Q3j27J76K0m4k8l4J08kj5J4m8j90K99j98
$$ 104 19 -182 129 119 264 -153 120 215 -35 48 -79 97 117 73 45 11 119 117 102 116 68 -122 177 -21
4899b1K26J36k04o3k28J06NJ75k66K15j38K3ln5O3j13J79o7j90Q6j5K40j26o7
$$ -21 205 341 137 74 -154 -48 -43 132 -134 81 -57 -34 -37 -92 -29 -142 37 -30 -220 -134 -149 91 -35 -102
4923a02K9k56J33J32O4K84n7k51j12J23n5J88qJ29k5j76L3j66J1j03N9J80j77
$$ -102 -73 -329 -196 -64 0 284 227 -24 -136 -13 -68 120 112 241 216 40 73 -93 -82 -185 -126 54 -123
4946a23L08j86N2j37J70k13L44k25k3j68J11J76M1j85J04R5o5J07j45j10j12J97
$$ -123 185 -1 51 -86 84 -129 215 -10 -33 -201 -90 86 127 -58 46 141 76 183 38 -72 -184 13
4968A3k91M68j59k32L54l05L80k5m62Q8J06N6J45j6j13J12J0k99K77j16j01Q8
$$ 13 -278 190 31 -201 153 -152 228 203 -259 -171 -65 -9 136 120 7 119 129 -170 107 -9 -110 -22
4990b2j18J53l38M58j31J22k57k60J19L06j49K02k12K22j43J79k19M9N4j18L1
$$ -22 -140 13 -325 133 2 124 -133 -393 -274 32 -117 85 -127 95 -48 131 -88 -39 15 -103 -72
5011g2J9M9j15l0K09J18j59m7j26K60J0ok39N3J85j25j02Kj2J12j6j6m1K2N9J44
$$ -72 -53 -4 -119 -149 60 178 19 -28 -154 106 116 110 -129 -76 109 -16 -118 -116 -128 -16 -32 -48 -89 -67 -8 136
5037A36k97M67k62J14k34m7R9k48M05l77L29k1j91K90k30J28J20l06K19p3j87
$$ 136 -161 306 44 158 -76 -123 -24 -272 133 -244 85 64 -127 163 -67 61 181 -125 94 21 -166
5058a66J38P0J72k20R7J9k33L18O6m22K45J83l99J45qj59L50k92L00l93L01j64
$$ -166 -28 42 214 -6 91 110 -123 195 261 -161 84 267 -132 13 5 -154 196 -96 204 -189 112 -52
5080e2n5n4R5J74%k80q8L15k49M06l73L73j06q8j33J72n0K8k16K37j92K39l74
$$ -52 -107 -161 -66 108 108 -172 -260 55 -194 212 -161 212 106 18 -115 57 7 35 -181 56 -136 103 -271
5103b71L55J92m13n9K96l73L25J49j88l4l6J15L9l15L13p6j71J30K01l42O1L23
$$ -271 84 276 -137 -196 100 -273 52 201 13 -21 -57 58 97 -218 95 19 -152 -22 179 -163 -102 221
5125B21l86J91L3K6J12m67L07k21J38J73n4L2k16r6J57j21K24J38j70m1o0n1J40
$$ 221 -165 26 59 85 197 -270 37 -184 -46 127 73 105 -111 -207 -50 -171 53 191 21 -20 -80 -131 9
5148IK7j73J77l37J91J44r9pK0J65j3mo4j74J20k27K07K22q1n5J51j16o6j15Q
$$ 9 36 -137 40 -297 -106 38 -61 -68 -48 117 104 100 36 -138 -18 -245 -38 184 103 48 199 83 17 -98 -90
5173i0M31l99j20l2Q0J07j0J03J6l02L25j37j5J48j76kJ28k84L59j43Q5k89K61
$$ -90 341 -58 -178 -210 -130 -23 -33 70 86 -216 109 -28 -43 105 -71 -73 55 -229 130 -13 72 -217 44
5196D4l1k50L60j18q0J2L24j17k95K23p3j20J54J17j85N5P2j56n8K47j62o5m3
$$ 44 13 -237 123 5 -75 -63 261 144 -151 72 -1 -121 33 150 -35 20 92 -64 -122 125 -37 -102 -145
5219a45M8J02k41J70L73m13K24r5k00Q3%K60o9k13q7Q7L00Kk50N8Ml9j33K95r7
$$ -145 -97 5 -236 -66 307 -106 118 23 -177 -94 -94 166 97 -116 -203 -116 184 186 -64 -6 -2 -41 -174 121 24
5244B4n3jM6k8J16J40j68j2J04j96P9P2j09l04L15P7Q3l7k3K3j09J03j8K7o5Q9
$$ 24 -29 -30 16 -12 104 244 76 64 168 -28 51 123 14 -290 25 102 185 148 125 148 39 142 124 151 86 175
5270A75J4n26O20l43n3K58n13K62J03J02j77L0L1j45P0K32k51j67J95P2p3K04
$$ 175 189 -337 283 -60 -113 145 -368 -106 -3 99 -78 -48 -17 -162 -92 140 -111 -278 -83 -11 -84 120
5292A20l5k11J85K50l52k9J09J39p3l02K97K7J20j62K8j06L5r6K02k28P5K6J96
$$ 120 85 -126 59 309 -43 -72 37 176 103 -199 98 125 245 83 111 5 40 -56 146 -82 -7 19 215
5315B15l55K35j16J79r8R2J26k52p7O7J20k68K04j58L1J92p7q0J51J6r5r2O5j17
$$ 215 -140 95 -21 158 60 152 278 26 -51 16 136 -132 72 -86 -55 137 60 -20 131 147 52 -40 25 -92
5339i2K09l7o0L8j10L2k70M60j72j89J6K40k25J25J33o5j21R3M1o6P6J69l73J23
$$ -92 117 80 20 58 -52 -20 -290 170 -2 -191 -175 65 -160 -35 98 33 -88 5 46 -20 56 225 -148 -25
5363b5J89l71K96k40J40J9k8K0m3K8p0j8P6l8J4R8J16m13PK91J70k97O5p6K02
$$ -25 164 -207 89 -151 -11 8 -20 0 -43 -15 -85 -103 -27 -65 -51 47 163 -250 -243 48 218 -79 -14 -90 112
5388A12J29k28K3j78L42j31Rk13j33L06M4m5j20J36k15L1p7J3K36r6J26j97J32
$$ 112 241 13 36 -142 200 69 78 -135 -268 38 82 37 -83 53 -162 -131 -208 -195 41 -55 71 -126 6
5411Fm1K16r6MO7j32k52K53J52j87j26J08Ok9K75k43J6P7J15j20j48N5p7K6J33
$$ 6 -35 181 85 89 156 24 -228 25 177 -10 -136 -28 -22 -51 224 -19 -3 74 189 69 -79 -24 -101 -75 58
5436E8k25O8L6o2J63m0j47K15o4p4j20J1K62k32L41Mk81J22K30k45o9J22K5J02
$$ 58 -167 -99 -63 -125 38 -2 -149 66 2 -72 -192 -181 81 -151 190 194 -87 35 265 20 -49 73 98 200
5460B00j96j32j99L40%L1J31m48J77N4J41K7j17J28J9q3j70R2r9J67m8p6N8p7
$$ 200 4 -128 -327 13 13 44 175 -273 -96 -42 99 126 9 137 156 73 -97 -5 -104 63 15 -61 -3 -80
5484h0M6J1m1j10R9p2J67m0J05q1O6j47J17j09P2k0Nm7J56j42J94l39J99J48k00
$$ -80 -34 -23 -64 -174 -75 -147 20 -20 85 4 70 -77 40 -69 3 -17 -12 -59 97 -45 149 -190 9 157 -43
5509d3q1J88k0K8k0k14J85M6k14K28J68k13j90M2J46j11p0P3J46j80K75Nj34J9
$$ -43 -124 64 44 72 52 -162 23 69 -145 83 251 38 -152 -110 36 -75 -145 -72 74 -106 169 174 40 59
5533E9j53K48n0q0Nj47lJ4J87j09N8L2j72J89k9o2J56Q0n73M13j64l3rL07j59
$$ 59 -94 154 104 24 29 -118 -121 -107 80 -29 29 61 -111 78 49 -13 143 223 -350 63 -101 -134 -143 164 5
5558Ek0M7n6j84K62j39r3N6o3K06j95L20pk72OK86o7j39K09j97J02J41m8j04J72
$$ 5 -15 32 -24 -208 54 -85 -178 -122 -185 21 -174 146 139 -133 -127 159 92 -47 162 -35 67 208 160 56 228
5583B28K4k02k69J6J17K22k32j8J58k04L00noj77J27L2k38K39k8l1l8J04r2j29
$$ 228 252 50 -219 -203 -86 136 -96 -114 44 -160 140 135 129 -48 79 111 -127 112 84 53 15 119 27 -102
5607a02J03J92l71K70J98m77J40J69j23J73k71J23m2J41k97J52j65R1L5j89K36
$$ -102 1 193 -178 92 290 -187 -47 122 -1 172 -99 24 -18 123 -174 -22 -187 -96 -61 -250 -14
5628a4j10J12J13m53K60J86k65M08k72m9K2q1nJ7j07J91P5k83J75K85j93J50j76
$$ -14 -124 -12 101 -352 -92 94 -171 237 -35 -84 -62 -143 -148 -131 -238 -47 28 -255 -80 205 12 162 -14
5651a4O2l2k8j9J26l63N60k82J0m9j47R9J44N5k14Q3M3q3Q0O2k05J75j34p8J59
$$ -14 48 16 -12 -31 95 -268 292 10 20 -29 -176 -77 67 122 -92 -9 34 -49 31 93 -112 63 -71 -149 10
5676A0Oj2p6J37R5j54J1j12J74r3J0j24J21J88j38m1j05L0p4K28J24q5j66J84
$$ 10 16 4 -72 65 160 6 17 -95 79 -14 -4 -128 -7 181 43 2 -103 -73 -147 81 205 120 -46 138
5700A38j50M5qKK46l16KLm3j1K86k86K41k11j2k4K44j21j09L0J42j83j71K83J94
$$ 138 -12 33 25 27 273 -43 -41 -38 -81 -92 194 -92 149 -62 -74 -98 146 25 -84 -54 88 -95 -266 17 211
5725B11j54n5J69k54J55j11k66J82n1N4P9j3K00q0j13J35P0l30J75k2j64J21J58
$$ 211 57 2 171 -83 72 -39 -305 -123 -174 -120 -41 -54 146 66 -47 88 158 -172 3 -19 -183 -62 96
5748I6n1J11j24k7J80j15Q1k10J15J61j81J67j00k07Q4j97r5L94J24o7k33J63
$$ 96 45 156 32 5 185 70 151 -59 56 217 36 203 103 -104 -20 -217 -312 82 206 139 -94 69
5770F9nj54O6l1k07N30k03J0n9r3K24r6k90J33L08k75J22N3N6j39j20r2L54l30
$$ 69 64 -90 -24 -55 -262 268 65 75 16 -77 147 51 -239 -106 202 -73 49 102 158 19 -101 -193 161 -169
5794a69K86l06L14p4j52J91o9P5k07K0j5j67L34j71J64L08l01P6k48j22K38l2
$$ -169 117 -189 125 51 -101 90 21 96 -111 -91 -106 -273 61 -110 54 362 61 137 -111 -233 5 -27
5816b7N2o3k62L37M7n5k40K81l32J44R0L6p3K77j56o9q4J88k6j58R0m6J4J8K7
$$ -27 25 -38 -300 37 84 29 -211 70 -262 -118 -28 8 -65 212 56 -13 -97 91 65 -93 -3 -49 -35 -17 10
5841A0j54L77k2r3O1k32o7K21J52k49K5L7j71K19R3k21j44L6K50j97J10j62K35
$$ 10 -144 233 211 118 179 -53 -120 101 253 4 29 66 -105 114 207 -14 -158 -122 128 -69 41 -121 114
5864A14q8N1l56K02k27N15m91K42j30nJ25J08M7k46KJ88j3n6J41j12J60k64J69
$$ 114 26 77 -279 -77 -304 211 -280 -38 -168 -173 -48 60 107 -139 -137 51 38 -18 123 11 171 -93 76
5887G6L9n7k8P7j1q8l9J35k56M0J37p7K1k39K60J31q7q1J16l90M75k07J71k8k28
$$ 76 115 58 30 107 96 8 -31 104 -152 -112 25 -52 -31 -270 -10 121 34 -47 69 -321 154 -53 118 90 -138
5912a38K79J35l45J19j15n4K42J77n41K57m2O9n2J58j15j26K32j84R9j80J34J9
$$ -138 141 276 -69 50 -65 -119 123 300 -241 16 -26 43 -9 149 34 -92 140 -44 55 -125 9 28
5934B8j01r9L22j12j07mK12K2j50r3K98j68j20J28j08J42j17l7Q5p0O1p9p4J37
$$ 28 -73 -172 150 38 -69 -73 139 161 11 -82 216 48 -72 56 -52 90 -27 -64 21 -49 12 -67 -141 -4
5958dJ10j40L6o2J01o8%j06K9L02k74J06J21q3j8k03j40N14Lk33Q0o3K4m8L6J1
$$ -4 106 -34 2 -60 41 -27 -27 -133 -104 198 -76 30 151 68 50 -153 -293 221 224 -9 71 8 32 -16 20 31
$$ [...]
8191a27
##END NTUPLES=NMR FID
##END=
