##TITLE=1H_LR-747-V2-CM1
 CDCl3
 8 sc, 
 10.03.2022
##JCAMPDX= 6.0         $$ Bruker NMR JCAMP-DX V2.0
##DATA TYPE= NMR FID
##DATA CLASS= NTUPLES
##ORIGIN= UXNMR, Bruker Analytische Messtechnik GmbH
##OWNER= root
$$ XWIN-NMR		Version 3.5
$$ Thu Mar 10 11:54:40 2022 Russian Standard Time (UT+4h)  she@DPX200
##.OBSERVE FREQUENCY= 200.131346
##.OBSERVE NUCLEUS= ^1H
##.DELAY= (6, 6)
##.ACQUISITION MODE= SIMULTANEOUS
##.ACQUISITION SCHEME= undefined
##.AVERAGES= 8
##.DIGITISER RES= 18
##SPECTROMETER/DATA SYSTEM= spect
##.PULSE SEQUENCE= zg30
##.SOLVENT NAME= CDCl3
##.SHIFT REFERENCE= (INTERNAL, CDCl3, 0, 15.7039)
##AUDIT TRAIL= $$ (NUMBER, WHEN, WHO, WHERE, WHAT)
$$ ##TITLE= Audit trail, XWIN-NMR		Version 3.5
$$ ##JCAMPDX= 5.01
$$ ##ORIGIN= Bruker BioSpin GmbH
$$ ##OWNER= she
$$ F:/spectra/data/she/nmr/H-F/1/audita.txt
$$ ##AUDIT TRAIL=  $$ (NUMBER, WHEN, WHO, WHERE, WHAT)
(   1,<2022-03-10 11:53:04.56 +0400>,<she>,<DPX200>,
      <created by zg, POWCHK disabled, PULCHK disabled
       configuration hash MD5:
       00 E9 B6 7A A2 85 ED C7 34 08 36 98 17 FE 4E 26
       data hash MD5: 16K
       58 D2 67 66 93 3A 75 1E B7 56 DE 2F 72 4B B2 D5>)
$$ ##END=
$$ 
$$ hash MD5
$$ 35 32 EE 45 9B 1A B0 B2 CE 1F 65 FA 97 06 E4 0E
##$RELAX= 
##$RELAX= 
##$RELAX= 
##$RELAX= 
##$RELAX= 
##$RELAX= 
$$ Bruker specific parameters
$$ --------------------------
##$DU= <F:/spectra>
##$EXPNO= 1
##$NAME= <H-F>
##$PROCNO= 1
##$TYPE= <nmr>
##$USER= <she>
##$AMP= (0..31)
100 100 100 100 100 100 100 100 100 100 100 100 100 100 100 100 100 100 
100 100 100 100 100 100 100 100 100 100 100 100 100 100 
##$AQSEQ= 0
##$AQ_mod= 1
##$AUNM= <au_zg>
##$AUTOPOS= <>
##$BF1= 200.13
##$BF2= 200.13
##$BF3= 200.13
##$BF4= 200.13
##$BF5= 200.13
##$BF6= 200.13
##$BF7= 200.13
##$BF8= 200.13
##$BYTORDA= 1
##$CFDGTYP= 0
##$CFRGTYP= 5
##$CHEMSTR= <none>
##$CNST= (0..31)
1 1 145 1 1 1 1 1 1 1 1 1 1 1 1 1 1 1 1 1 1 1 1 1 1 1 1 1 1 1 1 1 
##$CPDPRG= <>
##$CPDPRG1= <>
##$CPDPRG2= <>
##$CPDPRG3= <>
##$CPDPRG4= <mlev>
##$CPDPRG5= <mlev>
##$CPDPRG6= <mlev>
##$CPDPRG7= <mlev>
##$CPDPRG8= <mlev>
##$CPDPRGB= <>
##$CPDPRGT= <>
##$D= (0..31)
0 1.2 0 0 0 0 0 0 0 0.06 0 0.03 0 0 0 0 0.0002 0 0 0 0 0 0 0 0 0 0 0 0 
0 0 0 
##$DATE= 1646898783
##$DBL= (0..7)
120 120 120 120 120 120 120 120 
##$DBP= (0..7)
150 150 150 150 150 150 150 150 
##$DBP07= 0
##$DBPNAM0= <>
##$DBPNAM1= <>
##$DBPNAM2= <>
##$DBPNAM3= <>
##$DBPNAM4= <>
##$DBPNAM5= <>
##$DBPNAM6= <>
##$DBPNAM7= <>
##$DBPOAL= (0..7)
0.5 0.5 0.5 0.5 0.5 0.5 0.5 0.5 
##$DBPOFFS= (0..7)
0 0 0 0 0 0 0 0 
##$DE= 6
##$DECBNUC= <off>
##$DECIM= 32
##$DECNUC= <off>
##$DECSTAT= 4
##$DIGMOD= 1
##$DIGTYP= 9
##$DL= (0..7)
0 120 120 120 120 120 120 120 
##$DP= (0..7)
150 150 150 150 150 150 150 150 
##$DP07= 0
##$DPNAME0= <>
##$DPNAME1= <>
##$DPNAME2= <>
##$DPNAME3= <>
##$DPNAME4= <>
##$DPNAME5= <>
##$DPNAME6= <>
##$DPNAME7= <>
##$DPOAL= (0..7)
0.5 0.5 0.5 0.5 0.5 0.5 0.5 0.5 
##$DPOFFS= (0..7)
0 0 0 0 0 0 0 0 
##$DQDMODE= 0
##$DR= 18
##$DS= 0
##$DSLIST= <SSSSSSSSSSSSSSS>
$$ [...]
##$SUBNAM2= <"">
##$SUBNAM3= <"">
##$SUBNAM4= <"">
##$SUBNAM5= <"">
##$SUBNAM6= <"">
##$SUBNAM7= <"">
##$SUBNAM8= <"">
##$SUBNAM9= <"">
##$SW= 18.0517287032376
##$SWIBOX= (0..15)
0 0 2 0 0 0 0 0 0 0 0 0 0 0 0 0 
##$SW_h= 3612.71676300578
##$TD= 16384
##$TD0= 1
##$TE= 0
##$TE2= 300
##$TE3= 300
##$TEG= 300
##$TL= (0..7)
0 120 120 120 120 120 120 120 
##$TP= (0..7)
150 150 150 150 150 150 150 150 
##$TP07= 0
##$TPNAME0= <>
##$TPNAME1= <>
##$TPNAME2= <>
##$TPNAME3= <>
##$TPNAME4= <>
##$TPNAME5= <>
##$TPNAME6= <>
##$TPNAME7= <>
##$TPOAL= (0..7)
0.5 0.5 0.5 0.5 0.5 0.5 0.5 0.5 
##$TPOFFS= (0..7)
0 0 0 0 0 0 0 0 
##$TUNHIN= 0
##$TUNHOUT= 0
##$TUNXOUT= 0
##$USERA1= <user>
##$USERA2= <user>
##$USERA3= <user>
##$USERA4= <user>
##$USERA5= <user>
##$V9= 5
##$VALIST= <valist>
##$VCLIST= <CCCCCCCCCCCCCCC>
##$VD= 0
##$VDLIST= <DDDDDDDDDDDDDDD>
##$VPLIST= <PPPPPPPPPPPPPPP>
##$VTLIST= <TTTTTTTTTTTTTTT>
##$WBST= 1024
##$WBSW= 4
##$XGAIN= (0..3)
0 0 0 0 
##$XL= 0
##$YL= 0
##$YMAX_a= 116598
##$YMIN_a= -188519
##$ZGOPTNS= <>
##$ZL1= 120
##$ZL2= 120
##$ZL3= 120
##$ZL4= 120
##$ABSF1= 10
##$ABSF2= 0
##$ABSG= 5
##$ABSL= 3
##$ALPHA= 0
##$AQORDER= 0
##$ASSFAC= 0
##$ASSFACI= 0
##$ASSFACX= 0
##$ASSWID= 0
##$AUNMP= <proc_1d>
##$AZFE= 0.1
##$AZFW= 0.1
##$BCFW= 1
##$BC_mod= 2
##$BYTORDP= 1
##$COROFFS= 0
##$CY= 11.3945322036743
##$DATMOD= 1
##$DC= 2
##$DFILT= <>
##$DTYPP= 0
##$F1P= 2.36226072786647
##$F2P= -0.459571619588291
##$FCOR= 0.5
##$FTSIZE= 0
##$FT_mod= 4
##$GAMMA= 1
##$GB= 0.15
##$INTBC= 1
##$INTSCL= 1
##$ISEN= 128
##$LB= 0.24
##$LEV0= 0
##$LPBIN= 0
##$MAXI= 10000
##$MC2= 0
##$MEAN= 0
##$ME_mod= 0
##$MI= 1.114404
##$NCOEF= 0
##$NC_proc= 0
##$NLEV= 6
##$NOISF1= 3.799351
##$NOISF2= 2.8
##$NSP= 1
##$NTH_PI= 0
##$NZP= 0
##$OFFSET= 15.70392
##$PC= 1
##$PHC0= -16590.98
##$PHC1= 15.80078
##$PH_mod= 1
##$PKNL= yes
##$PPARMOD= 0
##$PSCAL= 0
##$PSIGN= 0
##$REVERSE= no
##$SF= 200.130013532006
##$SI= 16384
##$SIGF1= 3
##$SIGF2= 2
##$SINO= 400
##$SIOLD= 16384
##$SREGLST= <1H.CDCl3>
##$SSB= 0
##$STSI= 0
##$STSR= 0
##$SW_p= 3612.71676300578
##$SYMM= 0
##$S_DEV= 0
##$TDeff= 0
##$TDoff= 0
##$TI= <>
##$TILT= no
##$TM1= 0
##$TM2= 0
##$TOPLEV= 0
##$USERP1= <user>
##$USERP2= <user>
##$USERP3= <user>
##$USERP4= <user>
##$USERP5= <user>
##$WDW= 1
##$XDIM= 8192
##$YMAX_p= 0
##$YMIN_p= 0
$$ End of Bruker specific parameters
$$ ---------------------------------
##NTUPLES= NMR FID
##VAR_NAME=  TIME,          FID/REAL,        FID/IMAG
##SYMBOL=    X,             R,               I
##VAR_TYPE=  INDEPENDENT,   DEPENDENT,       DEPENDENT
##VAR_FORM=  AFFN,          ASDF,            ASDF
##VAR_DIM=   8192,          8192,            8192
##UNITS=     SECONDS,       ARBITRARY UNITS, ARBITRARY UNITS
##FACTOR=    0.0002768,     1,               1
##FIRST=     0,             0,               0
##LAST=      2.2672688,     0,               0
##MIN=       0,             -188519,         0
##MAX=       2.2672688,     116598,          0
$$ Real data points
##PAGE= N=1
##DATA TABLE= (X++(R..R)), XYDATA
0 0 0 0 0 0 0 0 0 0 0 0 0 0 -8 8 -8 8 -8 16 -16 19 -24 32 -32 40 -48 56 -64 73 -88 98 -113 129 -146 167
34 167 -187 210 -236 266 -297 332 -370 411 -458 506 -557 615 -679 750 -829 910 -1003 1106
52 1106 -1219 1345 -1486 1645 -1824 2032 -2273 2556 -2893 3307 -3829 4504 -5422 6745 -8826
67 -8826 12612 -21681 93155 18087 -130368 18536 -28659 -57885 96374 111923 -84872
78 -84872 -66381 14899 -58210 -32638 116598 30915 -91583 3621 32819 -85706 -13121 103503
90 103503 -2596 -68510 43126 19211 -76868 11640 77185 -18202 551 73205 -36863
101 -36863 -98219 33501 53969 -27872 27080 43474 -91260 -77666 62762 39488 -15719
112 -15719 49163 9452 -101137 -26600 71742 9532 -7632 46163 -24348 -84099 17709 61366
124 61366 -13192 1793 39638 -36008 -47934 43060 24112 -41693 12091 37623 -37536 -26708
136 -26708 37195 -6556 -35136 35173 28997 -38670 -6465 24457 -27732 -10590 52610 7171
148 7171 -43525 4949 13292 -29507 10617 48947 -14329 -39324 11293 4495 -19489 22448 25843
161 25843 -30247 -20111 21232 -3824 -14021 26401 10088 -31888 2008 28028 -12610 -12781
173 -12781 23059 -1518 -22693 16900 16965 -26449 -9703 22228 -3910 -11474 15400 -5301 -27693
186 -27693 9216 21153 -12049 -5854 12184 -13042 -14071 24108 15116 -17650 -964 12060 -12607
199 -12607 -3781 24949 4467 -20017 -1349 5794 -6094 8482 14196 -16583 -19369 11568 8862
212 8862 -7137 4158 -800 -21554 -1662 23145 1621 -14406 1869 589 -8807 11067 17782
225 17782 -8568 -12055 5033 167 -380 15597 5553 -17290 -8111 7715 3175 5721 10055 -12356
239 -12356 -22311 5865 18508 435 -5200 -3326 -12229 -4854 16090 10840 -8400 -7833 -3322 -3773
253 -3773 9005 15396 -4599 -13356 143 2806 248 11200 8871 -12838 -15052 4214 10933 6556
267 6556 2245 -9623 -14848 1723 12774 4271 -1853 -4814 -12044 -4975 14516 12701 -6790 -10913
281 -10913 -2426 297 5315 9993 1178 -8678 -6222 -326 6060 11975 3875 -10704 -9021 4255
295 4255 6870 3731 2765 -5367 -12499 -1982 10168 6698 -2445 -8185 -8522 -1164 7690 5967 -2259
310 -2259 -5724 -6435 -3576 6977 10958 -146 -7673 -2169 3018 4817 6817 2639 -5967 -6096 1693
325 1693 5787 4506 49 -7234 -6782 2424 5442 1836 555 -2646 -7389 -2848 5501 4067 -3488
340 -3488 -4825 -2685 -470 4773 5598 -1639 -5029 -1272 2555 5281 5213 -1847 -7305 -2245 4771 3478
356 3478 828 80 -2893 -2905 3061 4016 -1345 -3137 -2699 -2702 331 3389 797 -4330 -3998 -1307 1812
373 1812 5744 4209 -3092 -5116 536 4297 3466 323 -3440 -4518 93 5614 3867 -2415 -4818
388 -4818 -2451 2228 5713 3525 -2124 -5120 -3567 43 3095 3984 604 -5449 -5897 700 5577 4193
404 4193 -334 -4020 -5192 -1319 5627 6658 -1480 -7356 -4676 2056 6788 5489 -1508 -5050 -1264
419 -1264 2625 3246 3434 191 -6860 -5972 4087 6110 -1094 -3756 -3135 -3946 509 7408 5030 -3409
435 -3409 -7628 -6039 580 9619 7208 -5619 -8382 -1578 1110 4586 10114 2381 -10367 -6725 5660
450 5660 6920 3205 848 -5472 -7336 1460 6096 2841 1455 -3095 -9113 -2204 8942 3366 -5789
465 -5789 -2582 -1107 -4250 2856 7662 -2822 -7737 162 3349 2959 5195 -693 -8387 -1338 7310
480 7310 3688 1635 2212 -6711 -8933 5965 11203 -54 -4550 -3612 -6909 -1514 10065 6205 -5191
495 -5191 -5702 -4945 -4430 6702 10682 -2825 -7972 -107 -1242 -2083 8136 7168 -5974 -5107 3263 205
511 205 -101 4954 -833 -4905 3706 2911 -6450 -1622 3743 -3390 -861 8529 -649 -11921 -2520 4960
527 4960 739 3773 5206 -6928 -9332 1940 3492 2505 8522 1568 -12120 -4728 7167 2176
541 2176 1601 8327 -1636 -11642 7 6121 -1588 954 5464 -3837 -6243 2390 -1336 -5580 5431
556 5431 6960 -4832 -2907 1530 -7722 -4196 11511 6763 -5755 -1784 -1209 -8637 1746 14187
570 14187 3838 -5027 -687 -4460 -6369 7620 10758 -3139 -4294 495 -6279 -4302 9014 4446
584 4446 -6852 461 3983 -6628 -3648 5948 -730 -3930 6278 2796 -8776 -3348 3356 -1038
598 -1038 3914 10542 -1927 -10897 -779 2644 187 8804 8257 -9642 -12055 1538 3630 1907
612 1907 7746 2134 -11473 -6604 4721 2244 1527 4938 -3777 -9242 1888 5567 -3280 -794 4952
627 4952 -2524 -3993 6441 3005 -7267 -1013 5536 657 1290 3469 -5615 -7467 4419 6441 -210
642 -210 1797 -502 -11041 -4846 10376 6862 -3597 -2388 -3652 -7596 1408 10141 2591 -4526 -2686
657 -2686 -3813 -1872 7831 6666 -5023 -3575 2856 -766 -268 7124 1440 -8428 -1263 6446 625
672 625 -1671 1149 -3603 -4741 4052 4594 -2420 -2140 -1576 -4896 986 7988 -306 -7378 -1135 1297
688 1297 -2080 3503 6606 -3288 -7214 1431 4554 2196 3343 764 -5761 -2415 4312 2496 543
703 543 1646 -3577 -6001 2881 5994 -2229 -4257 428 -1495 -2426 3511 2648 -4215 -3082 871 234
719 234 1727 3185 -1658 -3810 1377 2799 -63 1657 2099 -3553 -2948 4045 3566 -1653 -1732 -704 -1717
736 -1717 1291 3776 -375 -3423 -928 -5 -933 2052 1521 -3779 -2738 2005 832 -1146 1271 330
752 330 -2737 -77 3256 1227 -524 250 -884 -544 3194 2552 -1665 -1692 -71 -345 822 2470 -1160
769 -1160 -4245 -986 1981 326 -379 -132 -2637 -2244 1415 2088 -427 -1188 -991 -963 1179 3138 669
786 669 -1277 -152 -78 339 3069 1904 -2703 -2855 793 1789 1112 1027 -980 -3011 -803 2129 2019 -26
804 -26 -2372 -3413 -937 2487 1405 -964 -1291 -1702 -1501 1975 4542 1117 -3125 -2088 727 2248
820 2248 2321 591 -1680 -1856 -149 2066 3286 1334 -3119 -3421 668 2634 623 -374 -1301 -3366 -2098
837 -2098 1838 3510 509 -2755 -3347 -172 3362 2996 -530 -2095 -1578 -885 1976 4073 826 -3530
853 -3530 -2650 1473 3157 1826 202 -1700 -2396 -630 1223 2404 1335 -2058 -4172 -1071 2872 2454
869 2454 -474 -1854 -2315 -1694 1826 3800 909 -2959 -2906 393 3385 3027 -576 -2477 -1074 791
885 791 1347 1720 1239 -1657 -3081 -145 2498 1506 -587 -1875 -1901 -1496 597 2391 1040 -2390 -3742
902 -3742 -950 2981 3366 -548 -2681 -1304 762 1604 1942 1228 -1261 -2631 413 3056 1285 -893
918 -893 -664 -112 -43 437 1084 383 -1146 -2182 -1116 1409 1861 -1191 -2766 -1263 467 824 1675 808
936 808 -2482 -3022 970 3243 1273 -758 -1414 -895 699 2081 1328 -225 -217 -770 -661 1679 1498 -1085
954 -1085 -1776 181 -216 -643 1164 93 -2480 -968 1424 672 -359 -302 -1529 -1224 1993 2159 -728
971 -728 -1056 -308 -1199 998 3631 817 -2131 -718 418 -204 1796 2003 -1498 -2621 473 1212 -32
988 -32 1000 -604 -2957 -336 2255 -157 -1442 85 -1058 -1862 2051 2430 -1480 -1433 727 -522 188
1005 188 3229 1165 -2420 -748 831 349 2208 2095 -2837 -3314 2039 2017 -1121 52 -190 -3485 -587
1022 -587 3570 233 -2783 -495 -113 -899 1953 2024 -2438 -1630 1253 -1142 34 4977 1467 -4799
1038 -4799 -1563 2621 605 1445 3409 -2149 -5201 898 3560 710 647 -613 -4166 -550 3736 -505
1054 -505 -3086 1700 680 -3866 214 3675 -1949 -2707 2723 858 -1995 1993 1904 -3201 -979 2669
1070 2669 220 744 2931 -2980 -4996 3916 5408 -1805 -1456 1205 -3635 -2483 5218 2364 -4316
1085 -4316 -1334 785 -2583 898 4325 -1384 -3002 1995 -697 -3398 3236 3926 -4123 -2858 3551
1100 3551 392 -1730 3261 1176 -4162 968 4104 -1656 -1903 1943 -1634 -2346 4120 1690 -5165
1115 -5165 -628 3507 -2034 -1473 4159 -471 -4933 1021 2547 -2190 454 2846 -2905 -2665 3795
1130 3795 1573 -2207 2362 1467 -4363 208 5436 -695 -3272 2109 361 -3914 1100 3435 -2592
1145 -2592 -2015 2476 -1093 -2438 2477 348 -4152 1037 3263 -2807 -1859 3097 -944 -2875 3732
1160 3732 3132 -3723 -930 3402 -657 -1028 3412 -234 -3595 821 2068 -2152 436 2990 -2252
1175 -2252 -2998 2604 710 -2354 1534 1397 -4185 -1441 3980 234 -3306 840 906 -1991 1565 2906
1191 2906 -2555 -2232 2832 1097 -826 1883 172 -3366 515 3324 -931 -1359 2394 -752 -3908
1206 -3908 1134 3067 -1309 -1162 378 -2208 -1675 3237 1839 -2731 -1371 461 -754 1688 2938
1221 2938 -2108 -3301 1827 2562 -707 262 1299 -1883 -1211 2972 1419 -1471 -56 -85 -1989 255
1237 255 2624 -233 -1496 -175 -1521 -1488 2838 2712 -2883 -3218 772 892 658 1721 -405 -2833 -112
1254 -112 2516 1193 376 304 -1766 -1316 2293 1546 -1148 -166 616 -1872 -825 2721 1442 -2357 -1912
1271 -1912 -343 -86 1249 1374 -1442 -2512 -553 341 1058 1940 -452 -3107 -632 2861 1282 -373
1287 -373 586 -49 -1551 367 2374 1005 -797 -1331 -784 520 1706 347 -1055 -711 -647 -776 877
1304 877 1767 -1235 -2654 -482 1143 512 141 -157 -865 -863 334 1329 1254 267 -1386 -941 1276 1541 119
1323 119 -416 -424 -753 -5 1415 926 -911 -1310 -272 469 440 -66 -686 -691 -368 -463 114 843 38 -939 -562
1344 -562 524 838 602 3 -482 -574 732 1142 479 -457 -734 -272 1018 1041 -402 -916 -68 287 82
1363 82 -192 -430 -814 -460 65 -50 -418 -267 -44 5 -157 127 351 443 35 -639 -29 751 936 -131 -586
1384 -586 27 902 938 330 -227 -740 -395 889 999 -845 -1620 -621 280 250 222 -262 -788 -238 -84 -8 508
1405 508 385 -723 -667 486 628 103 832 596 -1228 -794 1934 1785 -550 -896 -494 -279 1024 1448
1423 1448 -584 -1498 -389 -191 -34 1379 22 -2564 -977 1541 -17 -700 1170 178 -2255 -382
1439 -382 2267 806 -202 334 -1172 -808 1913 1570 -990 -316 165 -1371 489 2932 -418 -3419
1455 -3419 200 1524 -1145 272 1451 -1984 -2565 1196 1290 -393 1004 -222 -3133 -151 3162 85
1471 85 -1095 1520 -505 -2633 2018 3650 -1274 -1719 1140 -448 -1023 2726 1183 -2673 -584 1313
1487 1313 -1596 63 2885 -1669 -3615 1914 2005 -2214 -434 1661 -2337 -1724 3215 1528 -2437 207
1503 207 406 -2056 1554 3388 -1254 -1964 2030 -216 -2476 2780 3240 -2994 -2208 2162 -559 -1626
1519 -1626 2531 520 -3607 -249 2145 -1393 -627 1957 -1661 -2187 2799 1144 -3564 434 2904
1534 2904 -1677 -989 3340 -124 -3352 1622 2423 -1573 432 2322 -2241 -2495 2304 668 -1401 1932
1550 1932 729 -4218 -744 3581 -371 -2027 1983 4 -3345 946 2735 -1811 -1051 2695 -582
1565 -582 -2270 1686 1192 -1858 1251 2412 -2150 -1357 2342 -185 -1718 2416 1568 -2874 -910 1928
1581 1928 -1459 -1076 2989 169 -3623 -506 1330 -1231 575 2453 -1771 -2668 1754 1164 -1370 1558
1597 1558 1657 -2259 -1051 2639 -249 -1548 1786 995 -2014 298 2073 -1233 -1346 1837 106 -1654
1613 -1654 1142 332 -2914 -416 2512 -368 -1277 995 -468 -2487 1406 2920 -651 -1321 299 -1231
1629 -1231 -911 2580 1745 -1635 -412 474 -1401 898 3351 -296 -2717 447 749 -1418 526 1709
1645 1709 -1644 -2341 1216 788 -645 695 142 -1740 230 1960 -665 -975 984 -571 -1801 2040
1661 2040 2380 -1714 -1269 1534 334 -255 1765 251 -2447 -762 844 55 430 843 -2066 -1867 1387
1678 1387 1115 -658 645 539 -2360 -1288 2129 850 -1274 -154 -104 -858 785 1858 -79 -544
1694 -544 451 -342 28 1869 364 -2326 -687 1243 -93 -279 1176 -431 -1651 120 1187 83
1710 83 -93 -344 -1517 -742 1038 350 -802 362 -90 -1034 623 1820 226 -976 290 259 -223 467
1728 467 643 -678 -380 366 67 136 704 -495 -1110 370 796 -382 -539 255 -662 -826 608 759 -684
1747 -684 -434 -212 -249 551 784 42 -185 356 -132 -305 691 607 -459 -189 634 149 -261 159 164 -448 -35
1768 -35 81 -290 -378 76 -323 -52 146 -515 -697 176 336 -201 37 317 -412 -442 398 716 48 -47 -3 -14
1790 -14 295 552 385 -56 -269 -398 105 486 90 -895 -544 120 37 -64 216 -319 -894 -202 350 500 -190
1811 -190 -495 -274 76 469 444 572 101 -557 -336 970 1103 175 -609 -345 81 209 625 326 -417 -890
1831 -890 -592 397 714 -19 -761 -492 -126 -104 335 273 -239 -941 -613 444 999 651 -450 -699 -125 512
1851 512 688 572 56 -817 -634 697 1051 250 -650 -748 -280 20 268 55 -199 -891 -867 32 768 464
1871 464 -451 -836 -101 135 490 748 260 -599 -872 406 1323 987 -298 -856 80 581 367 220 248 -670
1891 -670 -881 -70 614 195 -612 -833 -325 193 270 211 313 -297 -1006 -391 920 983 -510 -645 -27 339
1911 339 407 799 316 -432 -322 360 648 457 -244 -976 -145 425 -133 -141 362 179 -1032 -423 757 233
1931 233 -429 -270 -379 -453 156 497 -69 61 10 -156 386 894 139 -589 545 343 -558 -248 505 -83
1951 -83 -311 489 343 -457 11 85 -465 53 481 -451 -971 105 -248 -687 569 744 -698 -404 769
1970 769 82 -313 732 544 -746 -37 337 -457 -113 972 50 -445 516 244 -940 123 825 -562
1988 -562 -652 398 -466 -1532 355 925 -351 -521 84 -788 -219 1502 798 -924 -60 36 -918 335
2006 335 1523 -122 -668 618 394 -736 778 1494 -690 -1127 328 -194 -738 443 -165 -1331 -70
2023 -70 972 -515 -500 589 -350 -873 1349 1046 -1526 -868 1288 75 -621 1095 539 -1237 23
2040 23 1011 -69 503 1179 -837 -1521 385 481 -355 845 422 -2106 -1317 1968 904 -1169 81 290
2058 290 -1255 -49 1548 -184 -961 670 -80 -677 981 1000 -935 -221 1307 -502 -852 1859 430
2075 430 -1991 -277 1440 -355 -505 731 -800 -1400 1045 1092 -1335 -327 547 -1215 -262 1826 -55
2092 -55 -1846 545 1011 -1054 89 1610 -358 -1282 773 673 -744 971 1041 -1641 -475 1333 -141
2109 -141 -838 1216 -154 -2087 471 1867 -1098 -989 1040 -320 -1374 889 724 -1187 90 1134
2125 1134 -799 -443 1420 -233 -1235 1121 1209 -1341 -39 1663 -646 -1165 1341 460 -1345 103
2141 103 738 -1128 -373 1180 -542 -978 882 -112 -1459 662 1224 -1276 -667 1164 -228 -1189 1057
2158 1057 740 -990 28 1413 -689 -529 894 187 -551 738 104 -1321 99 1313 -425 -670
2174 -670 712 -253 -1266 535 955 -965 -372 799 -656 -1045 1019 936 -618 -10 313 -534 115 1478
2192 1478 -115 -808 404 493 -388 493 580 -599 -567 1203 247 -1082 -71 256 -633 -40 480 -447 -763
2211 -763 54 -88 -563 663 616 -660 -737 54 -242 219 1402 159 -1409 -511 1009 746 334 263 -473
2230 -473 -867 288 732 -75 74 104 -754 -412 532 334 -516 14 -68 -897 -155 925 481 -760 -480 92
2250 92 172 527 15 -684 -380 436 536 244 199 -408 -739 282 956 -17 -574 -272 -151 -393 -4 629 151
2271 151 -615 -649 -208 364 723 -38 -569 -285 116 -273 375 809 -337 -978 -132 973 430 162 290 -141
2291 -141 -158 28 394 302 -98 -673 -452 410 508 -307 -511 -96 -179 -271 179 274 -449 -671 -161 324 207 -9
2313 -9 13 -98 -129 -101 421 508 191 -330 -321 349 586 142 -221 -293 -82 -29 310 179 -279 -417 -77 176 42
2336 42 -157 -280 -35 -55 -1 -158 319 286 -84 -297 79 212 412 177 146 -190 100 296 251 -30 -387 -199
2358 -199 215 283 -129 -335 -48 411 19 -214 -160 -118 63 -32 65 -180 -175 137 365 171 -237 -131 208 422
2380 422 71 -120 74 296 202 -210 -74 118 99 -127 -102 -365 -59 336 329 -163 -587 -324 276 366 -87 -461
2402 -461 -244 119 189 173 311 22 -143 180 421 292 9 136 -65 -428 -202 256 388 92 -463 -289 377
2423 377 459 -17 -346 -403 -334 -219 47 226 -290 -623 -233 419 254 -94 56 141 -121 -44 412 512 2 -366
2445 -366 -250 192 501 78 -86 -59 -117 -198 224 278 -74 -656 -491 56 64 -192 -130 -125 -310 -67 237 346 193
2468 193 -387 -392 112 586 157 -305 44 -121 59 149 536 82 -300 -133 106 69 -27 -115 -284 -464 -83 94
2490 94 182 287 -325 -693 -42 686 279 -287 -115 -262 -296 461 615 101 -293 -90 94 371 328 118 -113
2511 -113 178 -11 -379 12 661 26 -541 -157 46 -297 -104 36 -287 -350 53 412 -207 -249 -93 67 319
2532 319 361 -301 -328 351 429 -326 114 515 -218 -367 395 199 -296 19 331 -405 -391 233 22 -11 23 -65
2554 -65 -391 100 365 -296 -499 416 -58 -297 441 106 -549 89 705 17 -313 429 97 -219 308 261 -438
2575 -438 -143 543 -130 -533 354 116 -634 27 442 -515 -132 414 -169 -735 122 431 -302 20 356 -501
2595 -501 -123 856 223 -532 242 326 -495 365 702 -296 -532 423 136 -361 288 380 -599 -296 430 -158 -388
2616 -388 351 -294 -651 391 554 -730 -298 559 -219 -422 788 398 -518 -75 469 -14 -87 748 10
2635 10 -480 113 283 -21 124 251 -846 -426 585 183 -642 78 179 -555 -319 715 -73 -579 5
2654 5 305 -114 138 411 -239 -191 245 -143 -79 971 274 -845 -141 821 3 -252 564 -231 -881 -22 630
2675 630 -258 -362 48 -363 -317 272 60 -325 296 301 -585 -65 684 134 -496 255 403 -310 221 546 -106
2696 -106 -329 356 340 -199 112 -85 -699 79 500 -422 -613 211 -73 -651 145 507 -352 -423 367 -86 -200
2717 -200 358 299 -480 -39 209 -192 32 768 -143 -443 454 434 -287 -49 582 -277 -467 122 -28 -397 -155
2738 -155 147 -273 -199 181 -220 -159 382 -155 -607 293 380 -413 -169 570 38 -80 261 258 -124 53 415 86
2760 86 -45 97 -49 -102 402 36 -533 3 93 -316 -403 300 -284 -319 -104 301 -230 -83 177 61 43 116
2782 116 -112 -82 107 233 10 286 87 -190 -120 171 206 -137 38 99 -417 -177 266 190 -190 -166 -135 -207 35
2805 35 57 -3 -241 93 -94 37 239 201 -91 -61 160 66 126 107 124 -207 25 119 368 104 -152 -273 3
2828 3 45 19 -39 -40 -206 -304 121 162 81 -327 -317 -47 -21 194 209 238 -158 -80 98 183 172 -1 -127 235 119 270
2854 270 57 -133 -172 -300 -113 317 150 -327 -360 -83 64 61 -85 -31 -347 -356 -63 107 140 -69 -319 74 355
2877 355 -58 120 186 62 -100 134 257 255 -120 -400 60 189 76 2 -102 -132 -248 -105 256 303 -202 -380
2899 -380 96 211 -14 -113 161 -72 -204 41 228 175 88 -201 161 422 218 43 7 58 -119 9 394 191
2921 191 -171 -137 128 -108 100 122 -83 -12 -217 -224 47 174 -116 -300 -17 76 71 -82 119 84 -116 -48 306
2944 306 196 -51 -89 -109 62 54 86 -10 -139 -71 -121 -123 3 -105 -345 -194 12 -172 34 49 -54 -179 143 -84
2968 -84 2 127 115 -90 362 110 72 -79 160 130 -311 63 167 -172 -44 150 -18 -126 5 -47 -205 -13
2990 -13 150 -103 -212 -14 -324 -65 387 163 -263 -9 123 13 10 250 90 -188 223 132 -107 22 190
3011 190 -1 12 -23 -103 -113 156 38 -281 127 272 -386 -401 159 216 -341 7 162 -328 -234 186 149 5 -108
3034 -108 -285 -101 174 422 -161 55 291 16 -367 321 187 -216 -6 210 -97 -372 270 210 -424 -273
3054 -273 31 -61 62 66 -419 -126 400 240 -83 67 339 -368 -99 647 270 -207 -18 69 -71 94 355
3075 355 -42 -216 -114 -310 -262 395 380 -501 -115 236 -179 -232 333 39 -486 65 517 -32 -27 36 70 -44
3097 -44 420 265 -110 -4 157 -316 -73 574 272 -471 -118 210 -409 -28 323 -216 -353 -64 -15 -146 127
3118 127 142 -302 120 372 -305 -479 364 171 -383 279 527 -203 -425 349 193 51 332 42 -413 -67
3138 -67 315 -80 201 318 -193 -519 140 110 -286 177 450 -328 -547 240 130 -197 338 263 -283 -70 300
3159 300 -239 44 399 73 -139 287 156 -563 18 844 75 -453 -98 -188 -402 64 371 -161 -81 201 -437
3180 -437 -460 290 288 -6 54 16 -436 -61 618 259 -158 147 86 -285 52 240 -308 134 524 76 -392 -28
3202 -28 -55 -139 124 387 -435 -370 58 -12 -182 253 261 -453 -145 81 177 332 370 -79 -231 -195 174 -24 207
3225 207 209 -163 -173 325 172 -201 10 211 -67 -122 107 -116 -333 -59 115 -122 -240 0 -314 -210 66
3246 66 55 53 2 23 -336 -144 390 213 -82 -133 -26 -49 101 370 228 -11 -175 -193 7 160 125 -199 -51
3269 -51 -113 -179 -37 400 33 -153 -14 55 -151 -170 65 125 -53 66 175 130 56 -52 -41 239 353 -54 -156
3292 -156 33 55 -237 123 230 -172 -437 -347 3 233 -5 -158 -146 -49 83 60 73 95 22 -156 143 295 -18
3315 -18 -4 225 76 -46 92 219 0 -109 -154 -197 146 245 -274 -152 -72 -35 -36 15 43 -282 -136 11 66 -90
3339 -90 -301 52 134 55 37 12 214 175 -9 -45 106 185 63 -94 -61 -75 -142 330 139 -113 -309 -80 129 -23
3363 -23 -224 41 -36 -110 -130 -120 -23 -73 -81 30 21 91 111 132 163 -62 -18 69 237 69 -125 133 174 193 4 -82 -80
3390 -80 22 -139 -100 19 -75 1 93 -26 -210 -83 -12 127 35 -16 20 2 190 135 -37 55 27 39 48 51 -6 -197
3416 -197 100 20 -75 172 2 -15 -292 -84 80 22 -292 -142 -103 -216 80 27 144 -49 -74 -4 254 158 -118
3439 -118 -208 -98 -47 56 74 28 17 -153 -163 189 91 22 -217 -166 -158 -58 27 120 -38 -200 -290 -90 -47 2 -36 -67
3465 -67 -144 -28 158 197 219 -130 -47 179 371 212 -64 -213 -129 129 85 18 193 -327 -264 41 132 -214 -335
3488 -335 -151 -185 -292 -73 55 -28 -167 -132 -215 337 217 -237 -253 -66 1 12 153 340 -321 -260 322 383 121
3511 121 64 -79 -111 -67 -60 -139 53 119 -236 -8 159 217 -248 -65 50 -291 -109 315 28 -206 -77 111 90
3534 90 93 200 -248 -129 247 144 -66 -15 38 -267 25 211 -51 -156 201 -210 -271 146 475 121 9 -47
3556 -47 -348 193 220 183 -143 -21 73 -147 27 321 -2 -156 5 60 -234 -106 291 -42 57 -40 -11 -142 172
3579 172 62 -303 -47 109 -287 -223 152 -4 -154 120 16 -184 -323 359 152 143 161 -20 -311 -51 142
3600 142 -15 -78 160 -157 -227 74 295 -81 -187 -8 -269 -369 179 35 -195 59 -16 -226 -259 208 85
3621 85 41 16 -93 -265 -76 202 -58 109 261 -105 -364 3 402 171 69 217 -106 -447 12 61 -8 -35
3643 -35 -137 -419 -267 47 -40 -63 317 22 -303 -139 113 -62 126 333 125 -365 -178 170 41 148 225
3664 225 -105 -167 -38 -199 -84 429 223 -309 -249 32 -290 -39 242 278 -194 -367 -180 101 120 405 -51
3685 -51 -147 -69 -3 -201 125 396 -215 -261 161 -94 -281 210 216 -100 -144 176 -201 -135 -5 -133 -144 10 -157
3708 -157 -484 -70 235 -64 31 169 23 -343 33 352 119 178 174 -29 -399 -38 127 365 177 64 -359
3729 -359 43 65 -106 -236 5 80 -402 -31 203 -57 -105 15 6 -8 -13 38 -76 95 108 55 -178 176 146 0
3753 0 231 226 -4 -38 106 -38 107 18 99 2 11 -191 -44 116 46 -155 -59 27 -59 25 196 74 -157 -116 -85 42
3779 42 -165 165 24 -14 -57 40 180 -130 188 -81 117 -101 -91 -127 181 -20 -126 -37 -54 -82 -117 -115 84 43
3803 43 -15 25 -73 -149 -75 37 28 -62 -48 34 120 -10 -65 62 87 57 172 191 34 104 -47 174 155 40 56 18 -27
3830 -27 7 -31 -46 -73 51 17 13 5 37 -111 -211 -80 28 19 -20 27 -15 -30 136 150 -50 -25 -31 -53 -27 275 -80 -68
3858 -68 50 -216 -53 27 -1 -222 -167 -227 -59 79 135 50 -58 -120 42 98 160 -40 2 -24 16 81 -55 35 -21
3883 -21 100 -74 110 178 -158 -164 -65 121 -56 -81 -109 29 -211 -18 314 116 -160 -251 35 139 -5 -34 -81
3906 -81 104 87 -114 65 171 -129 -151 109 64 176 -3 -16 -64 74 -96 -38 -17 -119 -150 -66 77 73 91 -49
3930 -49 -20 73 -225 -25 131 101 -11 -160 38 80 101 75 -20 59 47 195 131 70 26 -69 31 66 -5 44 -215 -174
3956 -174 12 -177 164 -16 -251 -132 -68 -31 -127 -175 109 35 -78 -114 164 -112 -6 -11 233 131 84 163 -199
3979 -199 -93 -113 26 -55 -23 -222 -168 -116 116 -81 190 108 -36 -15 -114 112 -136 26 54 223 -168 -31 -37 89
4003 89 75 -27 36 -74 61 23 87 258 45 -77 84 40 -43 102 -16 -66 -54 -69 -63 -27 -13 -70 -32 -43 -28 -73
4029 -73 18 -72 -33 -101 133 165 -50 -155 22 162 119 128 -40 -214 -143 109 -21 198 -90 -72 -257 -69 -86 97
4053 97 -98 -40 -234 -184 -67 -86 4 -64 6 68 22 150 18 -15 67 146 -45 60 34 -117 77 66 83 -64 -63 -128
4079 -128 -293 -106 191 56 37 -27 -225 -150 252 131 46 -116 -139 -124 -17 272 248 2 -71 -106 -194 -182 221 76
4103 76 93 -102 35 24 -79 184 -110 191 169 -142 -248 172 181 -173 -2 -35 7 -141 32 206 80 -6 36
4126 36 -139 -75 75 160 201 165 -99 -409 -177 176 144 69 -126 -218 -592 -120 73 150 80 -93 -203 -322 79
4149 79 -55 218 266 2 -278 -87 190 144 134 58 -82 -101 177 216 85 7 204 83 -304 -250 -152 12 154
4172 154 113 -119 -289 -41 10 -106 282 285 -52 -251 -47 -215 55 389 14 -116 -86 92 6 286 320 -34
4194 -34 -48 -56 30 -128 38 314 -157 -153 23 -258 -179 269 157 -100 19 -106 -255 154 80 18 -83 151 -155
4217 -155 -90 86 306 61 -80 58 19 -161 195 190 -89 57 -63 64 -92 6 39 89 64 -39 77 135 19
4240 19 -3 -87 158 -64 -132 -61 120 56 -55 192 -89 -143 -4 111 31 139 75 -119 -25 132 -195 32 59 12
4264 12 -138 6 107 -43 -110 -187 -22 61 -15 4 43 51 50 -49 66 152 -18 -58 37 19 -77 68 47 -55 -5 9 15
4291 15 113 89 57 -18 -98 56 48 -188 -38 -86 -276 -15 -33 -112 -285 -250 215 92 176 129 -28 -10 -16 40 -67 -32
4317 -32 -137 50 97 64 59 30 -26 -24 -251 -80 -125 -27 -23 -100 -29 79 -25 59 86 4 -107 -57 60 100 -47 -34 26
4344 26 -176 -16 -175 64 104 41 23 19 -27 -53 84 -187 -137 -43 47 -50 -250 -116 70 134 49 -77 143 64 121
4369 121 -21 123 -85 32 23 -1 145 -47 44 26 111 141 103 -4 106 -29 -84 7 108 -184 24 30 -143 7
4393 7 -11 -7 -56 -81 42 85 -93 -234 -114 -126 -114 73 -99 18 78 -20 34 48 -30 -118 -113 -18 122 35 -145 56 153
4420 153 -44 -126 -108 -78 25 -125 -102 -14 73 51 35 -55 -40 93 195 6 45 -1 20 -24 235 -9 46 142 -58
4445 -58 234 106 12 -143 -15 -67 222 -66 -95 -106 36 -51 109 145 162 29 -211 -226 55 51 -43 51 64 3 61
4470 61 218 87 -8 -197 9 -8 91 91 87 -144 1 126 -47 -71 60 -134 -103 -99 -55 -78 -95 92 67 -231 43
4495 43 71 -100 -191 30 36 145 -46 20 -144 -32 121 -133 20 124 -197 -56 94 94 -112 -209 -234 -144 -62 11
4519 11 230 69 -87 -82 45 61 -10 67 -1 -178 16 -32 97 209 -86 -137 169 17 -101 125 69 -60 -5 -12
4543 -12 -88 -125 -67 -38 -122 288 34 -111 136 82 -245 -3 287 -13 -90 -5 105 -91 113 113 -96 -18 110 99
4567 99 -46 36 23 -147 55 -119 -24 -82 43 110 -111 36 86 -123 -133 101 -78 -211 62 34 -46 25 180 -151
4591 -151 -96 126 69 -103 163 156 -244 -7 159 -143 -177 289 148 -4 130 102 -281 -7 67 16 -240 148 -46
4614 -46 -305 53 64 -41 -91 116 -30 -118 81 60 -179 167 0 46 31 123 5 -100 112 -18 -95 -41 116
4637 116 -141 -183 13 32 -210 99 123 -126 -130 177 -133 -54 115 -163 -168 -15 103 -99 -78 183 63 -74 146
4660 146 131 -41 182 221 56 -87 213 -20 -115 32 -163 -97 -175 225 13 -159 25 -88 -85 86 72 -163 -219
4683 -219 134 -61 -160 30 -9 -112 83 70 15 -37 279 -17 -155 249 62 -129 -78 66 -85 98 260 -5
4705 -5 -269 -2 211 -44 4 8 -116 -146 55 73 -214 143 141 -57 -103 73 -71 -163 148 221 -253 -31 109 -238
4729 -238 -21 58 -96 -23 -8 129 -187 -3 87 90 -94 170 45 -227 164 288 -47 -46 166 160 -11 153 256
4752 256 -106 65 52 -68 26 207 5 -28 42 69 -29 60 78 -40 -223 -16 -93 -221 -45 -43 -31 -9 -64 -86 124
4777 124 7 -48 9 80 42 67 0 63 82 20 121 -107 -52 94 76 71 105 15 4 -153 80 100 -132 154 -103 -96
4803 -96 -95 -146 4 59 34 82 -137 -150 -62 10 18 -228 93 -22 -39 111 -22 -77 -159 -74 -129 93 -47 -99 185 198
4829 198 22 -23 -107 -108 18 101 -28 -118 14 111 -39 156 -27 -164 -80 194 5 58 -155 91 20 1 11 50
4853 50 -28 -141 64 -45 -191 22 -58 10 17 -91 90 86 91 1 12 104 58 32 139 90 15 112 30 24 27 12 -25 103
4881 103 -12 -68 -8 -78 -36 -177 -95 -31 -26 -242 -75 173 -55 -47 -15 -136 -235 63 17 12 45 -180 45 52 41 109 8
4908 8 -29 42 134 -71 169 -23 -33 -171 102 82 -65 -103 -6 -86 103 3 73 10 -163 -132 -46 213 -171 59 22
4933 22 8 -111 104 -65 129 110 -125 52 -32 -134 -18 -196 -113 25 -91 49 103 -91 -84 115 36 -26 -40 20
4957 20 -41 -37 47 -40 -162 -60 -76 175 1 11 -22 114 103 64 -83 153 175 -80 2 43 39 -43 -15 -16 -90 -170 13
4984 13 -8 -58 -38 -76 -90 73 -20 -139 10 -61 29 -42 -121 1 74 188 -85 120 48 50 102 50 98 -32 -56 -140 -111
5011 -111 -6 47 88 -113 -137 -157 147 -36 66 98 -44 74 28 90 -202 -42 -18 228 11 88 -51 -153 63
5034 63 -30 -18 -21 102 -59 -30 -211 13 13 -133 91 15 210 110 -32 -76 -234 -13 -108 -90 72 -34 -21 80
5058 80 -42 20 -52 -64 -23 -151 70 -218 -19 -43 -34 -150 -22 118 -10 -87 -110 -77 -368 19 4 -89 129 -122
5082 -122 -22 84 105 86 -69 -132 55 -143 83 23 -33 -80 172 82 43 44 -226 -92 58 1 92 2 -224 79
5106 79 -62 -162 8 -74 -47 -25 126 144 41 -147 -38 20 62 22 90 49 -55 -105 -4 -2 47 -39 59 -71 -125 59
5132 59 51 -26 -61 190 -105 117 -81 115 -67 45 129 -134 -184 -69 -50 0 21 21 -54 -13 -9 -100 -32 114 -7 -117
5158 -117 -165 123 0 -56 117 -42 64 -18 -41 -90 19 74 -85 89 114 142 -46 -105 86 -110 123 137 55 -91
5182 -91 53 -26 41 129 6 -24 193 -54 -19 -14 163 -12 -31 -131 59 6 -84 60 -277 -177 -57 47 -70 -29
5206 -29 11 -235 -141 138 -192 -41 -86 57 -38 -9 109 -137 32 160 79 -15 33 -99 15 -15 25 7 172 57
5230 57 4 -119 160 -27 -139 80 78 -14 -39 29 -82 -67 -106 119 82 32 63 -38 -33 93 -148 -1 3 -48 -46 20 111
5257 111 -29 -14 24 -38 -66 161 -7 71 -76 66 -33 -81 26 -54 -158 -123 3 -81 -71 -84 -107 -43 -25 -27 -70 -161
5283 -161 -121 -14 -76 -20 -11 71 31 9 -49 -86 -7 -73 -136 -133 -26 -27 -116 5 -74 -88 23 98 5 -78 106 118 23 -58 57
5312 57 -66 -48 -7 18 -4 12 55 -78 -22 44 -80 50 -142 137 -33 70 -29 51 14 42 54 22 195 -82 28
5337 28 94 57 -64 -4 -121 -72 59 -52 40 -88 -67 8 -41 178 41 183 12 -134 -37 -87 -29 77 -122 -97
5361 -97 -22 -124 8 65 56 -19 6 -116 14 -72 -36 -129 -170 97 120 34 125 -23 -42 142 -57 121 -64 -43 17 -54
5387 -54 -54 19 7 -24 -9 -7 3 96 -166 31 79 -100 -123 67 -5 36 -108 54 99 22 145 121 15 -37 -10 63 -34
5414 -34 -91 108 -131 15 -91 -21 80 44 15 13 -50 89 -22 -242 82 78 131 -161 66 98 10 80 8 65 39 55
5440 55 11 -44 -6 -24 -46 164 151 91 -11 15 72 105 -65 106 61 45 87 76 99 -117 -22 34 65 -104 -33 62 7
5467 7 -54 -135 -22 -91 -66 -38 -41 126 30 -22 102 57 -179 -50 -93 156 -11 2 -92 -6 93 -49 -8 19 -113 168
5493 168 18 -27 -84 78 -24 -67 -153 -49 16 -25 -123 -54 11 -158 162 105 146 -10 -2 -31 -3 24 48 -27 -181 -42
5519 -42 29 54 -34 -47 -50 -3 11 75 30 13 148 -26 -28 -107 -142 -185 39 -126 -54 -88 53 -48 -8 -145 62 -34 -146
5546 -146 -99 -75 46 -22 -48 -66 0 -38 10 56 43 -12 10 -120 -3 66 -52 28 44 -2 21 70 13 -190 -17 233
5572 233 -189 -60 129 9 -97 124 98 -55 59 10 -46 59 52 -24 -60 -35 -29 -2 107 163 2 187 53 9
5596 9 56 -67 -50 3 -98 -26 -18 177 35 33 -55 32 47 -111 -89 3 8 -64 41 -6 47 -31 18 -242 23 -220 -5
5623 -5 -171 88 148 116 22 -52 72 -87 151 -24 -89 29 -50 -11 -43 -19 -19 51 -115 155 -191 -8 -26 -39 -44 -57
5649 -57 -12 36 -5 -94 -125 -182 57 64 -19 20 -128 -170 178 98 112 19 15 27 32 -63 176 -39 104 128 25 41 0 -132
5677 -132 -52 29 14 4 -100 32 -45 -141 15 222 -77 -146 29 -17 -7 228 -12 -44 -5 27 -80 72 144 -101
5701 -101 -71 95 61 21 55 -36 -74 -41 206 137 12 16 17 -22 -82 70 -107 -123 2 30 -69 -39 -10 53 150 -75 102
5728 102 62 7 -10 -76 175 98 -58 -14 -165 -33 45 -16 94 70 -82 -114 -61 59 86 41 -24 24 46 -65 -73 80
5754 80 244 44 -100 -77 -10 -150 -23 89 223 128 -43 -35 42 -8 30 -77 14 -31 -113 -177 15 88 -18 -133 -35
5779 -35 7 -117 -26 -12 83 41 -195 -4 -5 -30 92 81 60 -17 110 39 8 -22 118 14 161 34 -3 84 -90 25
5805 25 -73 -89 18 -7 60 -112 85 -111 148 51 -126 83 -55 49 -7 -26 -5 -88 -40 247 -77 111 -141 20
5829 20 -51 -84 -12 -21 -32 -27 -13 -253 31 133 34 -161 91 -85 69 41 -144 90 -84 -56 -77 47 -35 1 66 70
5855 70 -25 -104 -33 130 55 30 -26 -64 -139 -99 16 101 -154 56 -10 120 3 -143 93 -6 -9 -169 -156 -52 -38 -38
5881 -38 -76 122 -4 -57 -154 81 -74 -113 64 66 -95 -66 94 1 -48 25 49 20 -135 -5 195 -10 74 -139 47
5906 47 104 17 -122 7 25 -5 -35 96 -40 -71 74 -54 -11 -74 43 144 -45 37 -55 -176 36 -29 -56 -138 41
5931 41 137 -143 -111 -6 -9 24 -20 42 103 161 220 60 83 -7 70 -15 88 -66 9 -55 148 73 4 28 -219 207 91
5958 91 -45 -78 -133 62 -73 265 -17 -3 46 -12 23 120 92 -64 -8 -80 -83 95 98 38 97 2 -50 -53 -100 -5 70 57
5986 57 85 -131 10 105 -127 137 -72 -18 110 114 -140 -66 -123 63 -182 14 50 -1 104 94 -59 -44 146 7
6010 7 -130 -27 116 23 50 -24 81 -86 -81 11 20 133 129 80 35 107 136 -156 -64 -44 -134 102 -56 19 -55 -70 75
6037 75 117 49 -18 -73 12 181 173 -70 88 39 -127 -34 129 26 -124 83 -70 -125 20 -76 -61 90 -126 14
6061 14 -79 53 37 -143 -23 139 -5 -25 186 -81 7 -11 12 -113 -17 -7 31 -113 9 123 -70 -24 37 56
6085 56 -26 44 -64 -119 -122 -30 9 -119 24 7 112 -34 35 38 -47 80 -164 -29 125 59 -126 25 54 84 -5 -16
6111 -16 -29 -68 148 -7 191 -124 94 18 72 194 -46 -15 38 105 36 63 -73 -25 103 113 30 -4 -51 -144 -73 19
6137 19 -36 -57 -9 -76 -7 81 -21 13 -46 83 67 4 -170 117 -1 -13 36 41 97 -87 -11 -193 -16 -60 -192 -11
6163 -11 256 85 -199 42 -143 -19 15 -15 71 -145 168 -41 108 36 40 77 -225 50 -97 36 34 -131 -20
6186 -20 -124 34 44 -50 59 42 57 -34 -10 -53 -28 139 -33 -172 -55 -106 19 165 -57 48 30 188 -65 -57
6210 -57 -8 52 11 -43 -69 -10 7 158 -28 -71 -37 -62 -38 46 -36 -156 -1 -86 -46 26 39 -32 77 38 -39 -21 -53 47
6238 47 137 -30 78 -61 93 84 32 -15 125 56 -158 -79 -133 84 8 -18 -8 110 88 183 8 -54 -35 -64 -65 -29 75
6265 75 -55 -229 -20 -72 -14 -97 25 -16 -3 -67 53 -13 -74 28 -17 144 123 -8 -84 -45 28 89 52 25 -47 147
6291 147 42 -111 -41 11 8 17 66 -112 -45 -8 74 -60 -35 23 -219 -37 0 -17 32 -15 32 106 -100 24 14 -31 50
6318 50 33 129 -90 -57 10 54 10 -26 57 50 167 132 -76 144 -45 138 -60 53 -85 108 -24 73 51 -64 48
6343 48 -77 -72 -29 208 -82 -85 35 86 -6 -33 -17 -30 63 60 136 -52 -118 41 -22 0 -3 -61 -12 13 -94 72 -90 35
6371 35 -81 -24 -80 -69 17 30 13 -14 -40 -97 106 228 -101 -1 104 155 -62 -47 93 34 -146 4 -147 177
6395 177 -57 -31 81 -64 -18 -51 53 11 41 -95 -101 60 59 8 -75 231 152 35 148 71 -90 -109 37 100 -1
6420 -1 -76 15 -104 44 27 -74 93 36 -117 4 -86 157 53 107 -26 -52 -57 62 -102 -142 -55 -50 -104 -37 80 -65
6446 -65 -136 1 99 -20 -77 260 81 -34 -156 73 -59 -73 -166 149 -101 119 21 -12 115 30 81 0 -47 92
6470 92 -34 -88 -26 -81 165 -156 18 -64 -148 65 -16 -34 0 36 -64 -126 176 -216 -32 -103 4 -82 12 -2 -50
6495 -50 79 -89 -137 41 28 -47 -56 -2 91 -33 -137 220 116 58 62 129 -179 -108 -72 -87 -47 -41 20 -27 -107 -65 32 -152
6523 -152 94 9 -18 -59 -84 70 90 -27 76 27 -27 70 58 50 -14 60 46 0 81 -44 148 -31 236 14 142
6548 142 112 -3 -100 -83 -15 -11 -158 -277 21 -61 27 -66 -28 10 2 79 99 46 -71 18 64 154 -83 31 32 -87 -92 81
6576 81 -174 5 24 37 -29 -72 -8 -99 -28 156 -41 11 68 -61 -81 -109 30 -72 -9 -103 26 -88 31 41 -120
6601 -120 126 44 70 24 115 32 -18 23 44 -99 159 -113 -149 -154 -157 41 -79 -126 -90 47 89 143 51 55 60 33 40 115 -52
6630 -52 107 -56 0 -1 -169 -49 -19 180 -33 -7 175 -34 -58 -129 -81 173 -92 -98 -79 61 64 141 -137 131 -24
6655 -24 -98 48 34 -67 -75 -40 43 40 42 14 18 111 87 -101 -107 -96 -54 -71 -89 -163 -79 -65 27 -18 -59 9 -25 -154 5 -32
6685 -32 -55 42 -104 -15 46 100 -148 -78 78 62 -53 186 -43 62 -68 6 60 41 25 -59 16 -48 -113 123 45 1
6711 1 242 68 103 -26 -66 -54 27 -44 -60 87 59 -103 46 -92 55 -14 -18 -63 -91 7 -23 133 -66 -8 -43 -159
6737 -159 95 -9 -126 -59 35 -1 68 -57 68 0 -60 -63 -14 -71 -26 139 123 -81 -75 78 60 55 -11 -2 -86 -57 -136 -12
6765 -12 -60 105 -127 -66 3 23 99 -50 -37 14 -24 122 12 52 -18 21 -53 146 85 32 119 -98 90 99 40 -209
6791 -209 -214 100 -9 134 75 21 -82 -47 7 -57 -130 -173 -192 120 -4 -83 -4 155 67 92 15 -138 -21 -208 108
6816 108 67 89 -27 152 134 26 2 112 99 -12 -54 45 -50 54 4 93 -100 33 -6 -24 -23 68 -15 -19 -36 23 45
6843 45 -95 -5 11 -51 -150 38 -99 -94 85 24 -47 58 30 15 -5 -121 227 96 17 59 29 -15 31 8 36 -136
6869 -136 -41 65 -86 -10 69 -92 -194 -66 71 36 -7 55 -47 -44 -81 -43 -95 -71 113 -137 -19 36 -67 30 -27
6894 -27 71 36 111 44 34 65 44 81 -170 -129 -109 18 -107 -212 -102 -4 -9 53 -33 -150 -30 -33 123 145 103 12 13 15
6922 15 -108 -39 -11 -92 -90 -112 86 -50 -36 87 -87 -111 82 -88 -30 31 117 137 -72 -74 62 87 128 -80 167 -32
6948 -32 47 99 82 117 56 51 -10 -12 -125 -103 -206 -152 37 4 -14 -125 -96 -112 -96 -8 -50 -178 74 -125 -36 -116 56
6975 56 32 -65 -4 -22 -104 104 -63 146 77 -10 -142 -21 -52 -151 -50 20 -40 -28 17 -56 4 -65 111 -10 85 177
7001 177 -196 -40 -46 100 -13 61 -20 -33 -10 7 23 140 -133 142 -157 86 -36 18 16 -94 -37 -38 32 -37 -27 -35
7027 -35 -25 -47 -1 -76 -98 127 12 11 23 -49 45 94 105 26 153 -38 56 0 -101 -120 -64 -24 130 39 -80 -21 -106
7054 -106 7 8 48 -31 -155 -14 46 -66 10 31 94 98 110 -40 -49 -41 -21 -30 55 146 -92 79 49 -9 151 112 69 36
7082 36 67 -9 -43 -13 -93 -58 190 33 83 76 53 32 11 -4 -3 -39 -111 21 69 -52 -36 -127 -79 38 -49 -64 38 90
7110 90 -31 -77 88 -151 75 39 128 -42 36 78 11 144 44 -77 15 -20 -26 -58 19 -18 39 80 -32 103 -3
7135 -3 7 164 65 91 18 69 27 -110 -18 -38 -103 87 -71 9 -3 -40 62 33 -131 19 -82 107 -46 -116 12
7160 12 -62 21 84 12 -66 -232 58 -33 24 111 28 115 81 110 50 -13 -3 2 80 -35 -7 -148 26 172 -74 25 -74
7187 -74 77 -43 93 1 -74 36 130 -46 -213 -60 60 -102 -16 -27 -22 -161 25 6 -87 -5 38 -22 -131 75
7211 75 17 59 37 -89 -101 -37 -139 -93 140 -44 37 -52 -15 -101 89 39 56 -61 3 75 90 -78 -107 3 10 -87 33
7238 33 52 9 33 -21 105 -40 162 72 52 -123 -12 -240 -25 -41 -118 101 165 -63 -63 -33 62 -262 9 136 -96
7263 -96 52 12 -37 7 3 -121 7 27 80 90 -96 90 147 -85 12 35 4 55 -2 -27 -30 15 24 -70 80 -59 -10 179
7291 179 41 -53 58 0 94 59 -12 3 -69 -46 -23 -39 -35 -82 103 30 46 -104 -42 -10 34 8 36 113 -29 26 -116
7318 -116 -31 53 -91 -153 28 37 101 84 -111 104 -61 -101 81 170 -36 -15 -22 16 5 170 11 6 -6 -131 -40 49
7344 49 -10 -66 -129 -51 139 2 14 -65 121 172 18 79 -16 70 -104 -40 23 -45 -22 -49 -2 56 141 -51 69 -173
7370 -173 35 -61 16 31 -7 -77 -25 109 -36 -13 -30 81 -38 -44 127 67 111 23 76 54 16 12 68 158 -33 9 -89
7397 -89 -15 132 26 -17 138 21 -172 49 114 -86 49 -84 91 -101 -15 -38 189 -11 -162 40 -18 -131
7419 -131 -195 -102 17 101 70 -84 -178 -3 -6 -34 152 68 56 -111 92 -80 38 -37 27 -70 44 -38 57 91 3 -139
7445 -139 -81 108 78 74 6 -62 31 -64 -32 113 -59 138 175 -67 76 12 146 6 9 -7 -144 -74 -69 -103 99 68
7471 68 60 -36 17 -5 41 102 -8 48 -24 -25 81 4 -46 -143 -97 13 50 7 -74 -61 138 13 41 -91 -101 -30 -51 115
7499 115 138 60 -33 184 -22 -168 -158 187 -73 -29 -99 112 -183 -42 -113 115 -155 52 43 -39 -81 36 122 120 -9
7524 -9 -3 147 -83 100 37 33 23 42 57 -180 -13 55 -52 -33 -62 16 21 42 -178 60 -46 -43 20 135 -74 -18 71
7551 71 -67 72 -28 -56 -13 187 41 -33 11 12 28 39 -47 -103 15 18 62 106 -52 -21 -60 -124 -43 28 12 -42 -82 97
7579 97 -36 137 42 12 -107 134 31 45 18 -31 107 -67 85 88 19 182 8 -56 22 19 48 23 55 61 102 -61
7605 -61 -89 16 1 152 -72 -76 117 -29 162 70 15 3 -28 89 106 -144 23 -88 100 -21 -190 -142 -40 109
7629 109 93 1 -159 -24 -16 122 10 163 -11 -37 92 -97 -108 -138 -72 -3 14 -59 104 116 -30 -103 24 121 -88
7654 -88 -102 -158 10 16 75 -3 43 84 67 94 218 -9 -47 -137 14 63 108 19 -73 7 35 -76 -59 -37 81 152 12
7681 12 -170 -75 -146 -20 60 -10 -122 -69 -31 -66 -24 -6 245 -11 -138 -113 -43 58 28 -58 -82 54 -33 63 11 115
7707 115 90 44 15 -161 55 106 42 -126 51 -2 -44 59 -53 95 -6 75 58 66 -103 38 112 39 -122 -144 66
7732 66 -20 -41 -16 77 51 -81 181 32 28 190 130 69 135 51 21 -66 4 -66 -86 4 8 -38 -38 -13 49 -2 71 57 36 -34
7762 -34 103 79 45 -29 -136 -8 -9 -21 -83 -12 26 93 79 60 -143 158 7 90 18 41 -24 75 -222 21 -188 23
7788 23 -158 -19 -56 267 174 -5 125 109 10 -71 -58 -103 109 75 161 -109 -26 46 -86 -128 -145 83 -79 39 -31
7813 -31 -56 109 -47 -49 57 73 160 16 5 -15 44 -70 -56 19 13 6 45 -71 -70 133 63 80 -8 -31 -88 -78 -139 170
7841 170 17 -238 71 -11 85 31 86 -105 12 150 144 38 -206 -107 161 -81 20 174 -12 -15 19 126 -39
7864 -39 -201 -33 -94 88 -77 -30 99 -121 166 7 -84 -102 -84 -86 -8 -44 -88 137 -12 122 211 -88 51 155
7888 155 -41 85 -59 46 140 50 60 -18 37 -6 158 130 151 -2 2 -4 115 -75 -33 -102 107 -136 97 -70 5
7913 5 60 71 -7 4 18 79 103 32 -7 -146 -45 -42 -10 0 94 -15 -11 -39 -81 -100 21 90 -172 -42 49 -21 134 115
7941 115 113 76 40 89 65 261 -69 -51 -104 105 40 -182 -70 -14 125 6 134 -165 50 -116 52 -84 -29 -48
7965 -48 30 59 -75 10 21 10 -125 54 -25 -110 -35 -59 11 18 -1 -40 14 155 -55 28 -5 50 2 11 31 -25 -47 28 16
7994 16 18 -76 27 28 -17 -64 19 -128 124 -17 -37 57 -4 -90 -62 64 58 -7 91 -106 18 -47 157 9 -127 -141 -85
8021 -85 -146 -65 -132 -57 -142 -157 96 -58 -38 -197 -37 -81 -104 -56 120 -136 8 79 63 -184 -22 25 -23 34 -10 -17
8047 -17 -138 -15 124 -53 -135 -47 -185 -11 -6 127 35 -64 20 -22 -242 -90 161 78 81 -66 -11 -70 43 -62 -5
8072 -5 -91 15 -78 -26 -94 -59 -120 14 -152 -46 111 43 -46 40 -56 -40 -35 -53 -53 -50 140 61 31 -16 27 67 -3 33 88
8101 88 189 53 119 115 50 4 177 44 38 247 126 -81 -67 17 144 -151 17 -95 -15 -83 50 53 31 -45 -119 -58
8127 -58 -71 -100 -123 16 -26 -32 127 68 32 94 -26 -45 4 56 -11 8 89 79 73 5 104 -106 47 105 128 -177 72 -15
8155 -15 -14 -5 57 -6 2 -54 -103 -5 -25 -83 88 -75 -140 -109 -82 56 -72 -34 44 73 -56 -88 -40 48 -106 -26 -66 81
8183 81 -137 50 43 -98 -2 -64 59 40
8191D0
$$ Imaginary data points
##PAGE= N=2
##DATA TABLE= (X++(I..I)), XYDATA
0 0 0 0 0 0 0 0 0 0 0 0 0 0 0 0 0 0 8 -8 8 -8 8 -8 15 -16 16 -20 24 -24 32 -32 40 -46 49 -56 64 -71 79 -89
38 -89 100 -110 124 -136 151 -167 184 -205 225 -247 273 -299 331 -364 401 -444 491 -546 609 -678
58 -678 765 -868 993 -1150 1355 -1629 2021 -2623 3651 -5723 11488 -59089 -188519 3637
72 3637 47203 -31980 69946 95272 -94908 -91184 51243 4979 -24179 96972 38200 -105089
84 -105089 -16238 59870 -51962 -22025 105599 13478 -87672 17966 34152 -70134 -2327
95 -2327 88987 -9658 -42459 37283 -31221 -93972 43168 89609 -27593 -19253 26615 -69040
107 -69040 -60369 91505 72081 -37080 2220 8596 -78299 -11734 99464 24107 -41687 15021
119 15021 -12980 -69332 22797 76095 -18310 -34737 23640 -23732 -49589 37551 34235 -45343
131 -45343 -4818 42951 -25500 -34505 38380 12796 -31979 28361 37277 -38958 -20626 33067
143 33067 -7248 -12410 45710 7827 -54817 -4862 29438 -15282 675 38846 -19146 -51852
155 -51852 10967 23458 -14645 9554 21001 -30585 -24187 29101 11035 -17165 15276 11849
167 11849 -29775 -1762 33730 -6995 -21622 19047 7989 -20456 11984 20412 -24715 -15589
179 -15589 25940 4321 -17455 7931 -567 -25386 7820 27450 -9933 -15508 9235 -6259
191 -6259 -13283 22003 17213 -22391 -11073 13369 -5253 -4868 22946 4700 -24991 -4138 14512
204 14512 786 4212 10834 -15045 -19646 14818 16883 -7951 -2907 505 -16145 -917 24696
217 24696 3066 -20285 -2710 5045 -6071 7224 15646 -10394 -17595 5018 6488 -339 10874
230 10874 3746 -18875 -8680 13759 8909 2068 4657 -11013 -18491 9520 23465 -695 -11920
243 -11920 -3901 -6248 -1742 15818 9484 -13350 -12464 -285 431 6790 10986 -7356 -17007 243
257 243 7958 1576 6662 5589 -13061 -13387 9350 15721 4057 -2924 -8729 -10019 6093 16367
271 16367 3826 -6419 -5442 -6992 -829 14327 10267 -11306 -14126 -583 3898 3489 5397 -2559
285 -2559 -11699 -5930 3246 6799 7800 -288 -12168 -7955 7500 9353 1896 -431 -4399 -8006 2024
300 2024 13214 6775 -4985 -7380 -3574 3262 8818 4418 -5321 -7866 -4514 -1091 5503 7063 -4222
315 -4222 -10860 -2286 4627 4090 3565 346 -5929 -4142 4315 6731 2477 -2017 -5673 -3528 5149 7234
331 7234 1228 -1359 -1624 -4282 -803 6267 3456 -5192 -5517 -1045 503 2635 2443 -3434 -5621 66
347 66 3585 2869 1412 -3560 -6599 -731 5661 2881 -1663 -634 -455 -366 3986 4366 -1124 -2492 575
364 575 784 1024 2235 -994 -5036 -3127 986 2204 2604 561 -5041 -4882 1931 4663 1105 -2583
380 -2583 -3648 -2244 2318 5444 1455 -4574 -4253 1204 4900 5132 683 -4534 -4567 12 3806 4249
396 4249 1791 -1776 -5024 -3189 3618 6173 1221 -4049 -5041 -2746 1656 5427 3265 -5090 -8561
411 -8561 -2057 5160 5922 1337 -5091 -5956 458 5223 3759 1055 -1475 -4910 -2108 7171 7052 -3017
427 -3017 -5965 -1812 57 2792 6616 1900 -6867 -7623 -1416 5219 8857 3039 -9236 -9755 1385
442 1385 5412 3906 4455 -2068 -11588 -4590 9478 8539 -606 -3456 -5058 -4195 4650 8372 1400 -2931
458 -2931 -3518 -5511 1086 10331 3145 -8202 -4267 1813 -995 1823 5449 -3988 -9188 866 5962
473 5962 1749 759 -2702 -7800 -205 9189 3587 -2896 -1234 -4411 -4866 8523 12311 -2548 -8235
488 -8235 -1940 -1026 2277 10076 4075 -9147 -7729 -994 547 6406 7805 -6029 -11477 -159 2984
503 2984 -849 4843 4357 -8225 -7492 4544 3155 -998 3117 208 -4590 3028 4782 -4508 -1620
518 -1620 6183 -51 -1752 6468 -92 -11144 -1089 9179 2263 -494 1347 -7494 -8957 4393
532 4393 6982 583 2279 -1700 -12330 -4031 10474 4865 -2158 3366 -2261 -10953 1155 10509
546 10509 756 -1725 4321 -2490 -6402 3603 3336 -3214 4258 6811 -6052 -6320 2172 -3074 -2997
561 -2997 10148 5293 -10339 -5811 1183 -3783 2292 12742 1232 -10927 -3470 -19 -2519 7582
575 7582 10377 -5082 -7940 1885 -503 -1440 9345 5600 -7878 -2320 4904 -4281 -4522 6531 1374
590 1374 -5553 3041 2473 -8951 -3893 6452 1682 800 5496 -4158 -12522 228 7861 1660 4098
605 4098 4300 -10019 -10636 6848 10137 2204 3075 -241 -11063 -5021 8758 5079 -1429 966 -3898
620 -3898 -8265 2677 7618 -2454 -3476 3655 -1497 -5647 3876 2720 -7849 -2329 6624 1224
634 1224 -1908 1602 -3318 -5050 6419 8759 -1579 -2359 -406 -6653 -1708 12065 6771 -7307
648 -7307 -5156 -570 -2620 3639 10003 543 -8684 -4271 -662 -216 5781 4007 -7463 -6351 3542
663 3542 1689 -1072 4593 1087 -7791 -1113 7985 1323 -4156 133 -1033 -2833 4783 5458 -3161
678 -3161 -3246 604 -1037 1740 6805 -952 -8889 -1215 3884 -896 675 3790 -4598 -7856 2436
693 2436 6442 928 -359 -750 -4915 -1312 6085 3316 -1434 20 -1788 -3427 4147 7171 -2183
708 -2183 -5232 1448 1435 -1487 2401 1966 -5104 -3820 2206 1379 63 1091 -2431 -4483 1334 3565
724 3565 -540 -683 889 -2621 -1990 4605 3943 -2730 -2387 840 576 1716 3257 -667 -3742 59
740 59 2331 552 1169 1090 -3358 -2677 2739 1538 -2060 -670 -221 -2813 -431 2956 158 -2561 -736
757 -736 -175 -249 2611 2010 -2252 -1934 1489 1525 1381 2177 -572 -3120 569 3617 919 -1318 -705 -1653
775 -1653 -1471 1901 1829 -1601 -2641 -1197 -458 977 1886 -841 -2888 -641 556 633 2148 1117 -2854
792 -2854 -2549 1926 3218 892 -52 -966 -2218 392 3257 2153 -969 -2226 -2193 731 3291 1126
808 1126 -2232 -2243 -1292 -760 1668 2932 -1044 -4496 -2042 1934 2639 1171 -740 -2206 -1477 1000 2528
825 2528 2515 207 -3093 -2268 2320 3926 742 -1359 -1147 -1902 -983 2743 2914 -1022 -4143 -3024 749
842 749 3131 1622 -2007 -3379 -1160 344 2059 2903 -277 -4098 -2030 2810 3613 1081 -927 -1704
858 -1704 -1306 913 2660 2173 430 -2231 -2790 541 3789 2185 -1707 -2688 -1693 -426 1847 2669 -762
875 -762 -4249 -2663 1216 3123 1493 -1873 -2995 -749 1638 1526 1157 531 -1454 -2142 1001 3333
891 3333 1668 -919 -1275 -642 199 1600 2364 412 -2568 -2984 213 3197 2087 -1932 -3435 -1228
907 -1228 1172 1039 668 -75 -1856 -2036 618 2736 799 -1614 -789 448 434 567 919 613 -687 -964
925 -964 387 2030 1671 -936 -2222 -248 1471 391 116 -447 -2597 -2457 1089 2834 -22 -2137
941 -2137 -1299 -234 887 1485 495 -848 -256 -37 -115 1302 1525 -671 -857 1284 886 -469 851 551
959 551 -1419 -363 1591 273 -1426 -752 -742 -366 1501 1080 -1978 -1994 -23 116 509 2186 -595 -3025
977 -3025 -494 1876 626 713 1098 -1404 -1962 1906 2554 -244 -42 -250 -1404 624 2918 -277 -2381
994 -2381 -182 -55 -795 1380 1424 -2718 -2624 971 322 -299 1773 -189 -3339 -932 2139 824 733 877
1012 877 -2506 -2311 3394 3590 -1389 -1063 309 -1561 469 3831 49 -3892 -856 1413 28 1320
1028 1320 1084 -3228 -2696 1865 519 -476 2572 -5 -5762 -1462 4592 1692 -467 819 -2182 -4361
1044 -4361 2379 5383 193 -1516 -603 -2287 632 4844 217 -4132 483 1688 -2726 8 3660
1059 3660 -1847 -4145 2327 2204 -2290 455 1448 -3387 -1614 3519 968 -1323 934 -2215 -3793
1074 -3793 4457 6759 -2318 -3652 1428 -985 -957 5412 2581 -5545 -2930 1857 -380 450 3945 -1535
1090 -1535 -4534 1193 1291 -2569 1933 3163 -4930 -4377 3754 1869 -2692 1508 1197 -3765 511 5334
1106 5334 -752 -2845 1723 145 -1633 3666 2280 -5067 -1676 4569 -20 -1750 3672 271 -5487
1121 -5487 383 3914 -1501 -1304 1857 -2789 -3726 3370 2537 -2793 304 1621 -3620 -416 5950 272
1137 272 -4375 1257 1611 -2779 1218 4458 -1859 -3053 2428 597 -2071 2302 1423 -3878 -244 3671
1153 3671 -1993 -2825 2590 -252 -3452 2185 3234 -3763 -2301 3382 -22 -2010 2726 936 -3489
1168 -3489 453 2801 -1318 -294 3350 -1132 -3268 2369 2259 -2086 850 2088 -3295 -2134 3937
1183 3937 668 -3755 -52 1674 -2210 -29 2238 -2168 -2720 2761 1242 -2184 396 807 -2321
1198 -2321 415 3652 -813 -2313 2302 713 -2960 1133 3738 -1035 -1757 1179 -640 -1435 2515
1213 2515 1646 -3041 -1578 1138 -161 155 1691 -2045 -3254 1804 2736 -1818 -1410 1444 -786 -1178
1229 -1178 2487 1420 -2011 -148 1222 -765 592 2650 -150 -1990 369 185 -631 2053 2041 -3084
1245 -3084 -3042 1871 1783 -622 -122 -681 -2669 -109 2520 365 -1296 -262 -786 -566 2198 1671 -1778
1262 -1778 -881 1427 -338 -531 2522 1447 -2285 -1384 1154 1108 731 589 -1528 -1954 434 1253 236
1279 236 656 -1166 -2736 -280 2854 620 -1963 -764 149 -824 434 2111 103 -1618 -802 362
1295 362 1303 1546 -28 -1204 -310 668 282 738 1070 -1187 -2459 452 1930 353 -945 -551 -723
1312 -723 -658 526 882 -137 -1008 -1417 -435 1671 1383 -725 -994 63 481 704 1297 640 -1036 -963 672
1331 672 1122 352 -406 -786 -318 588 501 224 81 -486 -1146 -449 632 222 -559 -1030 -857 -267 814 1055
1351 1055 105 -798 -416 597 1358 814 -714 -1149 70 856 304 -125 -114 -168 308 843 416 -17 -577
1370 -577 -340 -310 -172 -312 -129 -210 -766 -585 42 1070 898 -319 -1051 142 1122 779 -218 -669 -905 -137
1390 -137 1287 1253 -397 -1095 189 1180 694 268 -337 -947 -635 -7 -142 -62 99 -865 -1069 574 824
1409 824 76 177 -5 -1134 -939 1595 1513 -1177 -1380 -33 426 1221 1403 -420 -1200 329 939 484
1427 484 863 -36 -2385 -1097 1704 372 -1291 487 153 -2170 -245 2226 579 -1255 -688 -825
1443 -825 -669 1566 1303 -1432 -642 828 -382 525 2882 59 -3006 574 2663 -324 -541 1309
1459 1309 -1424 -2434 1394 2084 -867 -330 -210 -2375 29 3367 -64 -2308 335 -36 -2334 1221
1475 1221 3504 -1561 -2592 1456 624 -936 2009 1637 -2540 -673 2117 -534 -337 2502 -749 -3502
1491 -3502 1875 2900 -2047 -1192 1694 -1251 -1959 2777 1275 -3353 -1033 1191 -1350 348 3078
1506 3078 -1404 -3146 1578 1184 -1823 1946 3120 -2859 -2629 2973 1088 -1742 2037 1328 -3256 -378
1522 -378 2979 -823 -1376 1736 -924 -2498 1976 1511 -3428 -650 3129 -1159 -2271 2423 224 -3666
1538 -3666 1019 3170 -1508 -779 2353 -1107 -2399 2620 2062 -1619 859 1264 -3099 -652 4075 97
1554 97 -2795 1042 691 -3299 494 3133 -1599 -2230 2013 -52 -2758 1067 1813 -1862 195 2263
1570 2263 -1759 -2004 2601 1045 -1757 1754 1985 -2603 -1317 2893 196 -1198 2444 509 -3572
1585 -3572 -192 2451 -376 -429 1672 -1602 -2896 1606 1744 -1713 158 1507 -2126 -1527 2482 448
1601 448 -2260 1099 1369 -1955 -114 2367 -746 -1374 2087 978 -1666 605 1013 -2097 -267 2863
1617 2863 -133 -2247 626 -6 -2068 949 2785 -1262 -2459 224 -77 -769 2013 1409 -2345 -1211
1633 -1211 1091 -439 380 2649 -228 -2990 441 2324 -615 268 2117 -1060 -2186 1387 1512 -1127
1649 -1127 -193 114 -1475 -278 1868 -455 -1746 687 164 -1602 1222 1921 -2097 -1991 1684 1001
1665 1001 -778 948 646 -1972 -446 2058 825 368 602 -1274 -1577 1752 1542 -1245 -407 561 -1715
1682 -1715 -1101 2316 1158 -1780 -1001 346 -561 167 1262 -799 -1505 205 212 -160 1383 387 -1945
1699 -1945 -423 2225 695 -377 814 14 -1575 247 1827 -74 -672 -23 -730 -227 1400 632
1715 632 -1120 -273 -51 -957 -50 1393 -448 -1620 84 486 -201 228 848 -356 -229 721 421 4
1733 4 476 -119 -810 541 1075 -314 -452 468 29 -403 766 774 -804 -954 -80 -241 59 267 -429 -708
1753 -708 89 38 -264 444 644 -346 -434 688 384 -402 107 390 -121 73 393 170 -294 38 68 155 82
1774 82 -307 -689 -8 400 -500 -384 -18 -432 -508 325 556 -257 -331 3 -7 45 445 60 -168 -3 13 547
1796 547 636 116 -536 48 599 324 213 55 -362 -697 -195 466 238 -535 -778 -547 -33 221 154 25 -493
1817 -493 -646 -192 780 771 -390 -900 -199 457 601 659 235 -303 -675 98 790 741 -134 -761 -291 257 489
1838 489 151 243 -491 -1002 -315 537 660 -343 -1012 -697 181 589 373 173 -430 -762 -212 888 1144 21
1858 21 -791 -344 299 644 515 123 -390 -470 -359 323 785 107 -964 -940 -39 251 307 93 -495 -923 -698
1879 -698 539 1178 175 -859 -731 419 969 585 84 -57 -450 -400 482 940 410 -534 -485 134 386
1898 386 308 172 -190 -478 -1003 -253 908 300 -1143 -1088 147 433 289 166 -25 -610 -499 413 844 275
1918 275 -248 -596 62 737 342 -34 289 76 -595 -99 950 214 -666 -335 -251 -510 278 278 -320 -467 -230
1939 -230 -275 107 672 -31 -617 406 721 -346 -350 575 184 -390 555 392 -481 -146 550 -16 -75 803 -294
1960 -294 -891 250 197 -586 112 487 -893 -750 489 300 -576 312 480 -804 -264 553 -106 -227 813
1979 813 125 -647 339 572 -451 64 1330 18 -594 551 80 -895 613 1315 -715 -1110 38 -383
1997 -383 -256 998 325 -1372 -570 202 -487 132 1300 -155 -1152 476 647 -503 341 1384 -377
2014 -377 -1003 542 720 -302 262 429 -1008 -141 1184 -411 -851 220 -212 -727 758 787 -1754 -1140
2032 -1140 1530 408 -791 483 408 -1197 -254 1281 273 -152 833 -435 -1185 1010 1364 -355 153
2049 153 543 -1648 -698 2248 1143 -1731 -645 557 -846 -224 1458 -221 -1488 248 343 -875
2065 -875 595 995 -1118 -728 1168 -97 -819 1397 654 -1846 -280 2114 28 -993 612 -86
2081 -86 -1086 1131 1358 -1217 -798 706 -575 -436 1570 32 -2230 67 1430 -945 -446 1401
2097 1401 -257 -1726 508 1037 -827 395 933 -1193 -603 1826 317 -1096 933 472 -1626 356
2113 356 2191 -610 -1516 1035 250 -1386 440 1000 -1295 -579 930 -469 -905 1179 53 -1582
2129 -1582 620 1401 -1234 -561 1498 -247 -1274 1252 1127 -1157 -165 1186 -572 -483 1233 -111
2145 -111 -976 636 357 -1377 438 1295 -1245 -1188 979 196 -1402 537 842 -1463 -533 1191 -279
2162 -279 -1064 863 696 -848 351 525 -865 1 1626 31 -922 687 174 -1161 390 1184 -777
2179 -777 -637 814 -406 -1058 591 699 -737 -673 236 -457 -29 1234 -9 -1115 10 673 -254 -63
2197 -63 638 -464 -367 1204 527 -1068 69 848 -180 -152 574 -299 -716 486 215 -387 80 537 -809
2216 -809 -692 200 158 -17 742 -63 -1613 -593 1184 769 -245 -163 -395 -583 787 1135 147 -22 171
2235 171 -289 -129 640 346 -470 -99 231 -444 -276 612 304 -957 -584 238 265 217 -87 -542 -470 345 243
2256 243 -120 43 -160 -357 504 1072 68 -672 -82 358 -146 181 443 -17 -739 -256 153 394 600 -320
2276 -320 -761 -168 92 -200 216 111 -716 -1009 40 869 323 -394 -27 106 -236 288 424 154 -284 -386
2296 -386 117 593 457 -185 -316 327 106 -70 300 191 -435 -526 -49 435 -144 -320 -169 -179 -241 55 243
2317 243 309 94 -422 -157 410 425 84 -194 -213 181 165 405 158 -64 -111 123 223 149 -159 -163 107 -32 -254
2340 -254 -360 -48 202 -139 -428 -92 152 -59 -17 -53 -40 -167 215 258 61 -162 132 236 340 -219 -283 257
2362 257 512 90 -514 -117 117 93 77 -285 -283 -287 -108 299 -272 -408 -392 222 181 -149 -168 188 104 -60 -215
2385 -215 136 424 88 74 48 68 80 417 278 -297 -401 -119 460 338 -324 -580 -216 78 -3 3 -116 -164 -385
2408 -385 -21 332 151 -142 -201 55 -133 46 475 588 80 -337 -21 425 715 94 -179 -152 -199 129 315
2429 315 97 -422 -440 -163 339 62 -323 -408 -211 -141 -197 402 388 -217 -514 72 415 362 96 -8 -232 149
2451 149 200 513 592 -47 -577 -328 471 464 -2 -206 -198 -241 -177 303 193 -318 -577 -420 -74 441 193 -416 -253
2474 -253 201 125 219 426 117 -344 -417 351 305 -29 -146 -210 -22 183 129 264 145 -303 -875 -150 785 140
2496 140 -528 -340 -78 -151 278 739 -72 -533 -184 248 380 186 -64 -40 31 186 -59 172 549 91 -629
2517 -629 -14 714 -77 -74 249 -113 -368 -23 240 -299 -472 -232 -45 162 146 -353 -324 162 501 -130 -131 340
2539 340 -176 -396 309 393 -302 288 528 -178 -439 407 428 -6 -135 99 -395 192 549 -337 -458 218 -4
2560 -4 -474 78 434 -347 -37 436 -129 -586 138 296 -309 209 287 -414 -95 501 -58 -427 258 523 -222
2581 -222 -46 534 -316 -373 450 35 -594 268 360 -638 -569 189 -29 -146 525 87 -825 5 538 -310 -161
2602 -161 728 -126 -675 577 384 -410 179 549 -419 -273 603 116 -304 329 138 -381 160 506 -504
2621 -504 -488 575 -59 -431 485 337 -877 -509 642 60 -376 362 206 -659 148 569 -22 125 257
2640 257 -302 -329 843 387 -614 -54 596 -534 -406 670 20 -1009 39 328 -201 -144 354 -321 -434
2659 -434 304 18 -98 482 -10 -936 8 764 245 -342 378 63 -567 172 987 -62 -454 -35 -146 -226
2679 -226 292 80 -308 -7 219 -356 -201 786 41 -818 -39 445 -332 -104 320 18 -381 447 514 21
2699 21 -104 187 -95 110 692 -108 -501 144 272 -569 151 606 -290 -468 350 141 -198 145 126 -558 -264
2720 -264 73 -72 -79 461 -135 -602 390 666 -145 -157 452 -60 -564 251 249 -268 -20 444 -58 -2 397 -178
2742 -178 -238 362 -15 -506 49 369 -337 -485 403 -42 -236 103 216 -193 -183 283 -31 -91 214 150 -122
2763 -122 345 149 -340 58 474 -90 -147 297 73 -302 -139 169 -421 -293 230 -42 -319 52 -12 -100 44
2784 44 130 -108 223 146 -207 -161 334 387 -78 -72 430 -255 -18 353 256 -257 -98 -49 -35 108 -62 -145 -193 -117
2808 -117 -123 -115 159 -90 -227 -181 156 35 -22 105 -38 -175 -77 236 211 137 -116 27 148 223 86 -89 -133 -113
2832 -113 3 185 109 -82 -384 -70 56 -119 52 -71 -232 -28 -227 103 63 -31 -183 -246 -83 234 182 146
2854 146 -36 6 -66 117 445 -12 -328 -157 134 89 -84 -32 -63 -141 -134 -40 95 90 -243 -459 18 189 113 -364
2878 -364 -71 -122 -230 -48 379 192 -386 -209 137 444 -64 76 78 95 30 127 298 88 -328 -436 133 186
2900 186 -145 -121 52 15 -336 -75 279 52 -198 -449 50 180 135 9 80 46 -18 -64 331 356 -95 -164 158
2923 158 170 213 128 49 -69 -115 116 233 56 -88 -264 -183 106 -7 -255 -115 -112 -135 52 98 3 71 -34 57
2947 57 235 124 83 -39 16 15 -25 -41 179 -69 -285 24 236 -166 -42 46 173 -136 -83 -142 -195 -67 -113 14
2971 14 -39 206 -108 -145 122 87 -284 58 97 31 5 174 127 -203 -9 128 74 88 163 -98 -109 45 -58 -82
2995 -82 -9 -104 -381 -269 109 -67 -59 18 31 -398 91 300 14 -244 79 0 -145 238 56 1 203 241 -257
3018 -257 48 408 -98 -366 160 160 -256 -60 -179 -202 -429 197 327 -154 -52 -306 -234 166 546 -93 -263
3039 -263 66 56 -345 297 544 -262 -274 288 -32 -154 400 280 -356 -354 168 35 -89 -7 -364 -350 295 301 -363
3062 -363 -156 186 -223 -199 450 84 -394 -42 123 -43 169 441 155 -224 113 -40 -82 295 244 -361 -272
3083 -272 378 106 -451 163 114 -435 -57 497 -168 -301 -173 -201 19 260 79 -225 -210 -19 -199 -41 686
3104 686 166 -638 -66 428 21 -72 546 153 -442 188 105 -43 284 137 -255 -102 285 -133 -481 184 56
3125 56 -414 -41 402 -290 -614 258 322 -59 220 105 -274 95 229 124 98 527 -73 -614 239 396 -289
3146 -289 -128 412 -488 -695 218 317 -85 -3 258 -415 -348 350 -110 -124 511 -11 -398 101 252 -311 82
3167 82 547 135 -381 24 140 -279 119 413 -130 -281 139 -134 -258 374 300 -174 -97 58 -411 -159 733
3188 733 254 -302 53 159 -238 44 257 -154 -13 332 -120 -506 90 373 141 131 326 -401 -315 452 404
3209 404 -132 -63 126 -287 -294 183 95 -79 191 -80 -441 -240 211 85 55 9 -91 -339 279 244 -215 56
3231 56 156 37 -185 12 89 -36 107 456 61 -103 -64 -246 135 -59 134 -311 -129 110 -354 2 544
3252 544 177 -306 -261 -62 51 160 85 -93 -277 -108 61 220 203 -42 -132 35 212 70 -276 121 -63
3273 -63 -348 177 222 -152 -314 -77 148 -145 4 106 -164 -33 48 -78 56 255 -159 -369 177 357 66
3294 66 17 215 -32 -405 185 332 114 -301 -258 -214 79 225 -57 -262 18 -278 -180 183 163 -274 -199 -10
3316 -10 26 -137 25 100 -124 -89 2 171 272 148 -47 -110 106 106 -164 -226 12 -196 52 224 129 -142 -321
3339 -321 116 26 -111 -17 -247 6 -8 -155 -156 230 104 -227 70 25 59 51 -76 93 -94 -154 191 320 -129
3362 -129 -141 -101 165 250 -86 -168 -47 -47 -57 -125 -36 -353 -138 81 154 -11 -36 5 -17 -181 -22 218 -12 136
3386 136 -148 -153 149 231 135 -5 -40 -11 147 272 -51 -158 -127 128 123 -16 -208 -57 -211 -61 -25 -1 -62 -27
3410 -27 -75 -15 -51 -28 -7 -3 -12 -46 129 221 182 -117 -25 143 86 115 -132 62 -204 -77 -106 58 -155 -159 -137 44 91
3437 91 -47 -203 -19 222 -64 4 82 -9 -128 182 0 84 45 107 -57 -79 147 62 -9 78 34 -214 106 55
3461 55 73 -81 -92 -32 -139 -133 98 -74 -194 -112 -32 93 74 -205 -219 16 308 102 67 230 47 26 207 191
3485 191 -50 -38 94 65 -54 37 9 -93 -113 -165 -103 199 68 -219 -353 26 149 -133 144 155 -292 -52 259
3508 259 193 125 110 -53 48 11 77 42 98 162 -246 -272 54 142 -93 84 -39 -177 -180 79 -24 -299 -206 82
3532 82 146 -119 31 -30 43 388 64 -230 25 118 -85 29 418 64 -228 221 153 -190 -9 390 -35 -308
3554 -308 -85 -149 -62 254 91 -264 -92 -80 -159 130 273 42 -108 180 33 -127 -62 373 143 -180 37 -268
3576 -268 -93 194 273 -156 -101 227 -7 -188 131 241 -249 -167 -46 -266 -92 211 107 -136 -95 -74 -233 101
3598 101 147 -76 -90 131 -21 -108 283 318 49 -30 -2 -66 -130 378 255 135 -128 9 -324 -185 82 189 -165
3621 -165 61 -133 -322 19 366 94 -4 198 -159 -344 222 440 157 60 -60 -136 -348 320 376 155 -12
3642 -12 -109 -255 31 384 175 -111 69 -104 -376 -111 351 -133 -69 269 53 -574 -2 222 55 214 197
3663 197 -53 -239 -113 51 120 589 322 -278 -265 49 197 19 402 170 -474 -430 108 9 52 70 -260 -388
3685 -388 -89 -64 -68 -26 2 -36 -331 153 83 -88 395 383 -164 -168 222 164 8 111 60 76 267 12 -248 -88
3709 -88 354 16 -95 -9 -84 -351 -35 232 -42 -31 -43 -29 -87 206 84 71 122 33 -192 30 510 72 -238
3732 -238 50 22 -77 63 245 163 -47 212 -106 -319 -54 173 -81 186 67 -195 -31 -31 -59 -73 -87 216 -171
3755 -171 -118 46 25 -71 107 201 -68 -95 47 115 2 218 96 -65 -6 -41 7 105 101 2 -186 43 -59 25 -55
3780 -55 75 -51 21 -17 45 -20 54 92 -55 -60 -19 -53 44 72 112 -20 218 -6 24 -36 114 132 -42 -10 8 18 35
3807 35 -62 -23 6 -51 -66 107 -98 -130 57 63 13 73 -127 12 224 75 6 52 -4 -110 41 294 -16 14 24
3832 24 -29 -197 43 -5 23 -29 -83 -209 90 72 -67 -200 83 48 -59 95 79 9 -47 143 172 39 -21 -153
3856 -153 -268 92 -140 28 -78 102 -214 -192 20 -45 -114 -63 29 -140 -69 35 -55 22 -84 -101 198 96 -195
3879 -195 -5 -207 156 4 143 108 68 -128 -176 -51 191 61 89 -169 -38 -82 50 211 -51 -167 -259 -60
3901 -60 112 -39 -87 -256 -48 -141 -18 136 110 -110 -107 162 150 68 -46 10 66 51 -17 173 73 -23 -53 63 257
3926 257 -35 -121 -25 -101 -93 -120 22 63 -115 -35 -160 2 98 -112 -109 -43 12 -1 52 0 131 -111 -53 140 73 -37
3952 -37 -16 -53 18 167 17 67 -82 -44 -236 37 -142 47 -165 78 -35 89 -35 -29 112 -80 -31 29 97 -45
3976 -45 102 -34 -14 104 233 100 41 -44 27 76 -40 -69 -20 66 46 -31 -89 43 -125 57 -45 41 24 7 -99
4001 -99 -34 4 117 -80 126 154 -142 113 88 46 -68 -115 -53 -23 6 -102 -110 23 -131 -59 -112 -124 4 -33 -65 -19
4027 -19 -130 -83 85 -7 -178 9 113 -307 -29 107 233 25 73 -85 -69 -40 -42 161 99 60 -94 -16 -30 73
4051 73 240 44 80 -149 -167 -30 -2 -107 45 -41 -116 -13 18 -1 51 91 44 -111 10 24 -17 -69 212 78 -19
4076 -19 19 -217 -70 8 141 88 -131 -206 -38 -35 57 46 -112 -127 -165 63 -1 204 175 -326 -90 93 79 237 115
4101 115 158 -145 61 17 68 -8 239 -100 124 2 0 -56 283 118 -185 -297 -63 -96 -181 -12 230 159 -108
4124 -108 -150 -83 -142 11 117 69 -19 -88 -291 96 417 -7 117 57 -160 -105 115 179 90 -27 -137 -6 -234
4147 -234 64 236 40 112 -52 -147 -184 110 164 -33 42 29 -172 13 224 27 16 107 -74 -175 -134 223 70
4170 70 73 145 -271 -295 191 180 -55 -87 -122 -220 -239 81 -42 214 315 56 -225 -92 -48 -78 108 235 -255 -191
4194 -191 105 101 10 165 219 9 19 137 -69 122 220 186 -155 -23 -13 -35 -37 181 -151 -93 88 -23 -143 132
4218 132 254 -51 -157 110 -10 -218 274 210 19 -78 104 -31 -42 75 20 -151 125 -22 -73 -95 127 -133
4240 -133 -230 62 -13 -316 -6 70 -137 7 -24 55 -45 5 11 158 215 -82 -178 -30 64 14 85 181 65 -198 58
4265 58 284 61 -9 -172 40 -152 25 148 -52 -100 -55 9 10 195 12 -32 -26 -27 -114 -94 116 129 -42 -65 182
4290 182 198 -42 138 -47 -42 36 129 142 -75 -118 -135 99 4 68 -78 -69 22 69 -133 7 -79 -169 165 39 -144
4315 -144 188 -155 -109 141 11 168 13 69 91 -160 167 45 -14 -154 -118 -47 22 -15 176 -30 52 -19 -182
4338 -182 -92 -11 36 -135 76 -53 -165 16 140 16 -158 1 70 -21 -14 82 19 31 132 102 78 -91 -144 157
4362 157 113 66 -151 -140 88 -11 14 8 -90 8 67 155 81 -171 -94 26 -27 -1 -127 -41 97 121 -125 -48 38 -22 -40
4389 -40 -65 -134 96 91 40 -82 22 69 0 37 -52 -46 -16 -30 -40 -69 4 -80 -73 -96 -95 77 -61 14 230 76 55 -57
4417 -57 74 46 -65 113 -85 153 -157 62 67 65 104 -155 50 -2 57 5 -23 -150 105 29 -25 38 -20 -121 131
4442 131 67 228 84 -83 84 41 -30 145 58 73 -19 -34 74 100 18 -54 58 -26 47 -16 -81 -57 23 19 -167 -150
4468 -150 28 -120 125 -36 -148 76 98 17 -223 -9 41 29 42 -92 -209 -71 77 161 122 58 -81 -9 94
4491 94 68 113 157 -25 -43 142 -4 139 -22 162 -41 -42 -11 -48 141 -84 -19 -80 -54 254 166 -101 -111 136 88
4516 88 -113 123 126 -134 -132 107 -117 -63 102 -7 -137 171 -9 -74 11 -44 -127 -154 150 23 -153 -76 78 112
4540 112 70 31 -118 -4 53 167 53 -24 -17 -306 -90 41 -48 1 119 49 -167 -41 39 145 -257 59 -29 -34
4564 -34 245 -90 -22 88 115 -38 79 126 73 -122 -48 54 -81 -248 167 -227 -28 120 -20 -137 65 127
4586 127 -233 -53 116 -189 -73 -36 -42 -278 80 168 -87 -63 166 227 0 -5 -11 -160 8 224 -161 -75 -1 -145
4610 -145 -14 80 100 -112 -112 131 -72 -29 129 140 -312 18 -55 14 11 164 -133 -37 252 -24 -119 118 68 27 21
4635 21 156 -83 -159 281 -53 -39 200 114 -44 39 -3 -24 -27 61 -24 -41 -20 119 -137 -46 140 -52 -129 189 147
4660 147 -158 -77 132 -155 -135 40 1 -108 -7 50 -131 -49 -67 -68 -125 47 169 -183 79 144 -105 -130 129 28
4684 28 -60 128 170 -246 -69 103 -88 -68 24 63 12 14 -21 -78 -220 215 -8 -5 134 263 -307 -42 105 -138
4708 -138 -13 153 -10 -130 109 141 -92 26 172 -135 -148 246 25 -115 -53 18 7 0 166 7 164 72 0
4731 0 -168 159 186 -33 30 189 -56 -188 -3 -116 -127 -3 280 -23 -215 78 16 -183 -125 37 -79 -261
4753 -261 74 -82 128 130 -117 -199 233 125 -41 -8 64 -65 -47 14 -20 -97 52 53 -107 10 147 15 -50 -19
4777 -19 -27 132 -94 52 -55 -75 181 48 -35 -147 111 -52 -8 78 3 -41 56 -94 52 88 73 -189 -8 161
4801 161 104 -47 1 116 47 114 127 -129 18 -81 -10 -27 163 -8 -6 -48 -12 -3 39 29 -44 80 59 -13 83 -9 9
4828 9 -149 -96 60 -15 18 -49 -30 72 7 -110 14 97 -51 -98 179 -30 46 81 4 -47 46 -84 2 -1 -193 55
4854 55 143 53 -27 -22 123 123 96 106 -43 172 -26 -68 -2 82 -89 -63 87 149 -128 -36 46 114 -95 136 175 -75
4880 -75 -21 46 -179 -14 155 215 30 69 15 90 -89 24 -6 -91 -18 -37 7 -82 105 -8 73 -54 -23 110 131
4905 131 -26 70 -239 33 5 50 94 -118 -15 58 11 -32 29 -8 -59 34 19 58 -118 -77 -28 -14 48 162 5 65
4931 65 -98 16 41 -18 2 20 -56 -76 -142 30 -252 131 -17 12 31 79 -95 -19 91 162 129 0 43 -5 147
4956 147 -117 -51 -51 4 -20 -3 -13 144 -146 97 46 -45 -54 -64 77 57 -174 148 84 -35 57 8 -7 82 148 -7
4982 -7 -22 36 -48 -23 99 -25 -57 89 -79 16 -13 -24 -20 -198 -27 -108 55 63 76 -18 61 -39 -54 -144 -106 -36 -14 122
5010 122 68 14 -91 -137 -55 65 9 20 181 -136 98 48 -32 -18 -131 151 36 56 83 79 -81 41 -106 -6
5034 -6 102 -20 5 85 -99 -77 -68 62 -40 34 -74 120 67 -18 139 84 -31 -20 21 49 18 33 -210 27 -35 -33
5060 -33 163 103 181 5 -19 4 -56 26 -87 -57 104 -8 -156 -27 61 -10 173 102 42 -94 37 5 9 125 149
5085 149 -139 38 77 -6 -131 82 156 37 -88 -55 -132 34 -11 -176 29 -29 21 -35 10 20 3 -140 113 -42
5109 -42 -10 -76 -105 -2 -7 39 -114 59 1 -100 -22 7 -117 -116 -47 90 -153 -110 244 -45 66 -124 75 258 10
5134 10 -53 -122 -48 -120 134 96 118 76 -60 7 -93 -62 -170 -137 30 -182 35 107 21 45 10 136 -91 94 93 7
5160 7 141 173 -59 74 -131 -54 -21 49 108 -92 -21 -20 -87 -141 71 53 -173 29 1 -74 24 54 -30 -34 113 46 34
5187 34 -58 47 30 -76 104 -13 -55 111 218 56 -46 15 -58 -142 -9 23 11 43 -35 -77 -48 70 -42 -47 -74
5212 -74 112 -45 -15 -152 -12 -168 -92 -19 34 24 29 -109 -41 7 -68 56 -29 -81 -125 106 -45 -89 30 155 127
5237 127 94 -69 -77 -83 -148 116 -69 -47 -145 -19 -27 -12 -40 18 -35 -5 19 -66 58 -52 -20 -31 194 4 -62 41 102
5264 102 81 13 34 -135 -77 -70 8 -61 101 206 180 24 114 -14 173 -60 82 -10 -3 89 171 -63 -102 -171 -10 -90
5290 -90 -94 14 46 -3 -17 -71 -59 -61 64 49 -27 -154 -7 -99 126 -4 -146 120 86 72 79 -54 -35 -65 -86 -157 15
5317 15 65 -199 116 0 93 48 117 64 -89 8 -11 -90 -143 -5 -36 -4 -1 -165 31 -13 6 82 13 218 -125 -34
5343 -34 137 68 44 163 -77 23 -93 -75 18 -12 -82 -25 -103 -42 2 132 20 27 -81 9 40 95 -17 -28 124 -35
5369 -35 -105 77 -33 -122 4 -24 -20 -67 20 -93 -193 55 -18 34 173 30 18 62 32 59 -45 -77 -78 -99 128 18
5395 18 -129 -177 1 65 41 -42 38 -36 38 127 72 26 -200 76 54 77 62 -41 2 -25 -87 4 -57 116 29 -71 -97
5422 -97 120 -41 -128 33 84 -141 -11 61 -114 147 -88 22 95 -137 -89 38 1 -42 3 -63 -102 -37 -70 -88 40
5447 40 57 -63 221 1 108 86 61 56 -5 88 49 71 84 102 -55 15 -77 69 24 -168 -117 28 -45 14 117 -4
5473 -4 -47 -45 31 48 -43 -27 -43 -34 -46 -151 -37 -10 -89 10 -126 -98 10 -50 -78 100 38 -102 -4 -86 41 -79 -15 56
5501 56 -60 132 -33 -40 228 3 -34 62 90 -35 187 32 60 71 34 14 94 39 34 105 -25 48 14 -44 52 -40 -182
5528 -182 133 -75 -90 81 -94 -86 -74 -11 111 20 -1 -34 21 9 -70 -73 12 23 -34 -6 17 8 -86 2 -116 181 -66
5555 -66 -12 23 -109 -141 -30 -215 104 -72 -109 -20 15 -11 -29 -63 76 -6 59 257 97 -29 0 67 -9 -26 -45 45
5581 45 63 -144 85 -91 -148 -67 -11 28 148 96 -94 -42 104 16 -89 -78 -91 24 11 -111 -126 -114 -33 59 200
5606 200 137 209 -35 59 -25 -147 15 14 -26 -68 77 136 122 28 98 5 -206 -3 11 122 17 173 78 -12 -102 47
5632 47 -54 66 74 19 18 50 44 -71 10 -12 -13 54 8 -110 15 73 -129 34 -216 -57 -52 -39 -70 136 100 -84 -13
5659 -13 -123 -39 -70 -109 -22 8 9 70 140 166 -7 -28 -10 87 -122 -94 -155 -119 172 65 -47 51 24 110 50 33 187
5686 187 -3 -35 -76 -100 -6 -60 -132 34 -114 30 -38 -39 24 66 3 123 -34 -64 67 124 -63 -136 -59 206 -78
5711 -78 114 -67 -86 -113 201 20 -24 -22 44 -88 -35 91 -136 103 -8 -3 -89 69 61 -58 -32 18 25 -5 36 139
5737 139 -60 82 -60 -9 -1 -26 -173 -7 -100 -51 3 -131 5 -55 16 -25 -56 87 101 121 28 18 -26 -95 179 228
5763 228 -6 -141 41 26 -59 -37 180 -51 21 -53 -26 51 27 39 -45 -8 -129 -47 -129 -11 9 21 115 156 74 80 -12
5790 -12 -67 -22 -91 -81 48 -102 28 -17 -42 -51 139 -139 4 22 -76 11 -88 -105 10 -6 79 -51 -19 14 -80 -5 92
5817 92 71 4 73 24 -32 -10 -121 3 -11 53 -116 -42 67 1 -70 -33 38 27 -67 -17 26 82 -53 -30 58 -18 96
5844 96 72 -1 -34 -170 63 12 -51 -117 18 -88 -95 -149 -23 68 -46 -59 38 -174 -59 -55 141 -15 1 88 63 68 -64
5871 -64 -152 -165 35 -104 -22 61 153 28 -57 183 136 50 4 9 0 187 128 -58 117 -131 -67 11 61 -41 48 -33 -101
5898 -101 38 -17 -3 -21 -61 -83 -18 -146 25 -61 -87 21 -135 -36 -96 -9 125 -90 -151 7 -45 3 63 20 -13 113
5924 113 89 -28 139 -28 6 105 -1 25 27 -114 44 -92 1 -150 -99 0 61 -80 -23 57 12 111 75 -65 14
5949 14 35 82 189 -102 119 131 -58 -77 -196 -32 81 -127 21 69 -96 -118 50 91 -99 -46 126 -72 2
5972 2 11 17 36 21 30 -82 -129 112 -83 -70 61 -66 -35 -46 150 -52 -68 -10 -157 -10 -104 60 -23 -61 -13 22 -100
5999 -100 88 71 24 66 -41 119 -66 90 -75 157 105 -73 174 117 -150 -148 -34 -41 83 -134 125 -54 -41
6022 -41 -10 -42 201 7 54 91 54 114 -50 -57 -77 -178 8 69 95 95 -48 60 -17 -31 81 28 -11 -20 105 -140 87
6049 87 166 126 28 -28 17 31 92 -39 39 63 10 -66 -84 -142 -53 87 106 70 -21 -17 -11 81 42 106 4 59 -116 49 99
6078 99 24 -54 -164 138 -52 -45 -43 87 -13 -122 80 29 -115 -59 -92 -6 83 -76 258 -155 116 -15 -2 64 -65
6103 -65 -56 -3 62 -4 18 -30 -17 144 27 -63 55 -72 -1 -142 -19 -58 -18 23 -67 125 60 -40 7 58 -13 -93 -101
6130 -101 129 94 -69 192 79 65 -49 -31 -83 24 32 -99 2 126 -90 -66 139 37 23 86 88 -34 -271 -57
6154 -57 -47 12 -63 -24 36 61 147 -40 -105 -40 -45 -123 -83 -104 30 -15 35 -15 -79 85 -117 54 -14 -1 -76 19 -3 7
6182 7 -17 80 0 -211 146 1 -6 -26 -26 -79 -21 182 -67 -290 -3 -4 -39 36 -5 -26 68 2 -9 3 -95 3 -66 22 -53
6211 -53 14 28 67 -18 -32 32 -171 -32 -46 -118 117 -13 88 -81 23 -5 -41 -83 -94 26 32 179 -49 -19 -30 -74
6237 -74 -90 24 17 -18 140 -7 92 184 -16 24 -29 -100 13 78 1 -31 -89 -38 -85 -95 -126 -63 -138 168 -20 11 18 72
6265 72 52 -22 20 -49 58 -149 91 -9 -20 130 -33 -124 -183 -88 -156 -55 5 179 40 36 -65 42 -46 -70 -26
6290 -26 18 26 119 83 -66 14 -172 68 165 166 -1 85 116 -20 59 74 -59 -52 90 -66 26 -32 90 95 -113 20 13
6317 13 -59 14 89 15 -102 29 147 32 -6 -91 7 -37 -124 65 23 -5 -102 -71 75 50 66 -28 47 -87 29 65
6343 65 64 -7 2 9 -111 98 -165 -17 83 -72 83 -86 66 -20 -105 155 76 -242 74 23 -9 -21 11 20 142 64
6369 64 14 -13 -49 136 21 142 -159 -55 -37 47 -60 64 -11 -17 33 -147 167 22 -23 71 63 -131 -150 -162 121
6394 121 -71 -51 125 -49 -152 118 -185 -72 49 -76 91 22 -83 23 39 105 10 -114 51 27 4 -10 -111
6417 -111 136 73 25 -112 -49 157 -163 -17 58 165 76 -1 9 -106 -18 226 -45 -17 120 -77 18 -22 92 -140
6441 -140 -136 -11 -2 -46 22 103 -27 14 19 1 -10 -6 16 211 89 48 -56 -107 4 89 -126 -66 34 -65 -75 112 -27
6468 -27 -13 -23 -119 -85 18 33 -108 7 -44 40 -25 3 139 -151 -19 40 44 167 5 100 32 25 -13 5 122 49 -188
6495 -188 103 -39 -37 -70 -124 86 113 90 -57 43 64 -1 -67 13 -113 -31 -21 37 -31 -53 48 36 117 -42 -190 6
6521 6 91 -83 -96 -65 -59 39 43 -8 55 -155 -3 143 -9 82 11 58 -22 98 71 97 105 -25 -25 -36 77 35 86 -65
6549 -65 -35 43 -11 -33 -56 -32 54 182 84 115 -122 -157 62 54 145 -19 -49 174 -43 186 43 -39 121 27 -87 6
6575 6 45 175 -107 -38 -73 -24 -115 -79 23 12 -16 -201 84 -21 -83 116 30 137 38 21 33 92 18 -41 -31 -45 19
6602 19 82 10 50 43 -112 170 -57 -6 161 31 -80 -47 -68 -84 -51 94 -70 -60 -5 86 -104 90 -146 -113 21
6627 21 -14 78 -138 65 38 -74 -16 127 -78 -28 -92 -77 271 -60 14 25 -24 -98 39 -53 72 -37 -18 -182 179
6652 179 -90 17 106 -24 121 -16 52 79 -33 216 -36 14 43 -165 172 -71 -66 26 -39 101 96 49 -44 41 24
6677 24 -16 -23 -27 51 30 -57 30 78 19 -80 -59 13 -6 -68 -85 -62 -16 -40 36 -78 58 102 -51 47 -32 169 153 41 -44
6706 -44 50 -111 -227 -67 -177 -105 -11 27 -37 39 -118 -163 -68 -104 115 4 -140 23 11 -100 22 84 60 2 68
6731 68 -153 -59 -74 230 35 -23 82 -72 27 130 17 -97 72 -67 -169 -271 126 104 140 76 28 2 -87 20
6755 20 66 -34 43 12 69 7 104 162 42 40 -33 -76 -186 131 -57 44 66 -97 -1 180 55 61 -60 33 13 -6
6781 -6 -29 109 123 45 -100 45 0 -38 -61 5 0 27 85 -118 63 -19 -56 -5 -22 49 0 58 75 44 67 -48 -46 -31 114
6810 114 -50 111 -115 124 23 81 52 -25 69 115 212 113 -44 -56 -79 -128 74 -56 -58 -92 -53 65 -200 115 2
6835 2 -38 -9 -22 -24 8 48 -1 -29 -55 -115 -28 -35 -120 -42 44 -193 -121 -62 56 57 93 25 95 -79 -90 23 -138 112 106 62
6865 62 -37 48 -117 0 -153 44 74 75 -41 66 136 -8 117 -34 1 -97 71 96 -112 -76 60 98 86 -128
6889 -128 -70 -146 7 -169 10 -49 -166 121 158 -2 -142 117 72 64 49 82 -2 -19 121 -37 79 47 -36 -42 9
6914 9 -1 -94 53 98 -65 -98 2 7 13 92 53 49 60 1 145 -45 -86 8 92 -135 -106 -32 111 107 4 -50 18 26 -52
6943 -52 -71 168 58 76 1 -61 37 112 -24 -18 249 152 21 -91 -33 0 -48 -51 -27 13 47 -95 16 -155 43 -93
6969 -93 20 33 -83 -19 97 -78 -70 -174 139 33 -137 61 -7 46 -85 25 -132 123 -42 80 134 133 -12
6992 -12 65 -82 -31 13 105 30 -19 -13 -57 69 -233 29 -49 -13 101 8 24 -13 36 -26 -82 -109 107 -59 -14 16 -107
7019 -107 19 18 -101 38 65 54 77 42 87 0 -153 -4 33 -26 41 51 -130 -127 54 68 42 18 29 189 4 185
7045 185 3 -58 167 40 72 -30 -77 -61 -149 -5 -32 67 -136 -118 -49 -78 12 67 49 100 9 28 -14 43 14 39 18
7072 18 51 93 1 53 -31 111 36 64 -120 -132 -72 165 -3 -68 49 44 74 -70 -46 -30 -78 -40 -116 180 -8 45 -130
7099 -130 16 -41 -94 49 9 -47 -62 150 76 15 -72 -38 66 -33 66 -77 36 -118 -19 108 2 73 60 -25 -54
7124 -54 163 71 -42 39 -23 107 92 4 77 44 169 -34 24 59 -66 -64 -42 26 -86 30 51 -76 47 -46 -17 25
7150 25 56 41 -58 -97 -25 239 72 0 -2 -50 -58 -21 -49 23 23 -136 246 -69 -144 -103 -14 -93 33 35 -30 46 -114 -44 -11
7179 -11 -88 -46 24 23 64 25 110 -76 -44 -25 -3 -51 -170 11 130 25 201 -13 54 1 72 -216 14 -21 22 -16
7205 -16 -21 -44 -74 28 113 179 -19 -37 -115 -36 -96 7 -46 199 12 -17 -73 -5 -72 -42 -22 135 149 -11 -37 -28 -32 71
7233 71 64 -58 -93 -58 -2 -61 49 168 38 -126 19 -32 82 -155 73 -71 12 -49 174 -178 83 -72 -151 -48
7257 -48 -180 174 94 135 -49 75 -123 7 -26 12 60 10 109 -6 91 62 -50 -121 116 46 -40 -211 62 -52
7281 -52 7 40 101 -30 -87 -47 2 -87 -33 -56 11 -13 11 45 57 61 81 48 -89 58 -71 -28 -80 37 23 -69 -79 152
7309 152 12 134 11 77 97 -77 35 57 29 -9 9 100 -198 -5 55 -103 -77 -83 114 -58 -87 91 -105 -91
7333 -91 71 0 -8 -48 27 124 79 -108 -81 -106 -46 2 132 -104 -94 124 47 -41 44 60 -20 -74 64 -52 137 43 56
7360 56 84 97 84 -63 63 154 77 56 5 -58 -5 -30 -82 -137 -13 40 -1 -35 -5 -99 115 20 79 24 37 -4 -63 -51
7388 -51 45 -23 -56 151 -56 -3 30 81 89 41 -42 -61 71 134 68 26 100 -43 5 116 -97 150 -15 17 -110 -7
7414 -7 -41 -41 -30 61 8 22 7 -24 105 -22 -63 -24 -38 -51 -19 6 -30 7 -39 -65 -53 129 -6 -68 129 12 95 -7
7442 -7 -141 -44 -100 -6 -111 -71 -126 -58 -141 -64 -36 -104 -42 -9 -71 49 -30 36 20 21 -59 -10 -23 -179 -54 -54 -113 -125 121
7471 121 168 38 91 117 60 14 5 80 -31 -154 74 96 -44 135 10 84 -80 9 8 -70 -117 -19 -29 -20 91 -6 -6
7498 -6 -46 -11 -2 28 -105 66 22 21 -6 128 -23 -78 -142 -66 -35 21 95 -83 8 55 -98 19 -195 74 -194 -45
7524 -45 68 -52 -9 -64 -11 147 9 -105 14 75 36 -45 -12 -109 -178 91 -81 160 13 -44 -87 -118 -13 29 -52
7549 -52 176 -8 101 54 47 -117 4 95 -96 144 -82 44 -139 -1 161 22 -77 -41 157 74 -161 27 58
7572 58 -65 -31 10 82 -123 -59 -72 53 103 -101 -58 -71 -46 -98 -114 39 -20 122 -195 -5 86 -87 -32 -43 37 38
7598 38 -96 -209 -146 106 -13 3 75 9 -121 -80 -163 122 -34 13 -31 39 89 -34 -81 -115 -102 44 -13 -27 23 16
7624 16 8 39 45 -23 -109 -11 -72 85 6 97 53 -126 -131 -61 33 -19 -75 76 -28 24 -42 -87 69 45 -41 28 -79 -28 -68
7653 -68 -96 17 -1 169 11 -12 -3 68 26 79 -146 13 -3 -32 -149 -27 44 87 -128 -75 11 77 62 -102 51 -4
7679 -4 -11 61 17 -34 74 -8 196 -38 1 -30 -132 8 -9 32 21 11 -32 93 56 66 -90 18 -90 109 -145 -62
7705 -62 -11 48 -77 103 164 17 67 -132 -78 -247 59 -75 -171 -5 -92 -53 -25 -46 8 26 49 101 30 60 25 -57
7731 -57 -107 14 -32 48 20 37 3 -18 -36 -107 -25 -103 -119 32 63 -127 49 -6 -36 60 56 -162 -5 72 137 56 55 -14
7759 -14 36 -91 -64 -112 -17 -133 -69 3 78 76 35 -15 -112 24 -104 96 -111 212 -99 -10 -152 124 -57 -7 13
7784 13 -72 -44 -94 -132 -14 33 -146 17 -116 -22 -38 13 -51 -167 54 49 -24 -97 196 1 -11 22 -16 75 83 102 119
7811 119 181 -15 9 -38 -148 -67 115 -67 -42 -12 -86 90 -64 -57 -34 42 -52 -38 17 -48 17 -19 55 -40 -8 17 -15
7838 -15 155 1 70 90 54 7 -104 -33 -86 -142 -66 -66 25 -50 -38 25 -110 -70 59 -124 -26 -101 164 -2 71 7 -68
7865 -68 -107 -109 105 92 135 -95 88 -39 -37 -24 5 4 -12 14 0 -106 -93 -15 -111 -9 -17 18 -67 54 -70 -13 145 -77
7893 -77 74 1 -143 -9 21 -71 31 81 68 -7 39 28 -84 160 -32 -13 -38 52 -77 86 32 -82 -113 117 15
7918 15 -61 48 -7 -20 124 99 -47 54 -1 -107 -19 -2 -18 144 -28 223 -49 -30 68 105 -53 -58 114 -111 -76
7943 -76 54 -57 -96 -15 -72 30 23 142 110 -10 104 170 41 72 -70 -10 -58 93 15 -4 -43 55 -123 19 -106
7968 -106 101 99 1 121 -60 -56 69 3 47 -10 -21 -50 -1 131 -130 13 95 -5 22 -2 77 139 56 -75 -32 -67
7994 -67 -80 10 -50 31 -11 -3 29 111 -47 -55 24 180 -72 -135 15 -91 -59 -61 20 79 53 -120 -30 -37 -17 -3 125 -127
8022 -127 -36 -80 67 -26 -24 -26 -35 -56 -89 -23 -12 36 -132 63 135 -55 -68 35 -35 -66 -85 7 -95 96 -164 -41 131
8049 131 13 -15 -67 -81 41 36 5 194 55 -47 73 -166 -103 10 -80 -53 -47 50 -80 -28 -229 -13 -56 -206 -61
8074 -61 230 -111 -69 -137 -67 9 13 -130 -73 -58 -21 -99 90 52 92 62 -86 -51 80 -91 38 -54 -34 50 18 13 32
8101 32 -67 -23 -15 -67 112 -53 32 21 -49 -128 4 27 29 42 -28 10 92 33 132 13 -71 138 49 -115 -96 -97 69 -185
8129 -185 -43 -105 0 181 -116 141 -44 -153 57 -134 9 37 123 46 29 -180 4 -48 26 130 -58 -72 -42
8152 -42 29 4 -108 129 -66 -45 0 34 58 -121 -12 -36 -81 -32 64 -113 -166 12 -39 -119 -51 93 -63 -44 -129 -10
8178 -10 -4 -92 -28 -19 92 -44 -15 -13 125 43 -38 16 -23
8191b3
##END NTUPLES=NMR FID
##END=
