##TITLE=1H_LR-747-V1-PE-Mat
 CDCl3
 8 sc, 
 10.03.2022
##JCAMPDX= 6.0         $$ Bruker NMR JCAMP-DX V2.0
##DATA TYPE= NMR FID
##DATA CLASS= NTUPLES
##ORIGIN= UXNMR, Bruker Analytische Messtechnik GmbH
##OWNER= root
$$ XWIN-NMR		Version 3.5
$$ Thu Mar 10 12:04:28 2022 Russian Standard Time (UT+4h)  she@DPX200
##.OBSERVE FREQUENCY= 200.131346
##.OBSERVE NUCLEUS= ^1H
##.DELAY= (6, 6)
##.ACQUISITION MODE= SIMULTANEOUS
##.ACQUISITION SCHEME= undefined
##.AVERAGES= 8
##.DIGITISER RES= 18
##SPECTROMETER/DATA SYSTEM= spect
##.PULSE SEQUENCE= zg30
##.SOLVENT NAME= CDCl3
##.SHIFT REFERENCE= (INTERNAL, CDCl3, 0, 15.7039)
##AUDIT TRAIL= $$ (NUMBER, WHEN, WHO, WHERE, WHAT)
$$ ##TITLE= Audit trail, XWIN-NMR		Version 3.5
$$ ##JCAMPDX= 5.01
$$ ##ORIGIN= Bruker BioSpin GmbH
$$ ##OWNER= she
$$ F:/spectra/data/she/nmr/H-F/1/audita.txt
$$ ##AUDIT TRAIL=  $$ (NUMBER, WHEN, WHO, WHERE, WHAT)
(   1,<2022-03-10 12:03:12.12 +0400>,<she>,<DPX200>,
      <created by zg, POWCHK disabled, PULCHK disabled
       configuration hash MD5:
       00 E9 B6 7A A2 85 ED C7 34 08 36 98 17 FE 4E 26
       data hash MD5: 16K
       5E BD 83 AA 0E 0A 55 BC 3E A1 81 FF E2 CC 17 61>)
$$ ##END=
$$ 
$$ hash MD5
$$ 2B 47 BB 12 72 73 EE D6 FD CB 7D 5F C0 86 33 2D
##$RELAX= 
##$RELAX= 
##$RELAX= 
##$RELAX= 
##$RELAX= 
##$RELAX= 
$$ Bruker specific parameters
$$ --------------------------
##$DU= <F:/spectra>
##$EXPNO= 1
##$NAME= <H-F>
##$PROCNO= 1
##$TYPE= <nmr>
##$USER= <she>
##$AMP= (0..31)
100 100 100 100 100 100 100 100 100 100 100 100 100 100 100 100 100 100 
100 100 100 100 100 100 100 100 100 100 100 100 100 100 
##$AQSEQ= 0
##$AQ_mod= 1
##$AUNM= <au_zg>
##$AUTOPOS= <>
##$BF1= 200.13
##$BF2= 200.13
##$BF3= 200.13
##$BF4= 200.13
##$BF5= 200.13
##$BF6= 200.13
##$BF7= 200.13
##$BF8= 200.13
##$BYTORDA= 1
##$CFDGTYP= 0
##$CFRGTYP= 5
##$CHEMSTR= <none>
##$CNST= (0..31)
1 1 145 1 1 1 1 1 1 1 1 1 1 1 1 1 1 1 1 1 1 1 1 1 1 1 1 1 1 1 1 1 
##$CPDPRG= <>
##$CPDPRG1= <>
##$CPDPRG2= <>
##$CPDPRG3= <>
##$CPDPRG4= <mlev>
##$CPDPRG5= <mlev>
##$CPDPRG6= <mlev>
##$CPDPRG7= <mlev>
##$CPDPRG8= <mlev>
##$CPDPRGB= <>
##$CPDPRGT= <>
##$D= (0..31)
0 1.2 0 0 0 0 0 0 0 0.06 0 0.03 0 0 0 0 0.0002 0 0 0 0 0 0 0 0 0 0 0 0 
0 0 0 
##$DATE= 1646899391
##$DBL= (0..7)
120 120 120 120 120 120 120 120 
##$DBP= (0..7)
150 150 150 150 150 150 150 150 
##$DBP07= 0
##$DBPNAM0= <>
##$DBPNAM1= <>
##$DBPNAM2= <>
##$DBPNAM3= <>
##$DBPNAM4= <>
##$DBPNAM5= <>
##$DBPNAM6= <>
##$DBPNAM7= <>
##$DBPOAL= (0..7)
0.5 0.5 0.5 0.5 0.5 0.5 0.5 0.5 
##$DBPOFFS= (0..7)
0 0 0 0 0 0 0 0 
##$DE= 6
##$DECBNUC= <off>
##$DECIM= 32
##$DECNUC= <off>
##$DECSTAT= 4
##$DIGMOD= 1
##$DIGTYP= 9
##$DL= (0..7)
0 120 120 120 120 120 120 120 
##$DP= (0..7)
150 150 150 150 150 150 150 150 
##$DP07= 0
##$DPNAME0= <>
##$DPNAME1= <>
##$DPNAME2= <>
##$DPNAME3= <>
##$DPNAME4= <>
##$DPNAME5= <>
##$DPNAME6= <>
##$DPNAME7= <>
##$DPOAL= (0..7)
0.5 0.5 0.5 0.5 0.5 0.5 0.5 0.5 
##$DPOFFS= (0..7)
0 0 0 0 0 0 0 0 
##$DQDMODE= 0
##$DR= 18
##$DS= 0
$$ [...]
##$SUBNAM2= <"">
##$SUBNAM3= <"">
##$SUBNAM4= <"">
##$SUBNAM5= <"">
##$SUBNAM6= <"">
##$SUBNAM7= <"">
##$SUBNAM8= <"">
##$SUBNAM9= <"">
##$SW= 18.0517287032376
##$SWIBOX= (0..15)
0 0 2 0 0 0 0 0 0 0 0 0 0 0 0 0 
##$SW_h= 3612.71676300578
##$TD= 16384
##$TD0= 1
##$TE= 0
##$TE2= 300
##$TE3= 300
##$TEG= 300
##$TL= (0..7)
0 120 120 120 120 120 120 120 
##$TP= (0..7)
150 150 150 150 150 150 150 150 
##$TP07= 0
##$TPNAME0= <>
##$TPNAME1= <>
##$TPNAME2= <>
##$TPNAME3= <>
##$TPNAME4= <>
##$TPNAME5= <>
##$TPNAME6= <>
##$TPNAME7= <>
##$TPOAL= (0..7)
0.5 0.5 0.5 0.5 0.5 0.5 0.5 0.5 
##$TPOFFS= (0..7)
0 0 0 0 0 0 0 0 
##$TUNHIN= 0
##$TUNHOUT= 0
##$TUNXOUT= 0
##$USERA1= <user>
##$USERA2= <user>
##$USERA3= <user>
##$USERA4= <user>
##$USERA5= <user>
##$V9= 5
##$VALIST= <valist>
##$VCLIST= <CCCCCCCCCCCCCCC>
##$VD= 0
##$VDLIST= <DDDDDDDDDDDDDDD>
##$VPLIST= <PPPPPPPPPPPPPPP>
##$VTLIST= <TTTTTTTTTTTTTTT>
##$WBST= 1024
##$WBSW= 4
##$XGAIN= (0..3)
0 0 0 0 
##$XL= 0
##$YL= 0
##$YMAX_a= 48243
##$YMIN_a= -72885
##$ZGOPTNS= <>
##$ZL1= 120
##$ZL2= 120
##$ZL3= 120
##$ZL4= 120
##$ABSF1= 10
##$ABSF2= 0
##$ABSG= 5
##$ABSL= 3
##$ALPHA= 0
##$AQORDER= 0
##$ASSFAC= 0
##$ASSFACI= 0
##$ASSFACX= 0
##$ASSWID= 0
##$AUNMP= <proc_1d>
##$AZFE= 0.1
##$AZFW= 0.1
##$BCFW= 1
##$BC_mod= 2
##$BYTORDP= 1
##$COROFFS= 0
##$CY= 11.3945322036743
##$DATMOD= 1
##$DC= 2
##$DFILT= <>
##$DTYPP= 0
##$F1P= 2.36226072786647
##$F2P= -0.459571619588291
##$FCOR= 0.5
##$FTSIZE= 0
##$FT_mod= 4
##$GAMMA= 1
##$GB= 0.15
##$INTBC= 1
##$INTSCL= 1
##$ISEN= 128
##$LB= 0.24
##$LEV0= 0
##$LPBIN= 0
##$MAXI= 10000
##$MC2= 0
##$MEAN= 0
##$ME_mod= 0
##$MI= 1.114404
##$NCOEF= 0
##$NC_proc= 0
##$NLEV= 6
##$NOISF1= 3.799351
##$NOISF2= 2.8
##$NSP= 1
##$NTH_PI= 0
##$NZP= 0
##$OFFSET= 15.70392
##$PC= 1
##$PHC0= -16596.34
##$PHC1= 22.80078
##$PH_mod= 1
##$PKNL= yes
##$PPARMOD= 0
##$PSCAL= 0
##$PSIGN= 0
##$REVERSE= no
##$SF= 200.130013532006
##$SI= 16384
##$SIGF1= 3
##$SIGF2= 2
##$SINO= 400
##$SIOLD= 16384
##$SREGLST= <1H.CDCl3>
##$SSB= 0
##$STSI= 0
##$STSR= 0
##$SW_p= 3612.71676300578
##$SYMM= 0
##$S_DEV= 0
##$TDeff= 0
##$TDoff= 0
##$TI= <>
##$TILT= no
##$TM1= 0
##$TM2= 0
##$TOPLEV= 0
##$USERP1= <user>
##$USERP2= <user>
##$USERP3= <user>
##$USERP4= <user>
##$USERP5= <user>
##$WDW= 1
##$XDIM= 8192
##$YMAX_p= 0
##$YMIN_p= 0
$$ End of Bruker specific parameters
$$ ---------------------------------
##NTUPLES= NMR FID
##VAR_NAME=  TIME,          FID/REAL,        FID/IMAG
##SYMBOL=    X,             R,               I
##VAR_TYPE=  INDEPENDENT,   DEPENDENT,       DEPENDENT
##VAR_FORM=  AFFN,          ASDF,            ASDF
##VAR_DIM=   8192,          8192,            8192
##UNITS=     SECONDS,       ARBITRARY UNITS, ARBITRARY UNITS
##FACTOR=    0.0002768,     1,               1
##FIRST=     0,             0,               0
##LAST=      2.2672688,     0,               0
##MIN=       0,             -72885,          0
##MAX=       2.2672688,     48243,           0
$$ Real data points
##PAGE= N=1
##DATA TABLE= (X++(R..R)), XYDATA
0@%%%%%%%%%%%%%%%%qJ6j6J6j6K4l2L2m0M8n3O1p2Q1q9J04j20J36j53J71j94K19
38A15k44K74l06L39l77M18m61N10n64O23o88P57q32R17j012J117j231J362j512
57g95J678j871K098k368K694l098L615m301N265o724R214j4605M7980l9316m6362
72d6896P5074m3465j9034P5331P233q0569J1878L3224m1328J787P2254k8658n3985
85c7154L8422Q707m5903L1233M2695l3136k5380L2248n261l8379L1577L8314m3095
98e112n645L7633l6723k7039N2020R299l5527J6530J6553m5565p943N2815o043
111A5253k9162L3378n926n1076K2833L4731k1605k34K2149k1430k8345K2491K2535
124A5592j8754L561K1500k7788j8320K9837M424j5931J3079Q795k2643r978K3176
$$ plain form
0 0 0 0 0 0 0 0 0 0 0 0 0 0 0 0 0 0 -8 8 -8 8 -8 16 -16 16 -24 24 -29 32 -40 41 -48 56 -64 72 -81 90 -104 115
38 115 -129 145 -161 178 -199 219 -242 268 -296 327 -361 396 -436 481 -531 586 -645 717 -795
57 -795 883 -988 1110 -1258 1436 -1662 1953 -2348 2917 -3807 5407 -9198 38782 -534 -46896
72 -46896 28178 -15287 -34321 41010 48243 -32326 -20448 12776 -28552 -26765 45489 16831 -37154
85 -37154 1268 9975 -35928 -4695 38000 4864 -20516 11732 6471 -31908 -331 37983 -5112
98 -5112 -10757 26876 -9847 -36886 15134 24433 -11094 5436 21989 -23576 -31519 21296 15253
111 15253 -13909 19469 13543 -37533 -14700 20031 -1574 -1808 20341 -1089 -29434 -6943 15592
124 15592 -3162 399 21899 -5889 -24209 5628 10052 -5879 7200 15995 -6648 -16626 6550
137F550J034j8054J8915Q187l1656N389K0763j7137k313K1607o880j8922Q137
150d380J0232j3883J902K0929j1546j5382J4863j447j1742J3518Q962j0738n888
163d600O086j41r087R266J2618j5047m792J1614q757n912J4001K282j1148m14
177d031P310o986o056J6133M63j5623Q924M592j3658O138J1091p069m779N392
191A841J319p796L363J0486r138n460J1350m112p299Q795J149p849J85O862k081
206A615p250O439L356j1740N507R550j1025j039P941n759k839Q136K714q176j656
221d226Q034m597l552J1911k682j1113O646K794n270L623L634m826n216M217M306
236C683o408K427N782j0460j439J0336l123m042M239p48m393J399P141k235o234
$$ plain form
137 6550 7584 -10470 8445 16632 -15024 -9635 11128 -6009 -8322 13285 6405 -12517 -4380
150 -4380 5852 -8031 -6129 14800 3254 -12128 2735 1288 -10454 3064 12026 1288 -4600
163 -4600 1486 1345 -7742 1524 14142 -905 -5697 5917 -2840 -8752 5249 7531 -3617 -4031
177 -4031 3279 -3707 -9763 6370 6833 -8790 134 4726 -8932 -2794 8297 1228 -3551 1841
191 1841 3160 -4636 -1273 9213 75 -5385 5965 1853 -5446 3349 4498 -3351 -3166 3696 1615
206 1615 -5635 804 4160 -7580 -2073 7477 -3548 -4587 3354 -2405 -5244 2892 5606 -2570 -4226
221 -4226 3808 -789 -4341 7570 4888 -6225 421 3215 -2055 1568 5202 376 -4840 -623 3683
236 3683 -2725 -298 5484 -4976 -6415 3921 798 -3244 995 247 -4146 -2747 4394 2159 -4075
251d075N722l15o407Q508K591q674J696L098k840O88L854l77o929L10O245l851
267g56k33N827o800l565O040q9j403J661p94k663r13N319J338n143K870K46n418
284d476N801L586m784N6M61j778J024K326J446m175j925L616k572L94N053m674
300f21k999L494r98L64K003j218j698j383K846K045k600K284o32n059M281K568
316B677k655J758o95k341N44J397J812j794j479K334l106M29M682l889j765K804
332G13k209L62K415p41j466j568J457P83j155L120k22m451L046Q66k361K792L21
349A702k086K54P47J190j268q17J802k745l39M018k286r73K142k603m01J574Q6
366cN77j139L8L62k006K157P55k536K281j64j894K336J05p72N03q61P20O23n00
$$ plain form
251 -4075 1647 1332 -5075 3433 6024 -2650 -954 2144 -696 -8 3846 3469 -3460 -3150 3095 -756
267 -756 -989 4838 -1962 -5527 513 424 -979 682 -112 -2775 -3688 1631 2969 -2174 696 942 -4476
284 -4476 1325 4911 127 183 644 -1134 -110 2216 3662 -513 -2438 1178 -1394 -1000 4053 -621
300 -621 -3620 -126 -1124 -760 1243 25 -1673 -3056 -210 1835 -765 1519 887 -4172 109 2677
316 2677 22 1780 1085 -1256 -712 685 2497 703 -776 1558 -1548 -1119 3563 -326 -2091 713
332 713 -1496 -1134 1281 540 -926 -2494 -1037 -254 -1409 1711 1489 -2962 84 950 -1411 1381 1702
349 1702 -384 -130 617 1807 539 -278 1524 -1221 -1560 2458 172 -801 1341 -1262 -1663 -89 -3
366 -3 574 -565 -527 -165 -2171 -14 741 -1795 486 322 -1572 764 869 97 600 -261 459 1082 582
385E82J719j555j175J207j744Q84J926k292M50k86k074J918J53n24O75j070O77
402e29K5n16J943j225j184L257j545n91K741k091j313J741J30L19n01N84o33l101
420b489K861K124l705J647O51m345J585L358j407r67J75k45k217J360N106l057
436D35k270L463l060j837N952M64l328P76P36k023j052M327M67n452L130K312
452C040o087J880L908m727k87M495j178l795J614K300m122P12P234l813n406N133
468I01j089l559O204K687n154k403K863r83j580O277J345q148L94M198n119K035
484a131O645l770n107K275J262l438J887N634m021m364N517j656m772O205K357
499C523n117J572K682l759k532M762K356m341K431K708p527p01O265j639l77L731
$$ plain form
385 582 2301 746 -429 778 -966 -82 1844 -448 2 -284 -2358 -440 -287 -811 -136 -1206 -529
402 -529 -504 -1020 923 -302 -1486 1771 226 -365 2376 285 -1028 713 843 1162 661 1245 612 -2489
420 -2489 372 2496 -1209 438 1089 -3256 -1671 1687 280 -687 -512 -757 -2974 -1614 3492 435
436 435 -1835 1628 -1432 -3269 2683 3147 -181 595 1331 -692 -1744 2583 3050 -2402 728 3040
452 3040 -3047 -1167 2741 -1986 -2273 2222 1044 -2751 -1137 1163 -2959 -2247 4987 1174 -4232 901
468 901 -188 -3747 2457 5144 -10 -2413 450 -533 -2113 4164 5509 -2639 -2245 1953 -3166 -1131
484 -1131 5514 1744 -3363 -1088 174 -3264 -1377 4257 236 -4128 1389 -267 -5039 1166 3523
499 3523 -1594 -22 2660 -1099 -3631 1131 3487 -854 1577 4285 -3242 -3943 2322 683 306 4037
515D037k637n506L74L985M01JL413l726o728L652L162j009L458R18n250k781J801
532b435L167M06J747J441n784k486L930k1O45L685j763l858r32Q83J017K43K862
549B747M17m899p37Q32j466L148L211j352k038k462l33Q22J424M763J00m927j122
566a872m51l06M059L444j056l714k812P00l31K956N156l353m284O89k341q9N169
583A564K332k341k988o64o70q20N096L028m427l74J76l725J563M838Q09j792p82
600H23m12l330O6O040k95k836K522k639m571L457K958j101K65J028k941m009L194
617a781L694k383J895J979o112j846M402N97P39K232j060m105j657L593J117n82
633G22L393j773o203J940K695j178J596J856k531l793J021L031j669P80L291m259
$$ plain form
515 4037 1400 -4106 -3732 253 654 655 4068 342 -6386 -2734 428 -581 2877 3795 -1455 -4236 -2435
532 -2435 732 1138 2885 4326 -1458 -3944 -14 -35 610 4295 2532 -1326 -2258 -1375 -358 -115 2747
549 2747 3164 -1735 -2472 -1640 -3106 42 3253 1901 -137 -2599 -2932 -2110 -686 4077 4177 -750 -1872
566 -1872 -2323 -2629 1430 4874 3818 104 -2708 -2008 -2339 617 5773 2420 -1864 -1175 -3516 -3605 1564
583 1564 3896 1555 -1433 -2097 -2767 -3587 1509 4537 110 -264 -88 -3813 -2250 2588 3397 1605 823
600 823 411 -2919 -2853 3187 2892 56 2578 -61 -4632 -1175 1783 682 947 1975 -966 -4975 -1781
617 -1781 1913 -470 1425 3404 -2708 -4554 -152 445 1184 3416 2356 -1749 -3406 187 1304 722
633 722 4115 2342 -3861 -1921 774 -404 1192 3048 517 -3276 -2255 776 -893 -113 3178 -1081
649a081k090L688j048j047K822L47k322l30J925o11j920L184J121l396J196J050
665A488k813P01K131j24r65m91l3k067K38M052j211k231J947j715k128L144J886
682A809j266r24J90n14j336K717K070k953n8J616k827J108K449j292j065L98N19
699F41l46m20J487j218j993K115M84j702J270j91j534M07P42Q30j146m07J325
716C44j441K71K700j505j154J073p41K54J495j11n64j124M15P72q44J333rk334
734a170N81O20l86Q08m42l36l25p22J646K67j269Q37o21p55J593K47k62j73p62
753f24P18l8K91J460j698o54J328j015N94R43j308l63j10o4R55o44L50r3j765
772a737J032J052q93O15L2r70N29K81O75j07r32R04p40l72K353q43j242J019q21
$$ plain form
649 -1081 -3171 517 -531 -1578 1244 1591 -731 -1061 864 253 -1667 1517 2638 -758 438 1488
665 1488 -1325 -624 1507 1383 418 -73 -106 -2173 -1935 2117 906 -1325 622 -1093 -3221 -77 1809
682 1809 543 -381 -191 -705 -2041 676 2746 -207 -265 1351 -1476 -368 2081 789 -276 122 641
699 641 295 -125 1362 144 -1849 266 750 -952 318 127 -1407 -1000 -258 572 -574 -981 344
716 344 -1097 -826 1874 369 -785 288 -453 -199 1296 1185 621 -503 -88 684 -160 1173 1164 -1170
734 -1170 -589 31 -355 453 11 -325 -650 -1372 274 541 -728 109 -512 -1267 326 573 311 138 -624
753 -624 94 56 347 1807 109 -545 783 -232 362 1305 -3 -366 -476 -540 415 -229 121 28 -1737
772 -1737 -705 347 -546 69 101 -869 -340 -59 616 509 -423 481 -259 -631 1722 879 -363 656 -165
791a65p3Q81k1j44j026j95R40p63O58O81j982M14O39p03J058M9q00J05k28P14
811C9L60o42R70q57q37J676J76n59O12r01k31N10j35O15o64m55O66j234Q96J009
831A014j688p6N77j079R97N54l90l3q50O84M05m05J292o97j077J312l88r4J118
850A176o81n18K8j13P99l20j14O3j075L08J036q71K97J57j385O09N94N0L11p83
870d32m7K53m47J444j81j323J230n39l00J363k73n91j65n33Q70NK31N35j803l8
890g41J068p33M52P77j377o2N8L44L31m14J86r0j055J257N48r41Q37k06n78O02
910B63K36N15p86o82R74k71j81J167j173j038J204l31K06K86m09m14j001R18J313
929G96j212M03M22k033K78J887j32J52m34k92m98l31K233L9j695J342n71j571
$$ plain form
791 -165 -238 643 622 478 -548 -743 197 -566 92 773 -1209 -795 -156 -859 199 248 -552 -447 -675 39
811 39 399 -243 727 -130 -967 709 885 326 938 37 -194 316 181 796 132 -323 343 -891 5 1014
831 1014 -674 -750 -173 -1252 -255 299 -91 -124 -974 -290 115 -290 1002 305 -772 540 152 58 1176
850 1176 495 -23 5 -108 691 371 257 320 -755 -447 589 -282 15 172 -1213 -604 -10 40 351 -432
870 -432 -479 -226 -673 771 590 -733 497 -42 -342 1021 748 157 -8 -541 329 334 565 1100 -703 -741
890 -741 327 -406 46 823 -554 -616 -558 -214 117 -297 -111 -201 -1256 1 549 -392 445 239 -339 263
910 263 499 1014 228 -454 520 249 68 1235 62 -976 228 -103 103 389 -20 -434 -1435 -517 796
929 796 -416 -13 409 -1624 -1346 541 409 561 127 -165 -663 -994 1239 1278 -417 925 354 -1217
947a217J590R31j082m26M65l05j055Q78J462j949j51K211k103j096K427p00q46
964i66J214R85j559r98J670j84j569L025O20l386O71J451k197Q76K746r31k703
981a235O28J266k101Q53L750k837k753K741q77j823L277J483l191r08K236r39
997d30j691L845J051m591J477K085l465M45L899j549k257K136K78l133N11M056
1013B667k429j805L849j908l818L213J800k695J070K314l065k676L449J694l098
1028a438K373K146n389m46M346j308r34L326q07m186L32L692j396r11M011k372
1044A039m646L474J287k648J817K320l052k324K401J057k695K082K998m472q82
1059b244L633k016j628M100M59l109K05J783k142j119M665K3m113J950R20m324
$$ plain form
947 -1217 373 1304 222 -204 261 -44 -1099 -221 1241 -708 -859 1352 -751 -1847 580 -120 -966
964 -966 248 1233 -326 -1324 346 162 -1407 1618 2238 -1148 -477 974 -1223 -347 2399 1468 -1235
981 -1235 -607 659 -1442 -589 3161 324 -2429 312 -565 -2388 889 2372 -819 -1727 509 -430
997 -430 -2121 1724 2775 -1816 -339 1746 -1719 -1274 2625 1076 -1181 955 1233 -1900 -1389 2667
1013 2667 238 -1567 2282 374 -3444 -231 1569 -1126 -56 2258 -807 -3483 -34 1660 -1438
1028 -1438 935 3081 -2308 -2754 1592 284 -650 2676 1869 -2317 -1985 1707 311 -600 3411 1039
1044 1039 -3607 -133 1154 -1494 323 2643 -409 -2733 -332 725 -1970 112 3110 -1362 -2244
1059 -2244 1389 -627 -2255 1845 2304 -805 -600 1183 -959 -2078 2587 2610 -1503 447 1367 -2957
1075b957J851M019k230j774J847q54l054K220L907k823j553K968k670k495M529
1090I31J210k848J006J043k708j165L964P30l012J638J290m507J009L910k100
1105C91j266K520p56l091J131K987k259j154L647j914l479L409P59k665J854K018
1121B132k619j366K442K2k095K339K198m221n20L216k022n11L433q20l086N80
1137h98J477j492m7L262j332l385K426O79k706J984K041k465j156J914J26j906
1153a478J675J665l198J11K949j725j183K666o80j890J305J028j551o37J883l90
1169E50j828J777Q94k917Q66J604j597nJ576o47j948Q77J697j456L1K033j640
1186a33j792K632K41j422J099J66j246l73J655K92j638J034M31k144R32J731j633
$$ plain form
1075 -2957 -1106 2913 683 -1091 756 -98 -3152 -932 2975 152 -1401 1567 -1103 -3598 931
1090 931 2141 -707 299 1342 -1366 -2531 1433 2163 -849 789 2079 -2428 -1419 2491 391
1105 391 -875 1645 889 -2202 -1071 1916 -343 -1497 2150 236 -3243 166 925 -1740 114 2132
1121 2132 -487 -1853 589 611 -1484 855 3053 -1168 -1688 1528 -494 -1005 2428 1608 -1478 -898
1137 -898 579 -913 -960 2302 970 -2415 11 690 -2016 -32 2009 -456 -1612 302 428 -1478
1153 -1478 197 1862 -1336 -1225 1724 -1 -1184 1482 802 -1088 217 1245 -306 -943 940 550
1169 550 -1278 499 1393 -1524 -658 946 -651 -656 920 273 -1675 -798 899 -557 -526 1507 -133
1186 -133 -1925 707 948 -474 625 791 -455 -828 827 1119 -519 515 946 -1198 -266 1465 -168
1203a68o67J203n14o85P49R74j316q32J571m04q95J724j56j738R28R24q41J83
1221D0Q16m97j056P25J188j431M4J321j505k75J389l52q25N06L2o81L0J104l54
1240B19j395J157L17j189R60P72j417K16M65J7k36L51M30q50l55J291m59k69Q65
1259H90q96o35R66J30m27m7K11l79o48O73P16j019L44J43j076P70O33l27q0r1
1279a49J16j02q7P31l07m31O81k93rN58m56k75J29j77K38J02l4q9m75J58M97o34
1301c08K73J83q29M50N1J11K31m32j9K41k98P74p6m91M73m00k59R25l69m0J62
1322C53n67K50J34j15K38l88k20K34n25O79J58p56L47j85k07P24k40P2K93n89
1342c10L13K22j67L04l06lM07l36K01J50p14K62N7q3L65k51k74M9m90N96R9m33
$$ plain form
1203 -168 -835 368 -146 -831 -82 892 -424 -1256 315 -89 -984 740 584 -1154 -226 698 -143 40
1221 40 856 359 -697 28 1216 -215 -171 1150 -355 -630 759 407 -418 88 120 -561 -531 573 219
1240 219 -1176 -19 298 -891 69 841 -576 -360 105 122 -114 237 667 -183 -538 753 294 25 890
1259 890 -6 -641 325 455 28 -19 192 -187 -835 -162 554 -465 -121 22 -1054 -284 349 22 -58 -149
1279 -149 -33 -135 -222 509 202 -229 452 159 150 708 252 -23 106 -71 167 269 235 146 -329 -171 326 -308
1301 -308 -35 148 -681 -231 -180 -69 162 -270 -289 -48 -346 428 352 -139 334 -66 -325 600 231 191 353
1322 353 -214 36 170 55 293 -95 -315 -81 -606 73 231 -525 -178 -363 -570 154 -86 -14 279 -310
1342 -310 3 225 58 362 56 53 460 124 325 475 -239 23 80 -3 362 111 -163 -114 -604 -8 91 -342
1364c42L31l31j70M39P2n8K21l50j98L12J86Q8k5k12J43k24M34M06o51J10j88
1385gk25L99J72k17j1n86J86K51p0L29k55m92M39j57P3O08n83k15J06N7N74j34
1407B42L4J11p61O23K71n57O01k91l87K38J63o1j90l40J23J7j9M24m99n29O20
1428a67k97K23O96m09m85J73R0J63K08M79l69q86L86M66l02M78J72r50J90K37
1448I6p4L90q3j84m88nO65n33j11O45m70l10N16k74Q8J4O9L2r4K05K06q99M98
1471a01O25m07K15J73r74K74L17J67L21k58l50o19j72R07J78k20K44q91l40M96
1491d15L85K89j3k75k61n38M97P00j40L41k16q30J62L37L43K59n7k44l32n36M91
1512e3K28l85P39j09q79P6j21J53N31m6K51p50n07M14m8N66Q13m85o83l9k12L52
$$ plain form
1364 -342 -11 -342 -512 -73 -1 -59 162 -188 -386 -74 112 200 175 -37 106 -118 316 722 71 181 -7
1385 -7 -232 167 339 122 111 -475 -289 -38 -108 221 -34 -526 -87 -244 -171 437 -146 -361 -255 -198 376 242
1407 242 276 387 -374 249 520 -37 564 273 -114 124 287 226 36 -304 -181 -164 -183 241 -258 -787 -167
1428 -167 -464 -241 455 46 -439 -266 -176 -13 195 674 305 -581 -195 271 -31 447 619 -331 -141 96
1448 96 22 412 329 145 -343 -348 317 -216 -327 318 -152 -462 54 -220 -132 -118 -49 -17 -111 94 300 -599 -101
1471 -101 524 117 332 505 -469 -195 122 289 610 352 2 -617 -789 118 296 76 320 -571 -911 -415
1491 -415 -30 259 246 -29 -290 -828 -331 369 229 570 354 -476 -314 23 366 625 568 324 -8 -544 -53
1512 -53 175 -210 529 420 -459 -383 -504 -351 180 134 385 -365 -872 -458 -506 60 873 388 -295 -334 -546 -194
1534a94P27K48j74r14k38K10J43Q93L23o85o46k73p3N48O36N3m44o43L9l10M49
1555c25Q27k60j14k08n77m3R01J81O0k77k53L5k96N20L65k55L27m02p80L76K61
1576F3j80N16o0m01l24k69N01rK83M88o56p30M85k72O77O13l17l63m61k4M86M01
1598D47K32J13j138J89J43k12P62J27p65k25J38M0K22%R0l11n13P31l71J60L87
1619B46n06J9M33k53P0m1J02Oj47M15J7n79L21K04m57O23nm95j16j5J43J88j52
1642B1J34l56l15L50lL7M42o04m8K30O4K20m5j33M4k92L94N02n48J18j32l00M04
1665A84K11k72M0m18J28J19j14L98k93n69L66J91j40M18k66k01j5m8M70r2j77
1686h0K61l28J13M61m94K20%j92J58L2%J51m30N0L99n53L20J80p61P3L16L7M6
$$ plain form
1534 -194 533 781 607 -307 -545 -335 -192 701 1024 339 -307 -580 -653 -105 531 584 140 -503 -464 -774 -325
1555 -325 502 242 128 -80 -657 -700 201 382 442 165 -88 -53 -349 171 536 281 608 206 -574 -198 63
1576 63 -117 399 339 -62 -386 -655 -154 -163 120 608 -48 -778 -293 -565 112 725 408 45 -416 -440 46 447
1598 447 679 792 -346 -157 -14 -226 536 663 -102 -327 -189 -149 73 73 163 -148 -661 70 -301 -141 246
1619 246 -260 -241 192 -61 9 -32 70 76 -71 344 361 -218 103 307 -150 473 468 -27 -143 -158 -15 173 21
1642 21 155 -201 -516 -166 -169 -132 310 -294 -342 -112 -48 172 127 -6 38 -254 140 642 94 212 80 -220 184
1665 184 395 123 163 -255 -127 -8 -122 276 -17 -586 -220 -29 -169 249 -17 -218 -233 -281 189 97 -80
1686 -80 181 -147 -34 427 -67 153 153 -39 119 151 151 302 -128 -78 321 -232 88 268 -493 -420 -104 -67 -21
1709b1p5J15l47j22N83P8k91M00l31l34N56j05J77J16k58j33j95K26L28m78L18
1730B07l3n24K60K06j89L3K28k85j3rJ65k35J9M04l58j67O43l48l02L62j5k1J82
1753B10N3j89j12J87L67m88J37M5n03L16K25j55j12R3j96j02j02M37j22m17M64
1774C6k32l48O41j04K1O3j37Q1J2K6L43k45j76K12k67L07L40p62J22K20n12N46
1796A87k7j32j09m06M80J55k59J36n6l09L67q5P5L59m71J57pj74L36J4k16Q3k39
1819a41K16K83k49N0j48k76K31J29p3P6l80o1K12j41L53q6k55J24k12L41K19k44
1841c2R0j59j36M43n1K7M0l71J85J08k60L86o7m46K30J8K1K81l63j88J26l27M32
1864a3k6j94J34k69J75K42M8Oo8l45N12j63J26P5k54p5O0J79K64k18j60l1j5Q1
$$ plain form
1709 -21 -96 19 -328 -450 133 211 -80 320 -11 -345 211 106 283 399 141 8 -187 39 367 -111 207
1730 207 174 -350 -90 116 -73 -40 188 -97 -110 -119 46 -189 -170 234 -124 -291 352 4 -298 64 49 28 210
1753 210 263 74 -38 149 516 28 165 210 -293 23 248 93 -19 74 -122 -224 -326 111 -11 -428 36
1774 36 -196 -544 97 -7 14 77 -60 21 33 59 402 157 -19 193 -74 233 573 -189 -67 153 -359 187
1796 187 160 28 -81 -487 -7 148 -111 25 -31 -340 27 -58 17 376 -95 62 55 -119 217 231 15 98 -141
1819 -141 75 358 109 159 11 -265 -34 95 22 98 -282 -343 -131 -272 81 -5 -260 -136 -348 -7 212 -32
1841 -32 58 -101 -237 206 155 182 222 -149 36 144 -116 270 203 -243 -13 5 26 307 -56 -244 -118 -445 -13
1864 -13 -39 -233 -99 -368 -193 49 97 103 35 -310 202 39 165 240 -14 -89 -29 150 414 196 36 5 -10 71
1888G1J70k81O6p2k56M71j33j03K2j56j33M35m6O7J9l20P3P7M8K12j98l2J40k18
1912g7L76q4l64L21j63j39L38k83J10k0k36K24j11R8J21l03KK28k48J89J29l07
1934a99R3J17J42j31J7M1k72J33K45p8o1L03l13j55K06j57J98J27r1k07j36rL66
1957A79j71o0O5k48l0K18j49L66q3j65o6O6J31J03k36M19j57l66M08j32k22L88
1979B58k30J20p3k84K64k21j76L41j41J7K87o39K01K22L6O5k23j2o2j3M58K13
2001D08m35K22j09k57J95K43Q0j06k69L9l4j37N65m06k24P1j27q0M47n2L8r8j68
2024a94l9K3J44K34l32L21J01m03J73Q4k35M02K5L4k55k38J51L9KM14j30n42N8
2047a63j73K84K57O5k05l52j61L78n6J55R4k53o8J83j22J84L76k84j69k1J28J38
$$ plain form
1888 71 241 -40 26 -46 -302 169 36 -67 -45 -201 -334 101 55 122 141 -179 -106 -29 19 231 33 1 141 -77
1912 -77 299 215 -149 172 9 -130 208 -75 35 15 -221 3 -108 -10 111 -192 -190 38 -210 -21 108 -199
1934 -199 -106 11 153 22 39 80 -192 -59 186 108 47 350 37 -118 88 -69 129 256 165 -42 -178 -187 179
1957 179 8 -52 13 -235 -265 -47 -196 170 87 -78 -144 -78 53 156 -80 339 182 -184 224 92 -130 258
1979 258 28 148 75 -209 55 -166 -342 -1 -142 -125 162 -477 -276 -54 -18 47 -176 -188 -250 -263 195 408
2001 408 -27 195 86 -171 24 267 347 241 -28 11 -23 -160 405 -1 -225 -154 -281 -361 86 34 72 -26 -194
2024 -194 -233 -210 -66 168 -164 157 258 -145 28 112 -123 279 304 338 83 -155 -4 35 37 451 321 -221 -163
2047 -163 -336 -52 205 270 65 -287 -448 -70 -126 29 123 -130 -198 -15 -137 47 423 139 -30 -51 77 215
2069B15r6J25k1l32O3O1j86K07j65j27L81k33K5o8j22K02O2M0J37m15k4K56m9
2092f4K82Q3m81L81l70L11L05j83j47j30j11K55r2o2K57l64j08K85j05k8J25k18
2114a79r6K57K7o1L1m5M0j58J19K66l83L57k76L7J67j00J77l9j28pp5L0K78k59
2138b0N6J26k35j11M20k48m6q2MO6r7M2K00k40J87j91lJ65J6J9J56j46J68o9j24
2163A3K3N5N8J6j26k07J18o3N7K96k79M6k17j15K04K9K56l1l05M2j49K23K45l0
2187A59K1j28rj12J60L8P4L2l58J88r2m4J41J0q3Q8l07K81j47J3J07j38j37J64
2211g9J4q3J3J46L5r8P2pk83M98k08j5K82j89k3J2r1J88P0k14O6j86j79M43k21
2236c7n2J27k95K2K27m2J7L8n2k6j89J68K34j86L5K23k52J46J89j62N6j02P1l8
$$ plain form
2069 215 119 244 223 -109 -46 15 -171 36 -129 -256 125 -108 -83 -151 -273 -71 -9 31 168 -247 -271 -15 -64
2092 -64 218 301 -180 201 -169 142 447 264 117 -13 -124 131 39 -23 234 -130 -238 47 -58 -86 39 -179
2114 -179 -275 -18 9 -52 -21 -66 -26 -184 -65 201 -182 175 -101 -64 103 3 180 141 13 6 -69 -39 239 -20
2138 -20 36 162 -73 -184 236 -12 -58 -140 -136 -70 -167 -125 75 -165 22 -169 -172 -7 9 28 184 38 206 137 13
2163 13 36 91 149 165 39 -168 -50 -113 -56 240 -39 7 -210 -325 -121 -92 164 133 -172 -130 -279 -56 189 159
2187 159 180 52 43 -69 91 129 203 235 -123 65 -27 -71 70 80 -3 85 -222 59 -88 -75 32 -106 -243 -79
2211 -79 -65 -148 -135 11 46 -52 20 13 -270 228 20 5 287 98 75 87 -4 184 254 40 106 -80 -259 184 -37
2236 -37 -89 38 -257 -235 -8 -50 -33 5 -47 -73 -262 -94 140 -46 -11 212 -40 106 295 133 189 87 158 120
2260A20r7J35k31j79M99k09j53K06l76l1J62JK75k19k3J3j56M23Q1l17J01J79
2282B04k17j42L28m6j8j42K4J82k10K02j7l30J06K00j98J14j79k20K01M4K34j55
2304c5j0J42k96J13K03p0o0M8ll3J0n2J88k34J42KM2J74j71j40J7m7j36L53oj43
2330bj59k6K86Lj60q4P4j1Q8k6O4r0k06L35Q0j04J42j99J08J68k56o2K77NL5l76
2356i6j63K69o1K64k19k60Q4M7J09J75k69j3K19j87M3J25j39J61k40J0L03l0j59
2379b7K17j98R8P8k27K38n8j36L2q7J50J04l43J22K51m18J38J39j18n6j85L21
2401C5P6k23L00k31o5L73n1j18K17k85p4K08k47J95p1J8J33k65R8J8j33LKp9Q
2426a58J21L1K9n6n7p3J72L7m7j77K87j8j77K13M3j18J3N1K8q3j51K16j86m4K05
$$ plain form
2260 120 23 158 -73 -252 247 38 -115 91 -285 -316 -154 -153 122 -97 -120 -107 -263 160 241 -76 25 204
2282 204 -13 -155 173 127 109 -33 -9 173 -37 165 148 -182 -76 124 -74 40 -139 -359 -158 -114 120 -35
2304 -35 -45 97 -199 -86 117 47 -13 35 32 -1 9 -43 145 -89 53 55 97 271 100 -40 -23 -70 -206 147 141 -2
2330 -2 -161 -187 99 102 -58 -142 -68 -79 9 -17 47 -43 -249 86 166 62 204 5 113 281 25 -37 240 245 280 -96
2356 -96 -259 10 -51 213 -6 -266 -182 -135 -26 149 -120 -133 86 -101 -58 67 -72 89 -151 -141 162 132 -27
2379 -27 190 -8 90 168 -59 179 121 -15 17 -70 80 184 -159 -37 214 -204 -66 73 -45 -101 -286 35
2401 35 111 -112 188 -43 -108 265 214 96 313 28 -46 162 -85 110 39 57 190 -75 23 41 -92 -89 -87 -166 -158
2426 -158 -37 -6 23 -33 -90 -163 9 46 -1 -178 109 91 -86 127 170 52 65 116 144 61 -90 126 -60 -104 101
2451A01k66L8K12j48j86J14J08j1r4Q0j50j91K36K99q4L5r2p0J46K98j93j76Q2
2474H8K8k44J39J87j51n9O5j57P5J46j31n2m6J49q0q5j1K14m11K26K06j29k56
2497b89L49j29r5K43L85l50k85L27k49J32L68r2l44R2j01j35K44J55p3m87J43
2518a91K16m09L62J47k97j20L62P7k54M1J72k27R6L91k93l59M85J32n67M18J63
2539C45k80j30J62J5k77K85K42n11K6J71k31P4M91k94n20K42L65k59o6L54j71
2560C3l76M52J28n22L27J86l35O3M64l12k40K43M5m33K72M63n62j34L05j48j92
2581b73K32J31j86r7J28Q0l68M53J62o41K39L01k18L5L74r0n95M21Q4l63J21M09
2603C39l68j33M96j85l46R6L42k14j63L01k45l16L12L55m64K23J21j87m25O79
$$ plain form
2451 101 -165 -127 85 -63 -249 -135 -27 -38 -132 -52 -202 -393 -157 142 58 93 1 -69 77 375 182 6 88
2474 88 116 -128 11 198 47 -12 53 -104 -29 117 -14 -66 -112 37 -43 -128 -139 75 -336 -110 96 -33 -289
2497 -289 60 -69 -164 79 464 114 -171 156 -93 39 407 315 -29 63 -38 -173 71 226 153 -334 -191
2518 -191 25 -384 -22 125 -172 -292 70 147 -107 -66 106 -121 -25 366 73 -286 199 331 -236 182 345
2539 345 65 -65 97 112 -165 120 362 -149 -123 48 -183 -109 382 88 -432 -190 175 -84 -150 204 33
2560 33 -343 109 237 -285 42 228 -107 -44 420 108 -132 111 156 -277 -5 458 -104 -238 67 -81 -273
2581 -273 -41 90 -96 -193 -65 15 -353 100 262 -379 -140 161 -57 -22 352 262 -333 88 172 -191 -70 339
2603 339 -29 -162 334 149 -197 -101 241 27 -136 165 -80 -396 -84 271 -193 30 151 -36 -461 218
2623B18o5l13L45J48o03o4O60k07m64P24l63m61L46L52k38N8K58k39o10N76J48
2644B06m24K69L45n32k18N18j76j92M41o8k10j93L02P1k86M84m2o80L46L13m87
2665b13J91M95k71l80R6K41n27L29L76m57k53N21l72k06M45K15k41p4N6O7l45
2686c07M72J09j92Mj8m15J86N74j61j45%j1k99K12K73j56n44N75k38l80L84K99
2708B22l52J4K8M7l19M14J58m44J59M07l39q3J81k63J36J69J12k59j24K65m9k04
2730a24M39r8m22R0J09j06J33K01j53l10Q2m5J38LJ97l84L8K91o9pJ87mk65n1
2754a30J14J64k84K06N0j64o0K15j65m9J65K1q9J11k30P8p8K94q6j92J75qk19
2777a61K24k7J47o0r5J94l01J62J21k07L7J53k60l1J54m5J79j73j06J6K2K92l63
$$ plain form
2623 218 153 -160 185 333 -270 -334 326 119 -345 379 16 -445 -99 253 15 73 331 92 -518 58 206
2644 206 -218 51 396 -136 -354 164 -12 -204 237 169 -41 -234 68 139 -147 337 295 -385 -39 274 -213
2665 -213 -22 473 202 -178 -82 159 -368 -39 337 -120 -373 148 -224 -430 15 230 -11 -85 -29 38 -307
2686 -307 165 274 82 86 68 -347 -161 413 252 107 107 96 -203 9 282 126 -418 157 -81 -461 -77 222
2708 222 -130 -116 -88 -41 -360 54 212 -232 -73 334 -5 -88 93 -170 -34 135 247 -12 -136 129 80 -124
2730 -124 315 217 -205 -115 -6 -112 21 222 69 -241 -159 -204 -66 -63 134 -250 -212 79 10 3 190 186 -79 -130
2754 -130 -16 148 -136 70 120 -44 -104 111 -54 -103 62 83 -6 105 -125 -47 -125 169 83 -109 66 58 -161
2777 -161 63 36 183 123 28 222 -79 83 204 -3 34 187 -73 -104 50 5 184 11 -95 -79 -57 235 -128
2800a28r3K80j51j74L21n8p7O2m7nJ38k25J94N8j62J80p8q1J59k05J62J15j18
2823F7j15j84K14Q6j72J84R6r2k36J92j94P1J43j61J81j50j04K70p1j7J19j75
2845d8J99p2l0J12j05r7N5p2K83J8k58J8o4R6o3oq6K5L0P8o9J29j6j20N1n4n8
2872a24K83k75jJ12j86J3L39k69K29j08qm8N3M4K2j72J16o1m0l3J03q4Oj0Q4J28
2898A13j44K7m5l9J36j09L2O1n6J16j50J12N0N9k74L39k69J69k5j75j06J50j80
2921b08K94lj80Q0j09J7P4m8O7M8r8J71j55J56n8l1M3N9j57O6P4j72K84j92q6
2946f4K16j08r3O6j08K6K6R4J9l24K0J53J17j94K56j18j39J21j7J11K2k0j81n1
2970a70J62K48k22M8M0j99K46L3K2k78j6O0k53J77R9J16k89J17M6k3j40L36k07
$$ plain form
2800 -128 -221 59 -92 -266 55 -3 -80 -18 -65 -70 68 -157 37 95 -67 113 35 -46 113 -92 70 185 67
2823 67 -48 -232 -18 68 -104 80 176 84 -152 40 -154 -83 60 -101 80 -70 -174 96 25 8 127 -48
2845 -48 151 79 49 161 56 -41 14 -58 225 243 -15 3 -61 35 -28 -34 -120 -95 -65 13 -56 73 57 -63 -12 -66 -124
2872 -124 159 -116 -117 -5 -191 -178 161 -108 121 13 5 -43 10 54 76 -96 20 -41 -81 -114 -11 -95 -89 -99 -15 113
2898 113 -31 -4 -49 -88 48 -61 -29 32 -24 92 -58 54 104 163 -111 228 -41 128 103 -72 -178 -28 -208
2921 -208 86 83 -97 -17 -126 -109 -35 -83 -16 32 -66 105 -50 106 48 17 60 119 -38 28 102 -70 214 22 -64
2946 -64 152 44 -49 17 -91 -65 -39 55 74 -250 -230 -77 40 -154 102 -16 -155 -34 -51 60 82 62 -119 -170
2970 -170 -8 240 18 66 106 -93 153 186 208 -70 -86 -26 -279 -102 -3 113 -176 -59 -13 -36 -176 160 -47
2993d7j6J15O8k18J49m4j48L7L44k86l4N1J04k14pK97j58m0J16J8l82L64n5k04
3017a90K9K57k75J59m2M7j92K61K19m31P7K84l26J28J16k3L9j77L36m49J43K62
3039B52j22l13K44M8k57J92L9k11j8J28rk83L11J21j55j37L57k33k69N13k21k37
3061b60L50J13k77J60J05k35j25L53L3m10K79P8l43O6L48q0k31P7N0l25J24L95
3083B45l13l48N33j96k00L73j25moJ88k20m5L26L5m56J34K92k75k5L68p0j60k2
3106B9O7l55J56K82j40k45K81j68k68L28O3j48J18Q9j63mJ7L56l73N9K92m18J33
3129a2K97l08j00L73O4k70k21K08j43P8K07%n07j3M40j11LL46k27l76K95k4q9
3152i0J8M76l90l39L60J79k89J30K68m55J5M7J52k95K70L19n73J06J61k05j43
$$ plain form
2993 -47 -63 52 120 -98 51 7 -141 -104 240 -46 -80 -29 75 -139 -146 151 -7 -47 69 87 -295 69 14 -190
3017 -190 -161 96 -179 -20 -62 -15 -207 54 273 -158 -81 203 -123 5 121 98 137 -40 296 -153 -10 252
3039 252 130 -183 61 109 -148 44 83 -128 -146 -18 -27 -310 1 122 -33 -170 187 -46 -315 198 -23 -260
3061 -260 90 203 -74 86 191 -44 -169 184 217 -193 86 164 -179 -113 235 155 -76 1 51 -274 -150 245
3083 245 -68 -416 117 -79 -279 94 -31 -35 -41 147 -73 -118 208 243 -213 -79 213 -62 -87 281 211 51 29
3106 29 96 -259 -103 179 39 -206 75 -93 -361 -33 30 -118 0 89 -74 -78 -61 295 -78 -19 273 -145 -12
3129 -12 285 -23 -123 250 314 44 -177 31 -112 -34 173 173 -334 -347 93 -18 -15 331 104 -272 23 -1 -90
3152 -90 -72 404 14 -325 35 214 -75 55 323 -132 -117 -70 82 -213 57 376 -197 -91 70 -135 -278
3173b78M63N1n68J80J46j23j90N31m2k54J45J05m57K98J87k36k3K69j26k77J60
3194c9N47m29K8o8j77j11N11l16J6q4K60k61PJ90k9k81J57K36m82K77K63l77P9
3217h3L18j13k75J29J41j84Q5L20l19j75RJ11p0K08M9l50p4K75l4j29K54Ll37
3240b41p3M46o7o7J92r2k95J00J47j52K0K13j26r0K50j93k3R0J56j47j13R8j20
3263h7p5K11O7j59q4J51j83Q7KJ91k74K10J6Q5Jk77J75j35L08q0l66K46P8j10
3287bJ09j76p7R6k8J54q6R9R2k97j01N01l29k0J49k31J14k18J08K10j33j00K66
3310A00k04K01l2qJ11j70MRL7J1k05L55j79J1j11J2R7L6j07J20p6l0R2j09p8n4
3336a67K55j05j8J72k87J48J9L0r1J40k5j8j60J73M8p3j3J10j92J25J9j83K05
$$ plain form
3173 -278 185 236 -332 -152 -6 -129 -319 212 170 -84 61 166 -291 7 194 -42 -65 204 78 -199 -39
3194 -39 508 79 107 39 -138 -249 262 -54 -38 -122 138 -123 -116 74 45 -236 -79 157 -325 -48 215 -162 -83
3217 -83 235 122 -153 -24 117 -67 18 338 19 -156 -147 -36 -106 102 151 -199 -273 2 -32 -161 93 96 -241
3240 -241 -314 132 65 -2 190 98 -197 -97 50 -102 -82 131 5 -85 165 -28 -51 39 195 48 -65 33 -87
3263 -87 -162 49 116 -43 -127 24 -159 -72 -70 121 -153 57 73 158 159 -118 57 -78 230 150 -216 30 108 -2
3287 -2 107 -69 -146 -50 -78 76 -10 89 181 -116 -217 284 -45 -65 84 -147 -33 -251 -143 67 -66 -166 100
3310 100 -104 97 65 57 168 -2 2 11 48 59 -146 209 30 41 -70 -58 39 75 -32 88 12 -18 74 -35 -113 -167
3336 -167 88 -17 -35 137 -150 -2 17 47 -44 96 71 53 -107 66 114 41 28 138 -54 71 90 -93 112
3359A12j27j23P0L9J7J36k85K53m5j5j93K45j44K29j57P7n0l0J99j69kJ48j47
3382C8q5j03O7J01K9N1o7j95j9J62j15R2J10p4j7rJ3P6j61K11j37J05J59k94K59
3407A97j71k5n6J39R9q5Kj83M7Q8p1J77k16Q0n9j5K40k28kJ66j77Q0n6nP1j19
3433h2m0Q7n3J38j6j21J08N6%l5M9J9p4j09R5J13j90k7J98k14J12O3p8J49j45
3458Cq8m4J62jj46P3oM7k1K36j37m4m4J4K2j11K35j38j17J74k6j41J10p0O8j76
3484a66J25P4j59r4J28j1J68r3J44j5kl5p3R3R0k43o0K34j29o4J31J04k41J26
3508C2L3j8lK52j70j50n4N8j13j8J48m8q1J48J19j73mP2j54N1K43k48j15J58R1
3533E6r5L1K14j47j5O7k16m2J32J44j80p8K09k3q0J54p6m00J41K85k02J52K14
$$ plain form
3359 112 -15 -138 -68 -29 -12 124 -161 92 47 32 -161 84 -60 169 12 89 39 9 208 39 37 185 38
3382 38 -47 -150 -83 18 47 98 31 -164 -183 -21 -136 -44 66 -8 -25 -34 -21 55 -106 105 -32 73 232 -62 197
3407 197 26 1 -55 84 183 98 100 -83 -36 52 -19 158 -58 22 -37 -52 188 -40 -42 124 -53 27 -29 -34 37 -82
3433 -82 -122 -35 -88 50 34 -87 21 77 77 42 91 110 36 -73 22 135 -55 -82 116 -98 14 77 -1 148 3
3458 3 -85 -129 33 32 -114 -41 -47 0 -21 215 78 34 -10 4 26 -85 150 12 -105 69 43 -98 12 -58 10 -166
3484 -166 -41 33 -126 -220 -92 -103 65 -28 116 101 99 64 -9 84 174 -69 -129 105 -24 -88 43 147 -94 32
3508 32 65 47 44 296 126 -24 -78 -20 -133 -151 -3 -51 -132 16 135 -38 -42 30 -124 -73 170 -78 -193 -35 56
3533 56 -39 -8 206 59 44 111 -105 -147 -15 129 -51 -129 80 57 -23 131 55 -345 -204 81 -121 31 245
3556B45k20j00N2n5pL9L01l73j27L56J5k61J87J18k48N8J64j29j71J70J70l35
3578a51P8J47j52r0K46R9m40L68K4k24r5L74J4l14J75M4l67L58J41l0j82L9j06
3601d4k67L62P1j62k8J40l24J19J91Q3k85J10J13l04J55L76k31j54K20k32KJ21
3623C2mr2O1J17L8k82K8L48k88K9K62k90J2K3k15Q9J75J40k80o8J06r8R0J11L6
3648H0k66K7J82j86N5M32l02j89J29Jn7m0L04j51k83K35J16j41J6K52k81m9J03
3671a3L9k72K81R7k16j1J81k61k0L80k05n0J76j51j40O7R7K31l14J75n3j59L1
3694a10K11k9j33J74p9j11J08J25k59m9J50j09r5K80J03p9M4p6k62l7L71j09m
3717B5R0K8j46j63L93k77R8J34n6j03o2K2l6r4L64l8k90J05j55J18QJ41l33J49
$$ plain form
3556 245 25 -75 -23 -78 -85 -46 255 -118 -245 111 126 -135 52 170 -78 -20 144 15 -156 14 184 -151
3578 -151 -73 74 -78 -168 78 177 -263 105 129 -95 -190 184 198 -116 59 103 -264 94 235 205 23 62 -44
3601 -44 -311 51 122 -40 -68 72 -252 -133 58 141 -144 -34 79 -225 -70 306 75 -79 141 -91 -89 32
3623 32 28 -64 -3 114 152 -130 -102 246 -42 -13 249 -41 -29 -6 -221 -132 43 183 -97 -165 -59 -157 -67 44 80
3648 80 -186 -159 23 -163 -108 324 22 -167 -38 -37 -94 -134 170 19 -264 -29 87 -54 -38 214 -67 -116 -13
3671 -13 26 -246 35 132 -84 -95 86 -175 -195 185 -20 -70 106 -45 -185 -118 -21 210 -104 71 18 -141 -110
3694 -110 101 72 -61 113 34 -77 31 156 -103 -152 -2 -111 -206 74 177 98 142 66 -196 -233 138 29 25
3717 25 115 143 -3 -166 227 -50 48 182 126 23 -39 -17 -53 -147 217 179 -111 -6 -161 -43 -35 106 -227 -78
3741g8k2J34o5J38k4k11k0L46k75l1L06j43Qj75O8j32R9K32k38o8OJ93j08J39
3765G9J56j90o4R6j3r0j98L03p9j13K01j72m0K89j36n6oQ0j88J43j2j9J31o8J4
3790D8j67J92Om8j69J36N6j48K16j46J3l0J49p3L0Qp2PJ75j46j19O4M2J35k12
3815e3n5J63O7j36J14O9k01Po6K8P9K0o1K5o2Q8j25J09Mo5K6j31K47l3P2k11J26
3842D5j6Q6m3P3n3j04N3J85p3n6j24l4M0o3Q4j16M8M4L5o5P1M8j8Mj19Q4J3K6
3870E5k9rM9J20j82J1J80j06j65J56l4J52k64L0q5J52k8L9L7j21Om0qkj02Q5J88
3897H5m7J00q3j14P2L5r0M9j1J15L9k04R1J1J13k08K01j83J12k4j38J07n3M5m3
3922b3P6m3O1L7j24Qm7m3J44J80k20r5P1j6J72j14o9J78l02Q4J77k63K72K0j65
$$ plain form
3741 -78 -100 34 -31 107 83 -128 -148 198 -77 -108 198 55 63 -112 -44 -176 -77 155 -83 -151 -145 48 -60 79
3765 79 235 45 -19 77 64 -26 -224 79 0 -113 88 -84 -124 165 29 -27 -33 47 -141 2 -10 -29 102 34 48
3790 48 -119 73 79 31 -138 -2 54 -94 122 -24 -11 -41 108 35 65 73 1 8 183 37 -82 -18 24 159 -53
3815 -53 -108 55 122 -14 100 169 -32 -25 -91 -63 16 36 -25 0 -62 26 -99 10 14 -51 -25 -156 91 58 130 -81 45
3842 45 29 115 72 145 92 -12 41 226 153 97 -27 -61 -21 -84 0 -116 -68 -24 11 -54 17 65 47 51 -68 16 29 55
3870 55 26 17 66 186 4 15 195 89 -76 80 46 198 -66 -36 -121 31 3 42 79 -42 -36 -76 -84 -86 -188 -103 85
3897 85 38 138 55 -59 13 48 -42 7 -4 111 150 -54 37 48 161 -47 154 -29 83 59 -79 28 -25 20 -23
3922 -23 53 10 71 108 -16 -8 -55 -98 46 226 6 -89 -18 -34 138 24 -45 133 -169 -85 92 -171 101 121 -44
3947d4J86k53J36K9j10O3j6r1J39O0r8j2j50P9K18k2j36J26j56K0oR4m0K8o3j0
3973b9lQ8j69K7P7j31J54l0n4O6j47J32J86j33Jj06l1J04R1j02L2K0O6q0j07J91
3999A13j00k0J8J51l33K59M3j00N9j63L16k76PJ62j56M6Q1q6m1J54p8j90J96j70
4023a08O2R1q2J29j37k8K06j91P2M0k04L10L3j2k36J40j18rOQ8p3M5r9J15j41
4048a01K18j64J0L3m0R4j11K00r6j04N1k0P3m0J36J7k34LK00j21j4J79L0l08J38
4073B9m2j45K07N2q7n2J62j63q3J13K19q5j76J4O6k05L46P5k44QJ55j88r2J59
4097D3R1j78J47L1k66J70Q6lo0o3m2j28M8L49k39j26J64j38j17J63K08k59J03
4120a6J48j46J20M4k10L8P4J07k48J0J45p7j18K29j65M5n5L5Q0l9J59j47l01L62
$$ plain form
3947 -44 142 -111 25 54 -56 7 -9 -100 39 99 1 -11 -161 -82 136 114 -22 104 -52 -32 -38 56 16 44 -19 -29
3973 -29 -32 56 -113 -86 -9 -140 14 -16 -70 -4 -151 -19 167 34 35 -71 -102 2 93 -9 23 43 109 29 -78 113
3999 113 13 -7 11 162 -171 88 131 31 90 -73 243 -33 -26 136 -20 26 107 21 -20 134 56 -134 62 -108
4023 -108 -46 45 -37 92 -45 -73 133 -58 14 54 -150 160 193 181 -55 85 -33 -42 -36 52 -21 24 -75 40 -101
4048 -101 117 -47 -37 -4 -44 50 -61 139 43 -61 -10 -30 43 3 139 156 -78 -75 125 4 -10 169 199 -109 29
4073 29 -13 -158 49 101 14 -38 124 -39 -122 -9 210 125 -51 -37 29 -176 170 245 1 9 164 -24 -116 43
4097 43 134 -44 103 134 -132 38 124 121 61 -2 -44 -172 -124 225 -14 -140 24 -114 -231 -68 140 -119 -16
4120 -16 132 -14 106 150 -60 -22 52 159 -89 -79 66 -11 -129 100 -65 -20 -75 -40 40 1 160 13 -288 74
4144G4n2k27L74j04n6j68K08jo3J43Rj33k33K73j74J87R5L9m13Q3J64n4J40j04
4168GM9j54P8q0m0K19j13j11J79k7J6k19J29J24rn1kJl8P8P3m4j16J54p5j75K39
4195I2j39K41j35o9j82K04r4J77k20J68k77J31j54L40J1j69J90k99kJ97P2n9J35
4218A59j90j8j3O1l0J70j3J6k32m6M46k27j1k11qm0R4J61m9R6k00J61j79K31n6
4243G2q3M2k4n9P6R6j68N4L8M2j36n7Q9J62j77K03q1r3J08o1r9J04O1j60L7Q3
4269F9L0k52J19K16k35m0J02m4rJ62p2k2N0K4j41%J01M9k22L0J43k38K5J76Q0
4294A01j24N4j3k95K51J00r0j10J00J03p9R2k25J17o7mP9k0J79j56K2l1L6p9j41
4319b00L32r1nJj25O3Mr3J75p4J28j18j42K16m6L1m5J01k64N0J38o0J5p6J62j04
$$ plain form
4144 74 22 -205 169 65 9 -159 49 48 -15 128 137 4 -229 44 -130 57 152 191 -222 -139 25 -29 111 7
4168 7 56 -98 -20 -100 -140 79 -34 -145 34 7 23 -196 -67 57 48 -3 -5 -4 -42 36 109 65 -51 103 28 -147 92
4195 92 -47 194 59 -10 -192 12 -82 95 -125 43 -234 -103 -257 83 94 -75 115 -184 -186 11 83 24 159
4218 159 -31 -49 -62 -1 -31 139 126 142 -90 -136 310 83 72 -139 -147 -187 -93 68 19 115 -85 76 -103 128 72
4243 72 -11 31 7 -52 24 120 -48 6 44 86 -50 -107 -18 144 -33 170 89 -4 104 43 -56 48 109 -51 -14 69
4269 69 99 -153 -34 182 -53 -93 9 -35 -44 118 46 24 74 98 -43 -43 58 107 -115 -85 58 -180 -155 21 101
4294 101 -23 31 18 -277 -26 74 -16 -126 -26 77 -2 90 -135 -18 -85 -89 -10 -30 149 -7 15 -16 20 -59 -200
4319 -200 132 41 36 37 -88 -25 -21 -114 61 -13 115 -3 -145 71 25 56 11 112 -152 -102 36 -24 -9 -85 77 -27
4345b7j49J44r3J31l7mJ21j53o2R5R0r0J4J6K8km3J17p1j30Q8l0r3P5O6j90K27
4372C8j33K3JQ1Rr1Q2K45k27M0l8j91J39q9O8mN9k8l0J00J06k35J77j19Q5J09
4398A77j82r0Q5Rr2L3J24J5j33R4j22P4JM1R8l35K52r2q8J42j11K13j49J34k72
4423a74J31J36n6o3J27k0j99N3o5n0P3N7R9M7K1QJ5j29m8J69r7M2j5q5J15K7k74
4450a55nQ0J28L0p2K0j68J68J1j64J17J13K2o0m5N3O5j00l3q5J32m6L9o6o0J14
4476C3r2J05q6J44j54Ro3J85j34J20m6p9Q4J64k11J7l5J24n0j09J39p1N6j6j39
4501a05R7LM9l9K2K5j30J71j43M0P6j33l9O0J88k77J40M8n4p2n3J29M1j7J9Q7
4527A33j12J20j72J0j45K94m1l3j37R6O0l1r3J76j73J00Pr1KK7kj02J13Q5j21
$$ plain form
4345 -27 -176 -32 -125 6 -31 -35 86 -67 -129 -34 56 -34 -20 -4 24 22 -21 96 25 -105 -17 -47 -140 -65 1 -189 38
4372 38 -95 -72 -71 10 19 -72 10 255 28 68 30 -161 -22 -111 -43 -47 12 -16 -46 54 160 -75 102 -17 68 177
4398 177 -5 -95 -10 -1 -93 -60 64 79 -54 40 -82 -8 -7 34 132 -203 49 -43 -131 11 -100 113 -36 98 -174
4423 -174 -43 93 37 -26 101 81 -118 -65 -130 -180 -107 -50 49 96 117 125 140 11 -37 132 35 77 62 -23 92 119 -155
4450 -155 -160 -80 48 78 6 26 -142 26 37 -127 -10 103 125 65 20 73 138 38 5 -80 52 6 45 -21 -81 33
4476 33 -59 46 -40 104 -50 -41 -104 81 -53 67 21 -58 26 190 -21 -4 -39 85 35 -74 65 -6 50 34 -105
4501 -105 -8 -5 44 5 27 52 -78 93 -50 -10 66 -67 -106 -46 142 -135 5 53 -1 -73 -126 3 44 27 46 133
4527 133 21 141 -31 -21 -166 128 87 54 -83 13 73 42 -51 125 -48 52 59 -32 -30 -3 -5 -107 6 91 -30
4552c0l3J18n3j2J29n6j5p8l7Q0k20J52K0Q0ko2J36o3R2k21J10K7L3k54J15J64
4578A20k21J61p1j12J37r3R7n2L1n6k2K41j92Q5j9L3j08K8J6K6j28R9j22m7J23
4603d6J45j17M5J16m6j85P3J48j49N5J07k4l37J66M4jj51J81n5n2Q4Q3J01j36
4627D9P0j23k5p4Qj80K29J64q5j29J76j11j10K08M1o9m6p9J5J25j07J78j68J80
4651A37j74M5n1J08J05k77M1J08O1j33R0o1L5r7J8Q4L9M0q4q8j7L7j21K27J0j15
4677c3j0kj4J54r0J93k46J17j20n7M2qJ16l3j80J01L9j31K35q6P8r1q1O7P6j0
4703B6j12j5R7J52k43J18lr9L0r5j47K08R2k9J23Jn4j06J39k32J73l1p7J43p1
4728a2j50K80j67L2K03j17P2j98J31k01J25n3j2m2%O0j29J47L7r9j27K72Pk8m1
$$ plain form
4552 -30 -63 55 2 -10 119 63 48 -30 -67 13 -207 -55 -35 45 43 -19 117 54 146 -75 35 62 95 -159 -44 120
4578 120 -101 60 -11 -123 14 -79 18 -34 -3 -59 -81 160 -32 53 34 67 -41 -13 3 29 -99 0 -122 -169 -46
4603 -46 99 -18 27 143 97 -88 -15 133 -16 39 146 122 -215 -49 -5 -6 -157 24 -31 -83 1 84 185 49
4627 49 119 -4 -29 -103 -95 -275 -46 118 33 -96 80 -31 -141 67 108 39 -7 -86 -71 54 -53 125 -43 137
4651 137 -37 8 -43 65 170 -107 -66 42 103 -30 60 -1 34 -63 -45 39 78 118 34 -54 -71 -34 -155 72 82 -33
4677 -33 -43 -45 -59 95 5 198 -48 69 -51 -108 -66 -74 42 9 -171 -70 -31 -162 73 -13 65 -26 -107 -40 36 26
4703 26 -86 -101 -4 148 -95 23 20 -79 -49 -144 -291 -83 9 -20 103 104 50 -56 83 -149 24 -7 -84 59 -12
4728 -12 -162 118 -49 -17 186 69 141 -57 74 -127 -2 -55 -67 -109 -109 -49 -178 -31 6 -93 -220 52 59 31 -10
4753a0PN2R9j44r5J89j97J46j76J83o3K1J42L0o6k2j09J0q3m0J25Lo2P9J9J62
4779B00j41q7O8j09L9k2oJ92o6j01R3K7n7j91K46j59n3J97L1k63J77j66J23L2
4803DR0j33O6p8J3l6j21K18J15J24j59j8k31O9kK57j81P6j65J42j05j8N0j7J47
4828A07n1k20J05M0nP3n7q9J14k4p4J56p3J37m1m0q8J18j63J08on4J7l6j31K82
4854A05j35J5J26j40K3j29K27j70j0O6J32o5k0Pq9m0K70j88J18n8o6o1R1jQl7
4880b1RK6R3k18PQ3J29j08j3Q4J4k01L0J96OP4k48P2K20j59po8M0r7L7p6K6K10
4908A40m9j8k00O2K9R2j10K6r0J6O0L0J09j93J83o6k01K60k29q6K03R3r3K9N1
4933D8q5L5L3J22r1n9j08O9k9K28M9l79j3J46L2j19L3N2lJ41j79J18j11p2K03
$$ plain form
4753 -10 -3 49 148 4 -91 98 -99 47 -129 54 -9 12 154 184 118 96 -13 -3 -86 -126 -1 2 -60 19 38 200
4779 200 59 -28 40 -69 -30 -52 -58 134 68 -33 60 87 30 -161 85 -74 -127 70 101 -162 15 -151 -28 4
4803 4 94 -39 27 -51 -38 -74 -195 23 138 262 103 85 -146 -77 -79 178 -3 73 -92 50 -55 -73 -23 -40 107
4828 107 56 -164 -59 -19 -24 49 -8 -97 17 -7 -81 75 2 139 98 58 -30 88 -75 33 27 -27 -10 -46 -177 105
4854 105 -30 -15 111 -29 -6 -135 92 -78 -88 -22 110 45 25 32 -57 -97 173 -15 103 45 -21 -82 9 8 16 -21
4880 -21 -12 14 107 -111 -104 -21 108 0 -13 71 85 -116 -86 110 116 190 -58 14 234 75 68 0 40 -57 -20 -96 -70 140
4908 140 91 73 -127 -65 -36 56 -54 -28 -118 -102 -42 -12 97 -96 87 21 -180 80 -149 -235 -32 61 -32 -3 48
4933 48 -37 -2 31 153 62 3 -105 -36 -65 163 212 -167 -180 -34 -2 -121 -88 -36 -39 102 -77 41 -70 -142 61
4958F1J5j31j1k3J23j1k1M5O5k72N5pQ0m5J50j24N5j10J33j19K4Nk9K44k1j35
4984dQQ2r4O1j61O6j1J43M9j68M3n1l5J31J7M1J0q2j62K46l9L0k7J6j22L15j36
5011A66k37J68k6M3l65J46n2K46K2k0k65K16m6o0N0J37P0j84k6J26j33R5j38j02
5035a69L24j29j81J52J4N8m1K7r1j06P3n2J19j45K45j86M8m8M5j7K2Q6J88m8q4
5060A04k24P4k6K4J36q3J28o6J2O0j11pjJ9l1j23K11J8j23J11P3k16KJ09j2j74
5086a16K56j46j02J26m7P8j63Q5pn6J10N3j15P8R9k03R5n0J05j5o7O2j45lJ8P
5112f3RK10j7q8j27K22k71J92j24J40k06N1K42j07p1k8J40j41l8J88j20r4J09
5135Hk4NJ0K1p6J1lO2q3o7R4r4K11j24O9J04j3j81n7J20n3J94o6m2J0Mn1O6j07
$$ plain form
4958 61 76 -55 -66 -89 34 23 2 47 112 -160 -105 -112 -32 -77 73 -51 4 -106 27 -92 -68 -63 -92 152 131 -4
4984 -4 4 86 -8 53 -108 -42 -53 90 139 -29 14 -37 -72 59 76 117 127 45 -117 129 90 120 93 109 -13 302 166
5011 166 -71 97 71 114 -251 -105 -157 89 111 91 -174 42 -4 -64 -14 123 193 9 -17 109 -24 71 -67 -169
5035 -169 155 26 -155 -3 11 69 28 55 -36 -142 -69 -121 -2 -147 98 -88 -40 -88 -43 -60 -38 48 236 188 104
5060 104 -120 -46 -72 -48 88 5 133 67 79 139 28 21 20 39 8 -115 96 114 -9 102 175 -41 -39 70 58 -116
5086 -116 140 -6 -108 18 -29 49 -114 -29 -36 -92 18 71 -44 34 133 -70 25 -25 80 65 -2 60 -85 -88 -70 -63
5112 -63 -54 156 139 51 -76 146 -125 67 -57 83 -123 -72 170 63 -8 -36 104 -37 -75 113 -7 -101 8
5135 8 -16 -11 -1 20 -56 -45 -48 14 -69 -136 -42 -136 75 -49 20 124 111 -70 -127 -7 -60 134 68 26 36 40 -11 55 -52
5164e2J63q5j13J63k63J74J11n9j38k0J29m7n9J49m4j64oK13J40k86J92k09M6
5187f5R1O3j34j2j6M8J0P5p8J01j39K09j12r9J45j29M6J0J77l21J81j12K7L3p0
5212g1j00J65N8oj68K60R2j96j14K01o4K0m5N6L9j76J37k5j28R9q5jJ32p5R1j58
5238f2J43k23J94o4p9J61j46J17l2MQ3p5j78J92N0%j19J84k34N2J53j23m0m2J07
5263B3J37j74J87j42k6k49K49P6K1j19J3j70J56K83j28j21p6M5j10P3j6J29j8
5286D3N3j81K28j76j12K6J31K0pk6p0J60k17J47r3l0K06Q0l04J94n5j21P0R5r6
5311c5O0k15J95N0j66P1J15N3q5p3o3R1J0P2j01Q0K3n6q7j6L9J03j81J08R0j17
5337c5M5r3j4J86p6j70J37J96l20J63Q9p9L0L2m5r2J34l4oO6j57QN4mm0J85j52
$$ plain form
5164 -52 111 26 -87 76 -187 -13 98 39 -99 -119 10 -37 -96 53 9 -155 -161 52 192 -94 98 -111 -65
5187 -65 26 89 -45 -57 -73 -25 -15 60 -18 83 -56 153 41 -58 87 -42 4 14 191 -130 51 -61 -34 -1 -71
5212 -71 -171 -6 52 46 -122 138 230 34 -80 121 57 77 32 88 127 -49 88 63 -65 34 -51 -52 80 5 96 -62
5238 -62 81 -142 52 -12 -91 70 -76 41 9 13 96 21 -157 35 85 85 -34 150 -84 -32 121 -2 -42 -84 23
5263 23 160 -14 173 31 5 -244 5 81 102 -17 -4 -174 -18 265 137 16 -60 -15 -125 -52 -68 61 43
5286 43 96 -85 143 -33 -145 -119 12 32 25 -1 -71 89 -128 19 -74 -104 102 182 -122 72 17 -104 -34 61 -35
5311 -35 25 -190 5 55 -111 -40 75 128 43 -30 -93 -2 8 80 -21 59 82 26 -61 -77 -38 65 -116 -8 82 -35
5337 -35 10 -83 -97 89 13 -157 -20 176 -144 19 108 29 59 91 46 -46 88 54 48 114 -43 -35 19 15 -25 160 8
5364Ho0O1l7N0J3Loj5j03J83j36k4K2P0j41K61j53q7l3J02J8Q5p8Nk13K39k7r0
5392h3M2j7q2L0k0J69r4j0M6J28j13J4J1J04m0r8kj0O9P9p4n4jJ7l1q2J98j20
5420b4k9K9K6R9k53K64l4j77P0r1k9P1J52k51J65j21K00pj71L00j65p0J07r4J10
5445G7P4k15p7K10j04J58j13J36o2j17J58k63K22Q1j16pK9j24R3J28p2l3o5J36
5469A34l03J55lL5j6k0K3o7K8j15J17k0nJ71j52K57j27J4j18K8M2j6p7OK7o4Q4
5496A8M3o0J4l5P0m1j57R8K3J15j27k9J97j83J2m7L3M4n3J07j1o6J87k24j0K54
5522A72j67o5O1j36M6J12Q2l1r6J16q5lJ06rj68J3J36j34K0j4l5J39j36J24k2
5547B6p0j64K05N4j08m7J56j36K0J5M4n7M2Q0j53J93q6N3OM2k81J50M2j9J73k05
$$ plain form
5364 8 -52 9 -28 22 35 38 32 17 -86 97 -39 -63 -41 29 -112 149 -4 -91 -124 -22 -4 81 3 8 -205 34 7 -83
5392 -83 -41 -58 -140 -110 -130 39 -55 -65 -19 109 -4 10 21 125 85 -13 -15 -25 44 123 49 -5 -6 11 -20 -102 96 -24
5420 -24 -53 -24 2 101 -152 112 78 -99 -29 -120 -149 -78 74 -177 -12 -133 67 60 -111 189 24 -46 61 -33 77
5445 77 151 -64 -141 69 -35 123 10 146 84 -33 125 -138 84 165 49 42 71 -53 40 168 96 63 -2 134
5469 134 -169 -14 -17 18 2 -18 5 -62 -34 -149 -32 -52 -57 114 -38 219 92 106 -12 16 58 42 -35 -29 -2 -66 18
5496 18 61 1 15 -20 50 9 -148 -50 -27 88 -39 -68 129 -54 -42 -89 -56 -12 -65 42 31 -35 152 -72 -82 172
5522 172 5 -60 1 -135 -89 23 105 74 -22 94 9 6 112 103 -65 -52 84 -50 -30 -44 -79 60 -76 48 26
5547 26 -44 -208 -3 51 -57 -104 52 -84 -64 -49 -5 -62 -20 60 -93 100 14 67 73 115 -166 -16 26 7 180 -25
5573b5k2Q0q1L3O7o8L7o7L0k9j2Q6r4J29nj71Q9j07R3Q5p3M7K5o7KjN9J4k2j14
5603h2j9J89q4J4Po5o1R3J33j39R5P8j28or9LJ58j31Q7L6m5j30M9lJ91O7k05J5
5631A8l8K7P1j04M4j1j49J11j0q7J87j54Q1m3n8J57l3P2p3J3j1p0J50k02J02o
5657a6J83j21M2l00J22j33J38P6J5J27j72j20K73r1Ko5M3l0p1L01j68k2J48o1
5681A00Oq4l3Q4k9o8O5n9l1o5J77j88P5mM3M1J4N3l55K84P4j82J56k4J1r2J66
5708A35j60j67K42n0m8j33J30Q7j39J59q4J27j25r3K54j78L8pkm7J88j03j6p1
5732f3n2J01q4K3p1J45N6M5j82J73p2j53J16j9J56j25M9L5j55K0Q0o2L9M5q9O9
5758B5j2J5m6J48p0j3l6j18M4J72j0r5j09L12k47K2m0j0Ol4q2K14L2q4N9j84L44
$$ plain form
5573 -25 -47 33 -48 -15 52 -16 21 -46 -16 -45 -57 29 -65 64 59 -112 -23 -130 -37 48 -25 22 47 -20 -18 -19 40 54 32 -82
5603 -82 -101 88 4 18 25 -40 -101 -8 125 -14 81 159 31 25 -74 -71 87 -44 43 79 34 -96 -47 -50 141 208 3 18
5631 18 -20 7 78 -26 18 7 -142 -31 -41 -128 59 -95 -14 -57 -115 42 9 81 8 21 10 -60 90 -112 -10 -16
5657 -16 167 46 88 -212 -90 -223 -85 -9 6 133 -39 -159 114 23 25 -40 3 -27 -98 203 35 13 161 100
5681 100 106 22 -11 73 44 -24 41 -18 -49 -114 63 -125 -50 -54 -11 30 44 97 -258 26 100 -82 74 50 61 -31 135
5708 135 -25 -192 50 0 -48 -181 -51 36 -103 56 -28 99 -26 -119 135 -43 -5 -12 -14 -61 127 24 8 -63
5732 -63 -115 -14 -98 -75 -146 -1 55 100 -82 91 19 -134 -18 -37 119 -6 43 78 -77 -57 23 -39 0 45 -44 25
5758 25 13 28 -18 130 60 47 11 -107 -63 109 99 4 -105 207 -40 -18 -58 -68 -62 -96 -178 36 68 -16 43 -141 203
5785B03j80m5J04j71O3J82j72P0n8NM7m7R7p1k5r8J96j08j32L1k7J64Rq7K50j99
5811APj59J52l6kR0j32K06k70lQ7J26k0l4m2j1Q8P2q6j06J5Q7q4K0J01j04PR1
5839F1K2k07J78j90J25n8N3p2m3O5J76K0j94M7j8J4k4R1r8J51j61QM9o7q9J77
5865A6j23P2k2J30pr1N6l3l3J45l2j77K41j1o4o5N4j00Q7o8L5r1L5Q2kk7M2j99
5893a50K29o0L7p9P7N8k33J17j12K90j18j95K65j12n0K2Q8j14P9L3j86J67P6o9
5917F0r9N0m1Q5j2j1m2j0Q2j00J19J2j09P0r4M1J36K6l29J83L7j13L6J13r8l3
5943d1P7OK1J31k52J11o0j66K12k38K79r1j36K06k6o2L4qN7j00J32Ok3rqL3O0
5970A45l09J39J25k04L5o0J27l0N9q4m7J91j49J54j22l0J62k34O3O4p9P3LJ20
$$ plain form
5785 203 23 -22 82 -89 -26 156 -16 54 -4 1 48 1 98 27 2 -96 100 -8 -140 -109 -136 28 37 -50 200 1
5811 1 8 -151 1 -35 -37 53 -79 127 -143 -146 -59 67 47 13 -29 -40 48 120 34 -72 -57 30 -54 -34 67 -37 -30 61
5839 61 83 -124 54 -136 -11 -69 -16 -88 -131 -66 110 130 -64 -17 -35 -21 -45 46 -52 99 -62 -54 -5 -72 -161 16
5865 16 -107 -35 -57 73 66 -25 31 -2 -35 110 78 -99 142 131 67 2 56 -44 43 -25 10 -81 -46 36 34 7 49 -150
5893 -150 79 19 56 -23 54 112 -121 -4 -116 174 56 -139 126 14 -36 -14 74 -40 39 72 -114 53 129 60
5917 60 -39 11 -30 55 43 32 -10 -20 62 -38 81 93 -16 54 -40 1 137 163 -166 17 54 -59 -23 90 -8 -41
5943 -41 36 42 63 194 -58 53 -7 -173 39 -199 80 -11 -147 59 33 -29 5 -3 54 -46 86 92 69 60 52 85 145
5970 145 -164 -25 100 -104 -69 -129 -2 -32 27 -57 -104 87 -62 92 -30 -60 102 -132 -69 -5 -84 -11 -8 112
5994A12r9J02o8k9J9qq6J7n9m9J17L8kl9RP6p2J11l8P8k43J35n8l6L1k7O8K9r9
6023g0N3K69o8j91L4l2l9J06r3nj6Q6j0K1N0q2K6m0n3l1J07k04K26K2j43J29o0
6050hJ19l1j66J76k86K03lP0K4Po1n2o1J50q5M5p2O3N3j62K76j15j79K08j15l2
6076c4j8J01N9k14J78m8J2R7j72J13p1n3J32j40m7R0P1q2No2J26j33j11J95J0
6101Dp7n7J08J12l7j99K76k25O8L6q5M6L3J0m6r8k8Q2J3R6j82J53Q8n1j62J71
6127D9j22J17J15Rl16j44L45jq4J32K7j18J36j62l0Q7O2J3k0k40L20k24O8k4J12
6152A07j28O7j21O5L9p8k7J68j15o2J73J2Q0k04J10j58N5J0P0p4J35k30J80p7
6176cl8L8m7P7oM1L7p9J44k55K7O4j8r4N8q6K62n9M7m9j37O4jNP5J9k15Q5J12
$$ plain form
5994 112 13 115 47 18 37 29 -57 -40 -99 -148 -31 7 5 -34 -25 51 -21 90 52 130 -113 22 -36 -72 -41 -68 0 29 -70
6023 -70 -17 252 184 -7 27 -5 -44 62 -31 -36 -52 34 24 45 95 13 39 -1 -54 -85 22 -182 44 66 -77 52 -8
6050 -8 111 80 -86 90 -196 7 4 74 98 105 44 -8 -69 81 -4 41 -31 32 85 -77 199 84 -95 113 -2 -34
6076 -34 -52 49 108 -106 72 24 36 133 -39 74 3 -50 82 -58 -105 -15 56 -26 -21 -83 43 -90 -201 -6 4
6101 4 -73 -130 -22 90 53 -146 130 -95 -27 9 -76 -30 3 13 -33 -131 -159 -77 -64 32 -150 3 91 40 -122 49
6127 49 -73 44 159 168 -148 -292 53 52 -32 100 127 9 145 -17 -47 40 102 115 95 -145 175 -49 19 -5 107
6152 107 -21 46 -75 -10 29 -49 -76 92 -23 -85 88 100 180 -24 86 -72 -17 -7 63 -11 124 -106 74 -3
6176 -3 -41 -3 -50 27 21 62 99 20 164 -91 -64 0 -18 -112 -54 -140 122 63 110 61 -76 -12 -13 -8 67 86 -129 -44 68
6205F8j36J26J9l2m2O1oJ14k68J26o1J6J56Rk49J51j07R1l0N9Lq2o7L02l00qQ6
6232aj59J44J5l7R8k85L44j72R0J7k1j02J33L9o1j06M5J07O1k29J12k23K56q9
6256b4M3k0j80P4K02k2j43J16O4r7L6k21J83n2j6K7K8lp8L9M1j43LK80pk13N8
6283b5j39K35p9R4k9j52J76j31J19kj14QJ11rk3K20l58J21oj1k3o6R4q0J08q4
6309d5K8R7j55P3J2kJ69o1k49K67l5k7j55Q0J0r8N9k9J06J26r3j27j26J03K09
6334A37j4o0L1j32j64J55L5k2M2Q4r3J88l8j8j38mp2K6j36J82j05k2J1J88n9j17
6360a15J11O2n9m2Q3q3L2%k7p0R8o8N3K5o5P4n8J15J33k52J4R1o9R1o8O7j16K8
6388a5P9nJ6j16J14PP5k95r5J61j14L14j00p6P2J6%j10J07P9r5kj09J03N5M7M7
$$ plain form
6205 68 -68 58 77 45 3 64 58 172 -96 30 -31 -15 141 150 -99 52 -55 36 6 65 68 -14 -81 221 -79 -87 -1
6232 -1 -160 -16 -1 -38 60 -225 119 -53 37 54 33 -69 64 103 42 -64 -19 88 149 -80 32 -191 65 -24
6256 -24 19 -1 -181 -107 95 73 -70 46 110 13 49 -172 11 -41 -57 -30 -2 -5 -83 -44 -3 -146 -143 137 130 -83 -25
6283 -25 -164 71 -8 86 57 -95 81 -50 69 67 -47 -39 72 63 40 260 -98 23 17 6 -17 -83 11 -69 39 -45
6309 -45 -17 80 -75 -2 10 8 177 116 -133 134 99 72 -83 -3 7 -91 -32 -61 45 171 78 -49 -175 -72 137
6334 137 123 63 94 -38 -202 -47 -12 -34 8 92 -1 187 149 131 -7 -11 -83 -57 -193 -11 -116 -138 -127 61 2 -115
6360 -115 -4 58 -1 -43 40 -43 -11 -11 -38 -108 -10 -78 -25 0 -65 9 -49 66 199 -53 -39 52 -17 74 6 73 -43 -15
6388 -15 64 59 75 -41 73 80 155 -140 -235 -74 -188 126 26 -50 22 38 38 -72 35 114 19 17 -92 11 66 113 160
6415A60j21k70K86j45K27k44J45J42j58q8L6J3j52J20R2o5K1N9M4j81K95j71q6
6438d1Q0l6j3q4K42k79J57p3J32mj30Q3j88J43L8j1N8l3j38J75j53J66r1j18K05
6463H7kj79J48J00k70J30M4Mp8J36l3j07n8J00J93k46m8n2J63j35K7n2JjJ93m0
6489B5o0M2m6J38j79l7J55L8n9k0K1L9k23K01J43k88P2L3o5J4J97j73r0L29m5
6514A62j19J7j98nl1K45J40j05j85m8J53J05j76N0o1O4j78J28n3J27N1p6j78J19
6538e2o6q8K80k23J64m6l3j23K02k20M72j78r4n2K4J49j69J83k07J3L9K6R2j06
6562a3j18J13J84k30QR8J7o1L0j02j14J11K33j06j28J08L1oj31L7O1J11k44J06
6586eN8rl0m7k0N4J38j38L5j84J07M0k9K5q5J17k00L6J56q1L8P6o7J66j9j17j59
$$ plain form
6415 160 39 -231 55 -90 137 -107 38 180 22 -66 -30 -17 -169 -49 43 -22 -1 58 102 -79 216 45 -41
6438 -41 39 3 -10 -94 148 -131 26 -47 85 81 -49 34 -154 -11 27 16 74 41 -97 78 -75 91 0 -118 87
6463 87 85 -94 54 154 -116 14 58 62 -16 120 87 -20 -78 22 215 -31 -79 -131 32 -103 -76 -128 -127 -128 65 25
6489 25 -35 7 -39 99 -80 -117 38 76 17 -3 18 57 -166 35 178 -110 -38 -5 -70 -56 141 -32 -122 207 162
6514 162 43 60 -138 -143 -174 71 211 106 -79 -127 26 131 -45 5 -56 8 -170 -42 -95 32 83 7 -171 -52
6538 -52 -118 -206 74 -149 15 -31 -64 -187 15 -205 267 89 -5 -57 -33 116 -53 130 -77 -64 -25 1 93 -13
6562 -13 -131 -18 166 -64 -56 42 59 -2 28 -74 -188 -77 156 50 -78 30 61 55 -76 -39 22 133 -111 -5
6586 -5 53 44 14 -33 -53 1 139 1 36 -148 -41 -1 -30 -5 -90 27 -173 -137 19 -62 -24 52 -15 151 132 15 -144
6613a44K18k3mr4J43r4M3Q4K2m6j44l9j05R8J20j51jJ74n4n0l1J77j09Q9R9j48
6639C0j76K36n6o9j46J83J53Q2j71r7O2j07O0J4q3O6j1J0j31O0J31j21M8j05L4
6664a04K53k01N7r0N5L6L6j4j05P7P3k7k14J47l5P9m3K7J40j65K24k59KL0O6j61
6690a16N7K16j06m2j33J25L2n7q9K47j25Rlr3J9O4N7M6N5l45J37J08Q4j93K33
6715A87J5j82L1n3qJ0J26j34K9n7L0J99l13J63k5P3j20lKN7L4p0K10l71J37M0
6741GK6nj25J23q7O%K2R2j41J71Q9q6q2k3J07K6l7j7j86J83J19q0j25o6J21%M0
6769G2Qj27J61o2j35NJ41L6j45k4J51q2JN1J12j12n4r0Q4n2L7k0O2J12j18K0m5
6796a3P4q0nJ04k8QO3L6j25r3K81r4j18J81j84Q6r6P8n6pN4j05o7J01k4NQ2p0
$$ plain form
6613 -144 74 51 47 -47 96 2 45 129 151 105 -39 -78 -183 -85 35 -116 -117 57 3 -47 -78 99 -10 79 178 30
6639 30 -146 90 34 -35 -181 2 155 237 66 -31 31 -76 -16 -2 -85 -19 -30 -20 -151 -91 40 -81 -33 -138 -104
6664 -104 149 -52 5 -85 -30 6 42 28 -77 0 73 46 -168 -21 -56 23 -20 7 147 -18 206 -53 -51 -21 45 -116
6690 -116 -59 157 51 9 -124 1 33 -24 -113 134 9 18 15 -78 -59 5 62 108 163 -182 -45 63 147 -46 187
6715 187 202 20 51 -2 -10 0 126 -8 21 -36 -6 193 -120 43 18 91 -29 -32 -30 27 61 -9 201 -170 -33 7
6741 7 33 28 -97 26 -61 -55 -55 -33 59 -82 89 178 92 10 -13 94 120 83 66 -120 63 182 102 -23 -89 32 32 72
6769 72 80 -47 114 52 -83 -78 63 99 -46 -70 81 -1 0 51 163 51 -3 -93 -9 -61 -24 -44 18 130 12 32 -13
6796 -13 61 -19 -24 80 52 60 123 159 34 -59 222 128 10 191 7 93 -3 75 19 12 66 -39 -106 -5 -29 -24 58 -12
6824a2Mj9j3J59M6j70r9M7J23m2j36L5K32j89O5K1j15J25q0MK02k05r2J98j81
6849i2J56j2j84J79K3L8q3l8n8N8j7Onm9N3r5P0J98M5j81R9j58M4j08J73r7R4
6876E9k10J89J95j58j77J10l1j73K28k3J26j50M4j9M8o4O9k5l8J96j59o4R7K0
6900I0J1j12j4j12R5J72j61K5m0j7q6N2M2P4r4k2J1P4q7J23r4Q5j38J62l9n0L2
6927a8j08P5pJ46k10J14J08n7L7n2l0Kq1K84j85p1J8J08k01P3k1J00R5j17O6m6
6953B2N3j25Q2Jj59J77j53O2l3K42k31N9M6K1j34N5l6J14n9m2j03J51J59j92O1
6978C8M7k34J16P5j12J06O7k5j7R1l30J33l7J34j16K37k30j7K55k36p8J95p9R3
7002G6o3m7J03Oj4j35P6r5K3J54n4J26j23o7RJ00k13J44Q9j55P6kN9j14P6j04
$$ plain form
6824 -12 -8 -27 -40 119 165 -5 -104 -57 66 24 -112 -77 155 -34 31 52 -63 62 -18 -14 188 -17 -109 89 -92
6849 -92 64 52 -132 47 70 108 25 -13 -71 -13 -30 -24 -29 -78 -25 -120 -50 148 193 12 111 -47 -3 -111 62 -35 59
6876 59 -151 38 233 75 -102 8 -23 -196 32 9 135 -15 29 10 58 -6 63 38 0 196 37 -27 70 90
6900 90 101 -11 -25 -137 -42 130 -31 -6 -46 -63 -149 -97 -55 19 -75 -97 -86 -12 -99 24 -70 15 -123 39 0 -50 -18
6927 -18 -126 -51 -58 88 -122 -8 100 43 80 28 -2 0 -81 203 18 -53 -35 73 -128 -55 -76 24 119 2 68 22
6953 22 75 -50 32 33 -126 51 -102 -40 -73 169 -62 -3 43 64 -70 -15 -51 63 4 -38 -141 10 169 -23 38
6978 38 85 -149 -33 42 -70 36 103 78 61 152 -178 -45 -82 52 -64 173 -57 -74 181 -55 -133 62 -17 76
7002 76 13 -34 69 75 61 -74 2 -93 -70 84 30 156 33 -34 -25 75 -138 6 95 -60 16 14 73 -41 35 -69
7028f9J72m3m5J79k93J07J34j76j15O8J54p1j80K31l4j27J50j47J98j58J54k01
7050a12K53o8n1M7J13j69NR2j55M9o4k1O2Q5k29J94Kj41J06P4q8j2L0K0L4k35
7076a79O6n9P6J90j54l1J46j7O4j97kRJ09j13J33q5j17J46P0o8M2k7J6n3k4J65
7102A06k00K19j15J45n7j08N0O4j7r8k2l2O6R5j16o1q5K58j6r8nN7j93J93q0r2
7128a42J11K02Mq9m7jO4j19M1K0K0j05J6Nr3J05rL3M5r0k0J02l5K02k86R6P3k0
7156H3j4p3n7j8J44K8%j10j31J26p0n5K6K03k2Qj14qJ01p5M7j24R8J91j95O8j36
7183g9M2j12J10K47j92K3j32k5P6K1O1o3O8J05j66O8j60J5P0o0K72j57k7P7o2
7208B0J10j14Lk5j7o1J68j0j20J33p5N5J2L9j37k6J20j0m1m6M9p0q4qJ58J3J2
$$ plain form
7028 -69 103 60 15 194 -99 8 142 -34 -149 -81 73 2 -178 53 19 -108 42 -105 93 -65 89 -112
7050 -112 141 73 22 69 182 13 18 110 -45 4 -60 -81 -19 66 -163 31 33 -108 -2 72 -16 -28 2 22 56 -179
7076 -179 -113 -172 -96 94 -60 -91 55 38 102 -95 -97 -88 21 -92 41 -44 -161 -15 55 -13 29 2 18 -35 -59 106
7102 106 -94 125 10 155 98 -10 40 104 87 -11 -33 -65 1 96 -20 -81 -166 92 76 -22 -27 30 -163 30 -50 -142
7128 -142 -31 171 175 86 39 38 102 -17 24 44 64 -41 -25 -20 -113 -8 -17 16 61 -29 -49 53 18 220 -66 30 103 83
7156 83 69 -4 -61 -79 65 93 93 -17 -148 -22 -92 -147 -121 82 60 68 -46 -54 47 -28 19 -105 -7 184 -11 57 -79
7183 -79 -37 -149 -39 208 16 39 -93 -118 -42 -21 40 -23 45 150 -16 52 -108 -93 -23 -83 189 32 5 82 20
7208 20 130 16 19 -6 -23 -84 84 74 -46 87 12 67 79 118 -19 -45 75 65 24 -22 27 -43 -127 -135 23 36 48
7235D8j51J62l4q9K24k72J64j58K96k10p5P8j66K47J42l24N3J6K35j30k30N1n8
7258a81J07N0j6N5J7n6l4O0j02K30k95J95l2KJ36j19K0j35R1m9J7J34q4k41N8
7283a72J79K2m1r4R5k2n6P1p3%N0l0o7N3J68k42J79K4r9O7J5j00N3P3j13Q5k70
7310b45K06P5m5O7j28J62l3n7M3oL2o3j00J75L3p9L4J9k2j09K29j68pj8l0K35
7336B00k82k2J50j26K17Mk61qR4J1K3O2j72r7J52N3J11k20K41k57O7J69q1l1k1
7361b4J04j15J23j05k1j32L33p5j87K0P8j0k2j22L4L12k01R8Oj99J26j08L7N7
7385G%q3O0p2J64o7j90J68J28j13o5m4J56p6j02J37r9O4R6k7m3j30J42r0P6n6
7411e9J27k8j28P5j47J24J2r6K52k67O2O0k9j5KK4j5M7K8m0J28j39L5J15k35M3
$$ plain form
7235 48 -103 59 25 -64 160 -112 52 -106 190 -20 -95 -17 -183 64 206 -118 -65 -49 186 56 -174 -123 -181
7258 -181 -74 -24 -40 15 32 -24 -58 2 -100 130 -165 30 -2 0 136 17 37 -98 -7 -56 -39 95 11 -230 -172
7283 -172 7 29 -12 -106 -11 -33 -89 -18 -91 -91 -41 -71 -138 -85 83 -159 20 44 -55 12 27 -73 -20 53 -60 25 -245
7310 -245 -39 36 -9 58 -70 92 59 2 45 39 71 8 -92 83 116 37 71 90 68 -41 188 20 13 -5 -35 200
7336 200 -82 -104 46 -80 137 141 -120 -128 -34 -23 0 62 -110 -207 -55 -2 109 -111 130 -127 -60 109 28 -3 -24
7361 -24 80 -35 88 -17 -38 -170 163 88 -99 -79 -1 -11 -33 -155 -121 191 -10 88 94 -105 21 -87 -50 7
7385 7 7 -76 -16 -88 76 9 -181 -13 115 2 -63 -107 49 -27 -129 8 -91 -27 69 42 -1 -131 11 -79 -3 -59
7411 -59 68 40 -88 -13 -160 -36 -24 -120 132 -135 -73 -13 -42 -57 -55 -31 -46 1 29 -11 117 -22 13 128 -107 -64
7437f4J2m3o3J44ko7Q5J10j36k8R1j25K73j65J3pj3m5l8K21m3m3m3%j46J4M6J2
7465e0J98k69J15J52j96O6N6M3j30K0MN7j76O4K16l76K15K09k94J65q9J54k72
7488a18R7J07o3L5q1p3j48K56J65l5j61M1j00R3K2j6j11PK00j05m1J5mo7LJ34
7514E2j25J20q8K5lm6J92j25l1N8q2j6P0L3K2k1P0l03K32j48K18j46jLj2P9P1
7541I8j82k0P6Rj20J34n6l9K47O6l60K84%k74K00J9q4Or3J45K0j6p1J24J2p4n5
7568dk4L2j93Q1J16k91L68j16K0j79L3M0J78K3j67l2J00J4lq3K0r9L17k82J88
7593E7L0k45J93j41R5j10O6M2J35j34j7j4J05j49R1J67k01P3r4l5J33q9P2k0N5
7618F5j04n0Q1j25K14j82J26rq9J04P9j28q9J39j05R5R3q1j67l3R5J5o3k4J60
$$ plain form
7437 -64 -52 -95 -158 -14 -16 -83 2 112 -24 -52 39 -86 187 22 35 28 15 -30 -68 153 110 67 24 24 -122 -108 -62 -50
7465 -50 148 -121 -6 146 -50 16 72 115 -15 5 9 66 -110 -46 170 -206 9 218 -76 89 0 154 -118
7488 -118 -21 86 23 58 -23 -96 -244 12 177 142 -19 22 -78 15 37 21 -90 -83 117 12 -29 -14 -18 -85 -82 52
7514 52 -73 47 -41 -16 -19 -65 127 2 -29 29 -53 -69 1 34 56 35 105 -198 34 -114 104 -42 -43 -40 -52 27 98
7541 98 -84 -104 -28 -19 -139 -5 -61 -100 147 213 -147 137 137 -137 63 82 -2 4 -89 56 76 60 -11 113 125 51 -4
7568 -4 -28 4 -189 -108 8 -283 85 -31 -11 -190 -157 -117 61 84 -83 -115 -15 -1 -4 -87 -67 -166 151 -131 57
7593 57 87 -158 35 -106 -11 -121 -55 -13 122 -12 -29 -43 62 -87 4 171 -30 43 -51 -86 47 -42 30 10 65
7618 65 -39 -89 -8 -133 81 -101 25 16 -73 31 110 -18 -107 32 -73 22 115 34 -133 -166 -71 -56 -119 -143 17
7643A7m1RmJ34j9O9l03N0M9J05k06K15r4P9K2n0m5m2P0jO5j27KO8j89J63O5j0
7671E1pm8j02J55M0o9R4j54k6N4o1P6J15K3p1j33m3nK42M7k08J11j67q6J91k9
7697a0q7J4J69J7Nk17J49p2J51j29j16M7j25J92M8r0J08K3j40K35k59N8j94J79
7721d4m9J06j81Q8Q0j02N8Ok8J7j20K10m4j9Q0r5OJ0J2jQ3j00n9J74k26K06n8
7748A0l9j6J3J63p2j90J47L5j38R0k0L8j16j93K93o0o3K53L6j18k5j5KJ9j6o6
7774d8Q1K8k16J38N3Q8j13J08l52K19O8p7M4K6qj96M9L4P8l6J7q5P3J16k18M3
7800h6j17J84j27J76q9J58j37l7O4j86M9O3K05j73N6m2K9j72K32l3j9J04j93P
7824h4K02o7j08J25q1J19q1L2j96L85j40j43l7J13Rj03J8r4K17q1N5j43J29j24
$$ plain form
7643 17 -24 -15 -19 115 96 165 -138 -88 -39 66 -140 75 -19 60 82 32 -13 -55 15 14 79 -48 -46 22 -167 -4 61 51
7671 51 44 -4 -106 49 89 20 114 -40 -66 -12 -73 3 118 141 70 -63 -106 -111 131 178 -30 81 -86 -172 19 -10
7697 -10 -97 -83 86 103 108 -109 40 -32 119 -10 -126 -79 -204 -12 36 -54 54 77 -63 172 -87 -29 -223 -44
7721 -44 -93 13 -168 -80 0 -102 -44 -38 -66 -49 -169 41 -3 -22 58 -37 -31 -21 -9 -10 73 -27 -86 88 -138 68 10
7748 10 -29 -45 -32 131 59 -131 16 51 -87 3 -17 21 -95 -288 5 -55 -118 135 171 53 28 13 15 34 18 -48
7774 -48 33 61 -155 -17 36 124 11 119 -233 -14 54 -23 21 47 39 -157 -108 -74 4 -32 -15 -100 -27 89 -129 -86
7800 -86 -203 -19 -146 30 -59 99 -38 -75 -11 -197 -148 -85 120 -53 3 -39 -10 -182 50 17 -2 102 -91 -84
7824 -84 118 51 -57 68 -13 106 25 57 -139 246 106 -37 -74 39 48 -55 -37 -131 86 5 60 -83 46 -78
7848g8J35j60J47p4j4J64j71J29n3L3rj7j82K13k22K04l2K8j7M9j5L4n5%m0rl
7875a5J02j38N6n5l6J5J04j35J55n3j23L14k18M6k9k7QpK8p6L0J67k5j94J05n3
7901e4J27N2j06j25J35j3j62J08Q6RM8j41O2j25Q8L7No2R0J6k8r1K4m8K2N0n6
7928e2P2j5j00Q1L6n3J2L1j03J56p7m7L9r5K26j58J52m4j69Q4P4N5j01J50l5j97
7954g8J70k27K04j46O4N0N7j19J3J77l91R7L41k27M2j3j8n7n9J17j14J26j92l4
7978b17L30k08N8k5R3r6N4J36Q0j77k2qj5Q2Q8j54j33J77j12K8J17o6J0M1n8k8
8004b5J2J4P0m3p3K05k42J7P0l6J52j55j4OM3l7M9m5j12J22JJ84j39o5O7J2j27
8031h9J31j10J33J96l01RJ67j99p7J55N4K8N4j27N1q3k1P0j4j08P4M2j4j36K19
$$ plain form
7848 -78 57 -103 44 -30 -44 120 -51 78 25 58 49 32 -150 63 -159 45 13 41 24 73 58 92 37 37 -3 -12 -15
7875 -15 87 -51 5 -50 -86 -71 33 -102 53 0 -123 191 -27 19 -10 -37 -29 -36 -8 -84 -54 113 88 -106 -1 -54
7901 -54 73 125 19 -106 29 16 -146 -38 48 57 105 -36 26 -99 -11 26 31 -31 59 75 47 -44 -20 -68 -46 4 -52
7928 -52 20 5 -95 -14 22 -31 -19 12 -91 65 -12 -59 -20 -115 111 -47 105 61 -108 -24 50 105 4 154 119 -78
7954 -78 92 -135 69 -77 -13 37 94 -25 -12 165 -226 -129 212 -15 27 14 -4 -61 -120 -3 -117 9 -183 -217
7978 -217 113 -95 -37 -62 31 -65 -11 125 205 28 6 -2 -17 65 153 -1 -134 43 -69 -41 76 10 20 61 3 -25
8004 -25 -13 1 71 28 -45 160 -82 -65 5 -31 121 -34 -48 -42 1 -36 13 -32 -144 -22 -21 163 24 -41 26 38 -89
8031 -89 42 -68 65 261 -40 -31 136 -63 -140 15 69 97 151 24 75 -8 -29 41 27 -81 -7 35 21 -115 104
8056A04j13J31k57J07L1jj2pR5j35qM3n9J5R6O4j09J37o1j43J15Q2n7K8l1j00
8082d5Q6pQ8j04j25J7K19m34K67l8K27j81j9j30K32j49Q3J20k24P8k10J62J99
8105A12p9j22LJ35M9j91J91k77J95O7j60J24o4L1L3r6J20J3l4K4n9J20j42o4J07
8130C6o8M3r6J10jR4j6M6j88R1L0J5j44N2j1p5L1j29K61o9%m3P7j15k9%J05j40
8158a33M8J1J79j10PJ04p8n4Q9N6k03J45j15j06K28j1j41M5L5K4j26K42j30m5
8182c9L4N1J9j68Q0M7Qk02J78
$$ plain form
8056 104 -9 122 -135 -28 3 2 -10 -17 78 -57 -65 -22 -81 -66 30 94 -15 122 61 -82 33 115 58 86 55 -45
8082 -45 41 34 122 18 -107 -90 129 -305 -38 -76 151 -30 -49 -179 53 -96 -13 107 -117 -39 -249 -87 112
8105 112 33 -89 -86 49 98 -93 98 -179 16 83 -77 47 -17 14 47 -49 71 84 50 74 15 135 -7 -71 36
8130 36 -32 11 -85 25 24 118 102 148 -40 51 81 96 -48 4 -7 -82 -51 -180 81 12 12 -31 46 -69 -98 -98 7 -133
8158 -133 -85 -74 105 -5 2 106 28 -26 63 119 -84 61 -54 -160 68 57 -84 -39 -4 20 -106 136 6 -39
8182 -39 -5 46 65 -103 -23 24 32 -170 8
8191H
$$ Imaginary data points
##PAGE= N=2
##DATA TABLE= (X++(I..I)), XYDATA
0@%%%%%%%%%%%%%%%%%%%%Kj0J6j6J6j6J6j7K5l2L2l4M2m8N0n8O5p3Q2r0J00j10
42e8J23j38J54j70J87k04K22k45K70k97L28l63M01m44M96n55O23p03Q01r24J083
63E87j292J581k016K728m082P483k9620m8254Q9520l869m2321O1944J3450q3753
77c7914L513N7949k5221j5988O0523j6843o7738L3899L1823m4978J4624M5746
89C9395l4366l5503L1020R151l5243J9771M3081l8690k5652M0910j7510l2832
101c6468N0648K0371m5700K327K4332l2250j0818N4195L765m4594J8026J0432
113A4266m6213J7600M7726k3670j8849J9520j4137k5406K4071K8276k0506j1421
125h743J9335j7483k0656L2686J2943k3523M736J1087j8412q362K4040P429k1740
$$ plain form
0 0 0 0 0 0 0 0 0 0 0 0 0 0 0 0 0 0 0 0 0 0 2 -8 8 -8 8 -8 8 -9 16 -16 16 -18 24 -24 26 -32 33 -40 42 -48 52 -58
42 -58 65 -73 81 -89 98 -106 116 -129 141 -156 172 -191 210 -234 262 -293 330 -373 428 -496 587
63 587 -705 876 -1140 1588 -2494 4989 -24631 -72885 16635 12766 -29555 32389 45839 -37914
77 -37914 -34401 23548 -1673 -17661 42862 26019 -41719 -7820 24003 -20975 -6351 39395
89 39395 5029 -30474 546 9697 -25546 -5775 37306 -1384 -27036 13874 -3636 -36468
101 -36468 14180 34551 -11149 -8822 15510 -16740 -27558 26637 30402 -14192 3834 14266
113 14266 -31947 -14347 33379 9709 -9140 10380 -3757 -29163 -5092 23184 2678 -8743
125 -8743 10592 -6891 -27547 5139 18082 -5441 -705 10382 -8030 -16392 7648 15077 -6663
138f663Q191J3885k7260j556K8618j2391j1712K0250l968k0930P593J4759j0455
151a639m896J8066o957k0116J3837P265j3921R446J0332j3268p334P719L417o602
165d651M944J2587j3086j0129J4369k252q638J3117L897j3339k068Q772k803o831
179f111J2035L563j7821L914J0352j2379J904J3273p816q069N947L048n714R44
193b930R815o262q790J1499P11r623P711L873q625k8P232q94p477L618O071r668
209c767Q42J1508r346o269J0241l106n108P398K209q468k704Q647q94o343Q905
224C745P63j2710N733P303n954J373M302m506m431M595N443n150j791O450o986
239a821m134J1451j454p711L782O04m267J595N430j540p493L860L856o838N060
$$ plain form
138 -6663 1528 15413 -11847 -13403 15215 2824 -8888 11362 7394 -13536 -5943 8816 -1639
151 -1639 -6535 11531 4574 -15542 -1705 5560 -8361 1085 11417 -1851 -9185 -1466 1951 -4651
165 -4651 293 12880 -206 -10335 4034 1782 -6856 6261 10158 -3181 -5249 3523 720 -6111
179 -6111 5924 9487 -8334 -4420 5932 -6447 -4543 8730 914 -7155 -1208 1840 -3874 -2930
193 -2930 6885 623 -8167 3332 4043 -5580 2131 6004 -2621 -2649 4583 3689 -3788 -170 5901 -3767
209 -3767 -2925 8583 -763 -7032 3209 103 -5005 2393 4602 -3866 -6570 2077 1183 -5160 3745
224 3745 4508 -8202 -2469 4834 -1120 253 4555 49 -4382 213 5656 506 -1285 5165 -1821
239 -1821 -5955 5496 4042 -3669 113 717 -3550 -1955 3475 1935 -5558 -1698 2158 -4680 380
254C80N154r484J36O184k496k75L280p01n006k4O970j450l868N247l912n138P165
271B162J482l921P92p58k061NL737J576n763K57L266m780L386N113n887j592K718
288b68q23J049K240L19l039k258M301J46k068M632l367m507M728M58j656J764
304A651j629j848k66K209K193l131k83J335m191K777M731m164k15J025k419J256
320i69J936N60j195j880K365n38j082M376k661l490M222q03j378K923j242k052
336i08o06O34J951j593R07R32m530J496K899k885J356J327k571P50J049N97l83
353D22j512J814p03j336M057r17l239K687j355j209K658k64l98o04o72Q99j430
370a102J016J593l039O63J518k350J533R23k193P42j12J4J502q17Q87m66j584
$$ plain form
254 380 5534 -3950 -3814 2370 -126 -401 2879 2178 -2828 -2852 4118 2668 -1200 4047 135 -5003 2162
271 2162 3644 -277 515 -243 -2304 -2299 1438 3014 -2749 -2492 774 -4006 -620 4493 -1394 -2986 -268
288 -268 -1091 -42 2198 2517 -522 -2780 1521 1667 -401 4231 864 -3643 1085 1543 -113 1651
304 1651 22 -1826 -2092 117 2310 -821 -1104 231 -3960 -1183 3548 -616 -831 194 -2225 -969
320 -969 967 1527 332 -1548 817 279 -803 3573 912 -2578 1644 841 -537 2386 1144 -908
336 -908 -1514 -880 1071 -522 385 1317 -3213 -1717 1182 -1703 -347 980 -1591 -841 208 805 422
353 422 -1090 724 21 -1315 2742 1825 -1414 1273 -82 -1291 1367 1103 705 101 -571 328 -1102
370 -1102 -86 1507 -1532 -869 649 -1701 -168 755 -1438 -696 -808 -794 708 -109 778 312 -1272
387a272J941k06j8K198j933o33J260j959Q54J312j663N71p81n15P98j072Q86j82
405d14j712K431j49k129K591q25j971K505O14l51j53m06L44j687J748L045l646
422a65k03K394l723R82L972k130j893J58K2p25O26L823k333m648L422k22k928
439c571N306J032m839L13J908j126m11L356J116m838R55M361m970M5N326l775
455A88k105M780r42m330J055K927k542r97N870k748o847M835K264m374M291L197
471D522o627k397M044J131j810L763J900p909p96P081k991o46O519l619o285K960
487a160L016k313L69M363l128n865M932J390n560M401L681o092m47L728k816k376
503c877M524K923m322m28L840n507j589P763r1l254K627j973m899K126N018N95
$$ plain form
387 -1272 669 463 445 2643 710 77 1337 -622 232 1544 -119 452 -329 -844 -46 -1118 -232 -414
405 -414 -2126 305 156 -1973 618 -207 -2178 327 941 590 437 31 375 -1312 436 3481 -165
422 -165 -368 2026 -1697 -715 3257 1127 -766 -608 -586 -1311 -685 3138 805 -3843 -421 -643 -3571
439 -3571 1735 2767 -2072 -1759 149 -977 -1388 1968 3084 -1754 -799 3562 -1408 -1363 3963 188
455 188 -1917 2863 1921 -2409 -1354 1573 -969 -1966 3904 1156 -5691 -856 1408 -2966 1325 4522
471 4522 -2105 -4502 -458 673 -1137 2626 4526 -3383 -4179 2902 -89 -735 5784 2165 -4120 -1160
487 -1160 1856 -457 -88 4275 1147 -4718 214 1604 -3956 445 4126 -1966 -2413 1315 -1501 -3877
503 -3877 647 3570 -752 -1180 2660 -2847 -4436 3327 3236 -18 2609 636 -4263 -2137 2881 3476
519C476k596J052k190n918M155N891k483K46K65n438j911M036L460q6j014M48
535A393m165k537N761J743j232K051j742m207M45K403J849R3O15K2m819p83L314
552B04l99J585K702l038l193j105N64K731J256J998j067n766o82K436Q49L363
568B438J881l002m099j345K946J960J530L018l475n984K214J126R9M412R08m376
584B51l155K98J267L71L291K245n521k574K365j783J387M966m63l755j212N79
600a443o31M70N158J84n069J257L12m128L820M288k195j559M54k065k575L194
616e28M453k771j514K068m774j890N810J200j501P16j434l409k16M485K109k200
632F04J236r66n397K319N018j329L6R33k618k925J580L990j122j298K330l136
$$ plain form
519 3476 880 1932 -258 -6176 -2021 3870 1387 1633 1898 -3540 -5451 -1415 2045 1959 945 1393
535 1393 -2772 -5309 452 2195 963 3014 1272 -2935 -2490 -87 1762 1855 2470 2492 -2327 -3110 204
552 204 -195 1390 4092 1054 -2139 -3244 -2680 51 1307 3305 2238 -3528 -4210 -1774 -925 2438
568 2438 4319 1317 -2782 -4127 -1181 779 2309 5327 1852 -4132 -1918 -792 -693 3719 4627 251
584 251 -2904 -2606 -1339 -968 2323 4568 -953 -3527 -1162 -2945 -1558 3408 2945 -810 -2022 -1443
600 -1443 -2074 -1604 3554 3738 -1331 -74 238 -3890 -70 4218 2023 464 918 -1147 -3722 -528
616 -528 3925 1154 -360 1708 -3066 -4956 854 2054 553 1269 -165 -3574 -3790 695 2804 604
632 604 1840 874 -4523 -2204 2814 1485 1521 2454 -164 -3089 -1509 2481 1359 61 2391 -745
648g45k784M105M32k292K143L67k920j80J860K81j866J831J868l541P7K644k307
665a027K74K868n91j572m14M82n31L3L236n15l813J267K03j987K712K027k457
682A95j632M07L84o33J466K138l184j290K569j570J14L013j355j695R70N14j37
699B74m08R73j39j919J617J511k176N53L40j397N49R49M0r40r34J216m20q74K383
718A198j112k172J533J67k19J370k36r14o32O85J234o99N76L91k228N12J649p61
736C42O47l34j139L51k93P78Q84j926R0N14j089J294N74j300r2m21O28N79k26
755a39R36r21j306K143l86k81J298j242n48P07P0N81k42n61L36j216L88J602j336
774a17k09L26r91M08N86J60r2j137O54L68j045J838j9k021J429J35m81J001M2
$$ plain form
648 -745 -3529 576 1008 -1284 859 1226 -1694 -1874 -14 267 -1599 232 2100 -1441 -1364 1280 -1027
665 -1027 -753 2115 1524 -48 -462 20 -511 -478 2758 2243 -1570 -303 -100 -2087 625 2652 195
682 195 -1437 -1030 -646 -1279 187 2325 -859 -2149 420 -1150 -1036 1977 622 -1073 -103 411 274
699 274 -134 839 700 -1219 398 1909 -267 286 626 -771 -222 727 767 -173 -1107 109 -311 -1185 1198
718 1198 86 -2086 -553 -386 -605 765 529 -385 -1017 -332 902 203 779 1170 -1058 -546 1103 342
736 342 989 655 -484 -133 -426 352 1236 -690 -600 -86 -1175 119 693 -607 -699 -1120 -492 87 -139
755 -139 797 -124 -1430 713 327 46 1344 102 -446 261 331 912 670 109 445 -771 -383 1219 -117
774 -117 -326 0 -991 -583 3 163 71 -1066 -412 -44 -1089 749 730 -1291 138 273 -208 793 835
793H35n15m17m4J117m45m27J255j886j60J374o53J88L22j315J07K89L90L48r73
812f10J36J92j200J633Q10j460N86k36n72J100J4M94m45o50P32l15J18J152j457
831B2o23J086p50K77Q49r61k94m11J98Q84m94K15p3j395J019O08p09J129n22j106
851a051J013L06L35lp25O57n89j28J682r24p04P34j240N84R08n38j72o63j68M46
871b40l81R55J7j674O71O88q06J298j87p46P3PO66K69l12M81r38o40J838k73n43
892B23Q05j097m97O84K38J13n82k22K73j083P98J203j646L42M17q16P29K07K1
911A10j97q46J172L89p68R15m22j433J652K78m68J13l01l63m09O44J362j056p35
930c63O48j458R0J932j96r99l54j83J9pJ595L84k236O34Q80j536J177J756j696
$$ plain form
793 835 320 -97 -141 976 531 104 1359 -527 -687 687 34 222 544 -771 -664 -375 15 363 -610
812 -610 -474 -282 -1482 151 961 -499 87 -149 -721 379 393 887 442 -208 524 209 327 1479 22
831 22 -601 485 -265 12 861 -100 -394 -805 -607 277 -217 -2 -75 -1470 -451 157 -552 577 55 -1051
851 -1051 -38 268 603 600 -125 532 -57 -185 1497 573 -131 603 -637 -53 855 317 145 -518 -686 -240
871 -240 -621 334 351 -1323 -652 36 -770 528 341 -405 -332 -325 341 610 298 779 -159 -799 1039 766 223
892 223 1028 -69 -566 118 356 469 -113 -335 -62 -1145 -347 856 -790 -448 -31 -847 -118 89 110
911 110 -87 -933 239 628 -140 775 353 -1080 572 850 382 495 194 -169 -578 66 1428 372 -363
930 -363 285 -1173 -1083 849 653 -346 -700 -883 -864 -871 724 1108 -1128 -494 386 -1150 27 1783 87
949H7m70P50j32o51O40J418j514j179K339j145j926K482J34j783R95R27j580j057
967a665J525O28j850J919J161l649J71K917j748K04K660j047k872M83K222q74
983A85m59L314k189l700K954R20k280K317J399l478j305K436L00j919K357J305
999B157m282J74L402k455n75L997j192l134J834J353k538J55L643j070l226L128
1015A371j90m170K826L016k908m35K042k091k549K987K762l197R9K673m626j228
1031c618N435k36k689K237q1l921N69M461o65k325K586o25m590K886L572l136
1047a40J77K536k800k578K804J741k616O19K927l522k226M221n55k717L285J089
1063B245m085R9K304j001j299L736O77m828J173K606l263P68M499k234l147J794
$$ plain form
949 87 -383 367 235 -416 224 1642 128 -1051 1288 143 -1783 699 833 -950 45 972 -608 -1665
967 -1665 -140 488 -1362 557 1718 -1931 -1760 1157 -591 -387 2273 1226 -1646 -1163 1059 185
983 185 -274 3040 851 -2849 105 1025 -1255 1062 2461 -1017 -2322 114 414 -1505 852 2157
999 2157 -2125 -1951 1451 -1004 -1579 2418 1226 -1908 -74 1279 -1259 -1104 2539 1469 -1757 1371
1015 1371 1181 -2989 -163 2853 -55 -490 1552 -539 -3088 -101 2661 -536 -437 2236 -2390 -3618
1031 -3618 1817 1581 -1108 1129 1048 -2873 -2304 2157 1492 -833 1753 1128 -3462 -576 2996 -140
1047 -140 37 2573 -227 -2805 -1 1740 -876 -257 2670 -852 -3078 1143 588 -2129 1156 2245
1063 2245 -1840 -1741 563 -438 -1737 1999 2676 -2152 -979 1627 -1636 -868 3631 1397 -1750 44
1079D4M34k208J598L759k749l145K915q83k745L995K022l992l95J847j719j276
1095b498L727J224l673N3K558l220j50M900j737k688K245K25k823J147L211j759
1111G42k017K937o81l780K607K390l154M35K368k505j882K567J156k252Q88K387
1127B206l608j302L812n65j853L133l34l413N80K555q46q80K426n94l798K036
1143d45K369k856R20K238k611j723K382N14j779Q91J679k434j175L133p07k260
1159a864K506K69k432J198J735j561p84J818R7j827R70J545k569J04K492j524
1175A73r50J682m20j733N95J714j012r81J921r71k019K215Q71j952N73Q29j408
1192h73M3J307M61j577L31J316j635K24K123j362j316J616k21q52P15O21r14j085
$$ plain form
1079 44 478 -1730 -132 3627 878 -2267 648 -235 -2980 1015 3037 -955 -1350 497 -1222 -2498
1095 -2498 1229 2453 -1220 -1167 1391 -1829 -1979 2921 1184 -1504 741 966 -1857 -710 2501 742
1111 742 -1275 1662 981 -2799 -192 2198 -956 -521 1847 -658 -2540 27 1183 -1069 -181 2206
1127 2206 -1402 -2704 1108 543 -1310 1823 1489 -1924 -1344 1211 365 -515 1911 1317 -2481 -445
1143 -445 1924 -932 -12 2226 -385 -2108 274 788 -991 -100 1579 -855 -2030 1103 396 -1864
1159 -1864 642 911 -1521 -323 1412 -149 -933 885 982 -845 125 1670 -899 -795 1697 173
1175 173 -777 905 485 -1248 -653 1061 49 -932 989 18 -2001 214 1085 -867 -294 535 -873
1192 -873 -830 477 938 -639 -308 1008 -627 -403 1720 358 -958 658 437 -415 300 921 7 -1078
1210a078J317L48j442J046M29k052P87J260q25k92O90k66q47N61J390j047p78
1227g99J657p87r42J754r1j172M06M79n04k65Q14K4j417P59Q88j371N73P07j247
1246e34j76Q26j06k71J52K20m83l46J317l6j089Q57k07q93R75N26o77J53p7R3
1266B24n30N09O78r58j42O50r08L50O83p60r1J22k18P2m6N45k24o79Q02J07n58
1287c72P11j16o00M54o6L38O6l91K35l46m9Q19m56k07J36k82q2N16m56Q6k05j81
1309d48L57j52J77J19n68K68J61l47P31j64k64L27l74K16N57m93L25k40m06M67
1329B49r3n2M66p53K21K3k82M81j06m20J60m7r3M25l13Q3j58j72N33J1k45M14
1351C32o20P6N72j96L06j65m42L18m72M67K73l08r9P6m20N48mn54M51m52j01M01
$$ plain form
1210 -1078 239 587 -855 191 620 -1432 -645 615 -210 -502 188 -78 -925 -364 1026 -21 -799
1227 -799 858 71 -871 883 792 -380 26 505 1 -264 550 574 -843 -84 804 -567 6 713 -534
1246 -534 -710 116 10 -261 -109 111 -372 -718 599 563 -526 331 124 -769 206 732 55 208 131 224
1266 224 -306 203 881 -77 -219 431 -477 -127 556 -204 -295 -173 -391 -319 -365 180 -44 -723 79 186 -372
1287 -372 339 223 -377 77 11 349 415 24 259 -87 -136 683 227 20 156 -126 -208 308 -148 -62 -267 -448
1309 -448 -91 -243 -66 53 -515 -247 -86 -433 298 134 -130 197 -177 39 596 103 428 188 -218 249
1329 249 156 104 570 -183 38 61 -221 260 154 -266 -106 -153 -246 179 -134 -51 -209 -381 152 163 -82 332
1351 332 -288 -212 360 164 470 305 -137 181 -291 176 449 141 42 118 -302 246 242 -312 139 -313 -414 -13
1373a3j18J62j57n18N14j3J26L61l95j27K74k72L47L01n09K05k45LN52j93m9o5
1395A71p79P22k4k95N05m72o34N74J18K52j03m01K29l48L54M39m75J36K79n86
1415c38L77N26n00M6k23K06K73k49K97m53m93P13pl01O17n76o05L43J55K62m8
1436B2j21L8p43M41Q33n06K14K46j076L17N66k6J43j3m08M3k95P63N5p23M74r
1458B35p24O09ql51K83J37j40k60j31J58m18L45R10o87k61K77n63L21P01j8K52
1479F67p53j24j89J04R49J15p32K24o90k51P31N22j65l20l99j69r5J49J048m60
1499A62l76J15o47O4J029j16P5j31m34J22l01N40N31j96k9K00j126J90L36J37
1519A45L79j00l56m54l85N44N63k43N58n88r31K21N2P04N36p4n53o43PO72M06
$$ plain form
1373 -13 -131 31 -126 -644 -130 -143 -17 344 -51 -178 96 -176 171 472 -37 168 -77 -74 478 285 236 171
1395 171 -608 114 90 -205 300 -172 -806 -232 -114 138 35 -366 -137 -485 -131 308 -167 -31 248 -338
1415 -338 39 565 65 111 -112 94 367 118 415 -38 -531 182 175 -126 491 -85 -690 -347 -192 70 22
1436 22 -99 -61 -804 -363 470 -36 178 424 -652 -335 231 205 348 335 -73 -30 -325 438 493 -230 244 235
1458 235 -489 120 112 -239 44 181 41 -219 -350 -192 -610 -265 645 -42 -303 -26 -589 -268 433 415 667
1479 667 -86 -210 -399 -295 654 769 37 261 -429 -680 51 573 408 88 -311 -480 -575 -426 622 162
1499 162 -214 -99 -746 -682 347 231 306 175 -259 -137 -438 102 633 437 408 608 -518 -328 8 145
1519 145 524 424 68 -386 -771 -227 336 93 651 63 -868 -647 -595 109 645 571 18 -625 -618 54 460
1540D60K77K87j282m43L99J61P15L11m17n01p56M27M03J07O65l92q24j00j21L3
1560e91P23J99k81k61l21J81Q3N33L61n25n4m4m55L13N36l2K53k63n30o0J0N95
1582C70P4k15K10o06o45L15M09K83L57m72p99J32J62O32O4J90k93j040M29O33
1602A90j04L97N6o94j00J65J91L11r8km46k47M11K30l45L37l78j68M62l72p6K39
1624d1j80K75j89O0P3m50K72M33j97R8K51m92J7P5K57J13M3l56j15l07N55J66
1646C61m89L03j97o03O84J9L8j17l57J89j13J92L38l69k00M14l23L16L06k40m7
1667A05j90mM17p9Q4r3o68M31M06l54M03m79k20J49j95L54Qm16K42k61o2N71r0
1690E9l10K36q7j4K62k2J65k99k1N02m93J82K46n23j92O67j28j17K6l42J34k20
$$ plain form
1540 460 737 1024 -258 -701 -302 -141 574 885 468 -33 -789 -362 41 148 813 421 -403 -503 -624 -591
1560 -591 132 331 50 -211 -532 -351 -268 265 626 101 47 3 -452 -139 397 365 618 355 -175 -235 -225 370
1582 370 444 229 439 -167 -812 -497 -88 195 552 80 -719 -587 -425 207 271 461 168 -872 -443 190
1602 190 86 483 539 -155 -255 -90 101 412 314 312 -134 -381 30 260 -85 252 -126 -294 168 -204 -280 -41
1624 -41 -221 54 -135 -75 -2 -452 -180 253 56 154 405 -87 -70 5 262 375 418 62 -53 -360 195 361
1646 361 -128 175 -22 -625 59 78 116 -1 -358 -169 -282 -90 248 -121 -321 93 -230 86 392 152 105
1667 105 -85 -89 328 249 333 240 -428 3 409 55 458 -21 -241 -92 -287 67 75 -341 -99 -360 -422 149 59
1690 59 -251 -15 -102 -116 146 124 289 -10 -31 471 -22 160 406 -117 -309 358 230 113 139 -203 -69 -289
1712b89M59Q7m59J60k41k63N32L10m79J43j45R3m7J42M50m04p4K75m02J48N86
1733E82m23k68L14r1k12N2J76p6l78M61k16j89M14K5m92J22J52k35J28Q3j69J
1755b39L21K13k66k71N30m02j7M49k78J00l3j25j36J62J80J23m07jq5k82O30M6
1777B12o00J20Q7j60L55r3Q7k5j12J99j3J6J56k67r5K35j30L08K47k70j85lj39
1800g0K15o4n5nk31K15M7q4K68m79m0R4P6K91j78l51K73q9J70L70k03k51K6j57
1824b12M99%l33L28l55k7K40N6K19k94o12M67k1J07J4k52J2%p%M07l65J89k59
1848a99J6L31j52J49m6l45K77J88k37L26k62k60L41J3o9O9m09J41Q6q1L39l49
1870a33j39M6j31J90M30k18M2j77j25K61J9K36r6m93J90J46j9L06j59l23L41j35
$$ plain form
1712 -289 170 257 -202 -42 -283 -546 -14 296 -183 -40 -185 -92 -139 3 453 49 -25 250 -152 -4 582
1733 582 159 -109 205 114 -98 -46 130 54 -324 137 -79 -268 146 171 -321 -199 -47 -282 -154 -71 -240 -239
1755 -239 82 295 29 -242 288 -114 -131 318 40 140 107 -18 -154 8 188 311 -96 -97 -182 -464 166 212
1777 212 -388 -268 -181 -341 14 -79 8 -17 -129 70 57 73 229 -38 -133 102 -28 280 527 257 72 69 -70
1800 -70 145 81 26 21 -210 5 52 -32 236 -243 -283 -189 -113 178 0 -351 -78 -167 3 373 170 -81 -55 -212
1824 -212 287 287 -46 282 -73 -100 140 196 415 121 -491 -24 -45 62 76 -176 -164 -164 -171 -171 236 -129 60 -199
1848 -199 -183 148 -4 145 99 -246 31 219 -18 308 46 -214 127 140 71 140 -269 -128 -42 -123 216 -133
1870 -133 -272 -226 -357 -167 263 45 87 -90 -215 46 65 301 205 -288 -98 48 29 335 176 -147 194 59
1892E9N3J41k67N3l56P5L74j86k01K51k84pL23q9J00k67kK23j12K24J28l42J82
1915G3j69J92K24K4k30J58k25K4J67k77J39k62p5L17j54l2J33l33J2J35L4O2j08
1938a71j77M21m27M25Q8p6M1k37j97K94K40k43K88j13k1k37J08K81j65k18J41
1959D5j86Q3L43k90j9k5k86K4K26J54q8j81J87K7j87L00L5j67P6P9j09P8r5q0
1983e6pQL31k72k12J66oj88M36k17O8j75l41L90o1rL39k37k98L52k96K85L09j44
2007A65r8m1j84L7K35J10R4o55L47M3j54L78m6l05J96j42n7o6k7L20k81j10N59
2030C18n45q4K42j8J47K30l95j69O4J66L92j10R3q8m91J62J91J08L58m09k46j04
2052a88p9K85J95l1P2n66j48L93N9j6K62n08k80L45K06m2J34K4j40rP0R3l24L71
$$ plain form
1892 59 112 253 -14 39 -317 -242 132 -54 -255 -4 -288 -295 28 -61 39 -228 -230 -7 -119 105 233 -109 73
1915 73 -96 96 320 344 114 272 47 71 238 -39 100 -162 -237 80 -74 -106 27 -306 -294 -159 -125 -63 -171
1938 -171 -348 73 -354 71 159 83 124 -113 -310 -16 224 -19 269 156 135 -102 6 287 122 -96 45
1959 45 -141 -58 285 -5 -24 -49 -335 -311 -85 69 -19 -200 -13 14 -173 127 162 -5 71 150 41 119 24 -56
1983 -56 -63 -55 276 4 -208 -42 -48 -236 200 -17 51 -124 -465 -75 -136 -145 194 -43 -341 11 -285 0 309 165
2007 165 67 26 -158 -121 114 224 318 -337 10 53 -101 277 231 -74 122 -20 -77 -143 -170 150 -131 -241 318
2030 318 -227 -311 -69 -87 60 290 -105 -274 -210 -44 348 238 331 243 -248 -86 105 213 571 162 -84 -188
2052 -188 -267 18 213 182 254 -312 -460 -67 -8 -24 238 -270 -550 -205 1 -41 93 117 -23 -32 38 131 -193 178
2076A78N9k21J51j64J48Rj92J88J54j96j13k15j75N20j62Q3j05l33J57K52j82
2097a59M56k41m9L7k23L36J12l30J77j7l5N5r1k5R9j60K29r3j54L7m3k4N2q9R1
2122e2K07k71o2K65m69M33Q2j09K5j54J63n4qK22j96r5J29j49K49J16l64J08J23
2145A39k18L8O7k21J91k60M4K40k76J14j3k09M64l09P4J18k01J09K49j86J85k17
2167g8L0R9O1K14j26j12p0N6j94L69l14M2J06k07j07NJ61J16J28l44J00j95M3
2190b17L44k09J47M6j91l5K52j73K68j2j23N1j31PJ33k80M15q9l78L44k17j08
2212a56K03r5J05k2j64K22l72J29M03k88Jo5p2k7M37q9Kj88j22K69k53L16J13
2235B87k94M2P3k78L11J9j84j22K7J6j8j8K51l17j09L86j62j48M83m02O6J16K55
$$ plain form
2076 178 237 16 167 3 151 160 -32 156 310 114 1 -214 -389 131 -31 52 -53 -386 -229 23 -159
2097 -159 297 56 7 44 -179 157 269 -61 116 99 64 119 28 3 102 -58 171 78 -76 -39 -82 -106 -54 -143 -52
2122 -52 155 -116 -178 87 -382 51 133 24 49 -105 58 4 -4 218 22 -73 56 -93 156 272 -92 16 139
2145 139 -79 -41 26 -195 -4 -264 -220 20 -256 -142 -155 -364 100 -209 -135 -17 -218 -109 140 -46 139 -78
2167 -78 -48 51 112 326 200 88 18 74 -120 249 -65 -23 83 -124 -231 -226 -65 51 179 -165 -65 -260 -217
2190 -217 127 -82 65 111 -80 -115 137 -36 232 220 97 148 17 24 157 -123 292 203 -175 169 -48 -156
2212 -156 47 -48 57 35 -129 93 -279 -150 253 -35 -34 -99 -171 -198 239 150 152 -36 -158 111 -142 174 287
2235 287 -7 35 108 -170 141 160 -24 -146 -119 -103 -121 -139 112 -205 -314 72 -90 -238 245 -157 -91 25 280
2258B80p8k89Q0P8j42K86J64j46r8r5j47J53N8m6o5k99K96j11Q6K06j98j65J68
2281b4k13R0J43P0j10j00k17M80p2J22p0k80K87K9j08J01N2k47K28p7J6K0l50
2304b30J15j05J30J92k51j29L57l28J34J58l5o1j64J72K27j53j9K11k53oJ76j23
2326A5J45J28l73O9l3K9K78j88j78M3j94L46j26k3K0j36N3P9M9M3q7k84M05o5
2350A5q4J13q8J02J7k13K88J44l64J27k03J62L5Q5P0k98k5p1J03o3K74k61J69
2373C4k07j25L54o8j66J94j96J30K5M1Q7kp4J07n1M6K10k32o4R0k01J53R0k61
2397h6J30j73J22P3j23j33L0L1J64q3j48K55j49PJ60j27J69J89l41Q0R5k40L65
2420B67j50o5l2k9m4J53r0o9K3o7J28q4n0J75k65J1P9MJ42ok53O2K19J07k11j30
$$ plain form
2258 280 202 -87 -7 71 -71 215 379 233 135 40 -107 46 104 58 -7 -306 -10 -121 -35 171 -27 -192 -24
2281 -24 -237 -147 -4 66 -44 -144 -361 119 47 169 99 -181 106 135 27 128 180 -67 161 84 100 120 -230
2304 -230 -115 -220 -90 102 -149 -278 79 -249 -115 43 8 -53 -217 -45 182 29 10 221 -32 -38 138 15
2326 15 160 288 -85 -16 -49 -20 258 70 -108 -65 -259 87 -39 -62 -42 -178 -125 -46 3 46 -41 -325 80 15
2350 15 -69 44 -44 58 75 -138 150 294 -70 57 -146 16 51 136 206 -92 -117 -188 -85 -148 126 -135 34
2373 34 -173 -298 56 -12 -178 16 -180 -50 -25 16 103 101 27 134 83 129 339 107 43 133 -68 85 175 -86
2397 -86 44 -129 -7 66 -57 -190 -160 -129 35 -48 -196 59 -90 -83 77 -50 119 308 -33 47 142 -98 267
2420 267 117 52 20 -9 -53 100 10 -59 -36 -103 25 -59 -109 66 -199 -188 -109 -105 37 31 -222 -160 59 166 -45 -175
2446a75L29l21J95J98j06j57J21q1l2J80l2R5l03r0J64M6M8Q4k28P2q4J2j0J53
2470G8o2j49j62L60k00R1J71p6k86L05J40p3O6k09l5j59K87J78m64q7M44m70L52
2493D0K60l99j83J55rJ21j50M06l54k06K94N5j66L62m9l55J99K01j83J5K63n7
2515B60m67J97L18k89k03M85m91l15O38j8k78J49J59l37l6L75j8m14J55L83m41
2536a88J21L48l69j09K09J02l10M00J38l61j02L81j22l43M40k06j50l9L61k38
2556c7j41L33j75k17L83N1n30K46J53l83Q0M66r4k24J27J92j20l09N50k83m11
2577c43O49J9m66M38m9l69p2L87N9o13L95J15n04R1M84l49o4L83j43k95J29K79
2599A61j65j53N43k53m30N98K3m81L29K22l70j65L12j58j76Q1L05k47k15N72n04
$$ plain form
2446 -175 154 -167 28 226 120 -37 84 3 -29 151 119 214 -89 -179 -15 31 79 163 -65 7 -77 -65 -75 78
2470 78 16 -133 -295 65 -135 -44 127 51 -235 70 210 137 203 -6 -41 -200 87 265 -199 -286 158 -312 40
2493 40 300 -99 -282 -127 -136 -15 -165 241 -113 -319 -25 30 -136 226 177 -178 21 222 39 54 317 260
2515 260 -207 -10 308 19 -184 301 -190 -505 133 115 -163 -14 145 -192 -228 147 129 -285 -130 253 -188
2536 -188 -67 281 -88 -197 12 114 -196 204 342 -19 -121 260 138 -205 235 29 -121 -160 201 -37
2556 -37 -178 155 -20 -237 146 197 -333 -87 66 -317 -237 229 135 -89 38 230 110 -199 351 68 -343
2577 -343 306 325 -141 297 248 -121 -193 194 253 -360 35 150 -354 -263 221 -128 -192 191 48 -247 -118 161
2599 161 -4 -157 386 133 -297 301 324 -157 172 394 24 -141 171 13 -163 -82 223 -24 -239 333 -171
2620a71j75M60N7m63K51M6j50m2N07Pn39L43P3o20M17L67k30k64L31l10l32O02
2642A65M36m90j82K71m14k03N45J82m37J43J94n40L1L60O3m17M99l6n92J43O10
2663C31l66l5L73p5m37K42J94l03J16M50m21m28N06Jn12L95L67n63j4L9J17k52
2685b75N38R8o26m0M15k77lN88j91n08J53P9r1K37K53l14l20L46N2n40N91L15
2707D80n16l6j75K03k61L32Qk33M1K55l46p9M18r8q4K38j0k10j58K42K01j46J41
2730B07R5n14Q9M44j38j95J90j64M1n8K25j34j53K72l71k35O00k42j4K07k70J51
2752C3j50J03Q6j79K2M65m67o4K96j23j67K93q8l2J24n1J07l04K12R6m17L32r6
2775C1j13J32n8K4j33j05J43j39J51K73J5l47K65k09n9R6K38k62R6L2k8j35J19
$$ plain form
2620 -171 -346 114 171 -292 -41 5 -145 -187 320 327 -212 131 204 -416 1 368 138 -126 205 -105 -437 165
2642 165 601 111 -71 200 -214 -417 128 310 -127 16 210 -330 -299 61 124 -293 206 170 -422 -279 331
2663 331 -35 -70 303 228 -209 33 227 -76 40 490 69 -359 147 148 -364 31 398 -165 -179 -140 -23 -275
2685 -275 263 361 -265 -305 110 -167 -170 418 227 -281 -128 -49 -140 97 350 36 -284 62 114 -426 165 480
2707 480 -36 -72 -247 -44 -305 27 35 -198 -157 98 -248 -327 91 -7 -91 147 137 -73 -231 11 212 66 207
2730 207 302 -212 -123 321 183 -12 178 14 55 -3 222 88 -65 207 -164 -399 201 -41 -55 152 -118 33
2752 33 -117 -14 72 -107 -85 380 -87 -151 145 22 -145 148 60 28 152 101 208 -96 116 212 -205 127 31
2775 31 -82 50 -8 16 -117 -222 -79 -218 -67 206 221 -126 139 -70 -129 -33 205 -57 39 71 43 -92 27
2798B7K01k46J5L05l57M0L8k21K38j83J28m0n4R3j20j40L33q2j2N2j0J23J7j18
2822B7l6j11j0R0J01n8K88k33l7M3p5m0m9Q1k2J22p5j40J01j53J18JN3O6kR9l30
2849a81K00N4j52J00R1j26J18l0n8J28r2q6R6j41L3N4j35J78rq2k4j45J19J83
2873I3l50L03l4j50J26P1pJ9j18Q8M5L3o3K6j77P4L0P2L7jo8K5j26L6N0R3j58
2900c1j46O1K03j64q7J10o4K25k18J18P1l9j07O2oJ66j40j7RM9j3o4R2j07L9j65
2926a63J97O9j61R9n2j50J5K39j84Q0L0j43n3K38J38l49J55K66l23J48p3J32k13
2949e8O2Q4m6k79L25j03r4J68L1j62J80j69j85K34r6J9R0j3K5j10J24J50j84l
2973a0K69k70M8J8J17j43p7P6Q3k62L63j12l59K75J35k40N6J29l00K30o8J32k19
$$ plain form
2798 27 228 -18 -3 302 -55 -15 23 -198 40 -143 -15 -55 -109 -16 -136 -276 57 -25 -37 15 5 128 145 27
2822 27 -9 -120 -130 -40 61 3 291 58 21 64 -11 -51 -100 -19 -41 81 6 -134 -33 -186 -68 -67 -14 52 50 149 -181
2849 -181 19 73 -79 21 112 -14 104 74 16 144 52 -34 62 -79 -46 8 -127 51 42 -40 -64 -209 -90 93
2873 93 -257 46 12 -138 -12 59 52 71 -47 41 86 119 56 82 -95 -21 9 81 118 117 49 74 -52 -16 34 127 -31
2900 -31 -177 -116 87 -77 -164 -54 -118 107 -111 7 78 39 -68 -6 -12 154 14 -3 6 55 42 -22 70 -37 2 -163
2926 -163 34 103 -58 41 -11 -161 -146 93 -91 -11 19 -124 -177 61 199 -150 5 271 -52 96 23 155 -58
2949 -58 4 88 42 -237 88 -15 -109 59 90 -72 108 -61 -246 -12 -108 -89 1 -12 13 -97 27 177 -7 -10
2973 -10 259 -11 37 55 172 29 -48 28 111 -151 212 100 -259 16 151 -89 -33 96 -204 26 -42 90 -129
2996a29n2K16k10l3L51n3j88J19j10k1J78M5r1o0J31%k10K54Ol30J85M4j83J44
3020CM3j68q7K64J77j98l46N23l45j57M95pk85J63lj63j0K29p3j56K9M66n56J79
3044A7O0j48J06K26j42p5o6J56j15k33L37k78j32L76j57j14K13Q1k38oL73j90
3066E1k77K50K74m95MM11k07j74M81k98k66K28J77j55k4L90k08m73L87j10k15
3087b49J79K62l35oL07j57j61K51K43l30j91L50l36o8M63j20k84J95M7k65K55
3108E0K92q0m19O9L15o08L43K06j77k80L82j27k82J27L82l43Q7K90m58j75N45
3129A39J1l27K55N5k09j61M42L2m04K42J57n83J20N83k12k00L12l03k25J97J27
3150D8l4n1J46j43l17J95L97m74L00K63l49j17K58j07j24K12J87m80p8N53l10
$$ plain form
2996 -129 -181 35 -175 -208 143 90 -98 21 -89 -110 68 113 22 -38 93 93 -117 137 143 -187 -2 42 -141 3
3020 3 46 -122 -209 55 232 34 -312 211 -134 -291 204 197 -88 75 72 -91 -101 128 55 -101 -72 394 -162 17
3044 17 77 -71 35 261 119 44 -22 134 19 -214 123 -155 -287 89 -68 -182 31 112 -126 -132 241 51
3066 51 -226 24 298 -197 -193 218 11 -163 318 20 -246 -18 159 4 -20 370 162 -311 76 -34 -249
3087 -249 -70 192 -143 -149 158 1 -160 91 334 4 -187 163 -173 -241 222 102 -182 13 60 -205 50
3108 50 342 262 -157 -88 227 -381 -38 168 -9 -289 93 -34 -316 -189 193 -150 -63 227 -231 -406 139
3129 139 150 -177 78 133 -76 -237 205 237 -167 75 232 -351 -231 352 140 -60 252 -51 -276 -79 48
3150 48 14 -37 109 -34 -351 -156 241 -233 67 330 -19 -136 122 15 -109 103 290 -190 -268 285 -25
3171b5j50N14j74k11j87K93n9k27N36l01k92R1L38o03L46L90k05j60R3k4j53L08
3193A38K84k63l05L34j50l82M75J68l54m1j6QK1J63J41n11J98O8k21K18J94j64
3215Ck76L83j5j96P1J33k18r4L98j96j42K51R1k12R1K03l89M0K82O3l18O6R9j55
3239c7n0J89j66J0K10j79k83K39J56Jl5qq4p9J37J07j94J68O0k21l1K20N8j16
3263G2p4K47l00m6J53k09Q6J20k74J18Q9K4k2rK8J45l99K46R4j67M8J25j22L6
3287IJ28j69m7J3J17k02P9K30j69l5OO9k0K6j00o7J9J16j46J38q7N0j53L0J85
3312B0j20m0J43o1P4m2j36K35r4N0q4L6J14j54R7N3m8j04J01p7l7r1L7J45j37
3337a20P8NJ76l63K07o8LO8k8K8R5Oj75m6J66J28j97J55p1jlN1k04J15N8K5p0
$$ plain form
3171 -25 -175 339 165 -46 -233 60 1 -226 310 9 -283 -192 146 -457 -111 279 74 -86 7 -17 -170 138
3193 138 422 159 -146 188 38 -344 131 299 -55 -96 -112 -104 -83 80 221 -290 -92 -24 -245 -27 167 3
3215 3 -273 110 95 -101 -30 103 -115 -209 189 -7 -149 102 193 -19 72 275 -114 -74 208 271 -47 19 118 -37
3239 -37 -87 102 -64 -54 156 -23 -306 -67 89 90 55 47 -37 -116 21 128 -66 102 162 -59 -90 130 188 72
3263 72 -2 245 -55 -101 52 -157 -71 49 -225 -107 -18 6 -16 -25 3 148 -251 -5 89 -78 -30 95 -27 9
3287 9 137 -32 -79 -66 51 -151 -72 158 -11 -46 -40 29 9 35 -65 -132 -113 3 -143 -5 -92 -42 -195 -165 20
3312 20 -100 -140 3 -58 16 -26 -162 73 -21 29 -55 -19 95 -59 38 91 43 -61 40 -37 -74 -165 -128 17 -120
3337 -120 -42 -37 139 -224 -17 -85 -82 -14 -42 -14 81 87 -88 -134 32 160 -37 118 47 46 43 94 -110 5 63 88 18
3364A8j85Q8J7kR4j03p0J00J16j55n5K67r6r0Q1q9l4J43N5j99J61J07p7J9k0j87
3390i6J71j19%J72j27k2n4p2J86Pj11M8n4J11l8j80K64j82K2J70l6p3P7l1P6j65
3416e6K37q4j28Q9J55l36J22Q9j16o6N4N3N6j14n5J91j66L0jR2K8q1j60JL56j08
3442H2M4j94p7K53Q4k27J05%j0r9n2K97r3k59J82j23M1m6J61j02p3RJ30J4K2l9
3468C0j60J80n7N0L3j23j48K49j57K24o7r2J33j55J14L9J21l43P2K2J3OK0M5k27
3493a78K73m6j19J26O2j74M0M5l7j46K22j14m3N1j23J13J84r6Nj07P7J18j66r8
3517a31J55M2k32J70p0j22J02K45k72P3qP8j17M7k8K9rK2p0m8L15o4r4qJ92k73
3543g6r2L63j11k03J56J77m60J26L90k58j85K30j57j70J86K49o3k63K16j4k93
$$ plain form
3364 18 -167 -79 -62 -64 30 -73 -143 -43 73 -82 -137 130 34 -56 25 -64 -98 45 100 -99 62 169 92 111 91 -96
3390 -96 75 -44 -44 128 1 -21 -75 -147 39 46 -65 -17 -71 40 2 -178 86 -96 -74 96 60 -13 64 33 109 -56
3416 -56 181 97 -31 58 213 -123 -1 88 -28 -94 -40 13 69 -45 -100 91 -75 -45 -46 46 74 -7 -167 -166 190 82
3442 82 126 -68 -145 108 192 -35 70 70 60 -39 -91 206 113 -146 36 -87 -46 -92 69 -33 -106 -97 33 47 69 30
3468 30 -130 50 -7 43 76 -47 -195 54 -103 121 54 -38 95 -60 54 93 214 -129 -57 -35 -22 -16 4 49 -178
3493 -178 95 49 -70 56 118 -56 -16 29 -8 -154 68 -46 -89 -38 -161 -48 136 40 45 -62 15 133 -33 -131
3517 -131 24 66 -166 4 -66 -188 -86 159 -113 -40 -48 30 -87 -40 -68 -39 -48 -26 -96 -144 171 107 13 5 197 -76
3543 -76 -168 195 84 -119 37 214 -246 -120 270 12 -173 57 -100 -270 -84 165 102 -161 55 41 -252
3564b52N33k33k39K60J71k46q2K40j98k17M22p5j75L6K44j36k16K95r7l32K43
3585e4R8j95O9J51J8k44J56Q1q5j97M27j74k74K73j30j27K21K56k06k19K13j14
3607e6j15L34j02j1j25oj9N1K24j51k02J69J48l42K58M4n7k03K12m6j95L06L2
3630A48k28P4K68lm56R1L24l30L94j07k58j65J84J45J5M0L0m68J17J94M4j26J98
3653A25m8k64o7L86p2J4L50l42k92J41K45k34J72K22k67k44J97r2L8J43Q3l03
3675a09j28L39j31n5K09J7k45Q0lr4J14O0K9l24J82J40q7j25L84k07n3M2J18k52
3699i9j2L61k65r3J30J23j20J12J8l64L15O3l23n8L17o3k08K52J17l33K1M34l83
3722e8j16K00J06k89N7R7J49k54K06L3k55R0Q0j52K16N5j96j76M04j22n2P6O2
$$ plain form
3564 -252 281 48 -191 69 240 -6 -88 152 -46 -263 159 84 -91 -55 189 53 -163 132 35 -297 -54
3585 -54 44 -151 -82 69 87 -157 -1 80 -5 -202 225 51 -223 50 -80 -207 14 270 64 -155 58 -56
3607 -56 -171 163 61 50 -75 -81 -100 -49 175 24 -178 -9 139 -203 55 99 42 -161 51 5 -190 116 148
3630 148 -80 -6 262 259 -197 -106 218 -112 282 175 -83 -248 -64 81 96 136 166 -302 -185 9 53 -73 125
3653 125 77 -187 -254 132 60 74 424 82 -210 -69 176 -58 114 336 69 -175 22 -70 -32 111 194 -109
3675 -109 -237 102 -29 -84 125 142 -103 -23 -26 -120 -6 54 83 -241 -59 81 -6 -131 253 46 -7 35 153 -99
3699 -99 -111 250 -15 -108 22 145 25 137 155 -209 106 169 -154 -212 105 42 -166 86 203 -130 -109 325 -58
3722 -58 -174 26 132 -157 -100 -3 146 -108 98 131 -124 -34 46 -106 110 165 -31 -207 197 75 23 99 161
3745A61j91q1L53j36l08K10N8p3L3j32J23n1o3J59j85J61R9j39J91K05m63L4j36
3768a71K52k30Q0K23j38j6Kj4r6J92J8l2Mk52K63j30J29N1o9KLrL2M1j66m2J47
3795G4L5k62J50n3Q5M0pL6j36ll1q8P3R2O3j17OJ31r0j45K46J07j50k5l8L3q6
3822f0J05l2LJ43j65l6k4PK71j11j37J83l15K45J22j79j5k5K5L2J1Pn3NJ4K3j12
3849f8R6j79J48M1N2j52N5L7M9r3r2R9q2J18K9k4l2J6j53L5N1L9Q0j13J05k7p
3876B8J03k00O1N1J43q8n4j42J33ol1q8L3K35k03nl9J18Q2j63j61K20j23Q5J11
3901A00k0m1J0k02L56l02J05M4j68L8O3j18J69J13j82R9k7J36p4r8m1K60j29p1
3925B0n8p2K37l18J18PJ16R6k59L1R9R4j85R3P3k17K76k66J58K0q0nJ11j16J74
$$ plain form
3745 161 -30 -111 242 106 -202 8 66 -7 26 -106 17 -34 -97 62 -123 38 137 -2 189 394 -69 -35 -171
3768 -171 81 -149 -69 154 16 0 2 -12 -108 84 102 70 74 -178 85 -45 84 135 66 68 71 62 94 135 -31 -73 74
3795 74 109 -153 -3 -56 29 69 62 98 -38 -41 -72 -160 -87 5 68 -49 -43 88 -2 -147 99 206 56 31 -7 26 -60
3822 -60 45 13 16 159 -6 -42 -66 -59 212 101 -36 147 -168 77 199 20 5 -20 5 37 48 55 2 7 21 44 -68
3849 -68 28 -151 -3 38 90 -62 -7 30 79 -14 -106 -7 -89 29 58 34 2 18 -135 -100 -49 -10 70 -43 62 35 28
3876 28 131 -69 -8 43 186 98 44 -98 35 29 -2 -90 -57 178 -25 -30 -69 49 131 -32 -193 27 -96 -11 100
3901 100 80 39 49 -153 203 -99 6 50 -118 -80 -17 -135 34 147 -35 64 37 173 99 1 -40 220 91 20
3925 20 -38 -110 127 -191 -73 -66 50 146 -113 -82 17 111 -74 19 92 -125 151 -115 43 63 -17 -22 89 -27 147
3950A47n2j59J83j40M4P7Q5k35J0r5K60n9j72Q5M1l1n5J07O5o0k42K07R0j40P1
3975C2r4K3Q0Kk4R0k0K2k28K50J00r5j03Kj09J86j96qJ20j1J7l1J16j72j54K18
4001A3m9qo0J32Q4k57N2J95l06J69k8J00p0J96k17lJ93L6j53r1M6j07O4J98j75
4026d6Q2l06K34K2k6Q5m2j4jJ59k37n7K01l9JM2J7k82K76j3N3j05j7j12p1L43
4052A47r5j59K09j3j01J02K5j83j01K97m4n2mJ13p4j05J38l6j91R6R8O7j86K56
4076B04l37l5J25J12j51L6K17k53j70K71N0k64K16J79j92k09L22j09j62K13Q1
4097A44k69J13K7j76K24J38j30j19O9n5p8J13K69k66k07L32q4k25K52R3k51M6
4119d0J37k94J81R1J42j39q2N2k14R2J87j00M8J05J7m23K37J3o4J18p6P8k41K88
$$ plain form
3950 147 95 -64 119 -21 23 100 185 -50 -40 -135 125 66 -106 -21 20 -11 -66 41 106 46 -196 11 101 -39 32
3975 32 -62 -39 41 43 19 109 89 111 -117 133 233 138 35 37 -72 114 -82 -90 30 19 36 5 121 -51 -205 13
4001 13 -36 -44 -104 28 112 -145 -93 102 -204 -35 -63 37 -33 163 -54 -57 136 172 19 -72 -26 -133 -69 129 -46
4026 -46 36 -270 -36 -14 -40 45 3 -11 -12 147 -90 -147 54 15 16 58 75 -207 69 56 109 4 -13 -125 -196 147
4052 147 52 -107 102 89 -12 90 115 -68 -169 128 84 32 28 141 67 -38 100 64 -127 -31 67 134 -52 204
4076 204 -133 -168 -43 69 -82 -46 171 -82 -252 19 69 -195 21 200 8 -201 121 12 -150 63 144
4097 144 -125 -12 15 -161 63 201 71 -48 21 -34 -112 1 270 4 -203 129 45 -180 72 165 -86 -40
4119 -40 97 -197 -16 75 217 78 -4 48 -166 -74 113 13 61 166 183 -240 -3 10 -54 64 -12 66 -175 113
4143A13j54oO2q9M0K2K09k20N4o7P7o4k4J34p9j16L14j88o1%mK3P0J13j04N9j03
4170A1J28j59N8K6rk43J75J9l0J59n1j36J25j3k46Q6J88j40j03J68K6j15P6qL9
4195C1r6J17K4n5j20K95j99m8K05k70K3O5J5Q7k3M4j12J0O3Mj45J42J2k76l2J93
4221d6R4j18J76l3j43L4J41j7j14R3k16J11J13r4PM0k3P8l68K74O4J6j88K04j47
4246f2j13K63J23k50P6r1R0o5o1J65j49K38j40j54J10j4Pl2J26j13N3k2Q2r3j7
4271d3mj9R5J13k09L4oM2q0J9O5p5J2J30j16J40k15K30k04J10J01r8k5j81K57
$$ plain form
4143 113 -41 -47 15 -74 -34 -12 197 -23 31 -36 41 -23 -47 87 8 -108 206 18 -43 -43 -47 -24 46 159 55 114 11
4170 11 139 -20 38 64 55 -188 -13 6 -24 135 84 -52 73 60 -186 -100 88 -52 -155 13 39 -76 0 -8 31
4195 31 -65 52 76 21 -99 196 -3 -51 154 -116 -93 -28 -13 74 51 95 -17 -7 56 60 -85 57 69 -207 -239 -46
4221 -46 48 -70 106 73 -70 -36 105 88 -26 67 -149 -38 75 -19 -12 28 5 83 -285 -11 53 69 -119 85 -62
4246 -62 -175 88 211 -39 37 -54 36 -29 -90 75 -74 164 24 -130 -20 -34 -27 -59 67 -46 7 -15 67 -26 -43
4271 -43 -47 -66 29 142 -67 -33 -39 3 -77 -58 7 -68 -56 74 -42 98 -117 113 -91 19 120 22 -3 -184 73
$$ [...]
8191D6
##END NTUPLES=NMR FID
##END=
