##TITLE=1H_LR-747-V1-M2
 CDCl3
 8 sc, 
 18.03.2022
##JCAMPDX= 6.0         $$ Bruker NMR JCAMP-DX V2.0
##DATA TYPE= NMR FID
##DATA CLASS= NTUPLES
##ORIGIN= UXNMR, Bruker Analytische Messtechnik GmbH
##OWNER= root
$$ XWIN-NMR		Version 3.5
$$ Fri Mar 18 13:36:21 2022 Russian Standard Time (UT+4h)  she@DPX200
##.OBSERVE FREQUENCY= 200.131346
##.OBSERVE NUCLEUS= ^1H
##.DELAY= (6, 6)
##.ACQUISITION MODE= SIMULTANEOUS
##.ACQUISITION SCHEME= undefined
##.AVERAGES= 8
##.DIGITISER RES= 18
##SPECTROMETER/DATA SYSTEM= spect
##.PULSE SEQUENCE= zg30
##.SOLVENT NAME= CDCl3
##.SHIFT REFERENCE= (INTERNAL, CDCl3, 0, 15.7039)
##AUDIT TRAIL= $$ (NUMBER, WHEN, WHO, WHERE, WHAT)
$$ ##TITLE= Audit trail, XWIN-NMR		Version 3.5
$$ ##JCAMPDX= 5.01
$$ ##ORIGIN= Bruker BioSpin GmbH
$$ ##OWNER= she
$$ F:/spectra/data/she/nmr/H-F/1/audita.txt
$$ ##AUDIT TRAIL=  $$ (NUMBER, WHEN, WHO, WHERE, WHAT)
(   1,<2022-03-18 13:35:22.15 +0400>,<she>,<DPX200>,
      <created by zg, POWCHK disabled, PULCHK disabled
       configuration hash MD5:
       00 E9 B6 7A A2 85 ED C7 34 08 36 98 17 FE 4E 26
       data hash MD5: 16K
       47 B9 5E FB D9 0C 8E 59 B6 FB 5F FE A4 86 9F F2>)
$$ ##END=
$$ 
$$ hash MD5
$$ 97 CD 1B E6 7B 05 F9 03 E7 A0 65 B1 22 0C 8A 5D
##$RELAX= 
##$RELAX= 
##$RELAX= 
##$RELAX= 
##$RELAX= 
##$RELAX= 
$$ Bruker specific parameters
$$ --------------------------
##$DU= <F:/spectra>
##$EXPNO= 1
##$NAME= <H-F>
##$PROCNO= 1
##$TYPE= <nmr>
##$USER= <she>
##$AMP= (0..31)
100 100 100 100 100 100 100 100 100 100 100 100 100 100 100 100 100 100 
100 100 100 100 100 100 100 100 100 100 100 100 100 100 
##$AQSEQ= 0
##$AQ_mod= 1
##$AUNM= <au_zg>
##$AUTOPOS= <>
##$BF1= 200.13
##$BF2= 200.13
##$BF3= 200.13
##$BF4= 200.13
##$BF5= 200.13
##$BF6= 200.13
##$BF7= 200.13
##$BF8= 200.13
##$BYTORDA= 1
##$CFDGTYP= 0
##$CFRGTYP= 5
##$CHEMSTR= <none>
##$CNST= (0..31)
1 1 145 1 1 1 1 1 1 1 1 1 1 1 1 1 1 1 1 1 1 1 1 1 1 1 1 1 1 1 1 1 
##$CPDPRG= <>
##$CPDPRG1= <>
##$CPDPRG2= <>
##$CPDPRG3= <>
##$CPDPRG4= <mlev>
##$CPDPRG5= <mlev>
##$CPDPRG6= <mlev>
##$CPDPRG7= <mlev>
##$CPDPRG8= <mlev>
##$CPDPRGB= <>
##$CPDPRGT= <>
##$D= (0..31)
0 1.2 0 0 0 0 0 0 0 0.06 0 0.03 0 0 0 0 0.0002 0 0 0 0 0 0 0 0 0 0 0 0 
0 0 0 
##$DATE= 1647596121
##$DBL= (0..7)
120 120 120 120 120 120 120 120 
##$DBP= (0..7)
150 150 150 150 150 150 150 150 
##$DBP07= 0
##$DBPNAM0= <>
##$DBPNAM1= <>
##$DBPNAM2= <>
##$DBPNAM3= <>
##$DBPNAM4= <>
##$DBPNAM5= <>
##$DBPNAM6= <>
##$DBPNAM7= <>
##$DBPOAL= (0..7)
0.5 0.5 0.5 0.5 0.5 0.5 0.5 0.5 
##$DBPOFFS= (0..7)
0 0 0 0 0 0 0 0 
##$DE= 6
##$DECBNUC= <off>
##$DECIM= 32
##$DECNUC= <off>
##$DECSTAT= 4
##$DIGMOD= 1
##$DIGTYP= 9
##$DL= (0..7)
0 120 120 120 120 120 120 120 
##$DP= (0..7)
150 150 150 150 150 150 150 150 
##$DP07= 0
##$DPNAME0= <>
##$DPNAME1= <>
##$DPNAME2= <>
##$DPNAME3= <>
##$DPNAME4= <>
##$DPNAME5= <>
##$DPNAME6= <>
##$DPNAME7= <>
##$DPOAL= (0..7)
0.5 0.5 0.5 0.5 0.5 0.5 0.5 0.5 
##$DPOFFS= (0..7)
0 0 0 0 0 0 0 0 
##$DQDMODE= 0
##$DR= 18
##$DS= 0
##$DSLIST= <SSSSSSSSSSSSSSS>
$$ [...]
##$SUBNAM2= <"">
##$SUBNAM3= <"">
##$SUBNAM4= <"">
##$SUBNAM5= <"">
##$SUBNAM6= <"">
##$SUBNAM7= <"">
##$SUBNAM8= <"">
##$SUBNAM9= <"">
##$SW= 18.0517287032376
##$SWIBOX= (0..15)
0 0 2 0 0 0 0 0 0 0 0 0 0 0 0 0 
##$SW_h= 3612.71676300578
##$TD= 16384
##$TD0= 1
##$TE= 0
##$TE2= 300
##$TE3= 300
##$TEG= 300
##$TL= (0..7)
0 120 120 120 120 120 120 120 
##$TP= (0..7)
150 150 150 150 150 150 150 150 
##$TP07= 0
##$TPNAME0= <>
##$TPNAME1= <>
##$TPNAME2= <>
##$TPNAME3= <>
##$TPNAME4= <>
##$TPNAME5= <>
##$TPNAME6= <>
##$TPNAME7= <>
##$TPOAL= (0..7)
0.5 0.5 0.5 0.5 0.5 0.5 0.5 0.5 
##$TPOFFS= (0..7)
0 0 0 0 0 0 0 0 
##$TUNHIN= 0
##$TUNHOUT= 0
##$TUNXOUT= 0
##$USERA1= <user>
##$USERA2= <user>
##$USERA3= <user>
##$USERA4= <user>
##$USERA5= <user>
##$V9= 5
##$VALIST= <valist>
##$VCLIST= <CCCCCCCCCCCCCCC>
##$VD= 0
##$VDLIST= <DDDDDDDDDDDDDDD>
##$VPLIST= <PPPPPPPPPPPPPPP>
##$VTLIST= <TTTTTTTTTTTTTTT>
##$WBST= 1024
##$WBSW= 4
##$XGAIN= (0..3)
0 0 0 0 
##$XL= 0
##$YL= 0
##$YMAX_a= 389945
##$YMIN_a= -818497
##$ZGOPTNS= <>
##$ZL1= 120
##$ZL2= 120
##$ZL3= 120
##$ZL4= 120
##$ABSF1= 10
##$ABSF2= 0
##$ABSG= 5
##$ABSL= 3
##$ALPHA= 0
##$AQORDER= 0
##$ASSFAC= 0
##$ASSFACI= 0
##$ASSFACX= 0
##$ASSWID= 0
##$AUNMP= <proc_1d>
##$AZFE= 0.1
##$AZFW= 0.1
##$BCFW= 1
##$BC_mod= 2
##$BYTORDP= 1
##$COROFFS= 0
##$CY= 11.3945322036743
##$DATMOD= 1
##$DC= 2
##$DFILT= <>
##$DTYPP= 0
##$F1P= 2.36226072786647
##$F2P= -0.459571619588291
##$FCOR= 0.5
##$FTSIZE= 0
##$FT_mod= 4
##$GAMMA= 1
##$GB= 0.15
##$INTBC= 1
##$INTSCL= 1
##$ISEN= 128
##$LB= 0.24
##$LEV0= 0
##$LPBIN= 0
##$MAXI= 10000
##$MC2= 0
##$MEAN= 0
##$ME_mod= 0
##$MI= 1.114404
##$NCOEF= 0
##$NC_proc= 0
##$NLEV= 6
##$NOISF1= 3.799351
##$NOISF2= 2.8
##$NSP= 1
##$NTH_PI= 0
##$NZP= 0
##$OFFSET= 15.70392
##$PC= 1
##$PHC0= -17308.21
##$PHC1= 10.40078
##$PH_mod= 1
##$PKNL= yes
##$PPARMOD= 0
##$PSCAL= 0
##$PSIGN= 0
##$REVERSE= no
##$SF= 200.130013532006
##$SI= 16384
##$SIGF1= 3
##$SIGF2= 2
##$SINO= 400
##$SIOLD= 16384
##$SREGLST= <1H.CDCl3>
##$SSB= 0
##$STSI= 0
##$STSR= 0
##$SW_p= 3612.71676300578
##$SYMM= 0
##$S_DEV= 0
##$TDeff= 0
##$TDoff= 0
##$TI= <>
##$TILT= no
##$TM1= 0
##$TM2= 0
##$TOPLEV= 0
##$USERP1= <user>
##$USERP2= <user>
##$USERP3= <user>
##$USERP4= <user>
##$USERP5= <user>
##$WDW= 1
##$XDIM= 8192
##$YMAX_p= 0
##$YMIN_p= 0
$$ End of Bruker specific parameters
$$ ---------------------------------
##NTUPLES= NMR FID
##VAR_NAME=  TIME,          FID/REAL,        FID/IMAG
##SYMBOL=    X,             R,               I
##VAR_TYPE=  INDEPENDENT,   DEPENDENT,       DEPENDENT
##VAR_FORM=  AFFN,          ASDF,            ASDF
##VAR_DIM=   8192,          8192,            8192
##UNITS=     SECONDS,       ARBITRARY UNITS, ARBITRARY UNITS
##FACTOR=    0.0002768,     1,               1
##FIRST=     0,             0,               0
##LAST=      2.2672688,     0,               0
##MIN=       0,             -818497,         0
##MAX=       2.2672688,     389945,          0
$$ Real data points
##PAGE= N=1
##DATA TABLE= (X++(R..R)), XYDATA
0@%%%%%%%Qj6J6j6K4l2M0m9O3q6J04j26J50j76K16k57L03l58M16m86N66o54P51
30D01q58R79j116J265j430J614j816K040k286K551k840L159l510L892m305M758
46B498n257N801o395P045p759Q549r421J0389j1472J2685j4059J5631j7445J9568
60A0358k2092K5150k8946L3812m0302M9445o3393Q7531j40925M71194j97000o75773
72d90941M27426n8614N5818M56256m1184o73471L3380K83347p5566J36058L20131
83C72640m10192l73907L53068J92515k98316J04826J98936k48911o6371L12091
93A36379q3983k19721J80553R2529j64896J44820J15744l29496j09655L36291
103I8565O2807j46697Q3733m8007k69631R5105K90206l6864r1057L9293j63951
$$ y = [0, 0, 0, 0, 0, 0, 0, 0, 8, -8, 8, -8, 16, -16, 24, -25, 38, -48, 56, -70, 80, -96, 120, -137, 166, -192, 224, -262, 304, -350, 401, -457, 522, -594, 671, -759, 855, -961, 1079, -1207, 1344, -1496, 1663, -1847, 2045, -2260, 2498, -2759, 3042, -3353, 3692, -4067, 4482, -4939, 5450, -6022, 6663, -7396, 8235, -9210, 10358, -11734, 13416, -15530, 18282, -22020, 27425, -35968, 51563, -89362, 381832, 184832, -490941, -63515, -122129, -66311, 389945, 348761, -324710, -291330, -7983, -83549, 52509, 372640, -37552, -411459, -58391, 134124, -164192, -59366, 139570, -109341, -175712, 136379, 52396, -167325, 13228, 105757, -59139, 85681, 201425, -128071, -237726, 98565, 161372, 14675, 98408, 50401, -219230, -124125, 166081, 129217, 38160, 77453, -86498]
114h6498j26657K53475J54578j86892o0956N8124j18029k665K22398M125j70410
125e9407K4464M1311q2491O6568J11230j17209p6854J21656N930r2404O3903M4038
137E0735r9261K2816J10813n8775p8328N5452m56m1348Q3362L7212j15483k9117
149f2378P7064p604j0807O4480l2084r8903L2262P0441k2463L43K5790o2404l8342
162f4605P4207K9511m6706O097J1443m5540J2368O1102k3078m4716K6927R642
174F652k3633K7731J9046m8199j2201M4795J678j8119J6111j1830l3419K7617
186c771L7608k2713j9016R692j4468m448L8800P546l8371r298J3652l096J2309
199D426K0765k2137k8461J4768J5912l750P853J131k7140n439K7897Q913j1509
$$ y = [-86498, -213155, 40320, 194898, 8006, -52950, 5174, -112855, -115520, 106878, 111003, -59407, -34943, 6368, -76123, -9555, 101675, -15534, -92388, 29268, 35198, -57206, 6697, 50735, -48526, -25710, 85103, 26328, -52000, 3452, 2996, -38352, 45010, 82222, -33261, -62378, 14686, 7082, -3725, 60755, 28671, -70232, -37970, 32471, 10008, 10351, 36141, -26263, -64605, 9602, 39113, -7593, -1496, 9947, -35593, -23225, 37877, 14799, -29917, -2990, 6652, -16981, 10750, 29796, -18403, -30604, 14191, 15869, -2250, 13861, 2031, -31388, -3771, 33837, 11124, -7892, 1800, -12668, -17116, 21684, 29230, -9141, -18439, -4787, -7883, 4426, 25191, 3054, -25407, -10639, 5273, 1523, 9376, 10507, -16633, -22072, 5825, 14738, 3229]
212C229k709p165r509J7539J8453j2363j4307K016j488L339J7740p5k2349o265
226a3914J2017N757M387K186j3845j1963J0333J2215n43j529o124j1937K840J7403
240G283M270j0676o425k068J067J0456P158p905r588J00L412N637O687m000j2120
255f712j991Q785N680J79k491p937l581O715P065j39m564n331k861N053Q093K1
271E984p029m000P89L578M858R42n189n018J008M679L617N69m741n173J349N178
287A401K719j484l460k834N35M126K595j312l867k107R48M135K219j731l712j304
303c133J942K820J415j540l165j189J698K907R95j803k738o12K043K678O4k118
319B64k314q0K005J844J53k142j707L66K013J605m82k230j437N55K362J046r18
$$ y = [3229, 520, -6645, -16154, 1385, 19838, 7475, -6832, -4816, -6304, -2965, 14775, 14700, -7649, -13914, -1897, 3860, 8247, 10433, -3412, -15375, -5042, 7173, 6630, 5101, -1023, -12960, -10120, 7283, 11553, 877, -5548, -7616, -6549, 3907, 11065, 3160, -6428, -6328, -2916, 2721, 9408, 5408, -6712, -8703, 82, 5762, 5941, 3450, -4487, -8068, -1353, 5712, 5573, 1009, -4322, -7183, -2130, 5963, 5984, -1045, -5045, -4256, -678, 4180, 5122, -67, -5085, -4077, 602, 4219, 4788, 47, -5126, -3777, 1401, 4120, 2636, -824, -3658, -3123, 1003, 3598, 2286, -1581, -3688, -2740, 1395, 3614, 1883, -1829, -3133, -1191, 1629, 3044, 1504, -1661, -2850, -1152, 1755, 2750, 947, -1791, -2403, -360, 2318, 2382, 264, -2050, -2130, -125, 1719, 1872, -270, -1977, -1611, 402, 2007, 1525, -705, -2142, -1587, 775, 1821, 903]
336I03j888p06Q02J927N30j008j650m57J345J683M39j735j315l63J212J617J45
353A481j196j619p5J586J268j60j372j484K94J732J256j003j311p74K21J325J525
370A694r39j648n83P75R55J089n70j747n85J456J286L12p98j558p68J573J691
387A635j22j422r23o63Q14J926K38j696j255O17M32J133J025j820j505N70J150
404A34R96J02r27k006N59J635P21m64o40j063m71J822J372j152j166M0j97Q00
422I5J318o37j981j69J251M86N14K73j760j162J610J194q5o00o99j139Q33K051
440A393j48j387k72n63p4J541J056j573j114N90N0M68J224m34j799K16J026j20
458H0J98N09j366o54J879K37j260K07L32q85M76J575j295p83N05K98l78J253M1
$$ y = [903, -985, -1691, -889, 1038, 1568, 560, -1090, -1547, -202, 1481, 1920, 185, -1130, -1493, -281, 1336, 1481, 285, -1334, -1409, 177, 1445, 1285, -87, -1571, -1277, 455, 1711, 708, -603, -1377, -1156, 169, 1694, 755, -893, -1476, -701, 254, 1343, 773, -974, -1559, -103, 1183, 1495, 697, -861, -1629, -56, 1635, 1513, 91, -832, -1495, -681, 1245, 1483, -213, -1468, -851, -419, 714, 1739, -81, -1586, -1016, 134, 1130, 1232, 305, -1701, -1142, 493, 1214, 750, 110, -953, -1424, 398, 1770, 618, -548, -508, -705, 95, 1413, 776, -1205, -1374, -123, 363, 877, 1150, -610, -1772, -162, 1032, 947, 347, -352, -1491, -658, 1393, 1245, -142, -414, -977, -1051, 490, 1546, -27, -1141, -551, -501, -33, 1191, 757, -1042, -826, 200, 80, 278, 787, -579, -1233, 646, 883, -377, -170, 162, -723, -247, 1328, 33, -750, -245, 53, -325, 928, 969]
477I69j839k51J589M3p6L92q42j616J141J245l70p6Rj027m47J797R6q82J27N3
497C5p85M88J055o43p61J067J30q03L80M10r88K26J076n10j037O40J92p81R80
516C71P69j625k79O58j29R4J133m66j902O55J146l56K20O02j089j088J020P49
534D83p62N42J16p68j81J200o03m03O15kr07O51N25j277L19P73o9o71N03k18p14
555h48Q53Q55j048l09P41p49j83J544O4j293K90k66m11P51R06o09j106N89J28
574a01l3O27J58j183j36R65j05l05M50k38j005Q07N49p18J85M16n02l46R54j83
594B56q33K79N66o08M45O97r74n19N51M86o03P25l59r57M46R32j27l36J74l87
614a46o48R20N40o98k56M69l54j75Q02j3r59L21L74j48K39M83p01m62N20K68o48
$$ y = [969, -870, -1121, 468, 511, 435, 827, -15, -1631, -490, 755, 385, 309, 318, -709, -1156, 641, 737, -145, -18, 35, -750, -262, 793, 150, -611, 456, 586, -217, 163, 573, -415, -189, 887, 377, -660, -20, 172, -609, 371, 1140, -485, -764, -106, -235, -141, 992, 526, -1376, -721, 425, 69, 289, 891, -198, -1286, -266, 483, -279, 263, 379, -389, -570, 630, 27, -376, 239, 237, -670, -19, 506, -771, -452, 321, 252, -419, 84, -134, -848, 5, 860, -188, -497, 244, -505, -688, 856, 920, -373, -83, -349, -760, -9, 897, 288, -818, -229, -101, -134, 493, 651, -532, -668, 297, 192, -113, 337, 99, -906, -99, 450, -268, -83, 333, -169, -515, 439, 256, -577, -298, 268, -340, 105, 802, -172, -691, -140, 346, -257, 468, 109, -848, -402, 530, 403, 67, 241, -146, -794, 126, 666, -32, -288, 181, -173, -348, 454, 441, -518, -197, 177, 29, 268, 751, 50, -412, 108, 376, -272]
635b72L47m4j91k21M73J60m93K91j40m52O32L19p34O6J66J3P5K57j50o01M68K97
657B66l00nK58k98m01N93K43n30L53j48j88o6L50j12m58M58j49R4K30N0n91J65
679a86L18j84j58J12k74K6M08K33o05L11oj20j21N01j1k96J44r4onK83n34L19
702E5K9J42k67j1J59m38L20n8J4nk48L64k03N6L62m53J03pj6J00J8P9l56J18J69
727B6J4j27J3j59K00O3K1j05M8jj49K1M40l65j89J08J76j71J22J74l67k56K35
750b28K76n6M07n61K28LJ03j32j08o1J30o8j01M12q0k20M9j03J60j12J59j16J30
773A11k28L88j54Rm76M6L15K45j28m7j86k29Q6N57l93J71k0j25Q5n4K26l20n1
796a72j5K07o1JR2j53J31M6Q8J24l82k0j3K23l5j9j95k28L54J80J62m16J06j25
$$ y = [-272, 75, 31, -160, -381, 92, 252, -241, 50, -90, -542, 90, 409, -325, -259, -93, -80, -5, 252, 102, -499, -31, 266, -34, -39, 219, -79, -480, 113, 356, -174, 179, 31, -157, -223, 127, 15, -443, 15, -134, -40, 190, 240, -351, -186, 132, -52, -210, -98, -372, -346, 62, 295, -310, 1, -5, -125, -246, 255, 244, -52, 92, -2, -8, -13, 270, -264, 55, 84, 226, -41, -52, 107, -331, -11, -69, -55, -60, -308, 56, -147, -91, 271, -182, -79, -86, -102, -2, 16, 95, -261, -143, 26, 40, -87, -74, -233, -33, 30, 51, -54, -6, -7, -156, -135, 305, -60, -249, -141, 35, -136, -14, 160, -207, -463, -228, 48, -8, 399, -162, 66, 69, 172, 40, -68, -129, 1, -67, -168, 244, 164, -56, -7, -110, 50, -62, 97, -19, 111, -117, 271, 117, 126, -350, -304, 11, 256, 128, 81, -105, -334, -248, 309, -84, 87, 67, -58, 27, -27, 199, -121, -172, -187, 20, -41, -40, 52, -101, 30, 76, 164, 288, -94, -114, -127, 96, 61, 42, -153, -381, -27, 153, 315, -101, 5, -120]
820a20J72L2j20p0K45m48Q7K45o3j20j91M12K7j56J03r0m0j2J03p0J79k0l69M0
844b44J88J15k30R8n6M4k33M24Rj25r7Q9op7J39j61J07k01J29K30k03j05J07L1
868b8J07j05j63Q7J21N9Pr9p0l4P2J51j50j1J24j35L0M4J84m30M34j75j5j26J21
893@r7Lp5L42k18J22L0K11n71L58K10n11J49j61O7j54K11M8K73j52Q9L3j07K07
917C07j92j64nK46k25j1n7K85k75L53m41K43Q4k04J07j36L11j57n3J38lj56K42
940B37k12M1j49L73l15M2L8j47K37l6Lj37n0K43l34K66K02l99Q1m3J54%l15K14
964fr0j73N92k05j9p3N5j43j34J77R7n0r5n1K29r2J51j87j10R8QJ29j08J55m47
989b92M77m17q5L72O0J65k53K2k38J03K0K9m8L59L2l84J25N6j47k9L56k36j00
$$ y = [-120, 52, 84, -36, -106, 139, -309, -222, 23, -40, -160, -351, 61, 88, -68, 35, -55, -95, -107, -4, -74, 105, 85, -284, -244, -56, 59, -171, -73, -129, -85, -318, 106, 115, -10, -107, -18, -24, -101, 38, -123, -16, -217, -88, 142, -61, -166, -59, -28, 79, -26, -189, -102, 19, 78, 85, -14, -84, -118, -46, 105, -45, -56, 68, -67, -37, 7, 191, -239, 195, 20, 5, -121, 0, -97, -94, -169, 173, -45, 77, 107, 318, -253, 105, 315, -196, -47, -208, -141, -295, -84, -36, 237, 85, 174, 207, 100, 307, 115, -49, -54, 192, -33, -44, -101, 184, -91, 262, -179, 64, 148, -56, 51, -85, 226, 69, 16, 154, 151, -5, 237, 25, 66, -83, 290, -25, 17, 55, -92, 145, 109, 112, -25, -75, 168, -166, 100, 302, -97, -16, -59, 95, 95, -220, -6, -96, -269, 323, 118, 99, 26, 81, -62, -196, -19, 78, 28, -67, -118, 111, 19, 170, -17, -127, -29, -21, 108, 0, 155, -292, 185, -232, -317, 55, 115, 280, 27, 49, -189, -86, -66, -37, -85, 274, 306, -78, 47, 103, -44, -73, 283, 47, -53]
1012e3%N8j70mQ9Q0j6N1K80j80k90J98R9j45J55K65l78K5R1j67L01j10k19L2r2
1037a00J59oJ63j88q0j37K63q5r5J01L5J2k32O9K09k31L75j78N7q5q8j17K34j81
1061a26L52m87M53k82nK57j84O2o5J6j5j35K73j96R9J17k01J3q7J25P0J6N2l7
1085H5j0j42p9J45k21J76m0N5L35l22r8K60j82J6N8j37N0J25q2o2N1l9k39N72
1109B75m71K95j6n8p1J18k07J81J91j49k13J99l03K58J1m7j71J91J89j48k11K81
1131A24j2j88J60n0J01n2k2j3K5Q9k42L70r8k76m8L12k92J88k01N0J25R1j98J31
1155G4j66o9L94k30j2q3K21k39J98j70k5J20J12k8j41j22M9L71o8j17k76P4K57
1178A24J70l53K43m04L94q6M1J5O4l17r6K01J02J7j92L2J03k19L93L6k57m5O8
$$ y = [-53, -53, 5, -165, -169, -80, 0, -16, 35, 315, 135, -155, 43, 142, -3, 152, 417, 39, 64, 155, -12, 289, 179, -40, -8, -100, 59, 53, 216, 28, -52, -189, 74, -11, -106, -5, 30, 42, -190, -121, 88, -143, 232, 54, 111, 26, -62, -179, 55, -126, 226, -261, 192, -90, -95, 162, -22, 40, -25, -9, -24, -159, 114, -82, 17, 134, -67, -54, -141, -16, 54, 70, 122, 85, 75, -67, -146, -1, -222, -46, -86, -31, 304, -18, -116, 144, -38, -22, 36, -101, -51, 74, -8, -70, -19, -58, -297, 275, -196, 99, 83, 25, -46, 72, -135, 46, 237, 88, -125, 74, -229, 29, 40, -7, -178, 13, 202, 54, -157, 124, 112, -76, 84, 34, 135, 83, 61, 48, 73, 162, -80, 290, 192, -84, -132, 180, -112, 76, -125, -75, 50, 141, -57, 74, -92, -161, 233, 3, -9, -92, 129, -110, 88, -82, -107, 13, 125, 97, -44, -166, -117, 254, 186, 69, -207, -133, 124, 294, -59, 184, -220, 174, 88, 129, 144, 208, -109, -205, -4, 98, 115, -77, -45, 58, -161, 232, 268, 11, -34, 34]
1201C4m4j36K36m63L86j89K42L2j55j18P8O4j30J90p2m4J74P1j2j30P6k29Q0j37
1225a96K92j41M4N5k02N1K33K3K59l91j0r2J71k78J80K90k05j26P1P2L2o6n8o1
1249e3k02J80j20R6J56%k93R9J57J22k05J78j44l35K09MJ38MJ18k75J61q1L77
1272B91l32K2L07j49l13J82J52j46j30j02N53o77M35k88K81k34K65j29q4J42j85
1293a39K22j60J09r3J67k48J35J19k89K52j93M9r3j4K58m5j99J04q5J83l89L38
1315a1q1L47k21k62M72l55Pl6L14l04J41L9M1k17K72j62J8J48l31J1P1p5N38k85
1339G9J06j65j07O6n8L81m31J20j20m2Q8M7q0M6R2j25J46N0j84J45j01N7p4J86
1363A22k16N01n18J31O8K0k77L4J84J00n0j56J25M0k04LJ12K5j04j36J61lO0k1
$$ y = [34, -10, -146, 90, -373, 13, -176, 66, 98, -57, -175, -97, -33, -163, 27, -45, -89, 85, 156, 144, 14, 90, -139, -59, -196, 96, -45, -1, 54, -148, -97, 136, 159, 418, 27, 17, -75, 96, -182, -2, 288, 83, -43, 28, 100, 132, 66, 8, -53, -255, -75, -195, -99, 57, 57, -236, -137, 20, 142, -63, 115, -29, -364, -155, -151, -13, -9, 109, -166, -5, -86, 291, -41, -19, 288, 139, -174, 8, 160, 14, -116, -218, 335, -342, 93, -195, 86, -148, 117, -12, -96, 46, -139, 83, -77, 32, -61, 106, -142, -7, 112, -177, 75, -118, -69, -162, -176, 82, 37, -162, -58, -143, 40, -349, -11, -92, 255, 34, -228, 244, -111, -104, -140, 174, -130, 11, 50, 91, -126, 146, -16, 2, 150, -181, -170, -99, -174, 364, 79, 185, 20, -87, -21, -79, 302, -129, -9, -129, -171, -83, -36, -116, -70, 22, -103, 43, 93, -91, 54, -47, 10, -64, 122, -94, 407, -111, 20, 88, 108, -169, -135, 49, 149, 99, -57, 68, 108, -96, -93, 19, 44, -60, -196, -35, -38, 22, 1]
1387Aq2K6N9M4o1j90J67k5jpJ15Mj90K76M2k21rK8P6N6j77J05j66J31J05r6J85
1414A95j71j26J29j45J02K05m69K74j55L17P7k71r1K68k01P4J31j26K35k99J55
1435A08O8k70N5jK77l23N5p5N6LNj05M22j35l46L28j41j75L96j97L81l89k4O7
1459D0QJ98l51M0k9J37k73J75j08L09r3N4o9j11L0lk02N7K82j4k94J39j05J69
1483a4Q2p3N3j65R2o5K15k26K34j39O3j4k3N5m6o8R1l3m96N02J23o4N1L1j77l3
1509d4m9J66k86P1J03k2j68J89R9k30Q3j9mL08k92J65o4r5L16m34J75J79j27n9
1533c9j14L28q4j93l7q6J97j09K76l7J8l11K54Lk15M51l73m0P9l60Q2M75k00Q4
1557D9Q1j23K11m79M18k04K7J3J67k42J41r6R9j04J01j20j30L09j89J60lL7k34
$$ y = [1, -81, -55, 4, 48, -13, -203, -36, -61, -62, -69, 46, 50, -140, 136, 178, -43, -52, -24, 52, 108, -69, 36, -130, 1, 106, 10, 195, 24, -102, 27, -118, -16, 189, -280, -6, -161, 156, 233, -38, -129, 139, -62, 12, 143, 17, 252, -47, 108, 176, -94, -39, -40, 237, -86, -31, -106, -50, -47, -42, -147, 275, 140, -206, 122, -19, -194, 202, 5, 386, -3, -27, 40, 48, 246, -105, -65, -94, 43, -230, -55, -163, 146, 53, 107, 38, -73, -43, -46, -248, -191, 91, 77, -217, -78, -183, -14, 68, -5, 48, -117, -25, -90, 125, -101, 133, -6, 57, 43, 20, 75, 29, -39, 52, 19, -477, 25, 148, 84, 135, 166, -11, -44, -93, 73, -213, -142, -39, -61, -229, -40, 59, -171, -88, -107, -111, 197, -95, 70, 6, -89, 227, -207, -32, 147, 20, -39, -153, 175, 91, -102, -139, -225, -28, -137, 139, 102, 120, -191, 63, 66, -149, 302, -71, -111, -32, -392, -310, 165, -35, 49, 130, 7, 218, -261, 157, -47, -20, -7, 160, -82, 59, -37, 62, -42, 59, -61, -191, 118, -71, 89, 86, 123, -111]
1580a11J15k1j64J20l7l3K61j64J05j61K13q2J03l67J75k1M5K32O2k61j28O0o2
1603a21R5o0J40p8j49J33P4k31L09j5j59J07j91K20j59j96K80K02n4j25R9k56
1625a35K14k09J80l22J34oL11j2j63l0k2R5P4jK8j19j87J38R5J17j74p9ok0K84
1650A85k40q9J61J19L9l54J71K75J3j95m9j95P0J22R6l62J81K67k54J03k53L53
1672A64j61QJ28j41l2p2L57k06R9l64L96k77L06j40j50K74k34J95l3j05q9p2K2
1695a27K17k42R2l6K8n6OK13p5k11o2L19j63J12JO1j64J89m3m8L3K2j52J38j58
1720a06J80K7n4j21k7J22j1k5j64K11j48J98j34L1J01m5j79L3J69l18L73j49J9
1743a7k10N6pL38KJ48l47n9J50l8J36j49K92L9r9q8j15n9j03K98op5M9k06O1M4
$$ y = [-111, 4, -17, -181, -61, -98, -131, 130, -34, 71, -90, 123, 41, 144, -223, -48, -69, -24, 208, 270, 9, -119, -59, -121, -26, -86, 54, -24, -173, -40, 34, -197, 112, 97, -62, 45, -146, 74, -85, -281, -1, 201, 147, 22, 121, -135, 79, -130, 50, -272, -138, -144, 167, 155, -8, -38, -60, 35, 109, 108, 136, 17, -170, -32, 63, 180, 6, -73, -79, -99, 185, -55, -144, 17, 136, 175, -179, -8, 267, 280, 85, 36, -159, -89, 33, 129, -233, -52, 215, -39, 64, -189, 164, 3, 11, 139, -2, -34, -106, 251, 45, 144, -220, 176, -101, 205, 65, -85, 189, -45, 150, 117, 12, -77, -149, -127, 90, -152, -60, -96, -68, -124, -118, 95, 20, -191, -253, 66, -97, 15, 16, 77, -87, 102, 59, 11, 44, 66, -86, 52, -106, 74, 101, 47, -74, -101, 21, 10, -15, -179, 32, -116, 82, -52, -21, 80, 35, -144, -111, 58, -260, 113, -36, -17, -227, -171, -178, 160, 162, 310, -37, -96, 54, 16, 152, 3, 295, 334, 235, 147, 32, -27, -130, 168, 162, 87, 136, -70, -9, 35]
1769C5M6l55L92j1j59O6j38J05N5O0M4k32K01J11k48J71j87j13J19J2m4R7J7L07
1793C51k10j91J3o3q8R2Q0K7j31L99m23Q2P5n7j48K49n4q5K16J48j28j32J53l4
1817A41p0k43J45r7K27Q8m52K82n1J32q5l02K82K6m7%O8K8k80K63j28L4j2J43
1841I2L3k56J31n2P1k35K24O7o4j87K83j23o9Q3j97K60j17j34p3K07pLj9q1j5
1866a75L64j79p7n4p4J13j16j9J21J08j11J59n9L2j11L35k53j29K97k07k07R0
1888a52m6K96j66l6J06Rj7k2j21K07J84k27K40j19k12o0J87k09J31K75l43J72
1910G7r4p5J59j04J05j49Q6r2K12l50P4L56q1p4pQrL6L3j95n0J09J22r3P6jM4
1937A23J6j70k55R8K25k54K50l55M58O4k61K68r3j80j33M2J59J32j7j85J54P5
$$ y = [35, 81, -274, 118, 107, -52, 14, -124, -19, 36, 96, 140, -92, 109, 220, -28, 143, -44, -157, -38, -26, -70, 27, 44, 351, 141, -50, -37, -100, -188, -96, -16, 11, -120, 279, -144, -62, 13, -44, -192, 57, 3, -82, 134, 282, 154, 22, 175, 141, 71, -172, -27, -124, 103, 191, -261, 21, -30, 102, 17, -285, -3, 23, -24, -24, 44, 72, -208, 55, -73, -39, -51, 92, 125, -131, 0, -52, 19, -216, 8, 75, 11, -176, 107, -16, -85, -2, -199, 61, -56, -190, -263, -56, -63, -60, -79, -160, -175, 189, 10, -67, -121, -195, -82, -198, -217, -96, 12, -99, 60, 1, 33, -78, 257, 4, -125, 172, -35, -242, -152, -198, 98, -68, -104, 2, 11, -6, -28, -149, 58, 242, 15, 255, 136, -76, -136, 51, -158, -27, 248, -95, 77, -17, -92, 67, -37, 68, -81, 5, -87, 125, -225, -151, 205, 124, 50, 43, 51, 42, 78, 111, -84, -134, -25, 97, 4, 80, 79, 123, 139, -31, -286, -188, 37, -217, 33, -322, 136, 200, -61, 207, 114, -66, -199, -157, 2, 134, 117, -68, 86, 161]
1959A61p6M8k8k2qo3K7j76K19L0j7K1nj61J77k0m5j63m9N1J83p0p9J93l31N8L46
1986B01j92qj74L2QJ0k2L13k8k81p0J57J29r6N0j09P8l7j12Q3K81j14m02J18K30
2011D5p2j51K53l13L57j82j3K33k0Jk34Q6p8J49m7j87K58q1m6r5K12j19K6j68
2035a86K40n5M0KJ19l88K44M0m2J38r6R2j33j68m3J37K64j47k6O2j97j9k0K05
2059F3J9j55J04p5j8lN7r3R8LO0r0L9P9P2k91L07k74J23j40K7K52k11K1rJ58j41
2086a8q5r3M2L64j10o8p0J47j57K17k3j35n2k15L62l3k53N8Q2j24P0M0k3j0K67
2111A80m60K25j57J67J51Pj62j1J82j38J0R9n6J33k48po6N8J93r2K69k18m5Q4
2135I8R8k06J33k26J13n7L3k25J95K04j74K8k7J18j89M8J26n6j83J23K51j48O8
$$ y = [161, 85, 133, 105, 83, 75, 12, 39, -137, 82, 112, 95, 116, 111, -50, 127, 107, 62, -101, -150, -99, 84, 14, -65, 128, -203, -145, 201, 9, 1, -173, -141, -133, -123, -145, 168, 140, -141, -211, -54, 75, -21, 29, -80, -2, -39, -151, -68, 213, 99, -303, -185, 45, -27, -178, 75, -238, 119, -63, -76, 157, 137, 138, -96, -10, -88, 61, 14, -173, 85, 4, -42, -137, 75, -44, -18, -186, 54, -1, 39, 41, 160, -228, 16, 56, 14, 152, 56, 148, 15, -153, -196, -59, 205, 58, 32, 94, -103, -122, -142, 63, 82, -73, 31, -44, -62, -65, -8, -101, -3, 0, 60, -30, 9, 88, 160, -131, 176, -98, 25, -115, -88, 164, -47, -26, -35, 123, -18, -103, -196, -154, 210, 100, 32, -38, 109, -48, 169, 146, 11, -41, -256, 106, 73, -180, -122, -40, -164, -94, -54, -77, -87, 180, -280, -55, -212, -45, 106, 113, -49, -60, 122, -16, -6, 93, 37, 170, -78, -85, -151, -93, 100, 8, 277, 59, 14, 98, 196, -10, 123, -103, 10, -47, -14, -239, -44, 160, -14, 14, -13, 105, -84, -36, 90, 34, -149, -26, 225, 77, 145]
2158A45l12Q5J34p0j28L01k63j59K60J64j43K83l09J38m12L36k10J28J05l8k33
2179a98M18k58j0J97l5p2l8k02K58j45j01L53l56L43k57M45n13K03p3j35p9J33
2201a22J76J69j82ql5Qm0M7R4j99%l0M03l07P8j13j34K48k0p8K72q5N8k84J59
2226G5n9j4n6j52J98J44j26J9m1k94NL73L2j05J30j18k74J46L5J71O7l49J42J97
2250A46kj46j33l5J11m7r3L07j76j03L34l35J92K1Q1k96J88L6j3j11j43M17n3
2273A47l9L0l52m1L91J10k74N4rJ96J75m38Q7j71MQ5R0l7K8j44m7P8J37k56K20
2298B4N8J30p7j33L6J10k28J13j01K08j06l6J23l53K36r1Q9r3P6j42K00P3M5j93
2322c2k4J20n2j02k5L50k50j30J75n4J43k21J8L7R7k35K79j29m1K56l92M09L6
$$ y = [145, -167, -82, 52, -18, -146, 155, -108, -267, -7, 157, 14, 297, -12, 126, -286, 50, -160, -32, 73, 35, -198, 220, -38, -48, 149, 114, 42, 4, -198, 60, -85, -186, 167, -189, 154, -103, 342, -171, 32, -41, -176, -255, -122, 54, 223, 41, 33, -2, 6, -34, 13, 107, -92, -92, -122, 281, -26, 52, -61, -195, 53, 33, -45, 227, 142, 200, -84, 75, 16, 2, -54, -206, -8, 136, 10, 29, -12, -306, -301, 72, 104, -1, 129, 11, -263, -117, -82, 89, 156, -193, -51, 146, 144, -2, -135, -170, -59, -106, -199, 108, -68, -171, 163, -172, 20, 41, 122, -174, 14, 50, 37, -74, -217, 200, 147, 108, 138, -214, -255, 136, 246, -28, 26, 17, 213, 388, -50, 37, -134, -130, -45, 45, 8, 36, -108, -155, -77, 60, -196, 24, 82, 212, 135, 2, 38, 148, -80, 33, -68, 140, 34, -2, 121, -232, 4, -87, 2, -91, -15, -157, 43, 116, 161, -32, -56, 64, 12, -90, -115, 235, -15, -145, 30, -24, 119, -102, -84, -47, 50, -185, 94, -35, -76, 180, -212, 197, 233]
2345B33j37j04n4n1p3J72jk9J71J70j60j84k37J79K08K47l29k28K99j55J16j97
2367a44J30L13k35j15j01N3J42l0J03k25K09K11l63J42l28L03j0k89L57k95L14
2388A42k30K8o7J05J94k48j16K45J8J48m90J12L66m45J56r1M42j51J26j53k92
2409b01K07j8M7r3J11J59l92K15R1L9l43R3K53j52o3M7J42k26qJ38k0j80L17j34
2433B9j4J74j83j46J88P0o9j39K60q1l14J46K29o1j95r8J03J07M1q2m4Q5K60k99
2457c3R4j84O1J05p4j45L05M0r8j49Q9J98k66J64k54K16K5k20N2R5j26J87O4k81
2481a35J35l29L43j58J75q0K82l08j74L64k8j53O7L3k3l78K34J97l39K06J60o0
2503C1p1K9o4J03j07N5J12j21n4k88J95M20k44J57m02M69m2j83kJ12j16O7k7n2
$$ y = [233, 96, -8, -62, -113, -186, -14, -15, -44, 127, 297, 137, -47, -284, -105, 103, 350, 21, -207, 92, -63, 53, -144, -14, 299, 64, -51, -152, -99, 43, 13, 116, -109, 100, 311, -52, 90, -238, 65, 55, -234, 123, -172, 142, -88, -60, -127, -22, 172, -76, -192, 53, 71, 219, -271, -159, 207, -238, -82, -173, 269, 118, 244, 91, -201, 6, -12, 35, -58, 53, 212, -180, 35, 126, 165, -178, -85, 168, 16, -47, 0, 142, -84, -92, 46, 26, -154, 163, 29, 15, 189, 6, -140, 48, 118, 49, -90, 170, 89, -225, -79, 150, 89, -106, -204, -101, 6, 47, -35, -79, 6, 266, -33, 61, -123, -62, 43, -31, -176, 129, 169, 71, -78, 11, 209, -57, 107, -147, 69, 94, -126, -74, 21, -105, 82, 146, -135, 0, -329, 14, -144, 31, -49, 233, -75, -249, 115, 87, -66, 1, 34, 11, -367, -133, 64, -275, -69, 91, 31, -40, -11, -75, 28, -79, -24, 88, -33, -87, -375, -180, 240, -4, 153, -249, 220, 178, -5, -7, 105, -11, 56, 29, -23]
2527b3kJ07P5j08k81K32j01J69nj69K51j61K16j56j54J15m6M5j57K45J07j24j37
2550f2P3q4o1P6Q8k4L4l5L41j07j67j76O8Rq1l3L54Mk05j44j37M68k57K24o6k3
2576G7K6N6k47Q7O4J19l7j31K01o9O8j30L2j83J01O4k34K25p8mo4R6j11Mp8J65
2602A9O1J4j96nJ14m6J10j42Q0r8Q6J8QJ41q1k34L05n4j74j02N3q1K59k66K04
2627gM1K7L7j52jn7K65k99K05p0r8J0J68j78j8J60j95K10r7L0P3j54N9K20l97
2652b18k3K39M70k79l11Q8N5p2O9p0N03m54j76K59j75K47m25L05p2q2j0J15K37
2675B20l61%N2K9j19j6K12j53K12R7%l10J21J88k64r3K5K07k17O3R1k41L92j64
2699b9J08pk19R1K8J30j38j5l3K44M1k94J16j51M61n71J42K48j02o6J01j97k1
$$ y = [-23, -25, 82, 157, 49, -232, 0, -101, 68, 63, -106, 145, -16, 200, 44, -110, 5, -41, 4, -153, 92, 199, 75, -62, 11, -73, -134, -58, 30, 6, 40, 5, 346, 239, 72, -104, -36, -27, -108, -141, 213, 217, 12, -132, -269, 199, -58, 166, 100, 77, 103, 159, -88, -1, 63, 182, 145, 14, 215, 146, 214, 84, 116, -67, 34, 98, -136, 89, 11, 7, -57, 39, -72, -68, -146, 19, 80, 94, -102, -107, 7, -39, 71, -71, 9, -89, -3, 15, 23, 164, 83, -151, 154, 100, -74, -176, -123, -204, 55, -211, -7, 34, 61, 98, -54, -55, -112, 153, -146, 59, -11, -109, -99, 69, -109, -127, 33, -162, 48, -49, -19, 54, -100, -41, 179, -218, -241, -2, 468, 189, -122, -34, 21, -51, 18, -52, 451, -3, -179, 80, -95, 152, -273, 32, -40, -122, -132, -17, 220, -141, -141, -89, -60, -179, -195, 17, -136, 76, 173, 173, -137, -16, 172, -92, -185, -160, 47, -170, -107, -16, -257, 135, -29, 79, 72, -147, -56, -28, 102, -36, -51, -84, 160, 201, -93, 23, -128, 333, -238, -96, 152, 50, -16, 85, -112, -133]
2722a33K10k2nj4n1o7J85n2j1k11rJ11j63K06J39k13R5O5n1R4On7M2j15n3k81
2748c55J14M03r3pp7K0l02K37JN5k7J0j17J89L5N2m0M2k73J58r3o9J58J4J79o2
2774A52k20J88k91j68J81K50k48J73k9k06O2M6M0O0J17j59J81k06L3J70mj5P9
2797A86k29l5J59j36m4Q5K78j2k96K29k24K26l29J8J95J1j79J10j38J9J93j10
2819b3J63j98j53K97ln1o1l3R3J12l11O9J59m5J07k66J79Ro7J20j40R5O3n8K9
2844H6j13j71Q9J10j92J51m2j25K02K64k45j1J8j02K39k93K53m15K89J01j17K8
2866DM4m8J07K5k26J02K5J90l7L2k68r4Q8O7R6m40J59J95k02L59O4o2k40K52k52
2891f0J46o2q6K8o2J94j40K3j49K2J90j25j10K54j35J05L3r6J16j81m4P2J17m5
$$ y = [-133, 77, 55, 50, 36, -15, -82, 103, 51, 40, -171, -180, -69, -232, -26, 113, -100, -5, 60, 9, 103, 109, 52, 94, -21, -74, -355, -241, 162, 69, 62, -15, 5, -297, -60, -59, -4, -31, -21, -138, 51, 86, 138, 98, 140, -133, 25, -68, -137, 21, 35, 214, 152, -68, 120, -171, -339, -158, 92, -156, 17, -12, -218, -156, -110, -70, -10, 107, -52, 129, -77, -44, 126, 122, 107, 186, -43, -78, 81, -55, -99, -14, 264, 252, -44, 185, -39, 187, -142, -124, 71, 82, -97, 13, -125, -106, 87, -23, 140, -58, -211, 86, 83, 32, -29, -62, 31, 143, -168, -99, 60, 15, 122, -144, 35, 44, -23, 97, -43, 52, 115, 57, 86, -27, -198, -109, 1, -191, -40, -82, -207, -5, 259, 14, 3, 21, -81, 158, -135, 118, -297, -8, 93, -24, 4, 48, 0, 107, 132, -94, 8, 33, 223, 186, 218, -50, -144, -56, 11, 107, -333, -174, 21, -181, 178, 242, 180, -60, 192, -60, 86, 24, -62, -34, -96, 98, -42, -19, -168, -146, 44, -81, -191, 63, -72, 33, 66, -30, 86, -95, -139, -67, 50, 5]
2915Ep7Pm2n2R9o1j22K08r6J73P2k91K49M8J1k11K2J19K0L2n3j54L72l56K14Q0
2941B16j99J7k59J65J65l0l6J6j40N6J91m8r5N5j65m0K97n2k21o9Q7J18k7L8J03
2966A43K3j38J25k50pJ44J17m6J35n14J07K09q2J10J73l2l22m7K51j88j53L6M00
2989A94j80r7J5J67m7l9j53K53j95NM4o3J57k52l0N2J28P0r5j5J77j96J02j53
3013a51J25o7K39k19J72m5k5j53K98k60K00k25j0J49n5N6J61j17j58J78k10K39
3035A22k93J69j37R0p1K71k4N0J5k40M6k15J21P3m7L7J14q9J65m4P7k72j38K99
3059G9l7K2k08Q5L5L3j30J53N6j26q4pK40K8j15M8o2k15J67om9K27K8j0j22K1
3085E1k71J68J19k44j16L11L1l3L9j36N2p5J30q4K82k36N1nK00l42RK75m58L03
$$ y = [5, -72, -65, -107, -159, -60, -121, -243, -35, -131, 42, 114, -177, 72, 120, 131, -80, -58, 61, 81, 113, 60, -94, 278, -78, 136, 216, 17, 34, -225, -60, 105, 75, 39, 55, -85, -29, 162, 114, 19, 74, -91, -131, 166, 114, -107, -176, -89, 29, 2, 40, 143, 166, 28, 153, -97, -104, 40, 157, 111, 246, -268, -161, 48, -34, 76, 249, 217, -105, -152, 99, -89, -242, -206, 194, 14, -83, -68, 99, 52, 13, -140, 113, -82, -77, -33, -96, 61, -191, -221, -169, -41, 29, -66, -81, 96, -100, 2, -151, -26, -93, 146, -73, 99, 54, 29, -124, 174, -86, 114, -111, -121, 28, -27, 29, 190, 73, -85, 93, -117, 122, -171, -2, -139, -49, -120, 151, 127, 177, 192, -48, -2, -217, -96, -23, -70, -33, 81, -8, 157, 113, 190, -82, -220, 79, 42, 64, -144, -59, -24, 9, -121, 32, 88, -38, -122, -129, 111, 139, 24, 72, 10, -205, -38, -44, -93, 134, 162, 152, 30, 51, -220, -52, 67, -177, -293, 18, 49, 16, 55, -81, -29, -104, 26, -58, 224, -12, 39, 34, 234, -108, -99, 176, -282, 21]
3109B1Q9L2j11r4K4J90l30L02k34J41q2M5J12K07m26J05%P3j61J59j57O0n2J85
3133I8j8m1k5j07N8J21k99K98P4k8m1K46l85j33J35J84l18J90k3j49K21m6k8P4
3157E8J06j58j9l5K7K08r7k3j19M14m52K62k65r0J67j49L28j90m7m9J10k21J92
3180d2J35j45j12K13Q9k17j75J94J81j10j0p5R3LR2q1k95M33l14J84Ol5J87j58
3204D1j8%j92k6L28l40R8l3M4J3j44J64kO7m5j47J37K18k33J46k80K4J4j33L35
3229C6m3k56J46O3m4K79l6K1p4o5n1K80k38q6J82j44J05KJ08k01o9o2o3L48j37
3254Aq1M5J0m5j7K70j28j95R2J19pj98J79k16K73L0k62K16R9j59l2J90l12N5Q0
3279GJ67k25J46j5R9m31J30J92l24J43Q5p1q3L49j02k53J0J73l62L19k0N8K1K68
$$ y = [21, 110, 142, 31, -63, -39, 151, -179, 123, -111, 30, -52, -7, 105, 312, -114, -9, -9, 64, -97, 62, -95, -35, -87, 98, 80, 39, 14, -93, -35, 86, -213, 85, 159, 131, 90, 336, -49, -182, -47, 137, -181, 9, -14, -163, 58, 12, -16, 58, 164, 6, -13, -48, -21, 187, 90, 67, -52, 362, -90, 172, -93, -183, -16, -165, 163, -27, -74, -123, -13, -234, -42, 93, -52, -164, 49, 138, -79, -254, -60, 121, 11, 1, -74, 19, 22, 114, 33, -262, 171, -143, 41, 47, 12, 199, 41, 23, 23, -169, -195, 133, -207, -109, -142, -98, -85, -229, -65, -67, 0, -45, -192, -55, 163, -70, 76, -204, -180, -166, -299, 36, -7, -263, -117, -54, -98, 181, 145, 166, 92, 27, -24, 256, 18, -68, 114, -30, 75, 77, 185, -16, -85, -147, -210, 138, 1, -80, -35, -25, -70, -87, 183, 55, -140, -48, 71, 64, -134, 45, -171, 102, 132, -130, 86, 185, 26, -6, 184, -128, -73, 7, 174, -51, 95, 80, 179, -252, -122, 70, -254, -111, -26, -97, -180, 169, 67, -186, -176, -3, -365, -46, -66, -8, 13, 281]
3303B81k68J67N0l28K25k80L46k65J85k03L2j07J65L5L5k5j95q1K79J4l0M09l90
3326E1J5k80k8p2N10j56J09k78J51N0q3l3j7J8L7kRj3kK44k55J18J89k06L3J7
3352A26j0k11J04n3J12j47O9l7K40l78J9K07j36J04k4J58j29J0j06K83l79K71
3374I3o6QjN0p3N4j77P0Q9j76m8K90j54p7j1J04j46K29j6J01k09mM5n6R1K41m58
3401b07J92J38k80L48j46k42L6J98j42j42K23J66j31j33n5K36P4P8k6k75N9O2
3423C1NJ21l80L23j42j02O8K23k39L7J05o4j6j59L9K13N9j12N8j28o5K06M3k73
3447a49J93n9J26j70Q3o0J31j16l6NR0m5J05j9l16K60J13J7l44O4M49k37k9M7
3471A03j66J6r5K87k31J84O4R0j69k12Q3J2j31J05J47j7PJ58k07N4J10j30J4o8
$$ y = [281, 13, 180, 230, -98, 127, -153, 193, -72, 113, -90, -58, -165, 0, 35, 70, 45, -150, -231, 48, 62, 32, 441, 51, 66, -214, -242, -314, 196, 40, 149, -129, 22, 72, -11, -44, -61, -43, -6, -8, 1, -12, -14, 230, -25, 93, 282, 76, 109, 126, 116, -95, 9, -44, 68, -79, -10, -47, 193, -185, -166, 41, -95, 9, -15, 143, 14, 24, -82, 201, -178, 93, 27, 35, 34, 84, 11, 65, -112, -42, 47, -129, -177, 113, -41, -118, -129, -25, -171, 58, 42, 143, -66, -70, -25, -81, 10, 251, -207, -15, 123, -157, 191, 45, -197, -161, 37, -105, -247, -24, 142, 11, -122, -177, 59, 133, 211, 185, -90, -31, 31, 36, 157, -223, 100, -42, -144, -76, 147, -92, -55, 50, -14, -30, -189, -150, 63, 122, 10, 68, -60, -125, 81, 124, -149, 44, -15, 111, -59, 24, -36, 95, -21, -57, -52, 38, -7, 98, 79, -237, 23, 136, 153, -191, -127, 322, 85, 56, 103, -63, -47, -142, 145, -86, 98, 162, 252, 83, -129, -46, -34, -165, -60, 87, 70, 77, 235, 28, 82, 192, 62, 76, 8]
3495HJ01l03R7L8j36J61R2J50m58K31L11k26n4j32M1J63J17k24J25n4lj04J21
3518F2r5L4Pj48R1J4J60K1l33J31J82Kk8j04o6J23j98J71p7j25K18j45j21J40
3542h4K51l00k9K85q1J40j11k46K06j99K20O3j16M3J44j79P1j07J13k18L10j48
3564B8j79J23K07k43q3K69q2O3j55j18K45l0K9j05O2r7j28M49k60J10k63M6P0
3587d2L05k64J62Mj69J22j05K93k42n3N9l40K00L01k84o6J65J83k30j69J3k8J88
3610CR3j50j35Q5J75q0r0K91M5k70M1j70K58J4O0j24Lj24j43K03l6K38k67m7J05
3635b2J32j34oq2K41j29J24j17j50K85k49L27k45O9j26P5J40j02M1J44j10j60
3657e4P7J9k30L22p9j48P5J75j31l62J97K1MQ9o9K47j07n9k5N5Q3j83L0R4j36
$$ y = [8, 109, -194, -97, -59, -195, -34, 58, 208, -250, -19, 292, 66, 12, -120, -79, 84, 201, -23, 102, 48, 45, -59, 62, -33, 1, 8, -140, -49, -35, 125, 146, -187, -56, 126, 128, 100, -4, -70, 53, -145, 26, -51, -176, 42, -103, -224, -84, 167, -133, -162, 123, 42, 182, 71, -175, 31, -168, 52, 115, -1, 42, 186, 7, 78, -29, 84, -134, 176, 28, -151, -28, 179, -64, -147, 122, 40, 103, -52, -170, 75, 45, 74, -31, 31, -66, -194, 255, -5, 105, -158, -112, -42, 263, -1, 161, 165, -4, 118, 13, 306, 64, 11, 70, -270, -70, 231, -53, -119, 46, 229, -1, -170, -157, -185, 3, 96, -54, -189, -104, 71, -9, -99, 192, 237, -33, 8, -162, 96, 110, 170, 46, 49, -75, -218, -15, -51, 187, -80, -127, -22, 110, -24, -30, -112, 129, 0, 124, 7, -143, 142, -107, 220, -25, 44, -82, -7, 133, 31, 72, 216, 106, -54, 23, 42, -188, 134, 55, -93, -18, 157, 26, -336, -139, -118, -114, -25, -94, 153, 46, -13, -38, 17, 100, -83, -53, 41, -95]
3682i5M5j40J54J84k43L44j69R0j59O0j60O9o7Q1J31j05Q7o5j67J31J32q2j70
3705a14J11K53k95L39k49K27j86R9J1l20L25l80l18K70J05K41j53J59l0q7K0j36
3727a08j8J09J2R0j12m4K78k16M7j52K59l14J46Q4Onj77L34l33Np8K29J95k77
3751d0k3J08j07J27k53O2K96l50K60mJ57k66k3K00J40j06j82m3J18k29oJ15k64
3774c13K28l1J78j03m9p4J46K4PNK3k8r7K82j64j52O3j62M19k06J11j59j4K09
3798A43k26K8J30k80K54l28N13k63j2J41k3j88o9J95m1l5J24j73K91j48m8j26
3820a41RK08m1QL6r7O3n8j04K7n0p6K00J15j11M5O5Mm7o1K9l1l15J97Q8P7j13
3847g4m0J88l92L73J33j40q8k41L50k10J15j95L67l27K6L26l46K19j37Q0Q4j87
$$ y = [-95, -50, -190, -36, 148, -95, 249, 80, 170, 11, 71, -89, -20, -87, -6, 125, 20, 107, 42, -125, 6, 138, 56, -114, -3, 250, -45, 294, 45, 272, 86, 185, 196, -124, 201, -179, -497, -227, -122, 119, -34, 125, 95, 8, 28, -108, -126, -17, -5, 85, -27, -71, 207, -9, 38, -114, 145, -169, -23, 61, 67, 62, -115, 219, -114, -109, -187, 42, 237, -40, -63, 45, -62, 65, -188, -126, 170, -180, 80, 76, 233, -33, -56, 144, 284, 178, -4, -47, 71, -158, -164, -49, -313, -85, -116, 62, -41, -90, -164, -18, 6, 13, 18, 41, 13, -84, 198, 34, -118, -55, -217, 202, -4, 107, -52, -66, 143, -83, -55, 75, -205, 49, -279, 234, -29, -41, 100, 77, -111, -180, 15, -26, -61, 63, -110, 181, 33, -15, -141, -132, 76, 35, 43, 79, -18, 45, -13, -117, -90, -140, -216, -16, 99, -12, 33, 98, 102, 55, -6, 23, -8, -323, -126, -38, 39, -74, -114, 74, -318, 55, 188, 48, -40, -281, 69, -141, -26, -221, 146, -181, -155, 171, -175, 44, -93, -13, 71, -116]
3869a16K82j09k66J06J21o7J4M4J04l04K05J79m12J14m5L89k46j43K73r4J12q4
3891E7j56k56K25K69l1k50M17l0m28L41k61K13N7k21j06L74k17k4J41l5k11nJ58
3914B1J74n9j7N5j02k73J89p1O4J6J67l74K53Oj34K24o1k42J85r6q1m3Q7L86m73
3939a99K26L7N2J2q3l4j44Oj65J67J53r8M23l52m58K77K62J0j37q6J66r7o7K93
3963A64p0j8j20L99n32L51k01lJ43k51L34K9k10%K2j87K44P2kl29J75N6k0p8o0
3988i2J74j66O1ql2K07N7j51j13j50J95p4k06K97j33N0L4m6j4J68k07J94n8k38
4012b51L94m13L31j68K0j29K41J63j38J32k75M41j96m07J25l6k7J55J37j05J0
4033DN4j10J08j19Q7k07L88l08K51l10N4L25l9k15R9j75j9J46o7J80j67J05k30
$$ y = [-116, 166, 57, -209, -103, 18, -49, -35, 9, 113, -191, 14, 193, -219, -105, -150, 239, -7, -150, 123, 29, 141, 57, -99, -355, -130, 139, 108, -142, 275, 245, -183, 158, -103, 110, 167, -54, -160, 214, -3, -27, 114, 79, -132, -137, 21, 195, 136, 119, 174, 72, -201, -12, -83, -19, -3, 164, -210, 43, 49, -85, 139, 78, -164, 21, -75, -156, -199, -112, 274, -199, 27, 64, 116, 128, 45, 11, -133, -127, -292, -125, 28, -70, 353, 1, -457, -180, 82, 92, -45, -131, 35, -62, -129, 164, 94, 76, -44, 355, -177, 174, -27, -30, 113, -138, 196, 225, 15, 15, 37, -150, 94, 166, 164, -165, 10, 66, 46, -32, -92, 82, -84, -23, -31, -63, 144, 201, 50, -63, -213, -18, -92, -298, -1, -134, -84, -50, -96, -110, 58, -149, 45, -13, -251, 143, -270, 61, -107, -87, -216, 25, 188, 50, 182, -93, 348, 152, -255, -130, -166, -193, -38, 99, -6, 4, 58, -52, 56, -63, 24, -183, 205, -103, 148, -162, -108, 217, 178, -37, 62, -113, -132, 14, -53, 127, -40, 65, -165]
4056a65L33l44J13J4L1J47k40O4P8L1k09J20M1M6l5j8K9J81k65K36k31k3J12j97
4080a51K61J21k09j78L57m15J64j23L17j61jj28J1P5j72K03j77m9J61J89j82K5
4102f2j32J84KN6j50rL1j76L07j93J03j96K28N0Kk16K80j06K64q8m3j10N8k34
4126a50J24K1j1j5M3oJ42k21m4J35N4J87k72j01N2K29m3K0M8j11l9q2q5J3Q2L44
4152C14l98J27J92j59Q7l27M13j97Qn0o7N1n3J55n8l79K48O5J46k86K94n8Q7j35
4176B0N8N8n7l9o0K3o9K02l51Q1N3J56J3k20j55J88K36j81N6Q5K07m3l00j5J71
4201A17j34K7K3P8j8O6Pl49L3L65J83j99q6j79J67P4k15pk46P3J70K42l36L22
4225A78m70L86L8M2j20oR0k00oK3J93j47l9p1m5K33J72l00J9j07L8j30J73p0L
$$ y = [-165, 168, -176, -63, -49, -18, 129, -111, -47, 31, 62, -147, -27, 14, 60, 25, 7, 36, 217, -48, 188, -43, -66, 46, -151, 110, 231, 22, -156, 201, -214, -50, -173, 144, -17, -18, -146, -135, -60, -232, -29, -206, -255, -94, 95, -87, -62, -194, -10, -8, 48, -102, -111, -80, -256, 51, -142, -39, -235, -7, 43, 45, -171, 109, 3, 267, 179, 136, 26, 84, -150, -26, -5, -16, -31, 12, 6, 148, -73, -117, 18, 72, 259, -13, -114, -62, 167, 124, 144, 192, 81, 42, -40, -125, -112, -30, 314, -84, 43, 235, 76, 163, -164, 249, 52, 60, 10, -57, -6, -59, 96, 38, -341, -93, -28, 118, -168, 126, 68, 155, 20, 78, 136, 79, 40, -20, 3, -66, 136, -215, -134, -81, 75, 88, -132, -287, -99, 137, -44, 12, 97, 304, 261, -39, -54, 117, -17, 10, 33, 111, 93, 159, 166, -183, -150, 215, 398, 199, 113, -66, 101, 175, -40, -47, -293, -220, -50, 192, -144, 178, -292, 94, 132, 174, 54, 48, 138, -62, -68, -45, 148, 1, -38, -109, -154, 79, 251, -49, -30, -137, -99, -229, -56, -126, -123]
4250a23j7k16L22p7k65N21n3j47j19Q5J39l69J67K89l22J67m9J61K8n8l9p7n7
4273a09L09k33P4J24j83j08K61j17M0l04K07q0jK0K96k20n7K43q4n5J60j83q4
4296h4o5M59l14J76l46K79R8l42M2j00M70j13o9j29J24p4K13k83m7J96j81K98
4318B08l30L30l18mL18j66J28J7j25j26K44k44R8j75Q6k85L77k24K56N5K8j43
4340EQ2j5j81J77l9k18J55Q5mLo2j30q1K94k7O6j39j38N0J50k19J00J28N4R2r1
4366I7k82K83l0J88m10J86j05J14J5l8J36l24K58l56K10M3J87j45Lp6j00Q1J99
4389A34k23K17K94k15q9p1R8k72J28j6L5j19n8J52m7k1K99j84j76J71j41M27l48
4412b5j01J42j36N1K53k06Jk20K09J5K05l15L43j52K3j89P5J45k92J86P1Rj79
$$ y = [-123, -140, -356, -34, -111, -376, 145, 92, -55, -174, -89, 50, -319, -152, 137, -185, -18, -67, 94, 122, 64, 25, -52, -109, 200, -33, 41, 165, -18, -126, 135, 18, 58, -246, -39, -119, -120, -100, 196, -24, -81, 162, 78, 23, 183, 0, -84, -149, 310, -4, 172, -174, 105, 203, -139, -97, -197, 273, 160, 91, -38, 86, 12, 225, -58, -105, 91, -90, 208, -122, 208, -110, -114, 204, 38, 166, 183, 58, -68, 176, -68, 30, -145, -59, -344, 33, -191, 65, 120, 148, 5, 87, 72, -109, 68, 29, -189, -34, 51, 47, 50, -12, -142, -223, 71, 44, 110, -29, -167, -117, 33, -186, -86, 42, 96, 188, 97, -185, 98, 68, 256, -154, 32, -73, 41, 56, 18, 154, -170, 88, -268, -58, -15, 172, 27, 30, -46, -146, -65, 134, -89, 128, 422, 207, 118, 47, 145, -127, 1, -15, 20, -99, -157, -5, -52, -73, 226, 42, -134, 37, -104, 323, -25, -126, 16, -120, -69, 184, -22, -21, -241, -32, -17, 188, -127, 216, 64, 87, -102, -27, 118, -174, 12, 83, 92, -87]
4435h7K80j73J7K17l08J09o6m3N4J7j5k4J48k67L41l55q7K14L44n36L33k30o3
4458a80K87J3j02J43J54m13k73O12j63O5p7k08k0P6m2N6J24j96J21J5Q4j48L1
4481d1q2O2L8J10j03N0m4j46P6p6K6l1K28M3n1o9j00K98j17J42k55OJ97O1l25
4506a03J93p3l0LR0j26J81r7k04R1J11K5j06r7J93J88k42lK2J27j97J0L60m62
4530a46J16J00j20J7p9M0J2R2J47m2j24k77K64l5J5R2O0l70p3K01r1L17n0K8j22
4555b8n8p2M54l91K34j99Oj42n4P7J36JON1J69k37L80p23L52k32L73l14K67k59
4579b03R1J50j22O2k98M94j85J35j37L8jK3k19J64K6Q6k72J21n3J43J4J54r4k34
4603a17J01l9J60j25rK69l82L64r9m54L51j3j70J3J79NJ18k75O2M8o9L60k75n7
$$ y = [-87, 193, 20, 37, 254, -54, 55, -11, -54, 0, 17, 2, -22, 126, -141, 200, -155, -242, -28, 316, -220, 113, -117, -180, 107, 120, 18, 161, 315, -98, -371, 241, 78, 143, 66, -142, -162, -86, -128, -72, 52, -144, -23, -8, 76, -72, -41, -123, -61, -23, 87, -16, 34, -10, -156, -80, -156, -130, -161, 67, 110, 59, -10, -110, 188, 71, 213, -42, -36, 161, 222, -103, 90, 17, -13, -10, 80, -46, 135, 38, -166, -75, 36, 61, -45, -142, 51, 239, -3, -6, 16, 143, -54, -44, 316, -146, -30, 70, -50, -33, -112, -72, -60, 32, 179, 137, 13, -264, 0, -35, -20, 72, 132, -238, -311, -110, -201, 116, 66, 94, -28, -86, -158, 296, -95, 139, -60, -54, -196, -250, -173, -37, -36, -30, 21, 190, -47, 333, -390, -38, -270, 103, -211, 56, -203, -112, 38, -84, -22, -320, 174, -11, 124, -13, 25, 24, 47, -172, -8, 18, 104, -168, -47, -100, 43, 57, 211, 117, -117, -16, -55, 105, -20, -29, 240, -142, 222, 123, -331, 20, 7, -163, -150, 29, 34, 152, -123, -61, -13, -82, 278, 3, -54]
4627e4J39J37k99L40l47rJ72l3J76q7l7M9mn8J3M1q9O7j18JJ62j41Kl24K70L59
4653C28m29M5J11L04l46J23j3K1j63k07K41K3j64J60o0P3p9k99K13K88l42M65
4675B93n19K98j25j01L12m02M86l02O1R8J12j39O6j05k7J10k52rJ55j99K16j47
4697a20K84j17j97J19K44j47l7N3k07K72j48J2j83L31j98k2n3L01k35q8J77J81
4719B22j89K3K68k07oj43j49J1K77j15M5l17L42Q3O1m33P7Q9Nj22J02j3N1j80
4743b18P9R4q8J66J4q3P2r1J26q3J00l52J95N6N4k51O9K53j38q7R2J78k11O6J99
4768B11j37j11J2J7mJ86j88l2M9j7O1Kr6J25q8n4J95Pk63K22j63K3J42L0o0q2
4794a3p3L8P4j01L50j39p2J46j60j54k42J23K50J27l19K00K7j22oJ85l68K05K46
$$ y = [-54, 85, 222, -77, 263, -84, -93, 79, 46, 222, 135, 98, 147, 143, 85, 98, 139, 50, 117, -1, 0, 162, 21, 23, -301, -31, 328, -101, -56, 55, 359, 13, 136, 123, 144, -19, -226, 15, 38, -126, 34, -26, 47, -32, -331, -118, 170, -172, 293, -226, 72, -53, -154, 158, -244, 242, -60, 1, 99, 211, 72, 138, 33, 6, 116, -136, -145, 10, -189, 27, -120, 164, 47, -150, -31, 213, 66, 29, 82, -125, 147, -1, 11, -172, 159, -39, -61, -114, 187, -48, -136, 41, 222, 33, 56, 324, 117, 111, -32, -181, -170, 107, -8, 37, -280, 62, 145, 206, -227, -150, -61, -56, -178, -76, -89, -38, -218, -139, -45, -133, 33, 47, -36, 36, -55, 71, -12, 88, -264, -69, -13, 41, -210, -141, 112, -26, -113, -21, 157, -54, 12, 211, 74, -37, -25, -8, -12, 174, -14, -46, 3, -14, 47, 49, -47, 78, -10, -64, 131, 138, -125, 97, -66, -43, 99, 129, 69, -13, -86, -48, 26, -75, 275, 136, 64, 210, 50, -104, -346, -223, 27, 154, -165, 35, 62, -60, -66, 119, -249, -44, 202]
4817B02k78k28K08K22k42M4l6K2L84k22r1L01l51j64R3P3p1R5j92Q7r8L85j20
4840B3J90j5l43L22k05J34p5K30l33k7j79K26J19qq4j57rL81l96J76M3r5J26j3
4864C1j72O3J60l77M20m0J31l51J66r7K32J01j60J93j77j19j30K01k19K7k6J31
4886a2j2j57J43r7L4K23j37j56J64j7j09L41j42j05N6j1J3K80m08N5RK26k35L97
4910C43k91n5J87k65J80j1k7o8o0J8Q7P0k31K02pO8l52J57m5mL65k46m2j25J78
4935B6J72k56q5J77j21R5Q3J9j08RNNJ5j29K12k03J43j59j08M24l77J95k58J36
4959h8J34m5j06J21j02K54j13n0J54j65Kk43J37K17k63J31L09k75N0j96L46j91
4981A8K4P5j81J25j49Kj07Q2j0O6P4R8j61r5R8O2q8P3j9J84k95K09l83L69L0j17
$$ y = [202, -76, -304, -96, 126, -116, -72, -108, -86, 298, 76, -15, 286, -65, -229, -136, -63, -134, -39, -231, -144, -242, 143, 23, 213, 198, -145, 177, -28, 106, 31, 261, -72, -99, -278, -52, 67, 59, -25, -182, -191, 190, -206, -30, 13, -82, 44, 31, -141, -78, 82, -295, 125, 85, 216, -135, 31, -66, 166, 267, 107, 300, 123, 4, -126, 75, -144, -117, -143, -12, -24, -181, -38, -135, -101, 122, -15, -171, -7, -24, -133, 208, 66, -39, 17, 6, 19, 299, -109, -54, -45, 181, -54, 343, 52, -3, 184, -81, 99, 88, 61, -7, -67, -49, 38, 108, -123, 79, 72, 140, -212, -55, -100, -104, 261, 15, -27, -152, 26, 198, -58, -143, 34, -87, 8, 91, 110, 2, 11, 16, 21, 36, -93, 119, -84, 59, -100, -208, 216, -161, 34, -224, -88, 46, 1, -105, 16, -86, 168, 55, 5, 159, -6, -4, -247, -110, 107, -156, -25, 284, 9, 59, -137, 209, 18, 42, 117, -64, 61, -88, -86, -193, -111, -121, -55, 19, 117, -44, -139, -41, 21, -67, 6, -13, 171, -124, 85, -298, 71, 101, -16]
5007a6K53m96L20p9p8J94j43p2J38p2r4j04J18P8j4oK02l56K27J2L0j0J62j4k76
5032i6J63R7k1j07J03k66K43q1nj29J63q6K25j75Oj07r0J13l2j15Q4L69k92r3
5056a29N3p3K15j01J21j69J64N7j88j52J87J89m06L42j28m6J30J12J67k85k90
5077b30M48l22J88No5J13j49J72j1j61J83l15J09L04j19j39l7p0K66p6J43j76
5099F1K43k62j76K69j67kJ2n9J46l0K5j64J94j08J08k19K90K02l33j25J22k37
5121b10K56J18k22P6J5k34L59j57Q0q4k33K87J09k79J18J19k89L46k70J18m3j74
5143a94K57k21K49Q6j86J75k10J51k36K09P9N6k65J22j15j47j20M45k23J06R9
5164A17l02L8L20l13J59q0J1J14l1j0RL0k6mm1q2O6R9k28K35q4j18Q1O7j0N2j47
$$ y = [-16, 237, -259, 61, -18, -96, 98, -45, -117, 21, -51, -145, -249, -131, -53, -67, -73, 129, -227, 0, 12, 42, 32, 194, 180, -96, 67, 164, 143, 36, 139, -127, 116, 35, 30, -99, 64, -22, 203, 28, 34, -73, -163, -50, -82, -197, -113, 256, -36, -129, -76, -149, 66, -35, 86, -83, 81, 138, -50, -202, -15, 174, -232, 110, -18, -64, 66, 178, 345, 60, -230, 218, -104, 84, 89, 24, 137, -12, 160, 149, -12, 171, -144, -35, 269, 150, 11, -26, -96, 170, 94, 237, 61, 304, 42, -134, 135, -32, -34, -22, -81, 65, 35, 60, -104, 90, -18, 90, -129, 161, 363, 30, -95, 27, -210, 46, 164, -58, 18, 33, -201, 158, 1, 81, -3, -236, 51, 160, -119, -1, 118, -171, 175, -95, 23, -20, -194, 63, -158, 91, 177, -9, 166, -44, 107, -129, 80, 159, 215, -50, 72, -43, -190, -310, 135, -88, 18, 117, -185, -147, 173, -140, 19, -61, -50, 64, 33, 23, 32, 62, 36, 32, -9, -91, -25, 74, -154, 81, -3, -121, -40, 27, 17, 69, -78]
5191g8Q1j52L07j97j70K85j33J17k1j26L6o8K22k73K01J93k13o2M9Q0m4O1j11
5214a6K71k78J86k17J29J10M3l03J13oj4j19j05J33J72M1l14P3K19k48J10P7j3
5237D4O4n2J7m5j8o8P9o9L2K32k61O4oO8M5k00l4K93q6r0M8p2j83K53l4qk52J37
5265a02K74k99p9J83l9J14j93Q9N4N6R7k46R4oJ1k9k3m0L9J37j33j22R7mK31k16
5291e5J17o2P5Jl2J85l67m6n2J00l2M0J42J01j31k9j06L1J00k2n0J45k1k32J60
5316d0J07j87J44J36j95J58k1n4j26PpJ17R0j91j20J28m1J60J24qk47q0J70Rj56
5341a23R6j3N6Q1Q3j74K4r5j01O4K20n0l07L11j27j59K59J36j99o2nJ70j25j46
5365a86N40j60k40l7J86j61L8J86k03J54P9P0l99J59j01n6L0L1J05l9J87k42j27
$$ y = [-78, 3, -149, 158, -39, -209, 76, -57, 60, 39, -87, -51, -119, 103, -170, 31, 224, 11, -51, -2, 78, 34, 95, -16, 255, -23, 163, -54, 75, 185, 228, -75, 38, 32, 18, -101, -206, -73, 99, 140, -174, -101, 118, -130, -20, 57, 44, 108, 56, 73, 28, 10, -58, 21, -48, -16, 216, -45, 19, 13, 81, 126, -74, -108, 185, 99, 9, 57, -15, -198, 55, 21, 13, -239, -102, 172, -127, -206, -23, -62, 52, -141, -52, 2, 58, 155, -91, 3, -3, 8, -21, -44, -84, -45, 92, -41, -163, -66, -70, 161, -55, 62, 0, 75, 76, 44, 229, -138, -184, -236, -136, -168, -128, 14, 115, -16, -45, -151, -120, -20, -42, -92, 53, 32, -200, -40, 67, -120, 24, 160, -35, 123, 102, 48, -78, -71, -78, 39, 129, -62, -182, -54, -95, 65, 189, 181, -66, -146, 24, 33, -123, -27, -40, 16, 97, 180, 6, 30, -65, -166, -102, 118, 68, -239, 72, -55, -214, 45, 181, -18, -80, -85, 85, -40, -186, 354, 194, -46, -83, 103, -58, -20, 166, -37, 117, 196, 266, -133, 26, -75, -131, -101, -70, 35, -4, 183, -59, -186]
5388a86J88j39K1M5m6J54N1p5j88j1L90k09J8J51j91N9M3j62j8M9J08R1j45j04
5412a06O5j88K64O5j89L8J09j13J02j26J16p5J24l3j24l6J41J84j44Q8j52Q5j09
5435a4j45J54R0p6k72L08K8j72nQ7j5k5N7j32J15m4p2K45k11l5Q0rJ33R8qk98
5461a38m8K34O3p6k2J44J45n1l48J65m9k31K50p1J07J51l04J1j31L50J39l02r2
5484a04N4N6j70K75j88Kk3J97J70k24k03K77k31K09q9J0m7l8%l0L86k63J28J7
5508A71j66K44m4l43P9J51m6k2nQo4J2K3J32J37n04N15q2Mj03j88J70k54K35k26
5533a66J11O2K01l54N8K28j22r4R2m0j64J74M0L4j54nO3j33J22K02k13J00j1j04
5557g3K62m44r7L15o3K53p9k35J12L1j52M10l36L14k92j97J82l8K2J68l44lM26
$$ y = [-186, 2, -137, -116, -71, -117, 37, 88, 13, -175, -186, 204, -5, 13, 164, -27, 32, 75, -87, -105, -56, 52, 143, -2, -106, -41, -229, 35, 100, -89, -51, 58, -55, 47, -79, 37, -38, 86, 53, -71, -107, 34, 218, 74, 162, 10, 95, -14, -159, -5, 85, 9, -263, 45, 73, -99, -104, -17, -32, -57, 0, -132, -17, -61, -133, 112, -99, -134, -54, -63, 70, 168, 160, -138, -186, 48, 111, 35, 13, 157, 302, 251, -97, 68, 19, -212, 38, -33, 74, 225, -79, -68, -199, 151, 290, -12, -104, -50, 6, -164, 111, -77, -75, -98, 99, 269, 45, -158, 119, -112, 97, 8, 18, -29, -67, -67, -97, 289, 26, 154, 171, 5, 249, 205, -138, -59, 92, 46, 24, 19, 27, -37, -25, -2, 130, 267, -237, 278, 196, 200, 97, -91, 79, -175, 60, -166, -55, 7, 208, -146, -88, 140, 18, -76, 16, -24, -188, -14, 26, 60, -94, -99, -36, -169, -47, 155, -58, 42, 31, -73, 189, -255, -352, -37, -100, 153, 74, -161, -49, -18, -170, 240, -96, 218, -74, -271, -89, -127, -105, 63, -281, -284, 142]
5580A42L5o3j87r8J08O0pK45j43O6j53j4o2J10j26K03r1q4K40k00Q2K60l87j04
5604a68M09o1j46J79k52N4K7j60R3rk2j9R9j22K20j57Qj51j18J93r9J66l5J28
5628E7K46m79J87R7j32L1k18k3N42k86q5N2j0R1Q1k85J57k66K70O5r9j63K42K3
5652I5j97P4j05K57k63J36P3l11M36n0j36PR6Q4j68o2%k0j29J56n0k09K92m1J23
5677H8j36J97j86K15k79Q8j97M00J8j07k73j12K42J0Mm7L26r0l40O1KK57j35j41
5701a35k0k33M97r0j00J34J46j28L8j80j8O4N3l1k0M7k07L18k13N6q1j24K23K3
5725A9j01M6K0n5J88j47j05m1J73q8n2K47M0l40J64j07k4J6M13k33j05K28j71
5748a5P3R4p8j86O5l9J85p3p4R0k1m2m4Rl2QJ22j68N8r1K41R6J16k78o1J98l26
$$ y = [142, 177, 114, -73, -171, -63, -3, -10, 235, 92, 158, 5, -9, -71, 39, -87, 116, 25, -59, 181, -19, 63, 323, -64, -168, 241, 180, 34, 213, -39, 15, 42, -118, -25, -34, -56, -75, 24, -98, 122, -35, -27, -178, -296, -103, -202, -36, -71, 57, 303, -176, 11, 108, -24, 7, -211, -234, 308, 22, -63, -11, -21, 70, 151, -134, 23, -243, 27, 92, -7, -170, 72, 95, -102, -28, -133, 124, -139, -3, 70, -241, 195, 145, 9, 16, 112, 196, 28, -34, -34, -54, -183, -27, -77, -286, 6, -35, 88, -48, 149, -37, 178, -101, -13, -210, 190, 208, 101, -172, -284, -42, -32, -28, -75, 251, 161, -179, -118, -116, 141, 6, -135, -155, -388, 109, 19, -81, 53, 199, 71, 109, -71, -89, -25, 28, -3, -23, 24, -183, 135, -78, -22, -103, -227, -4, 19, -82, -36, -16, -71, 117, -30, -135, -176, -3, -91, -143, 104, 144, -196, -32, -139, -163, -147, 266, 33, -72, 156, -15, 58, 152, 74, -112, -47, -86, 99, 26, -48, 42, 21, -21, -65, -56, -88, -80, 42, -126, -68, -159, 82, 178, 294, 16, -45, 153, -173]
5775a73K81k67K16j42K03j09j5j29J6P5m5J2K03k71K04j61K7K59k45rJ47j92J48
5798C3n5k66K61m3l9j9l6k98L76QL7k8RN4L2L5nj08P2J50l73J25j85K50R7j84
5824a00L7LJ02k7N9p3m6r0K2m5O6J67m64J50J27lK18n9J47m36J74q6J73j70J55
5849AJ34j05L0r5J99k05J03k0q8P6l58J98J18Q2J03k58K16P4j03j88j14L52k31
5872g9k01K91l4K08j83M6q8K6o7Q2j47J41Q0J5J7M5k69J70K9j90J81n7j93J41
5896c6J01j73J70l47K13Q2r9L3lJ31J4j02j05K0l0J68K41k39r9j22K02K0q4L1
5920a3k44J28J76o8K11m26K74Q7j06O5K5k3J3j0k15K10k28J61q5pJ83k92L19l58
5944b23L45k12J80k9K65l32j18J39j92J44j2J63l03oJ07q1K38j46Q9j34K86o2
$$ y = [-173, 108, -159, 57, -85, 118, 9, -6, -135, -119, -44, -89, -77, 126, -145, 59, -102, -75, 184, -61, -70, 77, -115, 33, -22, -288, -27, -70, -109, -128, -164, -462, -86, -78, -41, -69, -60, -6, 26, 61, 56, -52, 20, 170, -203, -78, -263, -13, 84, -100, -63, -60, 42, 15, 74, 1, -45, -135, -113, -158, -92, 75, -389, -239, -112, -115, 103, 44, 191, -245, -71, -157, 16, -154, 1, 135, 30, 60, -35, 164, -41, 62, 42, -46, 30, -328, -130, -12, 70, 173, -85, 131, 205, 102, -86, -200, 152, -79, -280, 11, -23, 185, 2, 48, -40, -14, -81, 1, -146, -5, 75, 90, 107, 152, -117, 53, 82, -108, 73, 16, -177, -36, 65, -108, 62, -285, -72, 10, -89, -56, -59, 72, 86, -16, -121, -101, -131, 37, 278, 39, -60, -182, 20, 40, -44, -13, -257, -129, 47, -21, 190, -236, 38, 125, 19, 84, 109, 86, 99, 89, -126, 84, -144, 17, -68, -75, 108, -184, 135, -223, 122, -90, 90, 61, 326, -6, -124, 15, -177, -33, -45, 118, -185, -191, -84, -165, 73, -73, 16, -118, 168, 106]
5966A06k3l22J92K0J11j54L26k68j75J54rJ21r7N8p3J59k0m5j86J64k40K21j84
5989a64J50k1r6J29L1j20j08K4J61j61j06M22k07K69l11O7J51Q4j20k40L75l5
6011A74r9k47J25m3L6J61k94L99j58p6PJ33m89J60L35N8j21r8J33j50o7R0K66
6034B35m47J99J9r5K6L41k02J03k58J13k00M30j45n4pj19J8l6j99K26J55j57M6
6057hL1K5j7j00j34K59j01J63n29P27k90K7Q4j53o3K25o5j15k80J67J70j05J57
6080G5j3p2%r7J61R6n4j68N9O3n8nj69K51j87K48r3j96J55j34J17O2k38M9J04
6105d4K6j3P9o0k4K04O4k85o6K38j71L01l5k20PK27k25k29j6K01M6J4J52j17j45
6130i1OLn9J04P1M3l60M68j07j04J69L7j17n1p7J71m2L5k27J36p9L0J77j78J72
$$ y = [106, 83, -239, -47, -27, 84, -70, 256, -12, -187, -33, -42, 79, -18, 40, -33, 126, 106, 61, -125, 39, -201, 20, -164, -14, -35, -131, -2, 29, -91, -199, -175, -14, -175, -281, 141, -66, 203, -108, -41, 110, 194, 74, -166, 209, 174, 75, -172, -47, -90, -54, 107, -187, 212, 54, -22, -15, 118, -371, -211, 124, 182, 61, -37, 96, -54, -121, -31, 235, -212, -13, 6, -89, -63, 278, 76, 179, -79, 34, -166, 264, 119, 65, 58, -61, -43, -79, -278, -52, 103, -54, -8, 23, 48, 31, -69, -203, 56, -45, 118, -411, 316, 26, 53, 137, -16, -79, 146, 81, -34, -314, -147, 23, -82, 75, 62, -10, -10, -107, 54, 150, 96, -72, -13, 50, -8, -13, -182, 69, -118, 130, 37, -159, -4, -138, -21, 41, -197, -148, -44, -18, -31, 48, -12, -36, 168, 232, -53, -119, 119, -52, 249, 214, -6, 1, 228, 3, -226, -242, -41, 5, 19, 171, 54, -91, -85, -82, -141, -37, 34, 77, -283, 185, 78, -26, 143, 180, 63, 12, -65, 106, 64, 99, -128, 8, -71, -41, 136, -42, 130]
6155A30k6J00l96K49JJ30k28P3O8o3K67l00r0K56l80L61p2j39K04m60L42L3j10
6178e0J4J37nl45K80k36L11l41L07j5j01J4K7K23p7j22p2N5j32R5J25l9l81K23
6202a05J5J66q8P9j07j15J98J51m76K85K12j91q2PJ06j32N4j01q7J69J74m11L96
6225A17oj59j52L57j71j82J88Q6Q4O3ml40J69m4j06P8o0K05Q7k33p5J07N9j68
6249a00K16l20K40l8J61J1m72J98J79lmR7p4k08K6OJ96j58K03j90l0q1J73l8j36
6274a46K06M9j14K7j61K71J00k62Q3P0k04L1j89L78J71j66j74j3O7j81K42j46
6296f1K72k97PkqJ4J10j83J86j19J01R7k16J66L7m84L59j26L41L9m09K98l26L67
6320A63K7p7K7l79K53m5Q0q5J38r1J05l47O7K66k54kM09l66K50k36qQ6r2N8L4
$$ y = [130, 104, 204, -192, 57, 58, 188, -40, 33, 101, 38, 305, 5, -85, 171, -209, 152, 80, -59, 145, -315, 27, 60, -50, -36, 101, 96, -249, 31, -205, 106, -235, 72, 57, -44, -30, -3, 220, 143, 21, -51, 4, -128, -33, 92, 53, -328, -105, -90, 76, -12, 67, -40, -155, 43, 194, -282, 3, 215, 24, -58, -51, 55, -77, -23, -124, -211, -42, 132, -279, 117, 111, -48, -200, 157, -14, -196, -8, 78, 162, 225, 221, -119, 50, 6, -100, -22, -82, 123, 210, -23, -98, 9, 68, -100, 116, -204, 36, -2, 159, 170, -302, -104, 75, 72, 68, 165, 91, -117, -91, -85, 111, -47, 156, -34, -64, -145, 28, -10, -146, 60, 109, -5, 22, -139, 132, 232, -30, 53, 123, -81, -50, -239, 139, 310, 144, -30, -43, 24, -157, 85, -61, 211, -86, -79, -81, -89, -75, 35, -148, 38, -81, 20, 117, -99, 67, 104, -380, -21, -147, 194, 233, -176, 122, -204, 163, 190, 113, 140, -239, 14, -31, 49, -36, 102, 11, 116, -231, -164, 102, -152, -154, 255, -111, 139, -97, -105, -19, -111, -53, -19]
6345a9o4M24j77j09j63K96q4n2j44J63J07l31K39j5K2l6l11L58m0r1j29J60L2
6368C6P4m3P3j30Q4J0k28K50m6r2l8O4Q8j68j12K8K30l9J12q5n5l4r4J26n8K55
6394B08lk13j52J58R4Q3n0r9j12M6kJ17j33M08k69j92J00n5j5K77j28j70MK54
6418A56r2j17QJ38L5pl2ll83j5M09J46k93K50k66J4K5K23k27jj70K71L4NO7l66
6444a91L17rl0n39K40J68K50l33K37q4j08J03j01K22j70o9PJ46J88k81K27j98
6466hM6j9j43j2J48K08l2k40QQ5J80k00m3k41N50k93j24K44p4k65M20m5k45J16
6490B1j68K98k29K40r3J4j15J80n5k40J20j00kN5L9p6J98j06N5L1k05K67j63j01
6514a35K46J06j44p6j19M4K7O9j0R8j19J76k94K67jj19j6O7R5m03K05p4K9j26
$$ y = [-19, -83, 341, 164, 55, -108, 188, 104, 52, -92, 71, 178, -153, 86, 71, 93, 57, -254, 104, 64, -27, -156, 4, 36, 110, 67, 140, 10, 94, 104, -124, 126, 80, -12, -50, 14, 102, -66, -178, -150, 80, 41, 153, 68, 13, -21, -115, 11, -47, 208, 205, -8, -160, -2, 92, 175, 125, 26, -86, -40, -42, 75, -58, 350, 81, -111, -11, -66, -81, 196, 68, -102, -98, 156, 64, -53, -45, 93, 128, 121, 89, 86, -297, -312, 97, 243, -50, 200, -66, -52, -27, 196, -31, -32, -202, 69, 103, 108, 175, -191, 126, 117, 87, -452, -212, -44, 206, -127, 110, 26, -82, 21, -80, 142, -28, -97, -90, 56, 244, -37, 190, -8, 38, 19, -124, -136, 12, 220, 188, -52, -44, 41, 221, 21, -22, -263, 287, -6, -130, 114, 40, -225, 195, 150, -95, 21, -147, 151, -78, 162, 69, 83, -32, 148, 93, -147, -27, -127, -129, -74, -35, -111, 87, -19, 36, 67, -138, 129, -34, -135, 111, 217, 73, -3, -122, -78, -51, 18, 8, 106, -13, 163, -131, 136, 135, 16, 0, 67, 162, -241, -36, -110, -81, -207]
6538b07O8k38L65R4l30M66k29k3L8O1j7K64m69O9j33J51J54k16J40K15k78jK09
6561A53j87n0K83o9k20J18q3r4m1K78j88J50O0j22o8J26n4J4m1p4o1J17j00k8
6585a81L6J27Q2j07K44j56J01m2l26K96qj50K72j96J37om9q7k64K38oM3o7j4N3
6610c0k2J11j99o6J31j00L39n9j26Q2N3j27k7k1l7L61k32O1j37N3q8N6J5j08J85
6635F8k25J2K30p9j94L69l39J67O1L1j3r7Ln6J48j71N3nML29r1L7m17Q5n4K13
6661F9j35j14J26J89j42r1PJ60J13j70j78J51P8n0qj11P3o6K11j59kK68j20l28
6685b29J05J41l7J19nj3k18K00k84M39l62K46l5j1p1k33M17k18N2J25j99j5Pj6
6709i5K01N3l88J77Q1j27n3k4J9l5J4J04J82k08K39j32M3J83k08j70K91Q4m3j90
$$ y = [-207, -139, -377, -12, 82, -248, 218, -11, -34, 4, 65, 48, 312, -157, -88, -221, -70, 84, -132, 8, 223, -55, -56, 153, -34, -84, 199, 130, -90, 28, -55, -149, -190, 88, -100, 50, 110, -12, -80, 46, -8, 6, -35, -109, -170, -53, -153, -181, -145, -18, 64, -43, 201, 45, 146, 104, -222, 74, 66, -84, 188, -8, 129, 123, 74, -13, -277, -39, -45, -2, -69, -83, -30, -52, 59, -140, -206, -75, -175, 164, 105, -21, 61, 114, -13, -40, -61, -98, 263, 31, 92, -45, 8, -80, -24, -9, -117, 68, -157, -145, 85, 6, -188, 181, -158, 9, 70, 101, 88, -9, -6, -62, 86, -85, -32, -37, -33, 296, 205, 242, -175, -90, -144, 69, -66, -180, -54, 135, -7, -98, -91, 69, 182, 12, -166, -15, 63, 13, 5, -106, -33, -99, 112, -47, -49, 219, 99, -229, -124, 17, -20, 99, 94, 81, -137, 63, -221, 218, -144, 102, 67, 56, -15, -248, 169, -49, 3, 128, -71, -86, -79, -95, 106, 159, -229, -52, 29, -98, -151, -175, -156, -191, -177, -73, 109, -99, 140, 8, 51, 234, 26, -144, 147, 231, 188, -2]
6733bJ0Q0j55K63j70r0K86l44O3O9q3J59j91K78k54K98k34O8j60O7l0ro0o4K52
6758D7m5j13n7m4L94j71K26k33J55l37L07j38pK58l25Qn1J56n2j07J76L4j47o
6782g2R2r2j44J08L72k14J0j1l21M88P5j82r2p0OQ4J04j18KJ23k21J29m1R4Q4
6807A93j82P0q5j27L3O7%q2K11j7k41J73j76L80l89K95l32J33M5K3j60KL35p2
6831I7j78k80L75k02J79R2j05n4j74L77p6K0k80n2K67O7r9P0j08lJ70l8r6Q6Q6
6856A41j79Q3l03K72M0p1J62l7J27q9j03J10j36QJ66o9k38Q2O9Q5k11K19k22J19
6880B5J27O1l11K2M8j8NJ36o4n7J71k48P4K29l90K17j92n2K40K2k06K70k58P1
6904g8J79j83L2k6K9k2l5p0P0L6r7K49O8o9O1l1r3Rk08K06k20K63N4l5pk89L40
$$ y = [-2, 8, 88, -67, 196, 26, -64, 222, -122, -59, 10, -73, 86, -105, 173, -81, 217, -17, 51, -109, -42, -72, -81, -141, -205, 47, 2, -111, -168, -212, 182, 11, 237, 4, 159, -178, 129, -9, -16, 242, -83, -75, -126, 30, -22, -129, 47, 81, -66, -72, 20, -72, -216, -108, 264, 50, 60, 49, -272, 216, 291, 109, 17, -53, -47, 37, 141, 23, 25, 148, -73, 56, 15, 109, 193, 11, 81, -4, -131, -98, -31, -31, -113, 98, 81, -160, 13, -163, 217, -172, 123, -209, -76, -31, -8, -168, -166, 169, 97, -81, -361, 14, -188, -9, 83, -22, -76, -250, 127, 51, 71, -209, -261, 6, 73, -26, 44, -64, -67, 103, 65, -31, 55, 141, -38, 45, -258, 14, 54, -17, 145, 108, 235, 146, 43, 153, 17, 25, 191, 122, -116, -34, 35, 120, -91, 128, -94, 25, 152, 213, -98, -76, -28, -46, -41, 95, 31, -26, 145, -103, -29, 200, -190, 27, -165, -217, 23, 45, -161, 109, -149, -78, 101, -82, -50, -76, -47, -69, -104, -174, -104, -68, -165, 84, 152, 83, 144, 113, 20, 29, -179, 27, -193, 70, 124, 89, 82, -207, 133]
6931A33j77L17l78p2J75O8J44j21k38M56j48k77J26K00l11J59Mj75p7M77m6k04
6953C5N9j21J5J01q0J78k03K93l02L6K23l02Q2J27j09P5J8l89K72JJ03J1l16K94
6977A01l14M2RN7K13j7k2J63o0j11j06J95j02m92M55P2L8O4k90K43l2q5j23J30
7001B8q1P9R7l23J52r8J07nP7j7j84J54p9k7k6P3J40L4J12k90J12j09J30M6j87
7026h5p7J39P3q8j55O1K01p5R2m9k04K6N2Q9P0j2o0l7J93k78m2K06o5J45l63J3
7052b30O2J00J18j58K36j82j05k50L83J32l22O5j13J31L09k71K96j52j75R8O2
7073C4Rj18kK4q4K93k62r1K96r7J50j42J62k38J43j33P3J61k26J40Kk20J51j09
7097h4J12m8K20J04k45K78m59J39n7j32K83l0l0R2k11K59m06L91j32k20J26j81
$$ y = [133, -44, 273, -105, -177, -2, 66, 210, 89, -149, 307, 159, -118, 8, 208, -103, 56, 60, -115, -192, 285, 239, 35, 94, -27, -12, 89, 9, 187, -16, 277, -25, 11, 234, -68, 14, 141, 32, 107, 125, -264, 8, 9, 112, 123, -193, 101, -213, -171, -162, -105, 108, 91, 69, 232, 172, 61, -45, 150, 48, -444, 11, 83, 121, 185, -105, 138, 106, 21, -102, 28, -53, 26, 123, -200, -48, -146, -39, -44, 33, 16, -168, -14, -93, -120, -146, -73, 67, 101, 213, -77, 35, -74, 56, 102, -85, -162, -23, 50, -38, -193, -132, 69, -6, 86, 37, -167, -141, -89, 0, 70, 58, -2, -39, 154, -124, -166, 40, -25, 120, -243, -230, -168, -68, 50, -108, 128, -54, -159, -409, -26, 106, -216, -151, -264, -133, 176, -95, 201, 49, -126, -28, 34, 43, -75, -77, -53, -137, 156, -106, -197, 99, 2, 152, 10, 172, -66, 77, -56, 17, 178, -48, 92, 94, -126, 25, -84, 28, -20, 200, 304, 59, 337, -122, 17, -40, -172, 111, 81, 51, 143, -68, 191, -215, 176, 44, -176, -50, -231]
7119b31J95N1j58J49j39K36m6j79J35Nj78K39j79J2M09l39j15P7K17k09J57k00
7141i1K77p1j25r0n3K3lM8K55m25N3N7J91k07J68j17K63k01NK9J7k2J26k10j0
7166a13K17j51M3K10l40j3L26k17PJ2Q0k06K53l3k02J06j60K60j33J94J07k51
7188dp1J94j1M2j5N6j30J0k90K35O7j60K56K0j61J63k34p9M3K67k33L47l98k19
7212c05K23J89k68K58k80M42l74Jj12K4L38q4j79K86k6j08jp9L6j4J09o9K50j68
7236H9j74Q1O2O2j12k52J83J20Q8k85L42n3j96m7K14j65j35o8J86J40k69n7J63
7259h3R3j3p9k0j06L29n8J68j89N7Q0j32n0O4P1J29l30K88k59J45j28p1Kn3J91
7284D6Q1M2k66J78j81M5j86L99L2m75L70k48K61P2k87j9K90k25k9j52K98k06J16
$$ y = [-231, -36, 15, -143, 6, -133, 103, 57, -122, 13, 18, -160, 79, -100, -88, 321, -18, -133, -56, 161, -48, 109, -91, 186, 115, -10, -100, -153, -130, -133, -85, 170, -255, -202, -145, 46, -161, 7, -110, 153, -48, -43, -14, 3, -19, 107, -103, -113, 104, -47, -4, 206, -134, -147, 179, -38, -31, -19, 61, -145, 108, 75, -127, -21, -181, 79, -54, 140, 247, -4, -75, 119, 108, 150, 135, 191, 61, 71, -219, 16, 83, -77, 179, 199, 38, 201, -33, -112, -69, 198, -35, 312, -86, -305, -82, 107, -161, 97, -183, 259, -115, -114, -226, -202, 136, 52, -127, 159, 133, 25, 24, -55, -19, -33, 76, 7, 257, 89, -85, -4, 58, 120, 8, -244, -61, 59, 147, -138, 204, 151, -45, -92, 122, -43, -178, -246, -60, 80, -189, -246, -83, 10, -3, -82, -102, -208, 121, 63, 231, 42, 99, 179, 47, -3, 61, 132, 261, -69, 219, -40, 105, -23, -94, -92, -145, 46, 127, 169, -97, 81, -100, -55, -241, 158, 190, -285, 85, -163, 98, 170, -117, -136, 154, -71, -100, -252, 46, -160, -44]
7307d4R7j7j33L24k04j36M4J51j29J2M8k9r2j23K74j81K01k62L79j44j10J87j32
7330a9k37L37l7q4J73j62J73j63P5q3J86j86K25j71j9L0j31K24j28n3K4M4J30
7353A48m26J75P8L27l60j8O2k02K06m8J27j00r3J11j48L31j09j72N4M6p9J27j39
7376a02J46Q5j32P3n4l6o4J71j36N2j97k7J05K39k08J93j35k3K22n6l7J13m7k16
7400g1r5J70M2J12J98l88J44k43N1J92j7n7k35rM0J54k8m0K17m06K54L51n73L24
7424H7k34K4K73l8j81K37k33N4O4J23k35R9%j24J13J89l91J54k5J81k48K27l67
7447b51L80m04K52M1l6p0j5j71%K04J01j56K15N0j43LJ58q3O1N6m07J69J84j29
7471Ik91L85k58L33j73K53k50R5j00J83k7j88m0j2j77N1L05l42R2J64j56K03j41
$$ y = [-44, 53, 36, -97, 227, 23, -113, -69, 82, -47, -35, 13, -16, -108, -231, 43, -138, 63, -199, 180, 36, -74, 113, -19, -256, 81, 44, -40, 133, -29, 144, -19, 56, -27, 159, -27, 198, 27, 8, 38, -93, 131, 3, -50, -26, 18, 148, -278, -103, -25, 302, -58, -76, -14, -216, -10, -58, 69, -31, -124, -13, -161, 170, 61, -111, -57, -11, -90, 37, -102, 44, 129, -3, 70, 16, -20, -84, 87, -49, 3, -194, -221, -116, 123, -85, 108, -27, -50, 172, 116, 79, 192, 145, -71, -166, 4, 46, 158, 356, -32, 112, -131, -80, 112, 95, 38, -197, -206, -166, -12, -40, -80, 137, -269, -15, 336, -237, 87, -147, -123, 150, 112, -69, 168, -65, -11, 53, 176, -59, 40, 40, -84, 29, 218, -173, -19, -44, 137, -111, 116, -251, 129, -275, -23, 18, -18, -88, -103, -274, -274, -70, 31, -125, 90, 140, -3, 0, 158, 75, 136, 192, -215, -46, 138, 9, -282, 103, -155, 178, 5, 258, 8, 103, 3, 186, 159, -29, -69, -81, -258, -207, 98, -244, -152, 12, -144, 59, -82]
7494h2J46J40j0l59j25N4M21l27J99q0o5J9J38J12l35rJ00PJ35r1k1O5j10R5j24
7519a07K51j04J15k03J86j6j17J43Mk04o1K48m00K29L7Q3j19J30p7n9J63j14p1
7542f3K25m19K69J2p4l0R7J45j54J03Pj63m3P3L2J71k0N5j83R6l32J78nJ87j72
7567hNj25K05r8K70k17j41L09j13k7j8j27M0K82l54j45q5M97j6P5q6J11m41M74
7591B67k75R4k9j67Q5m2K73O6k41NMl2J40J29k27j64j22K24o0o8J0P3J84j2o2
7616E3l4N4k88J90J33j16L18k86o6rj9J33P3j96Q2N7j69n1J04j30K01J56ll0j83
7641b6J52l97K51R5K6n9m87M44J81j44q2K13r4K07m94L09j25Q2j5P4K0j23o5L60
7665C03j31m17M8N2J26p5L70k01o1j18J27j3k1n7lr0K68j64N8j99J34j1J37L7
$$ y = [-82, 64, 204, 194, -165, -290, -236, 185, -142, 57, -23, -88, -69, 69, 181, -154, -163, -63, -56, 79, -12, -33, 32, -78, 17, -107, 144, 40, 155, -48, 138, 122, 5, 148, 152, -52, -113, 135, -265, -36, 1, 84, -35, 95, 18, -41, 122, 8, -63, 162, -257, 12, 24, -50, -80, 17, 162, 8, 111, 118, -45, -88, -15, 17, 188, 168, 223, 40, 136, -196, -18, -23, 164, -8, -3, -128, 77, -21, 249, 32, -109, 200, 87, 60, 42, -85, -45, 237, -117, -262, -347, 150, 134, 209, 123, 234, -207, 267, -8, 86, 57, -110, -25, -67, 206, 272, 31, 36, 40, 8, 148, 277, 50, -114, -236, -12, -72, -140, -130, -57, 127, 115, 53, 19, 73, -215, -25, 108, -8, 310, 24, -42, -51, -70, 63, 136, -60, 22, 79, -90, -141, -37, -167, 34, 190, 187, 157, -26, 126, -271, -20, 75, 101, 42, -445, -1, 180, 36, -46, 167, 73, 280, -214, 95, -30, 52, 37, 111, 131, 8, -57, 303, 172, -245, -197, -145, -19, -94, 276, 75, 14, -104, 23, 10, -11, -68, -71, -161, 107, -57, 1, -198, -64, -75, 62, 99]
7689I9j5j49R0K42k76J26mk96L37j49j2j94J59J89m0N8q4k07m3J19L9kP0l43J79
7714a07J84j56L9J39l59J23K21Pj13J19j34n2R2j64L44m38J96R4J17p9O6k5k42
7737a28Q6j52J37K22j10j19O3N9q7M0k67M42k42J75k99K79k44K45k2o4R8k96K64
7760H0J4j24r6K60Q6k06n8q7k1J74J23Jq3Q7k50J23k3K7K1Q7k46M3K10J4k63j03
7786b10K96pO6q2n0J92l61K23k90L53j23j5k9K6O3l40K53j01K89k2p3N4J68l95
7810a15O7m2P9J55k19j84L87p5J28j04kj03m3K34J05j67o8k01J65K04m09P2J30
7833fJ47r6N7R2k74J36l0j32M8J56j91j92K30K6n8M86q16M28J19J6k21K15P5k77
7857f2J39jk7j66J8P9o7J09p9L1O5j0m2J11j69k68L42j96J32K11j4p8R6j95p5
$$ y = [99, 84, -65, 25, 267, -9, 117, 113, -183, 154, 5, -7, -201, -42, 147, 107, 165, 81, -126, -169, -50, -11, -13, 57, -286, -107, 77, -79, -40, 99, -260, -137, 84, 91, -22, 97, -37, -89, 3, -161, 183, -255, -59, 35, 152, 73, 139, 114, -128, -42, -194, -57, 165, 55, -64, -1, 58, -29, 11, -256, 186, -56, 119, -180, 99, -145, 100, 78, 14, 112, -184, 80, 94, -30, -126, 134, 220, 14, -44, -131, -152, 22, 145, 146, 63, 150, -100, 23, 0, 27, 48, 135, -111, -68, 142, 156, -107, -210, 86, 79, 145, 63, 13, 205, -156, 67, -223, 130, 7, -8, -37, -11, 52, -288, -35, -136, 153, 131, 58, 112, 280, -115, -48, -90, -11, 144, -75, -259, 128, 53, 181, 77, 75, -28, -71, 163, 268, 101, 33, -168, -3, 201, -208, -136, -6, 141, 45, 102, 194, -80, 56, 26, -106, -58, 98, -93, -285, -55, -29, -87, 399, -417, 11, 130, 146, -75, 140, 215, -62, 77, 76, 49, -117, -99, -20, -87, 22, -57, -26, 39, 29, -13, 98, -71, -339, 3, -193, -61, 150, 136, 58, 154, -41, -116]
7882a16J71P2k2k61L27m07J36J53q1j85P2J65N9j18L5%J16l2J70l33J68k1k62
7905a94p1M05k26J51o6O0j25j1l8J93%j36K02j94J77j74q1J13J52r4q0R1l8K39
7929B55m70J56K17k29J57l17N6M66k09l57L34J52j77j70K02l4M2K1r6j34K85j11
7951C9o9q9K60q4K5O1j24M9Q4k38K0j00J34j37j68L98j20P3o1J56k15J23j72K06
7975E1j08n9L3P7j37K58k3Q8j55J02m2P4k40Q4J58j29j25N6N3nj01M6J49p8P1
8000I8p1j82M22l29J72j13j76J52n9J27j28n0M7j16L41k60J40p5k18M53j88L6
8022B3j12O2K65l15L22j41j98M43l26l1j16J15o1K63j04k71m8J76Q3K4k56L17
8044A14k1l0Q7k78L53k91J30JK5R0l46OQ1K21k84L01o1j43j37M1K31j69J47q3
$$ y = [-116, 55, 127, 105, -156, 171, -236, -100, 53, -28, -213, -141, 24, 83, -35, 0, 0, 116, 84, 254, -79, 89, 68, -194, -265, 140, -86, 65, -1, 59, -66, -77, -115, 78, 78, -58, 144, -50, 127, -47, -128, -15, 137, 43, -37, 54, 16, 255, -215, -59, 158, -71, 86, -231, -175, 291, 82, -275, 59, 211, 34, -136, 66, 32, 74, 95, -1, -135, 150, 39, -30, -119, 141, 57, 82, 143, 19, 68, 152, -86, -66, -166, -32, -169, -337, 61, -59, 14, -47, 109, -106, 17, -155, 51, -57, -116, -83, -6, -143, 115, 92, 180, 25, 127, 85, 159, -81, 3, 161, 32, -93, -37, 16, 11, -90, -44, 105, 27, 98, 27, -155, 267, -62, 110, -3, -179, -27, -86, 41, -87, -137, -90, -206, 135, -125, 15, -60, -278, 175, -13, 23, -89, -27, 238, -77, 245, 104, -94, 349, 23, -8, -124, -9, -70, 193, 89, -182, -230, -54, 29, 53, -203, 114, 93, 63, 150, -128, 225, -66, 64, 65, 90, 180, -166, -160, -79, 142, -142, 159, 98, -45, -182, -141, 90, -79, 68, -15]
8068a5o4Q9J11j29l5j76J50Q7p2r0L3L62m45J54J58k6p5j8j77N5j47O26n58J6
8092a86L40k31L23m00K85N9j28P6o5k13R8k0O8j25P2K13k07M1J90p2m16J60J01
8115c7o8Q4N1M8K67m60K3J20m0K01l05J38l1j26J39m0O1J98k54KK29m04M0K70
8139A06j91J39k04J25j33J34J47r1n8M1j95K52l20K80Nk07J23JJ05k22K58j64
8161f9m0o7J59J08j62r5J90j94J44Q7n5l4J03l6Qp2o8K58o5ol46K90p6%r8K83
8187A47k57J68K9j98
$$ y = [-15, -79, 10, 121, -8, -43, -219, -69, 18, -54, -144, -111, 251, -194, -40, 118, 92, 17, -1, -178, -123, -270, 356, -202, -186, 154, -77, 246, -154, 131, 190, 62, 138, 73, -140, -42, -62, 6, -119, -47, 166, -41, 0, 190, 118, -298, -138, -37, -105, -21, 30, 78, 345, -115, -92, 28, -12, 189, -116, 22, -9, -135, 4, -36, 25, 223, -31, -29, 200, -204, -164, 106, -85, 54, -150, -25, -158, -24, 123, 32, -26, 15, -180, 72, -248, 32, 37, -170, -47, -46, 59, -163, 95, -69, -109, -176, -17, 91, -71, -166, 24, -170, -26, 61, 6, -28, 75, 39, 47, -25, -93, 165, 100, 94, -252, 38, -38, -38, -136, 147, -110, 58, 87, -111]
8191a11
$$ Imaginary data points
##PAGE= N=2
##DATA TABLE= (X++(I..I)), XYDATA
0@%%%%%%%%%%%qJ6j6J6k4L2m0M8n6P2q8J02j16J34j58J86k15K46k81L20l64M12
33B18m66N26n91O65p45Q30r24J026j138J263j398J545j706J883k076K288k519
50a319K773l057L371l720M113m558N067n655O340p153Q136r353J0903j2951J5789
65H726j9989K6825l9764P2351k98949n67697O65212K94407j18417K51372o3482
76B10595o37448N6112N18364j9267p3296J99365l24394l81657L90014L10298l26955
87g8269k4300K64237j78897j37060K95007k0627k76931J49193J80061j75559K4199
98B1054J32032k59283j17043L60130R5888k55695l733L7089j85596R1892L06248
109B22983p3570k19500J9604m7515p7314K36868J56689k37299j28440J15801k7392
$$ y = [0, 0, 0, 0, 0, 0, 0, 0, 0, 0, 0, 0, -8, 8, -8, 8, -16, 16, -24, 24, -32, 40, -48, 54, -62, 72, -86, 100, -115, 131, -150, 170, -194, 218, -248, 278, -313, 352, -393, 437, -487, 539, -599, 664, -734, 811, -895, 988, -1088, 1200, -1319, 1454, -1603, 1768, -1952, 2161, -2397, 2670, -2985, 3355, -3798, 4338, -5015, 5888, -7063, 8726, -11263, 15562, -24202, 48149, -250800, -818497, -153285, 141122, 22705, 274077, 210595, -426853, -370741, 147623, 128356, 55060, 254425, -69969, -451626, -61612, 248686, -78269, -102569, 161668, -17229, -154289, 140718, 120091, -156840, -7647, 172414, -3145, 21054, 153086, -106197, -223240, 136890, 232778, -22917, -26650, 10439, -175157, -83265, 222983, 149413, -70087, -50483, -97998, -175312, 61556, 218245, -19054, -147494, -31693, -59085]
120e9085j4903J94180O928k12025L370J07103n3751J9529J04808r6983r8643J26900
132B7428M6874j08873L1227O9661q7017j1086J09185m5491r9772O0226M0788n0986
144a7836M2397L6388j07859l4478J03688J4862m4701L4608j7544q9133L6052R2987
156D9431k5795l5532K2853l5473l2949P4594L7817o3008j2465K9319k5711K796
168a4123N7235j9676n7046K5795K8677k5304R852K1837m1479j6240M9169O900
180B5597l4084O538K313k5638K2609L8019k7259l2097J5933K728n501K9638O099
193B4895m2229r840K7703M987O64J2273j9112k6722J9987K4477q772m187M42j9644
207a5078k300K9906Q035k1003p019J304l178J3910J5285j6502j8061P138P649
$$ y = [-59085, -73988, 120192, 127120, -84905, -81535, 25568, -28183, -8654, 96154, -829, -99472, 27428, 74302, -34571, -3344, 66317, -20700, -31786, 77399, 31908, -67864, -7638, 33150, -17836, 24561, 60949, -46910, -81388, 22300, 37162, -7539, 27069, 9525, -79608, -43556, 49431, 23636, -11896, 10957, -24516, -57465, 17129, 54946, -8062, -20527, 8792, -16919, -14123, 43112, 23436, -33610, -7815, 20862, -4442, 5410, 27247, -14232, -30472, 18697, 25597, -8487, -1949, 364, -25274, -2665, 35354, 8095, -24002, -8069, -5341, -10842, 18796, 24895, -17334, -27174, 529, 5516, 6180, 18453, -659, -27381, -7394, 17083, 8311, 4124, 4566, -15078, -17378, 12528, 20563, -440, -7459, -6155, -9333, 4577, 19862, 3360, -14701, -7563, 86]
220H6J898J0022k591k2069l249J8900P214l948k695j0224p615J3068J3490n308
234F979p826m033n276N352J6220L83j5354o166M004M986P447L046j0583r473M569
249e725P600L428J610n737j0211J237J1502M638m191n139m963k50Q206N994l927
264D072o596k813J175N526O041l013q371k694M214M717K363j595n871l327L486
279b686N710J539k260m921k662L326N760J300l818l828p63K345M057R78l364l781
295c068l14K800L238Q17l205l562K62L271K326l6l052k457P8K790K968p09k467
312c20k227P60K478J936j160k623j207Q24K793R39j096k452p80J265K256N56j130
329H12j977o66J371K049J25j861j516J80J177J785j96j464j602L33J732J369m34
$$ y = [86, 1984, 12006, 9415, -12654, -15903, 2997, 10211, 6263, 3568, -6656, -14271, -1203, 12287, 6979, -847, -4880, -10156, -4804, 11416, 11799, -3555, -9721, -5717, -731, 6716, 9762, -821, -10294, -5725, 1875, 5303, 6913, 1176, -9035, -7798, 3704, 8342, 4151, -988, -5951, -6201, 2005, 7999, 4072, -2524, -5337, -4162, 1364, 7405, 4392, -3979, -6673, -2459, 2258, 4621, 3026, -2845, -6172, -2686, 3024, 4563, 2303, -2618, -5280, -1954, 3806, 5106, 1288, -2540, -3303, -958, 3099, 4077, 713, -3068, -3382, -582, 2656, 3473, 268, -3294, -3032, 239, 2565, 2529, -523, -2980, -2902, -112, 2856, 2147, -320, -2547, -1787, 691, 2627, 1467, -1156, -2363, -1539, 1254, 2193, 1097, -1355, -2135, -870, 1386, 1942, 812, -1165, -1831, -460, 1589, 1714, -147, -1663, -1483, -306, 1479, 1283, -181, -1783, -1450, 282, 1651, 1217]
346A217j823j207O36J790O37k43j749j110J110J823N41j074j415o40P37J980M31
363A641j545j444J2J092J393M39j295j785J55J502Q98J85r95j606m01K044J135
380A425o58q29j192j72J886J553p82k030l41N73J078J177o90j822q42J181J023
397E38O06j37j718j307J493J541J23n89r43j441Q65K385L85j835p30j73K57J406
415G26J059j616j437N58P88M85M77n37j930J25J756P72o53j91j314p88J836J445
433A561j105q35l70o07J156K037m44k184j85L39J44J382Q02k124r83J123L41K59
451C07O45p15j655P88J337qm37J67q22q02J625P15j412k67N08k43P7R70o86j237
471a145R39Q65l27o0K19j519k22J973J77r04Ol08m75P68J401j005p12L47q11q2
$$ y = [1217, -606, -1813, -1177, 613, 1250, 1007, -742, -1852, -742, 1081, 1622, 548, -867, -1507, -770, 1210, 1641, 96, -1348, -1336, -244, 1149, 1588, 293, -1492, -1337, 165, 1063, 1248, 253, -1353, -1754, 290, 1425, 767, -62, -1254, -1426, 460, 2013, 1231, -799, -1140, -567, 511, 1688, 998, -824, -1666, -485, 538, 1144, 1007, -711, -2018, -525, 1016, 1139, 550, -393, -1834, -969, 1416, 1801, -34, -764, -937, -680, 726, 1785, 169, -1268, -710, 78, 563, 1040, 503, -1427, -1302, 454, 1226, 573, 382, -932, -1720, 116, 1561, 456, -379, -749, -1356, -200, 1837, 1393, -791, -976, -637, -493, 889, 1691, -433, -1416, -293, 48, 307, 952, 237, -1418, -630, 707, 699, 262, 429, -393, -1195, 430, 1145, -267, -534, -26, -269, -192, 778, 92, -1145, -206, 659, 332, 272, 491, -1028, -1250, 723, 900, -4, 2, -306, -781, -13, 1388, 383, -329, 18, -793, -875]
491h75J471O32j545j37P08o77Q8J336q86j277J292K08r65P95M81q16k12J248m64
510D05j142Q60O6m96P81M22j413q72J643M2k58N33m26j210L99J394m90j77K40
529C01p01q35J385O18q59j34N03j097L84J065k41p99N91J64j073P49N33r53o6
548d65J121m30q49O18J27q17Q31Q97j170n51N57m50R0J531l49j432J2J027l73
567g5L04O13q30r73Q88O48n03J60M32j326j54J181J94r93M21J86q57N88J018j025
587a03n50M61J70j15M38j28p62L52P81m74N2M99r00o42R09P72o71K3m0p30J82
608d76R59P1q30Q2J06m31O11Q09j065n70O57L9m45R22l6j020J63P52m45K16K12
629B81m27o08R52Q0n67L61J61m08L6N04k6o34M30j72k72J66K99k74l60N83p3o4
$$ y = [-875, 596, 1228, -317, -454, 254, -423, -335, 1001, 115, -1162, 130, 338, -627, 168, 649, -167, -379, 869, 405, -737, 123, 189, -307, 474, 896, -517, -1389, 254, 296, 38, 571, 145, -1065, -666, 728, 238, 61, 301, -400, -1235, 150, 768, -91, -225, 278, -819, -435, 630, 389, -410, 181, 345, -728, 21, 554, -399, -465, 656, 226, -623, -5, 122, -695, 136, 1033, -137, -688, -131, -581, -491, 1040, 691, -741, -729, 298, -75, 229, 842, 12, -961, -73, 575, 72, 232, 664, -662, -816, 365, 559, -434, -13, 173, -684, -96, 922, -103, -653, -192, -22, -137, 301, 173, -589, -237, 544, 70, 122, 621, -279, -921, -12, 760, 89, 112, 72, -658, -476, 483, 554, -276, -194, -88, -519, 92, 901, -164, -734, -77, -38, -483, 439, 403, -617, -454, 298, -147, 69, 281, -146, -754, 198, 278, -289, 72, 233, -175, -139, 365, 339, -295, 135, -37, -309, -143, 156, -118, -478, 105, 32, -32]
651c2R6j67m02J42N28Nj80ll45M7M24J15m19J57J60k00K28J12j61k28J88J41k64
674e8J77J28l75q6N01j05l03P6j43k1J48L69r7k25p6J97o6K0Q1j51J34K46n67
697a96K38j91K61l23L41q6o4K00k28j69N2L71j89Ln1j00j55L40jk3l03K70o4L4
721c3L15k70j90L38K82k19l07J25j5j16N1K25j14k52J19L5L6nM8k20R2N8J95m12
745b34N8K47k02n6M24j31k30q0K20j4J42k07j13L22k37ML29k66j04j46K31l5L24
768B46k69K06N2k81P4J99P2n61L10k10K98j11Q6r2j70J45n8K84j19l76L8J36K87
791A86j66k5P1j32P4oj24J34j54l5J63K65m65J10j53J28Q3p5J41Pl34j2M92p7
815I6J82j81m9j14j6J10j9N6k70O5K9J2K43m02J3P2ro1J54J55j42k29N23q4k29
$$ y = [-32, 64, -103, -505, -363, 165, 170, -10, -13, -358, -311, 113, 228, -191, -34, 126, -74, 154, 266, 105, -123, 65, 206, -58, 119, 247, -128, -214, 287, 182, -121, -45, -188, -209, -61, 308, 211, -14, -90, 107, 41, 61, 142, -9, 125, 371, -196, 42, -149, 112, -211, 130, 44, -20, 180, -48, -217, -165, 206, 17, 20, -31, -131, -286, 54, 53, 30, -273, -3, -67, -33, 282, 12, -178, 160, 442, 223, -84, 41, 26, -90, -39, 186, 72, -180, -61, -26, 10, 5, 53, -167, -75, -17, 178, -234, -176, 71, -131, -187, 237, 106, -124, -204, 16, 2, 144, -63, -176, 146, -91, -87, 242, -24, -128, -274, -43, -78, 246, -23, 183, 235, -46, 28, 227, 299, -262, 48, -162, 136, 25, 111, 19, -151, -6, -64, 220, 101, -275, -237, -101, 186, 20, -5, 66, -66, 8, 2, -122, 12, -142, -177, -14, 251, -214, -104, -257, -129, -46, -121, 20, 27, -307, -319, 173, 96, 278, 97, 48, -66, -82, 28, 9, 65, -205, -140, -111, -99, 144, -258, -245, -173, -182, -243, -89, 66, -76, -305, 218, 134, -95]
840i5M0J08k29K23Q8k19l0K39q1j12K25k41R5O8k21J82P6k04L6J09j25K69J20
863C21j91l22%K54jj5n7j21p1J68P7k57J65j00J43J31o3Q9k61j43L5K00j12R6
887c5p3R9l07K05K63k40K1j43R0J9J21Kj74L5N9J24j28P1K22j54M6L5J16k00o0
912A4j6j68j07J73L1j6K00k99L22k98K85l03K5J09K29Ql54K75J7o0M8j43k6Q3
936B9r8J06K1qj33k93N09j67J53L0o8q2J50l22J38l7qm2K75j78k57M03k32M4Q9
961B2p2K45j38Q2o7j15P6k89K98j3JK07k84J52J05m4l21K79j25J27n8l78L71j58
985i7l0L4J67k20J21M2j24L08k53k1K89k89J45J0j40K9J05j8J35k16K18j00J00
1008A95Rj1J05j29m0j78j99L42P5r9j82O8j28J39Pk09J89K48ok26lP5j4l51L74
$$ y = [-95, -55, 53, -176, 47, 135, -84, -114, 125, 44, -68, 157, -84, 11, 79, -142, 40, 116, -88, -52, 57, -68, 201, 321, 130, -192, -192, 62, 61, 46, -11, -132, -203, -35, 42, -215, -50, -150, -7, 124, 61, 150, -111, -254, -219, -19, -131, -35, -108, -9, -316, -111, 152, -88, -67, -210, -120, -101, 20, 22, -152, -117, -58, 66, -62, 9, 231, 77, 123, 158, 274, 74, 14, -2, -170, -277, -104, -73, -89, 111, -188, 134, -164, 121, -182, -157, -48, 181, 189, -165, 110, 127, 67, 115, -28, -54, 29, -69, 37, 58, 50, -83, -376, 133, -34, 119, 149, 81, -1, 149, -173, -35, -72, -80, -122, 153, -25, -282, 121, -111, -67, 22, -50, 195, 57, 139, 72, -43, 33, -256, 42, 29, 30, 237, -47, 105, 210, 166, -155, 124, -1, 126, 68, -310, 61, -97, -127, -93, 74, -146, -25, 17, -107, 201, -52, -73, 216, -73, 72, 82, -58, -29, 76, 58, 193, -23, 195, 95, 195, 204, 193, 298, 169, 129, -49, -248, 94, 169, 70, -112, -44, -172, -33, -26, -235, -46, 202, 196, -30, -33, 42, 28, -323, 51]
1033E1j18p7M8K28l25J20P1K6q8J91l07J9O0J0P0J24j08j77L31k17K16k11J72
1056A09L8l16K49p5j33m0L60j35l22J65j9L78j2N1j90j53%K12p5k01J82lq3j47
1080a60M8K58k27K53r5j87R2j97J58M3M1nj21k13L53K16j62j54k6k85N78q6j53
1103c1J84l46K52j41J15J31j36N2j15K9j83L44j33o5P9m0Q0k29J44j69K35r2%
1126c5M4j41K90l73K04P4k24R6r0J58N4l7r8K98k61j95M08O1k98K20l25J48R3
1149G1p0r6K06k16P7q3K2L5J35l19M1J94j6N3L3j07J54K1J24n53K76k9j3J26j24
1174e8K7l7J43L6O8J2j35J40j95P3k8l9Q1o6K0p2J52l4l41L68k06J73l74N15r9
1199A24k23K05r1N0m8K2K4Qj48L3j9j65L24j55J05l9j31J16j29K35j92K1J73j21
$$ y = [51, -67, -144, -96, 132, -193, -73, -2, 24, -64, 127, -180, -161, -101, -91, -21, 103, -5, -182, 149, -68, 148, -63, 109, 147, -169, 80, 5, -128, -168, 192, 57, -265, -100, -119, 259, 247, 298, 108, -45, -45, 167, 92, -109, 73, 70, -13, -160, -112, 146, -81, 172, 77, -110, -18, -215, -57, -14, 27, 22, -99, -312, 41, 257, 95, -59, -85, -370, 208, 122, -31, 153, -193, 59, -82, 33, 164, 28, 80, -35, -6, -189, 155, 22, -43, 36, -4, 76, -153, -9, -178, 57, -35, -35, 9, -132, 158, -215, -11, 63, -161, -65, -155, 3, 57, 20, -78, 220, -41, -236, 172, 233, -65, 155, -170, -22, 71, 1, -95, 111, -105, -28, -111, -89, -54, 81, -238, -197, -3, -19, 34, 67, -40, 114, 135, 259, -294, -18, -47, -60, 66, -58, -31, -68, 75, 111, 179, 191, 56, 196, 1, 74, 46, 7, 88, 22, 42, -30, 122, 88, -253, 115, -91, 82, -292, 223, 124, -99, 106, 15, 65, 17, 39, 63, 71, -77, -44, -63, -228, 96, -59, 46, 7, -124, -8, -137, 98, -94, -73, 100, -21]
1223b1mQ7o1Q4J47l00Q5J59m57M16j21J65j37n2r2Q8J23O9j82L8M8j47P7j53J78
1248C7l11J06L28j93J17q4L8R5j52Jj18L54j98M3J50l36L15l0l21L59k39K11m13
1271b41M40l1k47L37r2k94Q0J03M6J03j32r8L1K12j90J69m43Q8J62P0k0k7M4k20
1295a50K09J16l3p6m8j19K05k42R7j48O4n1P6J23J4q2k20L97j83J71k46J15J81
1318A70k26n8q8nK68j40J34q7j0P3k71J15L07j71J02m1k46p3L05p0m0J32l9k7
1342A4j53l2J70j4J3J22j64K77j68k44j84M91j93J71l26L60J26k19j5k13K07j35
1364a09Q2K11j32J0k7l3m5K31k14NO9K88l88J8j3J87J70l54L10l43Q6M1j32O3
1388a9J0J89m4m3j8m0n7J24j02K7j33J57j82K0m8K37o4L1o5k3M1m3Q3LMlR1qJ19
$$ y = [-21, -25, 62, 1, 85, 232, -68, 17, 176, -281, 135, 14, 179, 42, -10, -102, -14, 109, 178, -4, 34, 82, -65, 12, -141, 37, -274, -168, 160, -33, 84, 0, 38, 133, -19, -18, -136, 218, 20, 63, 213, -123, 192, 162, -159, 200, -39, 172, -241, 199, 168, -79, 258, 166, -128, -48, 55, 101, 204, 72, -26, 5, 217, 27, 196, -247, -159, 3, 73, 53, 26, 70, -150, 59, 175, 142, 66, 18, -101, 104, -138, -41, -189, -125, -176, -100, 23, 37, -45, -265, 132, -51, 120, -126, -11, 170, -56, -114, -202, -207, 61, -79, 55, -32, -42, 31, -240, -125, 182, 11, 113, 72, -174, -247, 58, -12, -52, 80, 41, 14, -139, -171, -1, -15, -2, 120, -44, 233, 65, -179, -363, 128, -65, 106, -220, 140, 266, 47, 32, -181, 26, -109, -27, 184, 52, 62, 35, 2, -43, 188, -26, -21, 48, 336, -52, -34, -47, 140, 310, -44, 266, -77, 9, 50, -82, -19, -9, 180, 136, 93, 75, 35, -22, 102, 0, 27, -106, 51, -131, -111, -159, 78, 14, 45, -20, -43, -2, -45, 38, 41, 45, 42, 133, 125, 244]
1417B44k91J61o1j69K75j96J13k71J27K60m12J99L70j86J07o2k40q6j25O5J65
1438a3J90k27q0J52j37L00J07m84l4J99j45L58oj09j7p3mJ13Q3n1r3j1K11l33
1462a04J20LL4O3j85k6J25q9r3L29j61j17o1K20O7k51K17k77L18k61O1q0M12k43
1486B1j58J16L8M1p2r8Q6K3N2p6j7l4p0j46M49J31l08j99J10K7q5J29R7j00j85
1511b28K67J78l01o8R7j56L09q8N7j88J85o1J26j95m5K54j58J00J29j03m13N15
1533B13k67nR6L3Mj42j6k01K52J84k98j0N3K11O7j70Q2j66M9L8J06j59p6J26J87
1558A91j24j67K9K18j10Q4Kk24R0J93l10J67l7p7J18J4p2K33m10N0J63k18K84
1581H7j21p9K68r3k70K85q5M5n0p4K04j70J15j16k10J10L3%J18J38j54j2j24J59
$$ y = [244, -47, 114, 53, -116, 159, -37, 76, -195, -68, 192, -220, -21, 349, 163, 270, 208, -32, -118, -243, -178, -13, 177, -50, -130, 22, -115, 185, 292, -192, -226, -27, -172, 186, 180, 71, 54, -19, -23, 90, 173, 122, 29, 18, 229, -104, 16, 19, 53, 116, -69, -95, 30, -59, -152, 177, 16, -101, -162, 58, 125, -126, 91, -186, 132, -129, -68, -148, 264, 21, -137, -21, 17, 58, -14, -112, -26, -3, 49, -27, -44, -78, -148, -294, 155, 286, -22, -221, -111, -84, -169, -40, 57, -43, -228, 39, 217, -84, -152, -55, -211, 98, 10, 67, -121, 64, 3, 129, -66, -111, 143, -15, 85, 214, 111, -302, 213, -54, -59, 37, 70, 74, -68, -84, -285, -33, 151, -147, -157, -104, 107, 174, 4, 86, -80, -31, 7, 113, -46, -122, 4, 191, 67, -100, -71, 147, 37, 121, 123, -101, -11, 182, -128, 39, 2, -75, 43, 57, -15, 218, -192, -142, 21, -197, 87, -34, -113, 155, 62, -208, 77, -8, 37, -13, -87, 117, -53, 62, -54, -264, -154, -121, -121, -3, 135, -19, -31, -155, 4]
1605Dq2O5KK52j42k88J83K86k1m20Q2K7q0P7K55j50j46Q9O9j69J86L0j24p4M46
1630C57l33k58J61J23q9o2K38k92q0K70j04J8nl1K05p7%r7p0j9K53p5j94K16j69
1655a14P6n9K82q2m2J66n21L77R1j98j01Q2k6L8R0k25L12p3l1j75m8J69R7j46
1679f1J07Q5P6k95J88j06j73J17k76L98l2l9K51j93J26r8l3k04K93k69pr7L16
1702G4N0l74N34k51oj16J65k46K11j3R3j26l40J61j17M50p4k77L47j80k19M40
1724A86j66k86K05j04J78l1j8j46J50J47n5N1nk24j7J78j89L46o5j34j19K22J35
1747B39j78M0q3m0K3L7j0q8q7J6N0m7J23r8k9J44K53k80O9q6k5O9k64N90m75K97
1773A60l8j26j00m8L9n2R6R4K72n65K80j94K99k55Q3JOr7L37k39l2L3J21j51O2
$$ y = [4, -78, -13, -11, 241, 99, -189, -6, 280, 259, -161, -79, -52, -132, -55, 200, 50, -96, -7, 62, -107, 79, 109, -15, -89, 357, 24, -234, -73, 50, -39, -101, 137, -155, -235, 35, -69, -51, -56, -87, 118, 41, 41, -56, -126, -145, 108, 33, -161, 55, -114, -38, -97, 185, 103, 61, 227, -294, 83, 174, -24, -125, -43, -69, -31, 59, -166, 146, 73, 42, -133, -181, -12, 85, -61, 46, 131, 207, -88, 100, -6, -179, -62, -338, 60, 28, -11, 240, 47, 173, 75, 42, -162, 131, -138, -145, -242, 74, 124, -250, 284, 33, 27, -89, 76, -170, 41, 28, 121, -5, -345, -184, -301, 149, 75, -202, 145, -35, -254, 186, 20, -266, -61, -165, 13, -18, -36, -182, -32, 115, 60, 111, 106, -118, -135, 43, -146, 200, 135, 1, -118, 104, 239, 61, 101, 18, -22, 1, 38, 28, -60, -147, -131, -81, -128, -5, -103, -132, 12, 265, -15, 54, -32, -57, 12, -252, 338, -137, 160, 122, -4, -104, -152, -113, -165, -69, 25, 297, -268, 12, -182, 117, -138, -55, -54, -48, -145, 192, -47, -79, -46, 75, -76, -14]
1798a4K35j76p6mR0k7J30l26J43J19%J3L5l32p4L77j59j23K91j36j79J27r3Q4
1822g5o4P8K68l07K10q7n5J3n1J2J30l97O58l07J32j32K02j26j51J75l38K66n7
1845cj51N0j28L77q5O6k23j2j85K05J56k03J56p6K38k39r0K94q0p5M5j52J30O3
1869G8Q8p1j43n8J35k16K48N4k79N8J67k96R8J94p1k37J58M2J15oJ06k41J52l62
1893b87N41k23J56j55N5O3k47K25k38J29j21K0R8k44K73k6Q6q8O7J9j66R3j96
1916a66R4J80r7J19j2j39j7J61J82l87L06p3J77n07J15K9Q5O4j81K32k20J52j9
1939G8j69N0J25k38J09j29K42ol28L32j22O8J04j0K8j18k67M50k61K46M6l50o8
1962a88L43k06k6m9R7J71m14K65j02K1Q0m2N5l5J56n5L9l56J38J56O0J7o0l19
$$ y = [-14, 221, 45, -31, -35, 55, 28, 158, -168, -25, 94, 94, 107, 142, -190, -264, 113, -46, -169, 122, -14, -193, -66, -159, -75, -139, -61, 207, -100, 110, 23, -32, -19, -70, -58, 72, -325, 333, 26, 158, 26, 228, 102, -49, 126, -212, 54, -3, -154, -104, -232, 145, 60, 126, -97, -109, -294, -89, 67, -136, 20, -56, 182, -57, -147, 147, 67, -8, 37, -115, 15, 78, 166, 95, -48, -106, 29, -187, 61, 115, -164, -106, 61, -235, -137, 57, -14, -251, -93, -51, 64, 58, 164, -77, 75, -287, 254, 31, 187, 32, 87, 150, -97, 128, -110, 19, -102, -82, 16, -228, 45, 19, 105, 17, 84, 103, -63, 30, -166, -72, 108, 11, 130, 118, -21, -38, 123, 305, -82, 224, 151, 328, -179, -64, -35, 50, 114, -67, 165, -55, 97, 78, -91, -41, 84, -154, -45, -174, 68, 62, -266, 66, -56, 12, 116, 106, 134, 16, -251, 199, -62, 184, 230, -120, -188, 155, -51, -77, -126, -29, 142, -272, -7, -109, -88, -8, -50, 5, -30, 126, 71, 110, -246, -108, 48, 108, 125, 65, -254]
1986b54J98J8K5J3J32j62J8M5J78m67J49J46l8N4J84j05k02Q1r8J06J53n6j01
2009A7Nq3p6K29j07j37L01k11m5J28j07k39K12m4J07j7Q2K41m40L9K46j65j62
2032b26K85P7Nk00J15j35j7n7J89R4J66m24J38p3j46L91l51K31Qj20j51K50j46
2055i7J29J45l00P2r5K75k46k2K31l6p0k0L01k97J1Q9q1j5M6%n2j57K35j99J80
2080B7j38K14j43l6J48J71l03J62M6m8p3k29K97r0n0K34jj83q8N9N3n9K9o2L17
2105B54l10J22j0j59J62k50M2K72k84k1K31p8r2L18j97j43j0J11j55K65r4j07
2127a33KO3L4K47l47KJ71M8J49l12K31j7l7j62J43m7ml3J8j2K32j92p6Q5J75j84
2153D4k23J35j5K44m04L79j51q3J27k10L94j17p9r7j37N4J49J4j4L4l4l9j03K67
$$ y = [-254, -56, -38, -13, 0, 132, -30, -12, 33, 211, -256, -107, 39, 1, 55, 239, 134, -68, 13, -85, 21, 174, 118, 17, 22, -61, -137, 92, -15, -152, 149, -62, -107, 21, -86, -325, -113, -157, -50, -67, 15, 256, -184, -145, 101, -64, -226, 59, 136, 141, -59, 56, -79, -96, -153, 36, 130, 296, -128, 10, -63, -209, 182, -169, 62, 70, -50, -201, 49, -97, 32, 177, -123, -51, -146, 129, -117, -139, 92, 56, -14, -34, 267, -30, -19, 70, -11, -26, 20, 20, -32, -189, 46, -153, 27, -111, 103, -40, -76, 72, 243, -60, 102, 148, 100, 27, -202, 95, 5, -45, 189, 188, 5, -83, -24, 29, -30, -1, -63, 254, -56, 66, 56, -103, 59, -191, -149, 123, -161, -182, 49, -29, -121, 197, 0, -143, -153, -42, -197, 68, -26, -133, -131, -68, -34, 213, -134, -132, 39, 87, 236, -76, 155, 138, 101, -61, 82, 35, 31, -2, 16, 4, 236, 44, -32, 53, 228, 44, -179, -44, -59, 185, -219, 160, 9, -74, 53, -157, 237, 120, 41, -56, -193, -139, 10, 24, 10, 44, 10, -29, -132, 135]
2177A35j01j10qj23L37j20O4j30K76k39j35r0M4q0N46k52N3k26K14K6k22M72n96
2200b65J81N0K5O1r5o3n2n8K47P1q0j54O7K63n8k19j01L39k24m7J36j09l5M60
2224C40n50l7K87o0L4k5o6j04M79Qk55l6n3p2l6o0K96j23O6j64L10j50j61L40
2248B08j32J39j48j93J34R9j51n1K01r9R1r4j84J75k4n1n2J14P7J35p8p4P3J61
2272B76k73KL2P7j20j90L43j16j50M0K20l16L86k01Q3j05o8L64l69O6p3m0L57
2295B25k14o0J03K09j93K5j5K8j51l4j56K99j2J9k23O3k9J75l17K07K13o8q8J30
2319A36k1J17l47o8Q8n4J80k02J59N0j44J25K0o5k1n5J02m0K8q2J36j66j12K40
2343Dj52J55P1j37K84k91K95j43p4J8O1j32J62m09M04j96J64j68L43m34K34l25
$$ y = [135, 34, -76, -84, -207, 130, 10, 74, -56, 220, -19, -154, -244, -200, -280, 266, 14, 67, -159, 55, 81, -141, 331, -265, -84, -34, -9, 52, -43, -106, -158, -216, 31, 102, 22, -132, -65, 198, 140, -79, -180, 159, -65, -112, 24, -85, -120, 340, -210, -247, 40, -20, 14, -11, -77, -181, 298, 306, 51, 15, -38, -110, -146, -206, 90, -33, 33, -131, 179, 29, -132, 208, 76, 215, 67, -126, 8, 107, -44, -95, 106, 7, 98, 4, -180, -5, -29, -80, -132, -18, 59, 194, 116, 42, 115, 276, 3, 5, 37, 114, -6, -196, 147, 31, -119, -79, 141, -175, 211, 10, 93, -12, -80, 284, -85, -19, -92, -132, 225, 11, -49, 54, 263, 70, 95, 80, 108, -43, -77, -233, 66, 54, 73, -150, -87, -116, 59, -258, -51, 162, 94, 6, 136, 115, 232, -115, -183, -95, -149, 31, -171, -12, 38, -106, 19, 39, -26, -47, -102, 0, -40, -12, -94, 42, -124, -236, 4, -148, 7, 78, -59, 225, -66, 229, 86, 12, 30, 91, -41, 121, -288, 116, -80, 84, -84, 259, -175, 59, -266]
2365b66K30j47M0J46k13J57K9n8N3O7p4n6j2L%K87K0k33O7P1k21J24Q5p3j45K29
2391A10p5k91M53j03Q4k00J50O0j32j99K43k59J43r9K45k83J97j09l3J27k75K97
2413E1p7nl24L50L7M9k2J8r6q4J77k19J35J17j39p3P8J53J98p5j12j09j17L8Q3
2438C2M2k49L42k21O9Q0k11nJ12O8j65K35l10K89n9r9J20r0K6j25N9j23M58m29
2462a54M0m1N7R5j59N6J88k96J71R8j81R5P2lj53QJ83j62J29N9k57K73r0r5L40
2487B73l06j32K08J94k71p0K2L6J07j18J30J09l6l01M10j19r6K5l07M55l65K32
2509H0qJ00k35J10j3j55j66K89k23L03j70K13k40J72Q4k87J64l07L95k72R1o5
2531a40M16l09J35P0l10K52k33n7J63J59L3r5p4P4j86O4J14k66J21j14J5j40J35
$$ y = [-266, -36, -183, -143, 3, -210, -53, -24, -82, -29, 38, -36, -92, -104, -101, -101, 186, 206, -27, 40, 111, -110, 14, 99, 26, -119, 110, 35, -256, 197, 94, 178, -22, 128, 188, 56, -143, 100, -159, -16, -115, 130, -153, 44, -65, -98, 29, -246, 51, -26, -31, -355, -5, 32, 81, 59, 77, -19, -103, 74, -145, -10, 107, -32, -105, -27, 126, 324, 249, 137, 28, -89, -51, 32, 74, -175, 167, -54, 15, 95, -116, -121, -9, 59, -106, 129, -181, 108, 49, -50, 70, -20, 6, -119, -60, -183, 275, -154, -114, -155, -98, -3, -162, -106, 82, -214, -43, 55, -126, -31, 41, 38, -115, -107, 76, -86, 43, 102, -155, 118, 28, -67, 273, -33, -165, 43, 237, -34, -104, -82, -46, 61, -57, 73, 182, 146, -155, 255, 136, 40, 65, -242, 213, -152, 80, 72, 172, -63, 47, 34, -121, -287, 2, -221, 82, -88, 125, -115, 57, 141, -146, 18, -289, 106, -166, -75, -140, 276, -33, 102, 172, -138, 114, -119, -176, -13, 146, 179, 84, 10, 84, -102, -38, 76, -190, -69, -183, -168, -308, -173]
2554a73J83J75j90k6J10m8r1K98k92J50k24K85j68o5J60J64k6j2k99j2j01L36
2576A34j8k41L10k82q6J25J69k25J60oO7j57J4J05K01l99N6j03M06l7n6Nr9q8
2600d5NL06l40j58J43j63L67p6Q9k7lJ43l59J35oj19K17j05M6N1j21R3j79J41
2624C5l4j2j20K16K1J12j61j63K93l99K15J00k62K7o3L17j62L9k10J44L1J02p
2647E9J40k10Q1l6Nj96K36O0m04K75O2j43N7R8k6J1Q9p7k7J52n7j71j5l2K29k13
2673e3kJ02j71J04J5j61N9J51j45R5K2j6Q3j48K2N9k53K12R8k46K04j61P4m2M7
2698e1k03J74N2K4P5k70L25l35K88J01n1j57O2K22k60j8j43L16j88Q2M5j25J64
2721A29k07J64L5j25j23K97k4j46j2k2M9j1j02J82j22j10J78j63J56j33n4J88
$$ y = [-173, 10, 185, -5, -31, 79, 31, -60, 238, -54, 96, -128, 157, -11, -76, 84, 248, 222, 210, -89, -101, -202, 134, 116, -125, 185, -97, -183, -58, 111, -114, 46, 40, 107, -50, -36, 69, 270, -129, -73, -176, 230, 193, 137, 142, 43, -45, -40, 266, -74, -232, -89, -252, 115, 39, 128, 101, 98, 241, -118, 17, 11, -108, 109, 4, 50, 101, -20, 73, -106, 35, 1, -11, -131, 85, 106, 218, 57, -106, 187, -212, 3, 103, -159, -132, -195, 122, -40, -1, -211, -67, -36, 66, 59, 199, -11, 70, 34, 39, -157, 79, 139, -265, 10, 72, -71, -14, 84, 58, 69, 158, 81, 54, 206, 149, -22, -37, -69, 160, -53, -55, 47, -124, -20, -5, -166, -107, 44, -101, -6, 16, 0, 83, -65, -43, 16, -237, -25, 73, -173, 31, -130, -56, -98, -51, -254, -80, -28, -4, 71, -199, 126, -209, 79, 180, 129, -28, 34, 256, -4, -22, -165, 151, -37, 45, 90, -35, 129, -78, 86, 121, -4, -127, 170, 146, 0, -12, -34, 15, 4, -98, 84, -38, -148, 30, -133, 23, -110, -164, 24]
2743B4M9k57L58j25o6n7K37k1k60N2P2P4k31R3J92j91%M3o4J17J22j34l1j13J54
2768C7J88k26K65l45j16K24p4J24k07O8J16K30l11Q5rK2O6l79M18l92K62j96J82
2791C2j72K29J0J2J37j76j7r2jl9k99N88m2l46L8J48l6O8K20k57J01j35R0kJ44
2816B03j79K59k92k24L97k81J78p9J32L5j66R5j2J7m3K42m35o3M35Mk66R3k38
2839a88K06J32k71N1J25Q8r5j17Q7k58K38J4o2R9J4Mj84K82l17J1j8K6J67k26
2863a92J69Q4j78JL3J30k30J8J83k48J15J44J0j11J56p3l7j95L65r1O8l0o9j06
2887h4L86m91J80QJ64k00m4K52p1m4J24j56P1r1k09J82J16j29j46K73J3M9o9o2
2911B2j86J64nJ29k2j04J1j22K35L0l42L14r2j74JK09J38l18J16k36M33L7k62
$$ y = [24, 73, -184, 174, 49, -17, -74, 163, 142, -118, -66, 6, 80, -151, -58, 134, -57, -57, -14, -78, 39, 161, 27, -4, -117, 37, 225, -1, 264, -81, -197, 27, -47, 77, -130, -62, 54, 284, -27, 58, 49, 71, 137, -242, 176, -216, 46, -150, 32, -140, 89, 99, 111, 248, 72, 55, -37, -38, -77, -376, 212, 170, -176, -138, 10, -26, 42, 262, 5, 106, -29, 61, 59, 203, 24, 283, -9, -233, 164, -117, 61, -18, 114, 149, -17, 78, 66, 83, 40, 282, -153, -216, 219, 223, -43, 50, -188, 18, 150, -121, -70, 55, 143, 48, -69, 18, -240, -2, 12, -50, 49, 63, 67, -117, 165, -152, -141, -159, -133, 34, -192, -23, 61, -117, -116, -83, 47, -183, -165, 18, -230, -115, 29, 39, -72, 84, 11, -26, -221, 144, 53, 121, 91, 22, -84, 302, -189, -9, -1, 163, -37, -81, 171, 100, 56, 180, 24, 95, 4, -205, -23, 93, -36, -182, 91, 104, 153, 84, 22, -164, 0, -5, 124, 102, -2, 9, -113, 122, 152, -190, 124, 32, -142, -141, 68, 206, -112, 4, -232, 201, 238, -24]
2934b4N7j61K43k05J1K07rn2k92J83R1j87RJ35k30M17l70J25k9j03J99r8Q6P4
2958G7k53J76r9r0O2j75M45j05l9N1j05J40j53k5k41M58j01J5j81J51R0R2j94
2981dJ40o8j00k27K52R4J6l8q4k98L17r8J21J15j43m2J62j25J42j00j45j39J75
3004g7J31J01j23L4j06J58k92J82k21k3M7O0Q3j04K06J16q9P3q7QJ05j49j02K99
3028B30k56K82q3l33L1j55M43n47N77P0k38Qj7L3q4P2n0K74m8k80O6m5j04K69
3052A15m7l6q7K00k0R4j32L46m71j14L22k01q7Q8j24L9J42J23q8j61o5L36k61
3075h9ol1k5j24L81j75j06K45P6m1q4N4k19p3J63N4J11k10J70O3l03O9l3j5L15
3100A67K0k69N0J06p0m7q4R3J03J9lJ39p3l23R2M01k65j02J1J93j89P0j0j13K48
$$ y = [-24, 33, -128, 115, -90, -79, 128, 119, 67, -225, -42, 49, -138, -129, 6, -224, 193, -177, -52, -81, -184, 15, -83, 3, 77, -176, 0, -99, -189, -127, -302, 143, 38, -1, 50, -55, 85, -68, -93, -334, 124, 23, 38, -143, 8, 98, 190, -4, 136, 68, -32, -259, -7, 87, 103, 65, -19, -317, 0, -98, 23, 138, -5, -47, 115, -10, 132, 32, -113, -252, -77, 54, 155, 32, 66, -40, 118, -174, 8, -213, -236, -189, -129, -46, -150, 56, 172, 83, 156, 69, 77, 182, 33, -69, 230, -26, 256, 173, -160, -129, -284, 159, -388, 189, 259, 21, 29, 12, 45, -39, 33, -17, 257, 209, -71, -5, -50, -154, 115, 68, 32, -55, 145, 125, 219, 87, 433, -38, -152, 170, -31, -118, -30, -154, -115, 27, 150, 62, -99, -164, 172, -89, -95, -126, -151, -275, 106, -69, -175, 70, 146, 105, 21, 75, -144, -217, -54, 0, 111, -99, 71, 134, -169, -100, -133, -148, 167, 187, -82, -32, 74, 4, -43, -127, -34, 69, 88, 85, 224, 151, -172, -80, 321, 56, -46, -35, 158, -31, 39, 29, -84, 164]
3125A64m97L75k05O9J82j3k9j76K90k52J56m1j66L26l12J13O0l93L01J17nJ30
3147A94k93J90k44J94j7j72J77Q9j45q7j78K22j45L20L9k44p4R1J98m9j23K05
3169A48j10j80K85j09j2k3l77M39j21oJ88Ol42J28M2J15j36j11J37j3K8l5K1l3
3193g1L94l48j2P8k1k47J78K19j81L74m90J21j34J39M5Q9o6r6j46K10O2j20m8
3216g1j36J86N7j28J25l0j21J35j08J55o0j13O4R7r0M40k79m50L50L8K6rk93Q0
3240a35J71L0l71J11P7L25k70n0mJ60j78L24k60nO6M6L1j69P7J16mk04R7L6j31
3265a14kO6K38j95l2Qj18K58P8J4j63j82K03J11k81K44j51j48J37j08k04M80k53
3288a14K44Mk2o6j07J57J0j41J51j38L1l2R1p6M4K56k47J02m39M58l6L0k72M1
$$ y = [164, -333, 42, -163, -94, 88, 75, 46, -130, 160, -92, 64, 23, -143, 183, -129, -16, 44, -349, -48, 69, 64, 194, -99, 91, -153, 41, 24, -148, 29, 118, -27, -114, -292, -70, -215, 105, 144, -100, -174, -83, 115, 66, -57, 148, 38, -142, 143, 34, 22, -1, -378, 61, -60, -66, 122, 128, -214, -86, -44, 71, -65, -176, -39, -52, -24, -59, -38, -71, 323, -25, -37, 41, 20, -227, -49, 170, -11, 363, -127, -6, -140, -1, 44, 133, 67, -29, -175, 35, 97, -23, -71, -207, -21, 36, -92, 33, 3, -118, 17, -91, 64, 4, -109, -45, 52, -38, 402, 123, -327, 23, 61, 87, 78, -215, -135, 36, 66, -305, -194, -117, 208, -62, -112, -116, 44, -134, 190, -70, -75, -9, 37, 68, -101, -24, 92, 88, -116, -19, 17, -114, -116, -50, 188, -7, -39, -31, -149, 109, 187, 201, 38, -144, 59, 170, -111, 133, -18, -166, -29, -137, -341, 139, -114, 130, 134, 112, 46, -61, 96, 106, -35, 116, -22, 9, -23, 68, -8, 36, 292, 45, 147, -292, 166, 130, 160, -112, -71]
3312g1J9J73J62l51M8PJ0k61J58N2JpN5j38p5Q7O1K35K5m13K25j07J03j40K09
3337F7L25k67rj99RK33m01K39j7O9j39J80q9j8R3j08K16Rk29J13j57N5K57j39
3361I3K32n22M82k94q3M1K05j11j68P4pR4L7j56J42N0R8k93L5O5M7o3J63j20p5
3386c4j78J97L29l28K07k86O5N9k0R8k0j84K58l14L61k35j13K72L7j09j48K03
3408A17k11K28P3m14J34K33m43J79p5J24n3K09j11K2j76R4J94k06K4j57K77j84
3430a22N2K36l03J85K75k93Pl51M15MO7l47J58R7j85k2J00J26j17J12o2P5m7l18
3454b58K41j3kJ26n7K36j84j78j15L60k73M13l42o0p9K41Jj88J30j82J52O7R6
3477A32m47L87j68j18M00j91R0o9J10r7j51oJ04J39j49K19j12j74o3J39QN3q0
$$ y = [-71, -52, 121, 283, -68, -20, -13, -3, -264, -106, -54, -53, -60, -5, -143, -218, -131, -70, 165, 190, -223, 2, -105, -2, -142, 67, 392, 125, 116, -83, -74, 159, -242, -3, -20, 49, -90, 90, 1, -17, 76, -32, 184, 193, -36, 77, -80, -25, 232, 93, 325, -197, 285, -9, -92, -51, 154, 43, -125, -51, -58, 36, 73, -83, 59, 109, 207, -86, -51, 14, 61, -2, 161, 41, -34, -212, -15, 314, -14, 193, -93, -28, 31, 11, 109, 89, -95, 163, -151, 210, -25, -138, 134, 171, 62, -86, 117, -94, 134, 207, -207, -73, 160, -283, -104, -179, -55, -108, 101, -10, 12, -164, -70, 124, -82, -58, -215, 62, -122, -70, 166, -137, 48, 323, 30, 37, -314, 101, 105, 172, -175, -17, 80, -105, -127, -27, 99, -18, 94, 32, 107, 60, -258, -17, -30, -32, 94, 37, 273, 89, -89, -204, 156, -117, 296, -46, -106, -185, 56, 57, -131, -1, -183, -31, 36, 132, -315, 72, -96, -214, 186, -5, 85, 16, 126, 29, -122, -128, -24, 115, -34, 185, 73, -101, -164, -25, -17, 36, -44]
3500d4J35r1L6j95J36J55j48K0Q2k0L9p4k94K37r5K54j10j0J59j83J8n0j37K33
3524E3j04j7o2M5L27k75o6L8j49K49j62Q7k54K37K75l38N6Q7j18J20r9J47j38
3547f1M8K93l41Q3K08l12J45Pk49J69p0j1N6J43k32K78N5J4j43J03j50Mq9L29
3571B77k73j68K03j08O4k21K99J20j70j26P5J27j55r7Q9K05m04L31l28K50Q8n3
3593B5J64l64J85J39R1j98j31J31n9k95N08n7j81K91k39M0KK55l59J71j47o9M3
3616e4n5J67o0j72J74j3J94m80N0K74J19k7l04L05l25J40J83o5M8K11n70L61q
3639I3j35K59l07j28J62K8kP8P5j07j68L80k03o3o9J99l69M10q7k13n4L47j97
3662g1J77j81Q3l3j61J57L9k1L9n0J94p2q2k2j32J55J88k43J37l1l7q1K56m4k24
$$ y = [-44, 91, 0, 36, -159, -23, 132, -16, 4, 86, 66, 105, 31, -263, -26, -121, 133, 23, 13, 172, -11, 7, -43, -180, 53, -51, -68, -130, -85, 242, -33, -99, -61, -210, 39, -123, -36, -290, -53, 222, -116, -60, 27, -91, 29, -70, 77, -61, -13, 280, -61, 22, 230, -82, 63, 70, -179, -10, -80, -91, -35, 108, -124, 154, 209, 223, 80, 183, 33, 37, -52, 277, 4, -164, 39, -69, -5, -226, 73, 193, 23, -103, -28, 99, -56, -153, -64, 141, -263, 68, -260, -10, 78, 25, 189, -175, 10, 149, 240, 42, -89, 42, -17, -312, 196, 139, -42, 249, 10, 50, 52, 307, -52, 119, -28, -97, -54, -109, 58, -2, -174, 0, -13, 181, -299, -249, 25, 144, 117, -187, 118, -207, -67, 116, 51, 99, 310, -260, 101, 93, -42, 217, -90, -218, -56, -28, -30, 48, 123, 16, -152, 228, 25, -38, -107, 92, -277, 133, 46, -167, -221, 126, -71, 106, -75, 8, -25, -186, -29, 10, -11, 28, -22, 172, 100, 18, -4, -136, 19, 207, -36, 101, 70, 33, -48, 208, 164, -60]
3687f0L47l94K43j97R7q1q5J45n0j0P2j45L11O4k21k47J56j20J24j24R4r2k14
3710c87M88k96L1L22n23L73J4j20J67q2K79j90q5j16N5J56k9j53j16Q4K97k22
3732e3k6K31j41j3J97k56k8M2O2J01k57O4oq1J79P8j15J61k98M4K99q8j91J68
3756G3Nn3j00J92n8k26K10O9j36Kj13J17k9q3r9O6J25L7J04K3k05n0j8J9L51j81
3782D2k68J42Q4J04k48K63n0j09J5j84K33L5n4J47k58p8M0J09PJ17N2P9k22j7
3806a9N8j67K44j69K1L7kK25k69P2M0m7m7j20K51j37Km8K16j31OQ9Jl12K30n8
3832c4J9P6P7l73M40k31J12j44Qj13J59j83J89J76k32J31k38J76J27l6j3Q6p4
3855A05j65J04j21L6L9j01M8J60k0qj35j62J09K45k59M2Q0j47R4M4J04j85K72
$$ y = [-60, 287, -107, 136, -61, 36, -45, -130, 15, -35, -45, 27, -118, 193, 257, 36, -211, -55, -175, -51, -175, -81, -173, -387, 101, -195, -164, 158, -365, 8, 22, -98, 69, -13, 266, 76, -9, -125, -70, 86, 57, -96, -212, -128, 169, -53, -79, 152, 11, -2, 195, -61, -89, -47, 15, 116, -141, -77, -83, -164, 15, 93, -22, 139, -159, -115, 184, 96, -95, 73, 78, 25, -75, 117, 59, -167, 43, 112, -24, -22, -135, -18, -47, -130, -229, -163, -38, -1, 103, 126, -79, -129, -147, -128, 223, 42, -226, -84, 0, 104, -144, 119, 69, -40, -25, -209, 24, 59, 5, 152, -106, -184, -144, -35, -28, 89, 141, 220, -2, -19, 39, -128, 116, -53, -32, 5, 3, 228, -41, 31, 71, 24, -23, -143, 108, -29, -27, -75, 141, 10, 16, 105, 106, -206, 24, -34, -15, 61, 138, -235, 205, -26, 86, -58, -50, -163, -4, -187, 2, 178, -54, 77, -161, 15, 142, 106, 93, 179, 105, -60, 44, -77, -41, -2, -103, -55, 105, 85, 77, -58, -220, -111, 134, -125, -83, -3, -150, -56, -12, 92, -93, 179]
3878A79q4l37N91m99J40J49r3N5R1o2j26j7J1L8j49L74j88J21l04K54J3j90j6
3901d9J04kj5n0J85m3p7M1l1j44r7J95K39l01j55K37R4j15j80K50k26K33P4Mq3
3926H8n8J48N3j68l9J76l68K79r6%J28p2J05l2m17L35r9J00k0p0N6j61K26j64
3950g0J41k33M1PK33J0o2j80K02L8l37J63J56j77j12J1K29j73J16J21l98K63%
3973a1mJ01J19k76Q5M4k03R2l2K0k6J87j69J1J96o8J36l12O9k09K91o3K1J93k73
3998h1N0k45L10Lj55J69k36K47J8k10K20o9PN1J13m46L68j74J63Ok95k7J31M0
4022d2j87J93k7M9j7J32P1K3k28n2M67m53J85K9l32L38P8p3k27K62k66R5J81j39
4046F0q1L8R3j38J27k41K17k45k6O0N8q7J17q9J84J50k47nJ07j09J66j85J0N1
$$ y = [179, 95, -242, 349, -150, -10, 139, 46, 101, 192, 130, 4, -13, -2, 36, -113, 261, 73, 194, -110, 144, 157, -33, -49, 55, 53, 38, -12, 173, 130, 53, 94, 63, -81, -178, 17, 256, -45, -200, 37, 131, 16, -164, 86, -140, 93, 167, 171, 88, 30, 178, 231, 63, 24, 200, -168, 111, 15, 15, 143, 71, 176, 144, -273, 62, -37, 63, 43, -27, 29, -132, 94, -70, 71, -162, -121, -114, 119, 129, 67, -113, 89, 127, -210, -47, 109, -68, -180, -169, 60, -113, 3, 124, -274, -11, -11, -15, 86, 205, -71, 14, 58, -145, -53, -85, -65, -91, 96, -73, -62, 134, 66, 202, -110, -41, -250, 41, -22, -1, 192, -81, -31, -276, 34, 37, -118, 51, -185, 62, 80, -130, 90, 21, 28, 79, 192, -254, 114, -60, 103, 109, -186, -213, -82, -42, -229, -36, -63, -14, -31, 101, 172, 195, -33, -85, 382, -71, 114, 143, -189, 149, 227, 154, -73, 189, -77, 18, 199, 60, -21, 17, 110, -28, 99, -142, 75, -170, -196, -136, -78, -165, -48, -137, 47, 197, -50, -55, 52, -57, 109, -76, -66, -15]
4070a5J41j50m3J39k74L68j01J83l08J35L1j74j22K69j66K60j14q3n1j0J87o5
4092C7k16J83J84j51j8n9K04m51M22j2j10l47M01k51R3J00N4J1q9l8R2K02n02
4115b61M15j65n7j3R7j7o2K43l39R9J3J3J35K07j28m95J36J37K5J30N9l02n9J62
4139b7K50l06M43k08j05j72J36N7n9J06k55j08K67j21J08J71l76M87r0J0l77j09
4161b78K93R6k59K39n7k80L66Q9p0k63N4Q9j5L08m53J64lQ1k57LL00j88mKk5K37
4187A69k06J11M8j80L03m53K54k2j9j35M2K50rj60Lj93L80P0k80L29k09l1j94
4210a32M9K02j37j68K24m3%j62n9K58j82K71l05J27j07J39J33o9r4m6j39J82J93
4233A35j96J29M6j56J76q5j03K6L11m28P2q9J41K56l91R4M0nJ12j41n9J55KNj65
$$ y = [-15, 126, -24, -67, 72, -202, 166, 65, 248, -60, 75, 106, -68, -190, 79, -87, 173, 59, -24, -75, -85, 102, 37, -179, 4, 188, 37, 19, -40, 164, -287, 135, 123, 13, -334, 67, -184, -91, 9, 63, 74, -15, -53, 39, 241, -261, 154, -11, -68, -81, 16, -1, -63, 180, -159, -60, -47, -34, 101, 308, 180, -315, -179, -42, -17, 113, 172, -130, -189, -27, 223, -83, 360, 152, 47, -125, 11, 68, 9, 115, -140, -248, 19, -102, 6, 177, -199, 288, 198, 208, -169, -278, 15, 111, -148, 91, 34, -246, 120, 209, 139, -124, -70, 19, 4, 312, -141, 23, 20, 101, -156, -153, 147, -41, -45, -43, -68, 169, -37, 74, 122, -58, 245, -208, 46, 24, 5, -130, -88, 162, 153, -7, -4, -197, 183, 253, -27, 302, 93, 62, -132, -83, 119, -18, -186, 38, -5, -5, -167, -226, 32, -150, 121, -184, -57, -164, -25, 108, 39, -55, -101, -240, -58, 135, -61, 68, 114, -42, 134, 49, -54, -28, 283, -145, -73, -162, -21, 235, -156, -62, -22, -27, 85, -56, -115, 40, 42, 47, -118]
4258a18J34k9J10k02N1K2nrJ39q4q0m1L8J17k4j14o4J97p0L5J27j9Nj62Q8q8p7
4285a23K82j19J16j87jj03L91j64l5J44j79j40J67J17j57j15O5k1J86l93K24J1
4307c4P1Poj72K05n9j26K53k04J88oJ1q4k1J36j32j76J4k97M45j35K58k22L37
4331B51k34j68J72r3P5m6qO1P3j70j2J16o7J14Lj11O1R8j23j30M2K15M6l43K50
4356G2n0M4P3j69j97R9K22j09j32J84q3K9q8M31m03J92j55k09J76J27L0K2k34
4379a28J59M3j65o3L10j83K78l49k68K99J52k32K24N6q9R0k28J43p0k1j56K18
4401B0l1p1R4p2j16K60j28j03L25k65J90j57j64L59n1j24J30j18j3j50L26j64
4423b3l7J22J08L4np5k47K82j54m4O9J01nm20L26j6j12j93K7qL30r4o7P6j8j17
$$ y = [-118, 16, -13, 97, -105, -54, -32, -37, -46, 93, 9, -71, -112, -74, 43, 19, -95, -159, 38, -32, 3, 130, 111, 116, -46, 42, -46, -123, 159, 40, 156, -31, -32, -135, 256, 92, 57, 201, 22, -118, 49, 166, 9, -106, -41, -62, 124, -269, -45, -34, 37, 44, 38, -134, 71, 12, -114, 139, -65, 123, 117, 128, 44, 23, 159, 27, -149, -135, -432, 13, -122, 136, -86, 251, 17, -151, 21, -72, 3, -43, -51, 10, 83, -87, -99, 17, -50, 64, 67, -44, 17, 115, -8, -138, -96, 119, 165, -178, 72, 22, 66, 139, -30, -227, -128, 94, -15, -147, 37, -46, -17, -105, 326, -77, 115, -40, -249, -73, 54, 84, 106, -128, 31, 74, -91, -154, 156, -27, 251, -98, -366, -67, 85, -147, 77, 133, 44, 134, -94, 49, -21, -42, -198, 20, -11, -82, 12, -60, -176, 84, -44, -147, 178, -87, 103, -54, -218, 141, 90, -34, 96, -22, -35, -185, 141, -23, -60, 62, 170, 204, 199, 124, -123, 159, 5, -39, 30, 131, 126, -294, 32, 16, -96, -289, -262, -270, 60, -34, -101, -25, -43, -160]
4449a60K56j17j50J62l2k8m2J59j91L56r3k37K98k23O4N7p5r1j26J85R2L7k6o7
$$ y = [-160, 96, -21, -171, -9, -41, -69, -111, 48, -143, 213, 120, -117, 181, -42, 22, 79, 4, -87, -213, -28, 64, 101, 75, 8]
$$ [...]
8191a03
##END NTUPLES=NMR FID
##END=
