##TITLE=1H_LR-747-V1-M1
 CDCl3
 8 sc, 
 10.03.2022
##JCAMPDX= 6.0         $$ Bruker NMR JCAMP-DX V2.0
##DATA TYPE= NMR FID
##DATA CLASS= NTUPLES
##ORIGIN= UXNMR, Bruker Analytische Messtechnik GmbH
##OWNER= root
$$ XWIN-NMR		Version 3.5
$$ Thu Mar 10 11:41:43 2022 Russian Standard Time (UT+4h)  she@DPX200
##.OBSERVE FREQUENCY= 200.131346
##.OBSERVE NUCLEUS= ^1H
##.DELAY= (6, 6)
##.ACQUISITION MODE= SIMULTANEOUS
##.ACQUISITION SCHEME= undefined
##.AVERAGES= 8
##.DIGITISER RES= 18
##SPECTROMETER/DATA SYSTEM= spect
##.PULSE SEQUENCE= zg30
##.SOLVENT NAME= CDCl3
##.SHIFT REFERENCE= (INTERNAL, CDCl3, 0, 15.7039)
##AUDIT TRAIL= $$ (NUMBER, WHEN, WHO, WHERE, WHAT)
$$ ##TITLE= Audit trail, XWIN-NMR		Version 3.5
$$ ##JCAMPDX= 5.01
$$ ##ORIGIN= Bruker BioSpin GmbH
$$ ##OWNER= she
$$ F:/spectra/data/she/nmr/H-F/1/audita.txt
$$ ##AUDIT TRAIL=  $$ (NUMBER, WHEN, WHO, WHERE, WHAT)
(   1,<2022-03-10 11:39:14.15 +0400>,<she>,<DPX200>,
      <created by zg, POWCHK disabled, PULCHK disabled
       configuration hash MD5:
       00 E9 B6 7A A2 85 ED C7 34 08 36 98 17 FE 4E 26
       data hash MD5: 16K
       60 93 15 78 FD 4F EF 5B 39 80 AF 50 50 41 19 77>)
$$ ##END=
$$ 
$$ hash MD5
$$ 34 17 8D 7E 7F 4B 3D 27 2C C4 F7 C9 A1 75 40 A2
##$RELAX= 
##$RELAX= 
##$RELAX= 
##$RELAX= 
##$RELAX= 
##$RELAX= 
$$ Bruker specific parameters
$$ --------------------------
##$DU= <F:/spectra>
##$EXPNO= 1
##$NAME= <H-F>
##$PROCNO= 1
##$TYPE= <nmr>
##$USER= <she>
##$AMP= (0..31)
100 100 100 100 100 100 100 100 100 100 100 100 100 100 100 100 100 100 
100 100 100 100 100 100 100 100 100 100 100 100 100 100 
##$AQSEQ= 0
##$AQ_mod= 1
##$AUNM= <au_zg>
##$AUTOPOS= <>
##$BF1= 200.13
##$BF2= 200.13
##$BF3= 200.13
##$BF4= 200.13
##$BF5= 200.13
##$BF6= 200.13
##$BF7= 200.13
##$BF8= 200.13
##$BYTORDA= 1
##$CFDGTYP= 0
##$CFRGTYP= 5
##$CHEMSTR= <none>
##$CNST= (0..31)
1 1 145 1 1 1 1 1 1 1 1 1 1 1 1 1 1 1 1 1 1 1 1 1 1 1 1 1 1 1 1 1 
##$CPDPRG= <>
##$CPDPRG1= <>
##$CPDPRG2= <>
##$CPDPRG3= <>
##$CPDPRG4= <mlev>
##$CPDPRG5= <mlev>
##$CPDPRG6= <mlev>
##$CPDPRG7= <mlev>
##$CPDPRG8= <mlev>
##$CPDPRGB= <>
##$CPDPRGT= <>
##$D= (0..31)
0 1.2 0 0 0 0 0 0 0 0.06 0 0.03 0 0 0 0 0.0002 0 0 0 0 0 0 0 0 0 0 0 0 
0 0 0 
##$DATE= 1646897953
##$DBL= (0..7)
120 120 120 120 120 120 120 120 
##$DBP= (0..7)
150 150 150 150 150 150 150 150 
##$DBP07= 0
##$DBPNAM0= <>
##$DBPNAM1= <>
##$DBPNAM2= <>
##$DBPNAM3= <>
##$DBPNAM4= <>
##$DBPNAM5= <>
##$DBPNAM6= <>
##$DBPNAM7= <>
##$DBPOAL= (0..7)
0.5 0.5 0.5 0.5 0.5 0.5 0.5 0.5 
##$DBPOFFS= (0..7)
0 0 0 0 0 0 0 0 
##$DE= 6
##$DECBNUC= <off>
##$DECIM= 32
##$DECNUC= <off>
##$DECSTAT= 4
##$DIGMOD= 1
##$DIGTYP= 9
##$DL= (0..7)
0 120 120 120 120 120 120 120 
##$DP= (0..7)
150 150 150 150 150 150 150 150 
##$DP07= 0
##$DPNAME0= <>
##$DPNAME1= <>
##$DPNAME2= <>
##$DPNAME3= <>
##$DPNAME4= <>
##$DPNAME5= <>
##$DPNAME6= <>
##$DPNAME7= <>
##$DPOAL= (0..7)
0.5 0.5 0.5 0.5 0.5 0.5 0.5 0.5 
##$DPOFFS= (0..7)
0 0 0 0 0 0 0 0 
##$DQDMODE= 0
##$DR= 18
##$DS= 0
##$DSLIST= <SSSSSSSSSSSSSSS>
$$ [...]
##$SUBNAM2= <"">
##$SUBNAM3= <"">
##$SUBNAM4= <"">
##$SUBNAM5= <"">
##$SUBNAM6= <"">
##$SUBNAM7= <"">
##$SUBNAM8= <"">
##$SUBNAM9= <"">
##$SW= 18.0517287032376
##$SWIBOX= (0..15)
0 0 2 0 0 0 0 0 0 0 0 0 0 0 0 0 
##$SW_h= 3612.71676300578
##$TD= 16384
##$TD0= 1
##$TE= 0
##$TE2= 300
##$TE3= 300
##$TEG= 300
##$TL= (0..7)
0 120 120 120 120 120 120 120 
##$TP= (0..7)
150 150 150 150 150 150 150 150 
##$TP07= 0
##$TPNAME0= <>
##$TPNAME1= <>
##$TPNAME2= <>
##$TPNAME3= <>
##$TPNAME4= <>
##$TPNAME5= <>
##$TPNAME6= <>
##$TPNAME7= <>
##$TPOAL= (0..7)
0.5 0.5 0.5 0.5 0.5 0.5 0.5 0.5 
##$TPOFFS= (0..7)
0 0 0 0 0 0 0 0 
##$TUNHIN= 0
##$TUNHOUT= 0
##$TUNXOUT= 0
##$USERA1= <user>
##$USERA2= <user>
##$USERA3= <user>
##$USERA4= <user>
##$USERA5= <user>
##$V9= 5
##$VALIST= <valist>
##$VCLIST= <CCCCCCCCCCCCCCC>
##$VD= 0
##$VDLIST= <DDDDDDDDDDDDDDD>
##$VPLIST= <PPPPPPPPPPPPPPP>
##$VTLIST= <TTTTTTTTTTTTTTT>
##$WBST= 1024
##$WBSW= 4
##$XGAIN= (0..3)
0 0 0 0 
##$XL= 0
##$YL= 0
##$YMAX_a= 145163
##$YMIN_a= -250704
##$ZGOPTNS= <>
##$ZL1= 120
##$ZL2= 120
##$ZL3= 120
##$ZL4= 120
##$ABSF1= 10
##$ABSF2= 0
##$ABSG= 5
##$ABSL= 3
##$ALPHA= 0
##$AQORDER= 0
##$ASSFAC= 0
##$ASSFACI= 0
##$ASSFACX= 0
##$ASSWID= 0
##$AUNMP= <proc_1d>
##$AZFE= 0.1
##$AZFW= 0.1
##$BCFW= 1
##$BC_mod= 2
##$BYTORDP= 1
##$COROFFS= 0
##$CY= 11.3945322036743
##$DATMOD= 1
##$DC= 2
##$DFILT= <>
##$DTYPP= 0
##$F1P= 2.36226072786647
##$F2P= -0.459571619588291
##$FCOR= 0.5
##$FTSIZE= 0
##$FT_mod= 4
##$GAMMA= 1
##$GB= 0.15
##$INTBC= 1
##$INTSCL= 1
##$ISEN= 128
##$LB= 0.24
##$LEV0= 0
##$LPBIN= 0
##$MAXI= 10000
##$MC2= 0
##$MEAN= 0
##$ME_mod= 0
##$MI= 1.114404
##$NCOEF= 0
##$NC_proc= 0
##$NLEV= 6
##$NOISF1= 3.799351
##$NOISF2= 2.8
##$NSP= 1
##$NTH_PI= 0
##$NZP= 0
##$OFFSET= 15.70392
##$PC= 1
##$PHC0= -16601.7
##$PHC1= 30.40078
##$PH_mod= 1
##$PKNL= yes
##$PPARMOD= 0
##$PSCAL= 0
##$PSIGN= 0
##$REVERSE= no
##$SF= 200.130013532006
##$SI= 16384
##$SIGF1= 3
##$SIGF2= 2
##$SINO= 400
##$SIOLD= 16384
##$SREGLST= <1H.CDCl3>
##$SSB= 0
##$STSI= 0
##$STSR= 0
##$SW_p= 3612.71676300578
##$SYMM= 0
##$S_DEV= 0
##$TDeff= 0
##$TDoff= 0
##$TI= <>
##$TILT= no
##$TM1= 0
##$TM2= 0
##$TOPLEV= 0
##$USERP1= <user>
##$USERP2= <user>
##$USERP3= <user>
##$USERP4= <user>
##$USERP5= <user>
##$WDW= 1
##$XDIM= 8192
##$YMAX_p= 0
##$YMIN_p= 0
$$ End of Bruker specific parameters
$$ ---------------------------------
##NTUPLES= NMR FID
##VAR_NAME=  TIME,          FID/REAL,        FID/IMAG
##SYMBOL=    X,             R,               I
##VAR_TYPE=  INDEPENDENT,   DEPENDENT,       DEPENDENT
##VAR_FORM=  AFFN,          ASDF,            ASDF
##VAR_DIM=   8192,          8192,            8192
##UNITS=     SECONDS,       ARBITRARY UNITS, ARBITRARY UNITS
##FACTOR=    0.0002768,     1,               1
##FIRST=     0,             0,               0
##LAST=      2.2672688,     0,               0
##MIN=       0,             -250704,         0
##MAX=       2.2672688,     145163,          0
$$ Real data points
##PAGE= N=1
##DATA TABLE= (X++(R..R)), XYDATA
0 0 0 0 0 0 0 0 0 0 0 0 0 0 -8 8 -8 8 -16 16 -24 24 -32 33 -40 48 -57 68 -80 91 -105 121 -137 159 -180 203
34 203 -232 257 -290 327 -366 407 -453 503 -559 619 -684 756 -834 920 -1015 1117 -1230 1356
52 1356 -1494 1648 -1821 2016 -2237 2491 -2787 3133 -3551 4062 -4706 5540 -6677 8324 -10936
67 -10936 15721 -27401 120241 69018 -147916 -33868 -40142 -17961 118523 110656 -103353 -105473
79 -105473 -6588 -16044 26550 122494 -24024 -161198 -29548 59646 -45171 -20925 53347
90 53347 -36887 -62068 70292 43599 -68231 -12811 39412 -12769 57642 122523 -33955 -123363
102 -123363 20007 77011 16126 48474 26955 -121199 -98199 66284 79934 29778 37031
113 37031 -58198 -150254 -13628 111922 21693 -35805 -2896 -65818 -84214 59768 96620
124 96620 -20242 -33640 7814 -30940 391 83916 15596 -66364 10826 50053 -14427 6196
136 6196 39041 -41721 -47508 60811 52306 -30904 -17082 -13363 -55040 11963 85349 -1000 -76130
149 -76130 -27523 -10221 -15453 56434 60758 -51310 -71729 4629 17478 21576 57537 2548
161 2548 -75145 -18626 52242 21987 10081 23413 -32131 -49062 35496 53500 -14756 -19945
173 -19945 -394 -26304 -1820 51866 6602 -55168 -21130 11407 747 22935 22809 -44888
185 -44888 -50857 21415 35778 8102 12776 -11634 -52806 -6035 60708 32507 -14270 -14791 -23905
198 -23905 -19237 37847 50678 -10684 -36138 -13806 -7230 13821 44506 7784 -50414 -31762
210 -31762 13100 17764 18008 8429 -34815 -41327 13386 36987 11403 -3332 -17022 -34363 -1355
223 -1355 48186 29773 -19595 -27082 -13916 2242 33087 34125 -11511 -35907 -14987 7304 23742
236 23742 31708 -2992 -46103 -27839 19530 28311 11824 -5885 -29670 -29929 10196 35786 16367
249 16367 -11616 -25993 -23449 7179 38344 22564 -17398 -28444 -11368 10561 29491 23491
261 23491 -11954 -33178 -14700 14068 26970 18744 -10744 -35384 -19129 18694 29020 8745
273 8745 -14460 -26336 -16903 11915 29206 13581 -15013 -27342 -13771 14725 30090 12556
285 12556 -17902 -25087 -7229 14499 24723 13581 -13003 -26485 -9433 17578 24720 7682
297 7682 -15954 -24459 -8093 16616 23008 5344 -17535 -23616 -7508 15665 21630 4263 -17638
310 -17638 -22306 -5437 16878 22357 4345 -17716 -19720 -558 18559 19528 2939 -15527 -17807
323 -17807 -637 18946 20072 326 -19192 -18471 556 17299 15398 -2307 -18191 -17200 -157
336 -157 16802 15155 -3787 -19407 -14695 3968 17471 13860 -3366 -17723 -13233 6544 20376
349 20376 14045 -4915 -17905 -12218 7298 19810 12097 -6450 -17840 -12329 6772 19625 9901
362 9901 -11581 -19943 -9181 7476 16644 10046 -9786 -21653 -9439 11339 18076 8164 -8816
375 -8816 -18587 -8325 12831 19554 6652 -9171 -16309 -8019 12727 21792 4581 -15269 -15746 -3931
389 -3931 10030 18762 7313 -16680 -21027 -2069 13283 14776 5758 -13166 -22153 -4263 17325
402 17325 15844 1671 -11485 -19296 -6954 18544 20800 -1237 -13891 -12602 -5357 12812 23641
415 23641 3110 -19854 -13290 2766 9876 14432 6042 -16879 -18902 4315 15039 8506 907
428 907 -12998 -20695 732 22505 10507 -8037 -11512 -13113 -4095 20708 21574 -7975 -19788 -7657
442 -7657 1040 12665 22576 1491 -24928 -13811 8356 11384 12711 7339 -17220 -21941 5774
455 5774 17384 5330 1029 -6940 -20160 -3446 21276 7901 -12308 -5747 -2715 -5296 11825
468 11825 16571 -10546 -18172 2972 8482 6156 11656 -3714 -24504 -4986 20756 11515 1430
481 1430 524 -16920 -19244 14804 26049 -189 -10891 -8891 -16841 -1959 26392 12790 -16369
494 -16369 -11259 -2743 -6514 10420 21392 -5893 -19863 1141 5724 -2177 8916 5718 -16126
507 -16126 -4361 18429 3330 -10237 3185 -1415 -10281 12926 19694 -12689 -19788 1074 1241
520 1241 3691 20146 2706 -28150 -13172 11098 6153 9595 13871 -16182 -29030 4955 19637
533 19637 3767 5746 3216 -21199 -12537 20592 13233 -6911 2036 -417 -15296 3408 19311
546 19311 -5115 -13727 6620 3110 -6707 8175 3463 -20353 -4927 19552 3986 -7203 2266
559 2266 -10408 -17961 14805 26143 -4362 -12947 -3162 -11968 -2307 27913 15285 -18104 -12495
572 -12495 -502 -5331 11436 25311 -5048 -24011 -1543 5336 -2560 11811 10111 -19603 -14165
585 -14165 13317 5018 -7143 6235 116 -15447 4645 18142 -6504 -12874 4139 -557 -2773
598 -2773 16635 7238 -20766 -9657 12196 5037 5953 13243 -10507 -25563 3269 18482 3135
611 3135 2085 930 -20701 -14366 18388 15828 -5533 -2857 -4445 -15703 2821 21409 1293
624 1293 -13229 -706 -1860 -5484 12918 12129 -13426 -9543 10592 3183 -2325 8636 -2135 -16930
638 -16930 2705 16761 -656 -6541 86 -9094 -6657 16632 12137 -11565 -9545 -1075 -5669 5192
652 5192 18109 -1671 -19158 -4393 5103 1486 10378 9238 -13378 -13630 8548 8955 173 5107
666 5107 -1527 -14683 -931 14897 3207 -6109 -647 -4955 -5685 10187 9519 -9494 -8587 2350
680 2350 -1175 1254 10570 -1822 -15569 -2277 9785 3140 2296 2399 -10088 -9336 9322 11130
694 11130 -677 -1826 -3308 -9011 2059 14828 3673 -8755 -4040 -1855 -1774 8474 8269 -8131
708 -8131 -10781 1010 2905 2135 5814 -1810 -12464 -3571 8755 4954 -61 -674 -6550 -5300 7633
723 7633 9797 -1007 -4342 -2864 -3491 3578 10947 2071 -9366 -5220 1512 2344 5547 4019 -7194
738 -7194 -9819 761 5922 3376 1353 -3952 -8903 -1654 8348 5567 -1437 -3752 -5306 -2216 7359
753 7359 8251 -1737 -6663 -3244 192 4471 7630 957 -7980 -5495 2486 5264 4290 469 -6391 -6922
769 -6922 1160 6681 3697 -1418 -5669 -6328 290 7273 4608 -2846 -5380 -3827 617 6382 6014 -1753
785 -1753 -6722 -3146 2836 5875 4745 -1141 -6379 -4137 2789 6436 3828 -2205 -6616 -4389 2464
800 2464 6103 2491 -3115 -6109 -4256 1968 6419 3375 -3884 -6492 -2451 3115 5798 3430 -2823
815 -2823 -5921 -2483 3914 6622 3092 -3088 -5553 -1854 3784 6017 2529 -3199 -5981 -2663 3626
830 3626 5772 1242 -4491 -5826 -2127 3105 5171 1861 -3894 -6044 -1664 4251 5593 1172 -4038
845 -4038 -4904 -570 4292 5440 1513 -3654 -5060 -501 5042 5598 646 -4247 -4670 -994 4099 4800
861 4800 287 -5111 -5130 -705 3999 4430 -133 -5011 -4813 199 4289 4244 357 -4452 -4627 784 5416
878 5416 4075 -102 -3285 -3855 110 5333 4802 -1238 -4397 -3169 458 4086 4244 -1312 -5619 -3608
894 -3608 1053 3733 3391 -905 -5942 -4203 2115 4311 1970 -641 -3920 -4397 1454 6199 2958 -2155
910 -2155 -3021 -2321 487 5306 4192 -2382 -4405 -1364 1176 3507 3853 -1835 -6067 -1473 2986 2179
926 2179 1209 -717 -5200 -3759 3774 4626 -754 -2394 -2424 -2956 1928 6490 1253 -4303 -2631 -259
942 -259 1130 5218 3825 -4318 -5178 1192 2558 2370 3428 -1260 -6600 -1530 4783 1893 -581 -97
958 -97 -3703 -4126 3463 4628 -2326 -3107 -324 -1632 789 5348 63 -5705 -908 2914 880 2985
974 2985 2900 -4849 -5003 4220 5047 17 724 -1352 -6495 -486 7674 2392 -3620 -1740 -3041 -3757 4390
991 4390 6215 -2917 -4811 -352 -1411 -156 6254 1654 -6310 -1651 3748 -24 718 3966 -2305
1006 -2305 -5133 3805 4799 -2324 -1409 934 -3368 -93 6682 654 -6461 -1560 1086 -1495 3766
1021 3766 5055 -5657 -7587 1971 2738 400 4488 808 -8810 -3379 6509 3136 105 2553 -3151
1036 -3151 -7032 2939 7324 -531 -1558 1289 -3704 -2694 6273 2904 -5220 -871 2187 -3001 118
1051 118 4635 -3189 -6052 3148 3995 -2538 282 1119 -5596 -1685 7728 2835 -4012 -492 -1145 -3736
1067 -3736 4574 8292 -2066 -5456 263 -1141 -900 7170 3995 -7424 -4627 2512 -501 660 5411
1082 5411 -1696 -8004 -10 3997 -1315 706 2801 -4429 -3805 5068 2477 -3706 637 1825 -3259
1097 -3259 1032 5797 -1974 -5157 2449 2573 -1517 2867 2298 -6244 -3470 5093 2115 -1345 1636
1112 1636 -2065 -6489 1215 6336 -328 -2346 383 -3532 -3497 5504 4395 -3676 -1865 1347 -2439
1127 -2439 339 6096 290 -5197 444 2580 -1465 1302 3123 -3348 -3345 3766 1946 -2614 779 350
1143 350 -4148 623 4935 -1582 -4149 856 -207 -1960 3462 3030 -4544 -3231 2813 932 281 3598
1159 3598 -362 -5237 153 4311 395 384 1672 -2864 -3123 3629 3287 -2268 -784 276 -2927 -99
1175 -99 4589 -121 -4432 -187 783 -1211 1723 2244 -3287 -3165 2290 1900 -534 1292 -140 -3543
1191 -3543 593 4335 718 -1432 298 -1688 -1795 3416 3310 -2329 -2480 165 -711 368 3405 -245
1207 -245 -4436 -1618 1395 469 1202 1320 -2888 -2950 1943 2450 175 472 -473 -2823 163 4053 1530
1224 1530 -1641 -758 -676 -759 2371 3166 -1438 -2819 -266 564 890 1972 -321 -3465 -1430 1417 1158
1241 1158 603 138 -2463 -2477 1569 2810 170 -853 -850 -1739 473 3348 1697 -1431 -1487 -343 358 2133
1259 2133 2106 -1124 -2516 -641 929 1227 1296 -531 -2859 -1526 1340 1411 361 -629 -1944 -1723 1015
1276 1015 2513 473 -1143 -1221 -680 703 2252 1259 -1176 -1390 -244 1001 1720 1063 -910 -1792 -160
1293 -160 1272 1173 569 -904 -1965 -960 1128 1228 -109 -1196 -1489 -770 732 1457 84 -1326 -1282
1310 -1282 -95 1158 1598 463 -1010 -951 174 1100 1611 416 -855 -1162 146 1360 951 -174 -1067
1327 -1067 -1080 -382 954 1029 -379 -1478 -1302 -76 1090 840 -417 -1203 -857 243 1038 1142 -290 -1076
1345 -1076 -718 821 1371 904 -265 -989 -648 542 1372 762 -586 -1336 -612 514 969 465 -879 -1379
1363 -1379 -823 320 1138 573 -832 -1450 -427 905 1177 569 -504 -1193 -472 1073 1720 526 -743
1380 -743 -983 -200 1072 1642 289 -1159 -1248 -454 670 1245 107 -1462 -1461 -274 668 1033 496 -1067
1398 -1067 -1609 -294 1139 1150 116 -938 -1220 -238 1437 1562 179 -883 -898 65 1298 1839 110
1415 110 -1458 -949 33 771 1199 462 -1593 -1677 227 964 494 138 -1101 -1845 -107 1618 594 -365
1433 -365 -847 -1017 -237 1656 1663 -339 -1188 -496 23 945 2023 244 -1750 -739 755 546 812 746 -1482
1452 -1482 -1772 436 1191 192 -145 -705 -1690 -362 1670 471 -815 -305 -549 -755 1114 1760 -773
1469 -773 -1190 400 422 358 1505 253 -1703 -460 1455 742 106 398 -1242 -1580 854 1283 -433 -433
1487 -433 -307 -1492 -343 1849 578 -1491 -531 -40 -631 947 1856 -843 -1515 480 564 -40 1094
1504 1094 759 -1515 -463 1440 173 -332 594 -266 -1189 880 1429 -1040 -905 594 -547 -649 1341
1521 1341 247 -2254 -450 1126 -102 253 1106 -852 -1886 956 1485 -190 400 472 -1566 -377
1537 -377 2184 678 -973 181 142 -1392 572 1838 -783 -1352 529 -142 -1079 860 669 -1774 -637
1554 -637 1408 -266 -705 710 -465 -1473 1234 1844 -810 -602 693 -592 -122 2133 672 -1731
1570 -1731 -487 953 -495 677 1820 -943 -2273 415 952 -453 829 579 -2198 -1258 1415 572
1586 572 -546 684 -470 -1882 521 2011 -479 -724 829 -385 -748 1698 1126 -1358 -501 1083
1602 1083 23 18 1314 -620 -1813 598 1344 -477 -58 419 -1749 -1181 1605 829 -1088 -266 -229 -1414
1620 -1414 598 2247 -261 -1539 187 42 -496 1541 1505 -1256 -1058 767 -35 21 1366 -88 -1833
1637 -1833 -56 1269 -331 -293 591 -972 -1203 922 804 -1076 -392 456 -926 73 1403 -128 -1422
1654 -1422 267 634 -175 860 946 -1050 -915 1075 550 -252 740 -116 -1496 20 1370 50 -641
1671 -641 102 -733 -1149 863 852 -719 -828 139 -503 -142 1050 155 -970 114 671 -55 354 765 -427
1690 -427 -756 905 663 -352 190 419 -817 -136 1119 148 -744 -189 -159 -472 341 633 -781 -744 192
1709 192 81 -218 569 147 -1052 -94 1076 113 -62 420 -417 -396 628 1011 -272 -200 171 -255 27
1728 27 631 58 -725 -188 167 -48 57 332 -859 -926 161 491 -186 -8 -168 -827 -98 761 472 -452
1748 -452 130 -287 -208 622 789 -189 -433 -131 -15 165 593 129 -810 -299 254 161 237 218 -665 -618 261 528
1770 528 67 -223 -338 -565 -131 569 367 -281 -345 -222 -26 594 619 -102 -315 -39 362 482 578 -102 -741
1791 -741 -320 215 358 109 -76 -680 -399 102 365 202 -266 -485 -436 74 702 289 -181 -383 -266 140
1811 140 621 480 -130 -389 -130 278 567 468 -52 -628 -354 146 434 -5 -187 -556 -297 -97 344 306 -338
1832 -338 -337 -465 90 352 276 -206 -322 -158 330 314 441 -229 -446 7 322 515 317 -163 -394 -195 178
1853 178 327 171 -273 -297 -148 268 164 -35 -401 -448 -295 123 272 21 -197 -260 87 270 205 150 -121 -290
1875 -290 76 422 392 134 -144 -299 173 378 378 -47 -204 -176 -126 104 221 -73 -471 -327 25 143 104 -100
1897 -100 -310 -282 209 100 196 -1 -122 -35 144 454 -54 -67 -85 -38 186 406 237 -105 -286 -83 -145 210
1919 210 67 -145 -385 -246 211 150 24 -249 -400 -217 76 229 -2 -81 -52 -131 264 704 2 -147 -2
1940 -2 24 163 363 217 -157 -295 134 114 109 109 -200 -532 -31 359 121 -290 -244 -396 -501 210 325 -314 -214
1963 -214 -113 -39 128 614 167 -194 -171 191 136 199 179 -352 -313 353 416 125 63 -179 -399 81 503 150 -242
1986 -242 -227 -363 -412 358 460 -354 -365 -6 -141 143 473 211 -513 -234 198 231 329 205 -280 -539 352 452
2008 452 -33 165 193 -414 -161 408 -22 -510 -172 -47 -423 142 319 -308 -470 162 -29 -34 300 87 -597
2029 -597 -105 414 100 246 319 -7 -333 391 592 125 -294 -17 -480 -190 690 13 -425 -226 -72 -314
2049 -314 101 449 -277 -550 66 29 -186 263 310 -534 -249 478 246 -19 351 271 -299 371 380 -231 -126 214
2071 214 39 -199 299 294 -583 -272 202 -53 -121 384 -238 -656 293 255 -176 -49 125 -487 -154 380 190
2092 190 -112 77 52 -350 28 476 65 -240 276 191 -259 197 316 -335 -373 249 0 -245 206 -86 -415
2113 -415 218 357 -278 -224 216 -274 -235 528 197 -323 -116 171 -4 181 595 -4 -476 33 203 -110 208
2134 208 341 -321 -376 404 193 -117 -20 -153 -504 -6 294 -137 -243 -41 -203 -139 199 313 -336 -203 165
2155 165 -24 17 375 -79 -444 108 538 36 169 149 -414 -334 351 421 -96 -39 -232 -387 -42 275 73 -361
2177 -361 -18 -53 -160 393 247 -268 -129 253 -27 -72 277 233 -369 85 409 57 -5 92 -278 -119 280 122
2199 122 -139 -69 -170 -329 -50 299 -139 -403 -112 17 -137 165 200 -268 -137 64 157 59 33 56 -168 44
2221 44 350 108 21 24 -41 -119 165 299 -169 -198 103 -113 -221 149 -3 -323 -106 64 -115 133 16 -385
2243 -385 -281 244 318 30 83 -18 -97 -39 496 312 -160 44 2 51 259 313 -148 -137 -37 -31 -174 240 -115
2266 -115 -242 -183 -20 -64 -48 38 -98 -27 225 160 30 -57 43 -1 148 477 139 4 -1 -95 -33 179 132 -134
2290 -134 -159 -83 -39 90 -51 -74 -182 39 56 -32 -30 39 -201 -192 95 73 -85 -10 -137 15 152 188 -71 83 -115
2315 -115 -59 28 114 67 -114 -14 -25 78 188 125 -196 -269 -123 57 -11 -81 -191 27 -162 -69 27 -16 -143 -156
2339 -156 11 -64 55 26 -3 -34 -94 186 159 -61 -11 -35 53 13 6 4 -237 55 -119 15 -13 20 -169 -139 74 18
2365 18 137 165 -298 -189 52 66 172 -71 -77 -120 101 124 162 -121 -131 -81 -26 241 77 -254 -299 48 -78 57
2389 57 147 -89 -108 -112 -17 35 90 -23 -163 -1 31 93 63 10 -55 -73 -16 223 127 -58 -14 -43 41 103 154 22 -93
2416 -93 -68 131 73 162 -228 -165 2 -20 55 73 -54 -270 -144 86 17 53 50 -132 92 -4 70 43 186 -112 32
2441 32 99 64 -45 -122 -77 -42 47 106 166 -69 -116 -95 43 119 -97 -183 -306 -198 64 -63 113 -51 17 36 185
2466 185 158 88 -43 52 -93 -60 252 29 -109 28 87 -54 122 134 -239 -86 -99 237 95 26 -6 -220 -105
2489 -105 69 -1 -85 -80 -161 4 -1 233 38 -101 181 -12 72 229 -73 -137 -67 202 -27 -38 -50 -275 -229 33
2513 33 61 -184 -22 28 -106 -128 234 -2 -49 146 -78 -187 -11 234 -126 -57 68 -61 -187 -107 87 -27
2535 -27 91 68 66 -178 109 -88 -112 110 225 -156 -82 9 -138 -53 123 47 -353 -59 37 2 18 133 -30 -81
2559 -81 154 193 12 166 58 70 45 -29 154 -29 250 105 -161 -114 11 -117 -214 68 -21 -47 107 -10 -225
2582 -225 -116 -12 23 147 154 -100 -269 121 112 -47 73 153 -155 -58 66 245 0 134 -89 -135 -104 35 5
2605 5 -195 -42 -17 -52 15 -165 -222 -73 29 189 26 136 84 -153 -22 135 104 -168 47 54 -97 193 -4
2628 -4 -111 119 129 7 -133 65 57 -303 16 68 -80 -8 154 -155 -108 3 -3 -158 47 21 -134 21 231 -68
2652 -68 -132 108 -11 -89 28 350 -42 4 52 46 32 229 -12 -154 -29 72 -197 -58 -50 -287 -304 27 100 39
2676 39 -142 48 -79 75 151 35 -61 -37 -42 -21 3 124 -33 -104 172 10 -57 -50 -37 -52 -16 5 62 -158 -45 -73
2702 -73 34 54 88 -52 -108 44 -145 -120 312 102 -138 -60 116 -53 21 126 71 52 -21 119 -3 254 56
2725 56 -99 16 114 -16 -94 110 -74 -81 2 49 -57 -85 -46 -8 2 90 -118 -59 -138 135 -38 105 -18 154 -100
2750 -100 60 78 151 112 89 39 -141 -19 -64 121 -67 138 -70 111 96 -6 -76 6 86 -28 -12 13 -84 104
2774 104 152 152 -5 62 70 89 95 -3 48 -47 101 -9 -94 163 -47 -58 -27 -48 50 -204 250 4 -10 -27 149 -98
2800 -98 -34 27 -33 -165 53 -129 28 93 113 -81 89 88 51 -75 16 76 108 37 -5 46 -90 16 -107 -66 24 -14
2826 -14 -157 -146 -50 130 -107 22 -79 -192 29 150 56 48 72 21 46 27 83 -61 10 88 89 60 132 -131 -194 59
2852 59 47 -40 -207 -189 -71 -47 19 0 -99 -21 -242 -155 -44 -34 -2 64 -131 35 -44 -31 224 15 -8 -9 -203 31
2878 31 117 -11 122 78 11 -127 192 -16 -16 -157 3 -67 -82 -106 -81 -208 -64 40 -12 -59 142 42 25 133
2902 133 120 14 103 88 -5 -5 89 80 -150 -49 -70 71 39 -36 -73 -16 14 67 -81 90 -61 -3 54 -39 123 -3
2928 -3 -16 -19 -76 -17 50 189 161 -35 -67 37 210 -96 89 -11 26 -53 12 -26 -68 -67 -39 -54 -17 38 -49 61 166
2955 166 33 6 -27 -49 -206 -90 -6 -91 -36 70 15 110 34 -11 106 104 165 205 -39 -137 77 104 45 -54 -40 -132 -27
2982 -27 138 -86 17 107 -113 43 -12 90 90 9 142 -41 8 140 2 22 76 -65 -25 61 38 -113 22 18 7
3007 7 25 -116 81 57 133 -186 47 -47 -19 28 -53 61 -176 72 148 2 41 -20 43 -19 130 -46 27 28 -46 -18
3033 -18 14 66 94 119 12 76 -50 -33 -132 -56 50 -124 -21 20 -8 -84 -28 144 3 198 -185 -177 81 -6 107
3058 107 -54 -35 101 -23 55 64 -62 -65 -88 -147 -40 80 -1 -158 -139 -46 -16 25 -88 -50 -88 -62 38 55 -14 -1
3084 -1 -60 -12 -126 1 68 0 -83 107 25 103 -39 -32 106 136 50 5 34 -100 -26 26 -108 -106 -26 44 -238 64 46
3111 46 -152 -41 -61 -34 124 41 69 -35 61 11 50 84 -41 -43 -103 86 -59 251 27 -77 -18 81 109 76 59 -72
3137 -72 -148 -114 81 17 32 1 -197 -113 -25 39 -67 -107 -58 -97 -8 -35 65 -63 116 -10 170 -132 204 -4 21
3162 21 -66 72 57 -167 25 -60 35 48 26 -145 23 -141 -94 -101 61 30 -94 -32 31 -9 125 -38 131 -47 -125
3187 -125 132 51 53 40 -6 73 99 -65 -15 -9 -23 -116 -50 108 -99 -127 -117 -93 147 -8 -23 -114 -109 82 184 -10 9
3214 9 69 50 12 19 37 -39 -29 -21 -148 -63 88 51 -124 -86 -148 30 39 -20 -74 -83 88 -26 -70 15 -33 -134 56 -126
3242 -126 -84 82 -73 -76 111 93 17 -51 58 99 149 151 -47 135 -116 55 -42 68 208 -166 -70 15 -22 45 -119
3267 -119 -144 -44 -83 18 -29 37 -36 -158 -110 -45 -102 -26 -86 12 -11 -13 113 -141 58 -93 -14 99 57 -49 -279
3292 -279 -154 -18 -71 -17 85 3 -176 -126 -37 157 25 91 57 24 215 59 -64 158 1 -92 21 -80 -10
3315 -10 57 33 -124 -156 1 99 -92 31 -197 32 -13 75 11 -68 -79 -157 8 -68 14 -75 -159 -21 -13 -21 -114 -43 -23
3342 -23 61 244 48 -5 -51 38 55 -6 -101 -154 -167 -116 -49 19 -122 -131 50 107 -10 -51 -97 -78 -128 -24 96 0 -100
3369 -100 64 35 42 -28 167 -25 -129 -1 79 94 131 19 24 -78 -177 8 87 18 -149 -89 -55 21 -110 -150 -136 63
3395 63 -1 83 133 100 51 66 56 106 272 -28 -61 53 83 3 30 -120 -127 -31 125 -9 57 -13 -72 -144 -74 19 5 6
3423 6 -174 -23 181 208 -26 -86 -47 15 177 38 -21 -37 -92 -136 80 -30 13 57 -25 -82 134 -1 36 -68 -91
3448 -91 43 104 1 -190 -20 -133 126 -9 105 129 49 -43 44 27 54 -1 -52 -43 63 -136 93 -51 -96 -82 14
3473 14 15 54 11 26 -51 67 27 104 -132 -19 -112 -28 126 -2 49 -2 -17 -11 31 13 32 -171 -131 18 46 109 67 41
3501 41 -73 65 105 42 103 -218 -50 -24 35 -4 -51 -15 29 31 -164 3 145 51 -183 45 171 -30 42 -56 -60 91
3527 91 68 100 -88 -30 64 -9 19 189 -13 19 -72 -61 66 76 -10 -107 -69 170 82 -182 18 -200 -81 5 174
3552 174 90 47 -91 -83 -94 73 23 75 30 76 50 53 45 -46 -152 -77 206 26 112 -19 -54 4 93 128 73 -57 -55 -19
3580 -19 166 51 36 -144 161 8 11 130 1 -102 -30 85 45 154 118 22 -57 -81 31 -39 -43 57 -44 59
3604 59 -165 0 -178 43 -101 -21 56 84 48 59 -191 12 130 -45 -78 -142 -46 79 86 90 35 -43 15 82 32 -74
3630 -74 37 114 -59 -42 -96 85 -150 -76 -161 -12 -26 -62 9 -29 -97 16 61 249 57 -97 88 26 -22 64 -128
3655 -128 -112 -31 273 69 -89 -90 -51 -134 41 -42 -10 -75 -110 -68 -69 125 -28 85 -129 -36 63 110 -58 -21 -134 57
3681 57 121 16 171 -8 77 -135 -145 6 -61 -8 117 -174 -40 -25 41 13 -15 -268 -97 65 -106 -179 9 -177
3705 -177 -12 197 -89 -67 -28 -54 -55 103 -102 -78 -12 -122 53 63 65 -33 -147 -118 -35 -40 97 -82 -13 -48 -59 4
3731 4 -16 -24 45 -27 -79 28 32 60 -104 31 151 2 103 101 120 -119 206 -19 133 -10 -66 -143 19 77 -72 -73
3757 -73 -77 9 -37 -42 17 -16 41 -135 229 54 -126 -62 40 82 32 12 268 54 -47 -97 -35 199 31 -113 -44 19
3783 19 -63 50 -84 -34 54 107 100 16 -35 129 -31 -1 -34 -81 13 -82 -137 -90 -43 84 43 -31 -32 44 148 161 233 -89
3811 -89 144 -58 93 -234 13 -39 -107 83 95 28 -156 86 34 73 -85 -86 166 -290 -153 -36 -35 -8 6 -51 111
3836 111 -13 -4 153 -113 -39 -17 35 93 16 -56 -19 -21 58 3 -28 -170 -4 -126 -122 142 -39 48 40 -181 -23 -135
3862 -135 5 -28 -13 -98 43 77 -9 -23 6 -84 -40 17 77 -107 -215 14 89 48 -32 33 -5 99 -15 164 62
3887 62 -120 -118 -93 32 16 -41 -95 -201 54 151 -37 -25 -40 -7 -91 82 150 63 -30 -12 -49 -203 159 73 -12 79 -137
3914 -137 9 -44 84 55 -60 -42 -25 38 11 75 39 -90 92 58 -93 -154 51 84 118 33 -9 10 -5 -17 231 56
3940 56 -28 -124 -119 1 -78 -2 -131 -57 -4 201 40 103 13 78 34 -54 72 -95 -32 -33 -250 85 60 -77 7 72 1
3967 1 16 46 167 -44 -241 46 -17 195 24 8 42 -84 56 16 -29 232 -111 -33 -40 11 40 -16 -19 -120 111 182
3993 182 -68 70 -132 95 168 38 44 60 -204 10 -29 45 83 -69 -21 -14 125 -103 23 -28 -42 132 6 -12
4017 -12 -67 2 -104 -88 36 -57 -105 61 50 3 103 -74 -10 5 -28 -160 -17 38 -3 -68 52 7 52 49 113 -80
4043 -80 55 -22 101 83 105 109 1 -66 -71 -26 61 -116 61 17 -31 -35 -137 31 110 75 65 16 119 -92 -68 61 25
4070 25 -38 82 144 -28 -54 54 260 29 -137 28 -83 -52 135 -179 41 -83 -9 -35 179 31 12 9 -52 62
4094 62 92 -86 19 67 9 -32 -64 53 -65 181 91 -88 44 8 105 55 -60 61 -85 -118 -16 111 180 -78
4118 -78 -54 49 -91 92 -27 86 -33 56 -18 -22 79 -25 84 -83 -50 -40 3 89 -22 -63 -23 105 10 -24 -53
4143 -53 6 -2 -88 89 39 121 -151 -23 -29 -118 24 68 40 -43 -60 194 -9 8 15 -69 62 137 185 -24 -47 -115 98
4170 98 15 128 -268 -36 44 -12 -47 61 -36 -75 144 187 71 70 202 -28 16 -17 51 -38 29 16 33 145 49 -155
4196 -155 5 -102 -308 -135 -49 131 -89 -99 130 -8 23 115 54 17 -100 50 -6 -80 44 -75 -13 74 69 -44
4220 -44 74 109 9 99 18 -135 -25 190 -100 61 -4 25 -63 2 29 50 17 12 -76 114 12 183 86 86 -68 -42
4246 -42 201 -85 -73 79 -27 -94 -17 38 115 -64 -8 -103 -13 67 -22 -95 -95 -94 -175 -101 131 -16 164 -99 -46 69
4272 69 -86 208 51 -13 -40 118 53 2 -61 -11 -33 152 -5 -62 -70 -186 -52 -11 -26 -22 -129 -92 44 -36 2 17
4298 17 118 -17 48 141 32 -48 -88 -32 -106 127 172 -74 -158 -117 66 125 -45 -34 -84 157 7 98 103 11 51 -23
4324 -23 108 120 71 -15 1 49 35 31 -16 202 -81 0 -96 25 189 1 9 -21 -134 68 52 -148 -48 -60 87 61
4350 61 169 -104 -38 34 -26 -212 202 -197 33 7 25 90 10 -45 -112 -149 21 -1 156 7 -41 -46 -17 180 58
4375 58 21 35 -96 -44 89 -34 144 -75 -142 113 168 182 -7 -15 -139 -84 90 71 -43 -51 41 -44 -31 3 158 -101
4401 -101 -81 103 105 -78 -25 -108 -27 19 28 159 -98 -7 -88 112 132 -14 36 -59 -66 186 65 124 -166 -80 -19 -4 -74
4428 -74 -32 139 54 -82 208 111 138 63 -65 7 -154 73 31 -31 2 57 60 -101 -56 -46 -53 174 128 152 -16 35 11
4455 11 -147 -131 -25 20 105 -88 89 -8 -8 24 9 -66 84 14 -92 -8 10 7 -6 -153 24 -49 52 -72 -109 -59
4481 -59 158 65 -126 -5 59 82 122 31 92 -188 -37 121 13 -42 65 77 89 281 -46 -179 -16 -216 30
4504 30 -52 42 -78 -34 63 -84 128 164 172 -66 -56 108 51 -117 57 -56 53 -26 89 -98 -147 91 48 22 5
4529 5 -107 -36 87 -214 61 121 -6 -24 -147 10 35 -44 24 -83 -186 -38 -98 77 -50 -64 -15 85 132 52
4553 52 -59 -32 206 13 13 30 15 -93 16 57 209 -74 5 -4 -9 146 -128 102 4 -31 -23 -2 44 -51 37 -66 93
4580 93 39 -66 61 -105 18 2 215 70 36 19 -102 164 -33 29 75 -46 14 37 -141 -32 27 -62 -20 113
4604 113 116 -66 140 25 11 -16 13 -18 23 -32 2 81 -2 83 -77 -113 45 65 -18 153 -141 -158 -94 -22 -77 62
4630 62 -4 -119 122 112 -120 55 -36 -259 -116 38 -53 49 14 112 35 19 6 24 99 73 -76 183 -55 38 34
4655 34 -25 -22 63 50 -114 -16 -58 135 52 -137 179 54 -109 55 -38 103 10 -129 44 27 -102 146 -42 136
4679 136 -21 150 13 -157 172 -76 0 -45 207 22 134 89 -16 -84 -11 -70 -31 179 -103 22 49 85 -72
4702 -72 0 -63 -15 -40 -63 70 -33 60 54 18 53 -43 175 -32 6 103 181 52 -52 9 -6 55 41 -20 -140 -73 0
4729 0 -93 126 -121 -13 41 -104 72 43 36 -49 1 -33 57 30 35 115 -107 255 102 -11 18 -52 1 -86 -71 108 90
4756 90 -92 12 57 14 -20 23 -86 -25 -48 145 66 43 -64 -51 14 51 81 89 67 -154 131 26 -78 -7 22 1
4782 1 63 118 -188 8 -51 -80 -53 94 30 -63 76 -118 58 137 13 13 -141 -122 -23 -99 -7 120 84 -82 -23 -16 -121
4809 -121 -49 -39 -25 -78 64 -48 174 -2 -83 -125 -97 112 -71 47 -40 31 95 13 122 17 57 103 -46 -24 56
4834 56 28 22 -199 -74 17 -96 -10 -228 47 -32 49 -56 18 -77 -90 -88 49 -138 -130 -132 -55 -100 -96 34 50 -10 71 81
4862 81 -115 -61 -20 -114 20 -78 65 38 71 18 147 117 19 25 61 -33 -3 71 58 -135 92 48 118 218 -133 12
4888 12 70 -13 -114 -19 -43 -112 -28 -91 -16 74 -67 65 -8 98 -138 77 -78 1 15 45 8 43 25 -113 -2 145
4914 145 2 46 -82 -58 124 182 -46 -119 22 45 10 116 105 -29 16 41 12 -59 33 2 79 -97 57 168 119
4939 119 64 45 -77 -164 -30 34 97 -118 122 -13 -6 -53 106 45 -4 132 -64 21 93 56 -42 -220 5 -17 -66
4964 -66 10 -26 28 -11 54 29 123 36 24 -32 79 38 -20 -96 57 -92 173 -67 30 -165 60 -48 116 -19 14
4989 14 -13 -4 -112 -349 -35 -98 -74 4 114 72 158 69 89 40 86 132 53 47 205 102 -179 120 -99 46 29 -30
5015 -30 48 -168 8 -52 -119 -9 -155 164 62 -28 -229 26 105 14 -71 205 -28 68 200 -170 -126 -92 19 -55
5039 -55 162 54 106 -54 101 25 -27 26 26 6 -25 -47 134 -47 -29 0 -71 6 21 46 -76 82 -116 -63 10 14 117
5066 117 -57 -83 175 -45 42 -37 -17 -2 23 34 -185 -112 -38 24 41 70 72 -89 -92 99 107 88 126 60 -14 47 -154 160
5094 160 -100 -96 -121 60 -41 -85 -75 60 -16 -177 -100 148 -5 -66 114 -68 15 -192 -13 146 -21 15 -87
5117 -87 99 103 -3 -34 11 78 3 9 -86 42 -168 94 -195 159 -78 -49 23 121 9 112 -47 -4 34 73 105 -107
5143 -107 -38 -27 112 -2 -38 -7 -53 -135 115 -43 -78 -106 11 60 -89 53 128 -9 83 51 -143 95 33 -13 38
5168 38 157 -122 25 -87 -14 3 -31 38 196 33 -17 55 -59 -73 23 20 -246 91 -74 -53 70 -110 118 -2
5192 -2 -92 -116 43 125 30 -15 115 -71 -7 -14 -71 -50 -105 98 -50 37 139 -43 65 3 111 20 -1 18 -66 -42 70
5219 70 144 -138 -17 -112 31 167 -34 14 -51 -51 23 88 -65 -70 49 -62 -7 119 125 -58 -36 -59 -126 72 220 -26
5245 -26 -113 4 34 111 4 -68 -145 48 -29 25 79 -31 -31 -88 55 -91 -24 -125 -212 40 -85 -28 -96 -145 -56 6
5271 6 -15 -62 -13 -20 12 -61 -69 57 107 -36 -62 65 -173 -64 -167 -86 58 -197 -151 -72 -17 -67 0 -74 69 198 -53
5298 -53 87 -193 -14 140 114 101 77 -200 35 43 -87 190 69 22 -33 140 -43 27 51 -19 -4 75 111 20 -79
5323 -79 -79 76 -15 -54 0 22 -99 58 69 11 101 -16 139 150 72 227 -79 -104 -28 57 12 -32 78 -2 -40 28 -43
5350 -43 -66 -77 97 28 -78 -66 72 -17 41 -145 104 -16 -51 -82 214 76 33 109 45 140 -73 -152 37 11 22
5375 22 -33 2 -20 -89 54 -97 -28 -34 -141 158 -2 78 -50 28 -72 -145 119 -19 19 -105 4 71 -65 -34 -56
5400 -56 17 -8 115 -99 -58 38 40 -37 -48 175 -60 -74 16 -14 82 73 -41 -52 30 -80 -61 -32 -15 27 24 36 71 81 37
5429 37 -114 58 26 109 -68 -74 38 -110 -122 -67 0 118 88 74 -116 -35 42 4 -27 17 61 98 44 -30 -9 15 15 -104
5457 -104 -84 43 -101 -43 -188 73 -86 43 -163 -82 161 -61 48 136 -1 -5 147 -99 -129 -75 182 -22 58
5480 58 15 38 -123 69 -130 61 60 59 -29 -27 -13 -46 7 168 -27 83 -155 31 -12 -110 -12 20 148 82 -29 -117
5506 -117 -12 -55 -51 -54 0 96 -112 75 -61 183 -66 46 -78 -77 114 -86 -12 -75 61 -75 -8 -46 13 -5 84
5531 84 24 -84 -79 72 87 -148 95 123 -15 51 -73 5 224 -78 -23 -121 -7 -73 -10 66 -36 46 63 -87 -77
5556 -77 -146 45 127 46 21 -20 -14 107 104 -36 132 -2 -75 36 -88 36 76 118 206 44 -115 -19 147 -134 84
5581 84 55 12 -36 132 -32 -94 16 -43 -182 54 140 113 28 72 -96 -178 -126 32 70 -132 18 28 14 116 -51
5606 -51 -82 78 22 -93 19 98 182 -31 49 -88 74 61 50 50 18 -109 84 152 -58 165 -2 39 -143 16
5630 16 -11 -41 5 29 62 -34 91 51 -161 35 10 119 20 -55 -28 -62 -146 18 -45 -41 -3 -102 74 -118 -90 -61 -160
5657 -160 80 -64 39 32 121 79 30 164 117 5 2 71 51 -213 82 -92 -17 37 -61 126 21 59 154 -73 80
5682 80 -94 -66 218 -9 -50 -62 48 -43 -30 10 6 32 133 28 -36 -84 -45 92 -2 -98 51 -1 -134 -58 26 186
5708 186 -40 -67 -127 55 -110 51 38 -25 -56 -77 10 -57 8 -128 110 -111 68 55 -85 -7 142 34 -6 -66
5732 -66 168 -133 -204 -40 61 77 43 146 -101 -14 -241 159 217 48 73 83 75 21 78 55 116 -33 -29 45 57 -107
5758 -107 142 -121 31 5 -65 80 42 81 23 29 -46 88 -91 27 44 -2 -102 -42 93 56 161 56 151 134 126
5783 126 10 126 104 102 42 -13 66 192 111 -339 45 28 51 -22 -68 -4 -175 43 -64 -23 15 48 -10 14 48 -88
5809 -88 110 -71 6 -113 -27 87 -48 47 -125 7 -59 46 -129 49 -44 31 248 18 -33 -68 -67 -17 27 37 178
5834 178 -26 119 -83 67 -15 44 -161 10 45 246 2 37 75 -135 8 -71 -29 -161 -82 -31 -14 87 -1 -111
5858 -111 70 138 102 90 207 18 -52 148 25 60 187 -50 -10 164 21 82 33 -138 20 155 60 28 -92
5881 -92 119 -148 69 -92 157 70 75 -37 -31 -41 143 -76 -68 13 16 -49 -108 38 -107 -5 -21 87 -15 -87 -1 78
5907 78 -83 -111 124 -113 -222 36 -66 30 13 -14 111 -138 -151 -38 -82 -31 117 -10 -104 139 -51 116 -39
5930 -39 -80 20 121 -98 56 43 -94 -116 30 150 -113 -12 25 -13 29 11 110 -7 53 -41 -64 127 0 -96
5954 -96 9 129 66 33 -50 72 -30 -44 -7 -37 13 -3 -97 -10 15 14 41 67 -58 -65 -58 44 47 4 105 -137 13 -28
5982 -28 110 -27 57 -54 149 -49 10 60 197 160 81 -87 -108 -57 53 -46 21 127 -15 -26 -17 6 79 5 82 -91
6008 -91 -27 118 37 -92 155 -93 13 -48 -47 49 23 81 -146 -66 4 49 74 -5 -52 -8 61 129 146 128 16 36 98
6035 98 -6 -41 -37 -44 -164 124 -73 -77 97 -32 118 -11 27 -48 69 -16 4 194 22 46 24 57 7 -53 -9 129
6061 129 74 72 -7 -67 22 -106 -46 13 41 10 51 -19 -19 13 -40 50 -61 -4 -169 8 -99 1 51 -120 87 -39
6087 -39 105 75 -153 -64 27 63 -98 -91 147 90 3 30 27 69 1 -71 24 -26 -12 -64 -87 82 61 203 86 87 -41 -31
6115 -31 161 53 -68 -129 115 -30 34 23 109 66 157 -23 -154 -62 -107 44 -57 -96 -8 50 12 -15 40 -103 171
6140 171 69 -17 -55 77 -57 -85 -80 128 35 1 -187 40 144 184 91 -177 -31 38 5 127 -63 33 -53 -41 48
6165 48 159 -101 1 -78 -160 112 63 -121 -223 -4 59 93 135 9 -5 -154 31 61 13 113 80 -81 100 -76
6189 -76 -81 73 -34 -46 -24 19 47 -77 -35 -64 90 -20 -27 70 -117 -123 47 108 115 152 -9 -78 96 -138 31 106 170
6216 170 -16 84 173 -103 -34 -122 -99 -198 44 5 8 52 16 19 138 67 28 43 33 57 59 43 -48 -7 37 7 142 62
6244 62 -49 -15 182 -36 157 -68 -107 -97 19 -104 57 24 5 30 20 -78 112 99 -69 7 29 15 44 188 15
6269 15 -107 29 82 80 18 -91 27 4 -24 0 12 20 -51 -54 57 108 109 -97 -55 91 71 -69 79 31 -118 -12 38
6296 38 55 -24 -49 49 -132 68 16 -26 -15 43 98 13 -6 -71 -47 83 86 86 -6 -97 -32 -10 -60 52 -1 -58 -34 35 -120
6325 -120 24 1 -63 125 -19 -57 13 39 97 -21 -164 -18 30 -105 -144 -121 89 -77 -50 70 100 -260 -43 91
6349 91 -73 -72 -79 -214 -17 -26 -26 33 -183 43 -109 182 157 -50 -115 -126 -158 43 37 165 -53 122 -48 6 -15 -126
6375 -126 148 -96 7 48 -50 43 -95 53 -64 -94 85 -34 -40 -117 -127 -49 135 -16 -65 105 100 91 116 -211 -70
6400 -70 -99 29 113 14 -109 -153 -41 68 130 -52 -120 26 -26 -15 -34 10 -48 41 57 23 111 -117 96 106 44 22
6426 22 -5 8 -40 -18 -5 29 32 -82 -127 -149 1 6 12 29 -33 26 -77 13 -20 91 -77 -142 -65 70 -2 19 -21 -77 -180
6455 -180 49 118 -44 37 -41 171 -32 -48 56 -29 -51 25 143 -11 -49 -172 -127 -114 63 -68 -6 -223 -53 96
6479 96 36 -13 0 133 34 -1 156 -63 117 -5 -35 -66 -43 -27 56 41 -138 202 122 109 -28 0 -80 -9 -32 -32 -55
6506 -55 -103 119 71 39 77 55 -138 139 -58 -95 84 -23 -8 74 80 106 59 -42 -23 83 -115 14 61 29 -23 67
6532 67 33 -61 85 41 -10 2 129 -56 -22 -106 -107 -83 -127 7 74 -93 -38 -15 16 48 -3 66 50 -71 31 152 -13
6559 -13 -19 63 -6 -50 -71 -22 -1 55 16 99 -31 -21 -21 -92 -90 -61 52 99 -83 127 -82 -2 -65 97 -161 -69 -176 2
6587 2 61 135 125 -85 -63 84 40 32 68 2 92 29 64 74 30 -148 16 17 120 -75 34 -11 93 160 -55 -29 -176
6614 -176 -53 75 94 120 -194 4 -40 -24 39 208 17 -54 27 131 18 -30 -14 -90 53 115 31 -92 -62 122
6638 122 -78 -105 198 -15 37 -266 -61 207 64 -81 -38 -140 -18 85 33 165 -21 -67 -52 -99 -128 -37 -56
6661 -56 -27 -60 -8 140 135 121 -51 -38 158 212 16 195 -38 -125 63 -96 131 7 39 -75 -71 -95 100 -9 -225
6686 -225 52 71 124 -117 -61 -129 191 5 -246 80 -40 -16 81 114 -44 87 -149 167 112 -41 117 126 -75
6709 -75 -151 30 13 89 -84 16 -16 133 29 180 66 -200 76 -163 67 49 162 9 98 88 -48 -23 -73
6732 -73 -33 57 -67 194 57 -59 -2 -5 92 -54 79 63 -71 -37 -28 106 70 -101 -25 -18 14 199 26 -11 -143 67
6758 67 35 -13 20 45 -123 150 18 36 99 75 127 -113 76 -121 118 -130 -54 -103 71 82 69 -51 -164 -24
6782 -24 28 62 60 130 -65 74 75 44 20 -92 -67 -177 -130 36 48 46 7 -44 -203 32 -141 -77 57 20 62 136 -12
6809 -12 -118 18 -145 -10 -45 -122 200 -71 -104 39 -50 129 46 -175 -32 71 -53 -25 278 -34 12 51 32
6832 32 69 -61 228 -11 -89 210 134 19 88 -78 -60 27 63 -111 68 44 96 99 21 -47 -104 -84 182 -48 27 -120
6858 -120 9 -219 235 -22 -55 -75 82 -86 -49 -35 9 3 46 -175 74 -76 -92 79 -126 -31 -10 231 -114 19
6882 19 21 -96 26 310 -92 -41 24 76 54 91 15 52 -176 -35 125 -161 -14 31 -35 119 109 5 -11 14 29
6907 29 127 -9 36 -29 -11 -61 78 6 138 54 -83 -4 79 16 -14 33 -27 3 -39 106 -74 -98 63 -67 -4 107
6933 107 -175 94 -25 7 11 48 -26 -155 13 -143 42 93 -53 62 -124 -89 -103 187 -34 53 6 94 -6 -11
6957 -11 -122 -67 -23 -63 -3 -33 72 -71 19 45 3 155 40 -200 72 71 7 12 16 -149 107 28 136 -123 -58 5
6983 5 16 169 80 -12 -127 108 -154 95 263 32 -24 73 -13 106 26 72 108 -135 112 25 162 53 -116 -2
7007 -2 33 71 -13 -12 5 51 70 28 19 -42 49 35 34 -34 -25 14 -31 -130 -6 95 -136 62 -157 -49 -19 -98 17 194 56
7036 56 -100 -78 -72 48 -1 -76 -1 74 65 146 1 0 3 -18 -40 -3 17 -99 121 75 -195 -52 3 101 -117 -89 57 -113
7064 -113 -77 -19 -42 -31 -55 -36 -2 -1 -13 123 -39 28 52 -95 -33 -37 187 74 -70 -150 31 73 37 108 95 -57 27
7091 27 -101 -36 -3 16 103 -37 167 -56 116 -15 21 49 44 232 81 94 -122 -76 9 -4 -117 50 -53 -79 -7
7116 -7 56 -3 -171 -24 25 248 83 238 -94 -143 79 4 -79 69 73 -102 43 74 145 -91 131 -90 8 -128
7140 -128 70 119 42 23 -44 -64 134 -42 -33 -214 17 -57 -15 -68 -75 29 -35 -30 9 25 3 103 55 -38 -106 141 -82
7167 -82 -7 99 -24 -46 65 -153 -52 8 -62 59 -38 -42 27 66 18 -44 -32 -44 115 33 -123 -53 6 -55 49 34
7193 34 3 63 28 46 -142 135 170 -38 -5 -12 -81 77 29 51 39 124 -20 45 32 36 -40 129 11 143 150 -96 -20
7220 -20 -72 -124 -23 8 48 71 -53 46 120 6 109 17 -15 127 63 142 74 -20 -87 -105 -79 63 -83 -115 -71 -58 -34
7247 -34 -11 -140 80 47 -76 -37 -115 -96 -32 54 -57 80 23 49 30 3 -70 12 15 -37 0 -25 68 -46 91 -124 -14
7274 -14 -118 4 59 -102 18 -114 -186 151 53 -94 128 -85 100 63 29 96 -88 12 52 -60 -43 127 -129
7297 -129 1 -93 -64 -39 39 75 -132 -28 -35 53 -101 -258 114 88 34 18 25 20 -78 105 -160 -56 -71 -70 -49 6 -44
7324 -44 12 62 -23 -20 -5 -6 78 111 -100 -2 -74 -49 -56 -130 -49 0 6 -22 -70 -1 4 181 -36 -29 85 73 34 142 17 -8
7354 -8 -68 105 10 -89 -36 48 142 -97 -190 -37 -120 35 81 -163 -65 -15 97 -179 101 20 -19 -64 -104 7 -106 -87
7380 -87 37 61 54 3 -121 120 -15 -55 115 -24 -63 56 -52 0 70 -82 123 58 -51 -47 42 -48 12 -105 -22
7405 -22 -35 160 -17 -24 89 54 -130 183 108 -74 -49 -2 -30 64 -31 85 26 39 146 -62 235 -79 -5 -119 70
7430 70 -168 -51 -41 5 79 -32 108 22 11 -48 55 130 -17 -17 -59 4 -25 25 181 -40 -25 -149 -31 -22 -55 89
7456 89 -189 -32 205 99 -94 159 -85 12 55 -121 121 -44 32 -32 -99 198 -123 109 5 -114 171 -135
7478 -135 -8 -13 -31 12 64 -36 -42 7 28 -44 -32 49 -19 -47 156 -81 217 -156 111 110 -168 42 -82 65 12 -114
7504 -114 -33 -13 17 -38 -38 -95 171 -37 209 -111 181 -69 120 147 -18 -15 147 -93 -13 113 -143 -49 47 47 -75
7529 -75 75 71 193 9 117 -92 97 159 145 40 58 -22 -91 -8 222 194 -21 8 14 -54 27 67 -191 -128 -126 112
7555 112 66 -13 93 11 -138 -195 22 65 -13 36 -6 -94 -85 27 124 -78 -89 -29 -138 -41 6 3 -59 32 27 -64 31 -29
7583 -29 -113 -28 -15 -35 -148 -138 -5 34 90 -149 24 -52 18 -60 13 -35 -148 75 56 -30 -8 8 -31 -54 -152 -36 -45
7610 -45 -100 -6 -151 35 31 46 105 -133 74 7 18 -84 48 154 38 21 -16 -57 73 -95 32 124 84 45 181
7635 181 17 -113 -51 -154 71 33 -124 -59 -1 157 -21 -46 -40 -7 172 47 -16 50 -100 -99 -28 -4 -12 72 -17 -88
7661 -88 61 -48 -47 63 -172 -28 37 -37 146 -122 168 -54 -31 -52 35 -35 -79 -30 19 10 94 -31 -165 -17 -7
7686 -7 -29 25 -118 -62 110 53 195 -76 -111 24 -71 35 15 8 -52 -56 151 1 18 34 33 -139 23 149 -16 -2
7712 -2 -47 -55 -83 42 108 133 39 -66 -77 -45 17 19 -54 25 39 7 102 62 -60 44 7 -21 27 32 36 -89 -62 53 -116
7741 -116 -49 -18 -53 22 -52 -21 -51 106 -58 36 -18 -7 100 33 76 -95 -31 118 18 -12 40 -59 -66 83 -48 91
7767 91 -57 -210 92 246 3 -90 151 132 -25 23 -68 -22 -112 77 -95 -57 52 -82 115 27 153 193 -130
7790 -130 -42 95 49 132 35 -50 7 52 -11 -15 4 -5 94 -7 -72 12 60 79 12 -20 28 -97 -64 -39 -7 -94 33 49 -102
7819 -102 -176 -52 7 -111 17 28 10 12 -95 56 78 23 -80 9 23 116 117 -67 75 -31 71 -115 26 22 64
7844 64 135 -28 -98 -32 45 89 -107 17 44 -148 132 -155 75 -127 -19 -30 -31 178 -26 -46 169 47 72 82
7868 82 -3 31 -85 -86 50 46 -43 57 18 34 -49 22 12 -27 99 -52 62 17 -112 16 -240 53 -98 -33 -32 -64
7894 -64 -34 132 7 116 87 -82 11 102 -18 47 92 -74 40 57 -20 -174 35 -151 -74 89 -61 4 -106 81
7918 81 65 19 -45 12 -76 -75 54 -113 -109 -53 1 -122 2 95 -39 92 7 30 82 -49 41 -44 -62 78 -32 -42 50
7945 50 92 121 -56 -13 26 -112 71 -49 -78 11 9 -39 -114 22 -51 47 75 -113 -12 -32 105 15 68 -105 -42 125
7971 125 -87 76 -23 -58 -34 70 -80 -124 78 -73 -21 76 35 81 -74 207 -146 -21 -24 138 41 71 0 -34 41
7996 41 -132 -8 64 160 14 -1 42 -2 24 82 2 164 -22 64 0 -34 39 110 -13 -62 92 -124 0 -138 -96
8021 -96 107 5 -22 39 -2 9 49 -43 95 61 -86 -5 66 -14 -103 -12 49 68 -97 32 -74 -118 -45 61 49 -22
8047 -22 25 -246 61 -99 -22 -10 -72 48 -87 -18 28 69 114 53 91 -20 68 -26 -35 77 -37 -40 -17 41 -32 66 42
8074 42 -63 -55 154 177 -72 -22 122 156 45 35 30 -42 -111 -164 114 126 -47 114 67 89 90 105 0 129 78 -54
8100 -54 62 -12 -85 -76 185 -41 -20 187 -124 46 57 45 50 -44 61 60 84 28 44 -20 41 -2 129 -46 -23 120 -30
8127 -30 -161 -216 -15 102 59 119 116 8 61 -13 135 127 -27 -62 26 279 77 -119 55 60 32 97 34 60 168 -84
8153 -84 -14 53 -11 -90 -47 -37 78 -112 -1 -135 -61 23 -162 -27 60 -15 34 156 102 26 -28 -6 121 1 81 58
8179 58 -114 -62 -118 6 -65 -144 153 64 -109 67 -106 66
8191F6
$$ Imaginary data points
##PAGE= N=2
##DATA TABLE= (X++(I..I)), XYDATA
0 0 0 0 0 0 0 0 0 0 0 0 0 0 0 0 0 -8 8 -8 8 -8 8 -16 16 -16 20 -24 26 -32 35 -40 48 -53 60 -68 76 -85 98
37 98 -107 119 -132 148 -165 182 -200 222 -244 269 -298 326 -358 398 -439 484 -533 592 -656 730
57 730 -815 917 -1039 1189 -1375 1614 -1940 2399 -3104 4306 -6732 13525 -70865 -250704
71 -250704 -70078 33390 10873 84224 67951 -128190 -121272 46892 52930 22618 75011 -32006
83 -32006 -155022 -7846 117391 -3193 -35014 56522 -3146 -55130 61594 57997 -69577
94 -69577 -22300 70021 14565 19165 69937 -56485 -138134 24882 106490 -1077 -21658 -9147
106 -9147 -103012 -68884 106634 104292 -17237 -33179 -62897 -110250 22795 145163 25739
117 25739 -77360 -19123 -19609 -37086 78317 106774 -36052 -68536 12422 1533 153 65191
129 65191 9998 -79801 -4480 59662 -13432 -23758 25583 -27389 -45575 54546 51607 -51574
141 -51574 -41941 4455 -20772 15386 74647 -9744 -89911 -17596 36181 12993 41786 41753 -59614
154 -59614 -72818 29955 51793 14686 23464 -12265 -73143 -11744 69655 25432 -20453 -1296
166 -1296 -25717 -39739 36467 55163 -26635 -40496 5446 -3594 833 41695 2825 -58836 -15853
179 -15853 35949 13750 6838 9508 -38827 -39653 37227 48948 -5002 -13807 -14056 -36064 5189
192 5189 63453 21950 -41249 -28625 -7327 -501 37015 39540 -26466 -48347 -3188 16988 18398
205 18398 29225 -4759 -53072 -22667 34130 28361 3639 -6629 -31039 -28154 26454 43348
217 43348 -672 -23507 -18577 -18057 9693 45564 16574 -37785 -32526 2124 17787 28297 18520
230 18520 -24698 -38763 -1896 25752 24422 14506 -15806 -43067 -13353 36670 32379 -3197 -20186
243 -20186 -25340 -14140 22302 36346 2703 -28428 -26244 -7951 18519 34016 7794 -31865
255 -31865 -29749 2740 22958 24593 8125 -23222 -31507 -765 28167 25529 3951 -20821 -29878
268 -29878 -3788 30855 27969 -4569 -24809 -21225 -1872 21762 25643 -23 -26261 -24613 -463
281 -463 22941 24076 -1997 -27847 -22338 5082 22491 18672 -405 -21474 -22338 2550 25460
294 25460 20214 -4460 -22197 -17149 5930 24530 18817 -5338 -22256 -16199 5876 22471 16397
307 16397 -6729 -23251 -16286 5851 20937 14253 -8746 -24222 -15226 8099 20839 10841 -9276
320 -9276 -20210 -11481 9346 21935 12893 -9332 -20866 -9279 12781 22023 9812 -10146 -18343
333 -18343 -8011 10826 19384 8095 -12472 -20397 -7229 12223 17068 4245 -13544 -19457 -6786
346 -6786 12847 18233 3685 -14767 -18677 -3976 14777 19205 3817 -13776 -16099 -1682 15550
359 15550 19392 3139 -16657 -16258 2070 16390 14981 1134 -15908 -18820 -628 17778 14819
372 14819 -2969 -16933 -16596 -788 17065 15509 -3919 -16780 -13226 995 16887 17242 -3843
385 -3843 -20098 -10994 7292 16060 13867 -1019 -19432 -15489 8492 19980 10190 -4356 -16289
398 -16289 -15940 4972 22150 11141 -9265 -16470 -12972 2068 20662 14790 -11534 -20664 -7790
411 -7790 4532 14793 16080 -5438 -24213 -9332 12976 14358 8003 -1699 -16951 -12691 12706
424 12706 19913 3476 -7728 -12456 -11947 7953 23873 4996 -17805 -13843 -3753 4210 18702
437 18702 13132 -17232 -24253 -1172 11598 12215 11818 -7094 -26692 -8581 18916 15731 4091
450 4091 -2225 -16639 -15526 13509 23017 1358 -8498 -7498 -11916 2249 22924 6677 -18194
463 -18194 -8173 4245 -48 7657 10725 -13320 -19795 6441 13959 1343 766 -6663 -19919 31
477 31 25847 10486 -9873 -6616 -10232 -9533 19081 26125 -7212 -20673 -6058 -3045 5374 24792
491 24792 8600 -23573 -14599 5936 2757 7678 14777 -9811 -23837 2060 12696 -1711 1865
504 1865 3961 -13589 -5447 18340 4277 -14997 135 5200 -5629 8545 15997 -13925 -20954
517 -20954 8200 13102 3493 10708 -1458 -26943 -8798 21671 11806 -554 2104 -16603 -24748
530 -24748 10804 26515 108 -8092 -2327 -16022 -8844 22913 14905 -13841 -6117 2777 -9058
543 -9058 3072 19562 -3260 -16507 6963 9556 -6593 2876 5164 -14744 -3534 21659 4565
556 4565 -15127 -2662 -3064 -10543 14127 23505 -11441 -23011 -1520 -190 1813 22535 9246
569 9246 -25768 -16368 9035 5424 8941 17772 -8744 -26831 1576 16678 1473 5001 6786
582 6786 -16773 -13287 17470 10768 -10083 410 2988 -12257 1585 16816 -6914 -17643 4592
595 4592 6308 -3322 8728 4296 -20639 -8855 18473 9644 -2371 3777 -9837 -20719 8579
608 8579 25290 1759 -8310 -1940 -12579 -7250 22218 17408 -12632 -11123 -1218 -7549 3812
621 3812 19769 -1222 -19659 -2642 5286 -2454 8023 9332 -14380 -11811 12638 7116 -6346
634 -6346 2963 -34 -13216 3495 18867 -980 -12051 522 -667 -2175 15012 10226 -15714
647 -15714 -12573 4954 2507 3928 12393 -5058 -21497 -2625 12588 3514 2986 3363 -13756 -12828
661 -12828 11445 12535 -3922 -2213 -1479 -10087 997 16881 3203 -10564 -1856 1011 -1843 9025
675 9025 8396 -10662 -9847 6003 4114 -317 5790 -2491 -14729 -402 13398 3030 -4461 -1738
689 -1738 -7575 -6733 10414 11165 -5537 -7661 -2141 -3659 3927 13617 1437 -12279 -4162 4001 2461
704 2461 6521 5912 -8765 -10015 4998 7743 1243 1481 -2826 -10562 -1294 11019 4113 -5597 -4507
719 -4507 -4630 -2934 7546 8049 -4940 -8242 -1212 1154 4216 8457 -275 -10527 -3480 6524 5104
734 5104 3163 1358 -6816 -7565 4429 8756 1525 -2921 -4759 -6291 1069 9255 3527 -6127 -5994
749 -5994 -3026 820 6908 5461 -5196 -8563 -971 3884 4809 4319 -1753 -8498 -3285 6028 6752 1810
765 1810 -2405 -5758 -3723 4727 7839 1600 -4361 -5461 -3024 3187 7211 2039 -6145 -6297 -1324
780 -1324 2995 5390 2398 -5108 -7568 -1052 5178 5216 1258 -3704 -6189 -1208 5684 6519 1113 -4189
796 -4189 -5240 -892 5729 6583 429 -5209 -4927 -755 4646 5785 244 -6239 -6009 -76 4781 4532
812 4532 -512 -5607 -5827 -180 5500 5077 -387 -5320 -4774 941 5744 5072 -471 -4735 -4357 899
828 899 5925 5339 -943 -5554 -3987 1464 5166 4071 -1060 -5685 -4962 749 5413 3434 -2263 -5960
844 -5960 -4058 1554 4986 3234 -1660 -5339 -3748 1978 6136 3684 -2166 -5194 -2621 2524 5410
859 5410 3817 -1916 -5322 -2704 2755 5290 2711 -2523 -5735 -3166 2516 4732 1910 -2763 -5460
874 -5460 -3284 2582 5237 1598 -3254 -4459 -2235 2025 5458 2935 -3284 -4747 -793 3452 4731
889 4731 2670 -2521 -5080 -1029 3880 4382 1454 -2842 -5303 -2204 4235 4469 -514 -3500 -4004 -2717
905 -2717 2538 5595 420 -5030 -3833 -429 2144 4443 2181 -3995 -4520 992 3664 3162 1827 -2502
921 -2502 -4942 504 5409 2365 -838 -1638 -3626 -1790 4930 4285 -2498 -4453 -1712 -763 2122 4957
937 4957 -774 -6453 -2802 1899 2308 3177 1449 -5335 -5059 2998 4628 1434 892 -1665 -5317 224
953 224 6860 2616 -2501 -1058 -1729 -2115 3894 4773 -3146 -4560 557 225 435 3263 -980 -6405 -882
970 -882 4419 793 -279 736 -4363 -4199 5386 5955 -1891 -2061 -501 -3344 1124 8355 2236 -5708
986 -5708 -2407 193 -584 4323 5452 -4263 -6524 735 1437 -28 3757 594 -7342 -2574 4839 797
1002 797 -1845 1923 -1621 -4595 3445 5396 -3001 -2871 2123 -290 58 5740 589 -6858 -955 4482
1018 4482 547 1586 3410 -5412 -7045 3691 5499 -705 507 -643 -7885 -2586 8206 3416
1032 3416 -3572 -878 -2270 -5347 3340 8030 -1478 -4538 1065 -938 -1599 5899 3432 -5750 -1657
1047 -1657 4081 -780 -1105 4121 -1795 -5611 3248 5148 -3177 -2451 1289 -3535 -1679 6753 1908
1062 1908 -6745 -2547 1242 -1479 3493 6410 -3713 -7550 1225 2897 378 4998 2661 -7709
1076 -7709 -4554 5408 2805 -269 3503 -1368 -7391 597 6357 -590 -1808 1782 -3059 -3940 4696
1091 4696 3000 -4885 -1487 2784 -2121 -419 4791 -1748 -6001 2398 4488 -1607 395 2119 -4582
1106 -4582 -2654 6671 3696 -3137 -161 -372 -4368 2122 7065 -775 -4872 -125 -1066 -2289 4689
1121 4689 4011 -5381 -4064 1957 -517 -885 4393 -189 -6191 -50 4252 -819 -293 2666 -2566 -2989
1137 -2989 4138 3069 -3096 -342 1797 -2151 608 5081 -1161 -4953 1044 2238 -1481 1888 2206
1152 2206 -4943 -4004 3427 2113 -1337 1047 -822 -4924 218 5079 312 -2028 611 -1561 -2085
1167 -2085 3852 3754 -2713 -1922 1440 -827 165 4202 105 -4585 -184 2615 -521 329 1583 -3056
1183 -3056 -3338 2583 2354 -1665 -501 -350 -2857 515 4153 139 -3024 -308 -13 -627 3079 3069 -2796
1200 -2796 -2984 1637 1270 573 2458 -192 -4275 -625 3218 1259 -191 0 -2534 -2714 2149 2931
1216 2931 -1069 -1472 -837 -2043 400 3557 751 -3007 -1235 493 155 2098 2198 -1853 -2812 872
1232 872 2419 1174 1121 -453 -2750 -441 2760 1653 -594 -887 -2037 -1694 1986 2558 -945 -2252
1248 -2252 -1112 -907 719 2691 513 -2860 -1924 672 1340 1625 1087 -1552 -2325 568 2385 1440 501
1265 501 -911 -1990 -162 2454 1686 -684 -1276 -1358 -945 1356 2142 -530 -2377 -1327 -28 949 1440
1282 1440 11 -2059 -1603 391 1512 1303 228 -1415 -1346 763 1998 1194 3 -963 -1139 253 2054
1299 2054 1480 -644 -1410 -833 78 1076 1264 -626 -1982 -1254 210 1038 805 -659 -1641 -956 664 1176
1317 1176 871 -356 -1360 -943 911 1639 596 -398 -911 -279 709 1447 797 -609 -1386 -649 731 1074
1335 1074 358 -1021 -1491 -474 624 953 200 -1004 -1463 -382 1026 1241 -200 -943 -1055 -189 1032
1352 1032 1348 356 -899 -782 210 1264 1236 -106 -1043 -972 59 1230 999 -157 -1300 -1382 37 1180
1370 1180 588 -500 -1338 -1245 -269 879 1189 -314 -1327 -1004 401 1416 1105 -10 -1306 -564 799
1387 799 1395 1099 -58 -1298 -863 741 1348 704 -308 -1234 -1200 259 1529 534 -1026 -1506 -1137 37
1405 37 1213 1036 -956 -1402 -626 439 1316 1241 -452 -1587 -298 958 1040 745 -66 -1255 -1121 1132
1423 1132 1495 211 -454 -808 -903 541 1697 395 -1390 -1244 -484 -103 1420 884 -1294 -1771 -30
1440 -30 543 929 1173 -354 -1997 -422 1617 1160 346 133 -934 -1181 1153 1938 65 -582 -582 -1111 109
1459 109 1705 490 -1456 -728 -208 -442 858 995 -1102 -1559 425 795 50 608 56 -1693 -195
1476 -195 1956 801 -469 131 -439 -975 1379 1954 -589 -1186 -19 -493 -97 1859 291 -2031 -829
1493 -829 522 -286 303 1055 -997 -2119 438 1105 -578 217 480 -1332 -623 1643 699 -1048 392
1510 392 284 -624 776 1662 -736 -1049 998 373 -548 1022 357 -1970 -516 1740 249 -832 272
1527 272 -811 -1762 894 1679 -531 -802 253 -1022 -380 2350 760 -1531 -116 481 -563 622
1543 622 1913 -554 -1748 813 809 -894 598 906 -1519 -565 1738 156 -1307 347 -50 -1224 536
1560 536 1393 -1212 -1399 707 -12 -444 1537 414 -2316 -479 1576 307 238 1338 -651 -2082 782
1577 782 2013 -115 202 459 -1749 -1104 2055 1003 -1253 -319 -273 -1695 347 1990 -592 -1646 424
1594 424 78 -793 1005 983 -1668 -912 1386 480 -323 819 41 -1578 871 1885 -457 -492 557 -875
1612 -875 -872 1963 857 -1676 -845 198 -757 189 1802 -523 -2191 -79 662 -286 718 956 -1535
1629 -1535 -1351 1104 835 -105 894 30 -1534 184 1923 99 -527 580 -395 -1078 1147 1199 -1219
1646 -1219 -712 483 -418 -458 1103 -226 -1734 -57 884 -286 -86 547 -1100 -938 1244 1053 -610
1663 -610 70 198 -1132 186 1738 216 -886 -29 157 -649 685 1276 -764 -981 439 61 -296
1680 -296 636 -77 -1402 -276 834 -192 -401 524 -529 -748 685 1053 -638 -284 488 -306 -95 1294
1698 1294 582 -904 34 497 37 552 561 -710 -792 493 557 -312 141 -132 -1036 -337 976 0 -673 12
1718 12 -331 -522 558 855 -504 -592 110 107 153 683 324 -566 -121 699 215 162 429 -542 -548 562 685 -204
1740 -204 -183 -151 -507 -246 821 -43 -736 -516 -24 -161 218 449 -507 -681 -7 396 249 354 -107 -570
1760 -570 -151 783 411 23 23 -302 -622 493 776 164 -554 -369 -320 -116 303 179 -601 -475 -94 134 542
1781 542 216 -566 -641 -20 412 481 248 -161 -541 145 511 550 -2 47 -202 96 555 550 38 -462 -616 -108
1803 -108 295 388 64 -474 -446 85 44 483 0 -349 -558 -25 455 477 166 -153 -201 36 596 448 221 -156
1825 -156 -395 121 338 423 71 -428 -385 -47 340 300 -22 -459 -554 28 181 174 -82 -346 -500 -20 521 485
1847 485 -74 -416 -105 31 348 492 188 -271 -113 122 442 431 96 -348 -256 183 218 267 -78 -559 -323
1868 -323 -61 302 45 -232 -456 -299 -148 223 302 -188 -247 -95 -17 263 347 -55 -270 -103 387 402 173 -84
1890 -84 -304 -56 253 233 132 -106 -239 -164 141 266 -107 -367 -421 -278 105 152 33 -297 -66 80 88 476
1912 476 220 -308 -145 145 304 294 17 15 -283 23 427 68 -267 -178 -324 -153 270 156 -248 -301 -286 -54
1934 -54 200 245 -179 -510 -127 277 274 286 340 -241 -116 314 360 351 108 -147 -316 330 464 187 -203 -63 -198
1957 -198 -122 341 231 -371 -421 -211 -161 -45 284 -323 -378 -178 317 55 195 77 -317 -333 397 600 -62 64
1979 64 24 -226 264 778 141 -201 -129 -28 -56 323 338 -571 -723 -20 213 -86 260 -273 -743 -248 221 119
2001 119 155 106 -460 -491 578 501 -81 40 132 -147 39 604 203 -263 -9 69 -59 185 315 -233 -531 175
2023 175 172 -86 197 8 -651 -398 437 137 -177 -101 -174 -434 381 666 -266 -191 90 123 100 757 256 -513
2045 -513 -115 263 89 229 358 -240 -527 43 226 -85 195 179 -406 -308 405 75 -143 38 104 -318 151
2066 151 433 -157 -353 272 59 8 276 258 -505 -88 375 165 -53 136 -190 -507 161 381 -240 -409 20
2087 20 -334 -321 464 178 -465 -142 -7 -321 -9 405 -16 -134 -4 311 -205 286 302 -222 -68 565 285
2108 285 -118 135 212 -461 49 486 -211 -401 83 21 -146 320 159 -527 -515 155 -67 127 381 -39 -416
2129 -416 78 371 -90 191 231 -203 -141 465 368 -137 5 -48 -229 44 519 -20 -285 165 -49 -217 9
2150 9 106 -435 -292 449 37 -105 104 -83 -461 126 456 -39 -94 125 -101 -34 408 533 -70 -229 10 -126
2172 -126 212 372 59 -448 134 -8 -180 -32 112 -328 -405 109 163 -139 51 -49 -321 26 293 85 -99
2193 -99 48 112 63 245 335 -210 -90 -1 26 88 388 127 -495 -25 171 -27 77 54 -389 -225 165 279 -69
2216 -69 -77 46 -378 -17 217 175 -331 -78 105 -37 204 318 31 40 237 52 89 216 57 -240 154 145 16
2239 16 132 53 -147 -283 123 111 -27 -204 -136 -142 103 211 173 -50 -96 72 47 251 150 -8 -204 -34 142
2262 142 73 162 -39 -68 -90 12 125 -78 -140 -134 -160 131 114 -197 -95 -91 23 -87 131 165 -68 -179 96 3
2286 3 117 144 158 -6 70 243 66 143 -27 -101 85 167 46 -92 -222 -191 -158 -10 171 101 -171 -145 22 -143
2310 -143 39 -60 -238 -110 112 138 -26 80 -40 -57 135 91 111 -165 97 -22 -90 296 122 -75 -84 -122 -108
2333 -108 -1 -17 -203 -71 -243 -18 56 -71 -198 -211 -56 37 15 -20 -26 -51 -192 232 115 185 -102 -3 128 205
2357 205 281 71 -38 33 -13 76 16 -39 -36 -228 -53 34 138 109 58 -155 -78 26 270 105 -175 23 -7 214
2381 214 114 -8 67 -28 106 69 202 156 -124 -149 3 18 233 32 -44 -281 141 -62 48 -142 -103 -90 -71
2404 -71 101 -40 -88 -130 -47 98 225 94 133 -106 -92 173 181 53 175 -83 -149 -10 -93 75 -68 -97 -28 -43
2428 -43 28 86 -70 -117 -116 -77 -61 155 -88 -112 -94 105 37 134 18 -244 150 -149 7 214 -83 -37 -77 113 -11
2453 -11 68 -150 -43 -262 -45 140 -42 -178 -128 2 -33 73 63 -238 -100 -57 -37 167 167 100 -215 34 174
2476 174 17 0 178 -17 1 232 201 -58 38 71 -2 -5 307 -132 -68 -12 -150 -249 9 205 -258 -56 23 66
2500 66 -12 172 -34 -167 -5 263 64 8 205 1 62 59 244 -1 40 22 83 -145 61 1 -178 32 -68
2523 -68 12 -14 114 -32 -119 60 -92 -149 -12 80 -47 -98 176 131 -96 -90 139 -108 83 101 6 -100 189 -126
2547 -126 -9 195 71 -291 -3 116 -67 -216 32 -205 -172 -47 276 -104 16 3 -110 31 174 -22 -67
2568 -67 95 38 34 66 100 -236 -401 55 139 -35 170 -104 -286 -54 132 10 -97 45 -170 -304 79 105 90
2591 90 -57 132 -179 9 184 117 -216 -89 12 -36 112 132 21 -196 -148 181 57 64 40 -73 -225 95 -11
2614 -11 -99 -61 -71 -157 -195 135 -138 -124 9 -72 -129 145 262 -167 -178 90 -9 124 172 -30 -83 -92 266 88 44
2639 44 1 50 -120 142 44 -99 -78 121 -122 -158 274 25 -258 -31 1 -32 -41 170 -44 -252 94 -49 71
2662 71 4 34 -150 98 289 -77 36 -142 -44 -179 85 115 -47 -162 -20 -106 -213 133 130 0 -32 22 -231
2685 -231 33 8 -50 -86 58 -40 -145 85 34 -130 -34 304 55 -69 -12 24 -34 -43 60 -131 -203 -21 -178 25
2709 25 91 76 -231 -252 47 -41 -119 123 102 -189 -45 -1 -119 20 72 -6 65 149 57 -20 77 -27 -88 -44 135 23
2735 23 136 -42 17 -66 6 -44 -25 112 -48 -127 21 -47 34 -94 -91 53 77 -71 18 45 197 -4 186 1 100
2760 100 187 25 -39 145 21 -29 49 105 -81 -11 57 -141 56 34 59 -102 -66 -76 4 -35 121 82 -98 -18 114
2785 114 -95 118 -30 -167 -22 197 -71 -63 1 23 -91 -14 -29 -148 139 36 11 -82 49 102 -8 80 -179
2808 -179 48 -72 66 45 -30 146 213 107 140 142 -23 139 -17 46 -59 -58 -3 -11 22 36 15 -70 -40 -28 -66 -38 16
2835 16 91 -107 -92 -127 61 22 -73 73 20 202 67 130 -9 -34 46 27 105 129 -11 -71 -7 19 92 40 -19 -32 53
2862 53 -204 -17 48 38 -137 -155 -11 -59 -29 -3 43 -66 -56 65 46 99 54 94 20 -130 77 123 57 -4 -18 -19 133
2889 133 115 -42 106 63 -40 -155 -137 11 -142 -15 18 -26 16 72 49 134 -53 -40 -8 -161 -3 13 98 58 -70
2914 -70 20 7 4 92 52 -109 73 -24 36 -137 -3 -4 -98 -164 84 43 -210 37 7 -80 26 37 112 47 -13 119 166
2941 166 90 89 21 84 -15 197 8 65 -17 -122 10 5 52 26 -19 -103 -32 13 -13 -57 6 -143 66 8 31 54 -101
2968 -101 -141 70 173 91 45 44 61 -6 46 33 18 85 -4 -61 30 -41 86 -6 -80 -149 21 39 24 -13 -1 -175 75
2995 75 87 20 -76 30 -199 31 49 33 89 79 69 32 -36 39 -31 13 133 -73 -24 53 108 90 -93 -94 -20 154 -81
3022 -81 -115 22 -10 -74 54 37 -55 1 -28 -131 160 3 -12 -124 -2 178 18 134 10 -50 150 -45 -92 -68
3046 -68 8 -24 -132 48 124 48 -93 -28 85 98 83 22 -124 36 -227 89 75 6 -90 -40 26 -18 43 88 -124 14
3072 14 -37 -107 -54 -49 -214 -68 31 -13 -151 -91 -48 -125 44 188 -81 30 -106 52 -8 78 44 14 -7 -189 -17
3097 -17 -28 173 -33 22 -137 166 -42 3 28 -4 -64 -93 115 -79 -103 -58 91 66 125 7 -37 -17 -16 71 -5 160
3123 160 -143 95 132 123 66 121 46 -63 -141 41 92 106 -104 -6 -76 23 27 26 -85 94 -133 96 102 -85 -85 32 -40
3150 -40 -91 117 -14 -189 1 -25 30 36 113 25 171 92 41 -43 205 23 -88 26 48 16 -114 -45 -19 98 -120
3175 -120 -49 75 41 -41 42 57 -92 7 20 -132 120 58 138 -83 -72 -64 -46 140 138 138 12 36 -91 -138 4 -78 71
3202 71 -103 23 -16 -49 89 -85 -57 -165 8 57 -129 -50 3 -49 102 -109 -53 -45 23 57 -27 145 -38 -66 -22
3227 -22 29 30 -9 -7 -68 8 29 225 -55 -84 -46 -73 -137 221 -25 52 -2 -82 -66 -11 65 -205 -133 -60 270 23 -109
3254 -109 -166 20 -129 104 -30 84 108 -29 -90 158 -69 136 -156 -86 -2 74 84 -86 -214 -190 26 75 221
3277 221 -6 -142 109 59 258 45 118 -159 56 53 55 94 46 42 -99 31 -18 26 6 -12 -78 22 -23 37 18 18 8
3304 8 -155 -61 118 -80 -49 -88 -19 -99 65 -11 -76 113 -3 30 93 -137 152 153 -12 55 69 -89 70 -84 -114
3329 -114 -51 -88 -43 -113 45 -59 103 -64 48 -42 -124 60 97 19 -22 -13 -86 65 102 38 25 -36 -72 61 -145 11
3355 11 -71 -132 -55 -11 -55 -15 21 -17 -153 -27 -196 -31 -16 -109 -89 26 123 57 43 53 -67 -94 67 95 -51 -23
3381 -23 -162 10 106 -11 25 -161 30 77 63 8 -29 63 66 -61 -31 75 0 -93 30 -36 24 125 26 4 65 168
3407 168 199 179 0 -165 -29 -36 215 -81 -188 -41 -96 88 23 -176 41 -200 -180 83 -65 -153 -94 -37 -14 31
3431 31 -134 -68 -75 -48 56 96 -20 -147 87 12 221 210 158 -150 -38 -44 65 0 85 29 -12 34 -122 44 93 -67
3457 -67 -130 135 -129 -38 -27 77 -186 -66 70 45 183 -27 -46 36 280 159 144 12 -62 -122 81 154 97 -79
3481 -79 104 -62 -83 62 100 -167 -93 80 -48 -25 -88 56 -46 -118 30 45 199 -42 -67 -36 32 83 23 -9 -209
3506 -209 -4 -74 130 -119 -83 38 -36 13 -76 -17 -115 -25 142 -48 20 8 -157 -67 -95 51 -57 -14 -21 -112 110
3531 110 17 10 -33 158 -62 -74 63 -171 59 39 -255 -17 30 -50 51 -67 -7 0 118 59 -45 -167 -38 -63
3555 -63 22 88 -98 -55 -9 144 159 -12 -42 98 -177 79 -79 198 -72 93 22 -37 83 -23 58 -3 -37 -64
3579 -64 76 -63 51 -110 -8 111 39 -11 -34 13 151 77 -81 42 91 -70 -59 -22 68 -30 56 -42 15 7 56 93
3605 93 10 21 12 -60 136 -33 -33 -57 -19 -13 73 2 -30 -77 12 2 63 -10 -135 62 -161 -4 179 100 -95 66 -66
3632 -66 -61 106 119 -196 -113 -154 -22 103 -19 46 39 -74 67 109 -90 1 -28 54 -36 123 53 -158 -61 4 110 3
3658 3 -51 -53 -89 -68 57 51 97 121 -12 3 44 87 41 -63 -164 -113 95 50 -99 17 -18 51 143 27 -135 -75 -42
3685 -42 42 72 -7 -165 42 -10 -50 111 55 95 -46 -97 36 94 33 -30 2 43 117 22 94 18 -54 -217 67 103 -31
3712 -31 70 -28 20 -117 131 -13 198 -35 49 176 42 2 -69 -137 -34 58 -1 115 117 -50 54 4 88 29 0
3737 0 -108 -16 -98 -43 -21 -143 32 83 12 137 -100 36 -210 -38 141 53 -14 -61 48 -34 97 1 17 -156 -48
3762 -48 97 -104 83 100 -13 -8 13 80 97 -93 24 -116 -86 -63 28 -5 -25 -78 -42 -59 111 227 -99 -9 -219
3787 -219 57 172 53 182 19 -54 77 -31 -103 -136 -229 -88 169 49 103 10 -29 70 112 83 -103 152 0
3810 0 85 164 -28 -138 -132 98 1 65 146 -148 21 -29 -5 110 -90 44 -121 -49 -22 86 41 -95 41 -12 89
3835 89 55 212 214 123 -48 -91 -209 -15 -35 -133 -96 -78 242 50 -52 -85 -78 -176 73 -103 -21 -25 -52 -143 62 -62
3861 -62 -6 -76 27 -70 23 -8 -104 -224 -70 -31 -107 30 -106 -98 -7 -8 138 69 -97 -35 -123 1 6 -50 -104 -18 36 58
3889 58 76 229 -21 28 114 54 -27 -53 -17 -12 5 106 85 86 129 71 110 154 43 -20 78 -52 -16 67 106 136 -66 -122
3917 -122 -53 90 -161 -63 -153 182 -48 80 109 109 53 -60 -38 58 -57 -14 -32 49 102 67 190 -154 -197 68 124
3942 124 -12 85 25 95 104 -49 232 68 -88 -213 -131 -110 80 37 -76 60 27 -55 62 162 -54 -113 -19 121
3966 121 112 52 19 78 -89 -17 50 24 -11 -120 -95 -20 1 -155 -33 -7 -112 92 -62 192 50 104 -27 19 64
3991 64 -34 28 -61 15 -21 -17 -15 1 39 -46 123 245 -53 -16 -4 -62 22 36 -39 31 -117 234 -61 75 37 -156 -198
4018 -198 51 -22 4 -102 -70 195 3 2 -63 15 -109 62 -143 20 55 30 -37 -76 51 99 189 -29 -92 -35 19
4043 19 -129 79 100 135 -111 -12 132 -37 47 -133 -240 92 62 -10 -56 34 -156 -157 36 -20 15 -144 -152 165 -133
4068 -133 83 26 -19 71 51 84 -69 -8 94 -12 -8 -4 -12 30 -168 28 66 104 40 2 68 151 82 83 67 17 -26 -27 -69
4097 -69 75 -41 -18 -87 178 54 33 -3 55 -28 -12 44 87 -83 -63 -119 110 2 -120 82 -69 -88 29 9 143
4122 143 -65 133 -19 137 -52 218 -43 -71 44 -74 -7 10 -94 -98 -112 -74 9 46 -63 -34 -170 -98 -11 -30
4146 -30 60 45 -187 173 -93 -55 -107 -45 113 -46 -81 -10 -46 23 -223 -113 -47 65 265 -70 -19 -51 -69 -17 -5
4171 -5 -39 -44 97 -13 11 -113 -17 -121 -21 119 -82 38 -68 -108 -3 148 154 -137 -43 -152 55 114 27 29 32 -62
4197 -62 135 -30 78 -40 67 -124 50 -9 -20 -29 -141 -29 -14 -39 127 -90 -11 33 18 -76 -19 -27 -61 -157 -128 -44
4223 -44 -5 11 -124 61 -76 -40 -43 12 97 -107 -101 -61 48 -155 -69 24 -85 -35 35 128 -240 52 145 -5 24 124
4249 124 13 113 33 -59 188 -47 -194 -106 -85 126 75 109 -51 -7 28 9 100 -18 35 -21 67 -59 -13 68 27
4274 27 235 101 65 12 -6 23 33 -120 44 84 -10 21 30 32 -8 186 -109 89 39 20 39 74 -126 -205 -35 38 66
4301 66 24 64 -198 27 -24 27 -68 121 -53 -96 87 2 -22 15 -64 -19 -66 -40 75 66 -34 -6 134 180 -75 70
4327 70 -109 -22 75 19 38 -25 35 -37 -88 -5 84 58 38 35 2 -25 94 45 -23 170 60 127 -157 -58 69 -39 -11
4354 -11 47 -90 74 14 -108 38 116 80 -119 -143 -179 -44 25 9 2 127 -94 23 -60 -27 42 13 132 90 44 41
4380 41 8 -173 55 19 144 -56 131 -16 -70 41 -117 34 -29 -86 -19 33 18 24 81 31 31 48 -76 34 -125
4405 -125 172 -70 -16 81 48 -37 84 69 80 -18 -49 -4 -147 -41 78 9 -9 -135 -24 52 -2 113 -118 -68 -10
4430 -10 69 54 41 -174 -79 60 32 100 11 24 -60 -6 124 -29 7 115 14 -6 24 3 -19 -54 84 144 -2 19
4456 19 -65 -73 160 -20 -35 148 -146 42 -15 103 133 224 26 -113 26 63 114 -66 108 2 117 -176 -68
4479 -68 75 -62 38 21 173 90 9 0 108 -30 -42 -29 6 177 -115 -84 -98 28 -66 159 -10 149 -19 -27 99
4504 99 14 43 -36 18 165 81 -60 7 -110 -53 140 101 56 136 106 96 156 46 114 -157 -51 12 -187 58 21 -15
4530 -15 -44 -14 -116 76 23 -84 66 -44 -110 64 -187 -67 98 -5 41 92 -85 -89 -60 -28 39 31 -90 -187 -209
4555 -209 86 -20 55 95 -261 -11 26 64 112 104 78 90 -120 36 50 -31 150 -140 -9 181 -18 -44 2 51 -3
4580 -3 -18 -122 -1 102 120 100 -75 -24 -106 -60 -77 106 -74 92 -123 -182 2 34 34 119 -21 36 -63 2 -2 -51 -91
4607 -91 113 64 94 35 -138 -219 52 -171 -15 -6 -64 214 -56 10 114 -37 -92 -46 117 73 -60 26 -75 -10 -98
4632 -98 -1 69 30 37 -120 -31 -78 -62 -121 192 -35 -108 -83 -16 66 -184 114 19 74 -1 -19 -124 54 77 22 8 70
4659 70 -51 -134 -26 46 48 -79 20 -71 38 -83 74 -140 54 -67 -33 81 95 189 -25 -45 -170 23 -116 -25
4683 -25 43 31 -80 80 -45 -34 -105 59 -25 -75 -19 -78 -31 134 26 -30 -55 -117 37 -49 -165 61 80 -81 16
4708 16 -160 41 -16 45 123 -94 111 60 15 -13 -5 -17 -52 -115 118 -145 89 -36 -60 -93 -62 75 -36 -45 21 -41
4734 -41 89 34 178 27 55 31 87 52 239 -110 37 -55 -44 -113 50 -31 -92 -45 19 -37 -82 62 -70 -88 -147 -124
4760 -124 -41 -185 102 -60 -124 218 64 159 6 69 -44 -50 72 -18 -1 -229 -66 51 28 -22 9 279 69 -152
4784 -152 -31 46 -141 -116 -32 3 -79 -13 65 -9 -86 -109 -1 -57 70 -191 -22 28 -75 38 14 139 46 -20 24
4809 24 -32 -37 7 -11 -70 -27 27 214 -48 41 -64 -29 -72 141 90 -180 9 -73 -156 90 -113 76 -66 -30 -5 -77
4835 -77 74 -126 -13 -142 -73 32 -66 68 63 16 24 1 -74 84 -17 51 49 79 -65 39 -91 -13 134 17 -31
4860 -31 64 16 22 -72 -111 114 99 93 -131 66 -42 -22 111 18 12 -58 31 -64 -81 -62 8 -97 73 -75 -48 71 -136
4887 -136 -33 54 143 33 22 41 42 21 46 161 13 -132 -72 20 -27 84 47 -5 -16 -37 79 0 -105 11 -53 31
4913 31 -89 -9 -14 -163 -102 -185 59 -102 -64 29 -223 174 37 -93 -5 -67 7 62 98 26 -61 -103 -45 53 -109 0
4939 0 -47 13 -140 -68 37 81 -79 -37 195 140 -60 -22 -81 106 91 50 -122 71 12 11 3 81 68 -62 -121 34 -117
4966 -117 -182 60 123 -10 32 11 -49 7 60 -123 166 20 195 -2 -62 -43 -21 -119 -63 115 89 -48 -195 100
4990 100 -39 34 15 -50 31 45 -10 -30 -140 75 -72 -30 -91 -70 112 -12 41 -53 168 -38 90 -89 -88 -16 49
5015 49 162 -15 -22 115 -15 97 -44 -51 -21 53 7 39 -45 78 46 46 -108 66 146 -42 -83 -125 263 105 -8
5040 -8 82 -73 -37 68 55 4 101 111 56 -75 145 90 -23 60 -5 -64 -28 114 -19 -202 -24 -88 -97 -89 -144 -109 -65
5067 -65 -16 -9 99 59 -60 63 -86 74 -84 -90 0 -128 10 7 20 -90 -103 -91 80 3 41 -60 -71 -181 -26
5092 -26 22 135 101 -116 -124 8 45 63 114 -54 -68 -47 -14 132 -156 -101 55 7 8 17 -66 120 23 11 63 -21 0 -93
5120 -93 -122 -5 80 7 -62 28 -119 -35 31 -162 46 3 -115 -79 -94 -81 81 -72 -29 24 27 68 4 -42 58 29 -88
5147 -88 112 4 156 80 98 -62 117 -37 -168 -74 -6 154 59 -74 -43 -72 44 -50 20 -31 -169 51 -33 23
5171 23 86 -105 -116 17 62 1 145 -38 -127 48 174 83 -64 90 37 31 18 -20 29 124 -92 3 -90 188 203 -74
5197 -74 -108 64 10 -28 -149 19 -79 -90 -21 7 -9 115 -108 -7 -138 -125 -27 -33 -27 -73 238 -223 119 -56 71
5222 71 -4 -97 58 41 8 47 -33 102 112 26 -109 -102 -75 -5 114 -25 -81 -112 38 65 15 -53 78 -148 -1 3 -47
5249 -47 -84 -77 -10 106 22 -90 40 -88 -168 -2 69 -65 37 60 -127 151 76 -40 -116 57 73 -201 87 -86
5273 -86 -140 -127 -33 -97 77 -4 117 -25 -93 78 -177 73 -204 121 71 89 -32 43 -16 -46 -5 -67 43 -92 -17
5298 -17 63 -115 -77 -6 -29 65 8 16 55 67 -58 17 -37 -50 -12 -60 -11 9 -39 178 75 8 116 -75 143 -45 -31
5325 -31 -57 98 -100 21 -39 14 -32 -50 -162 -230 105 38 13 23 20 3 128 150 -46 -106 -113 0 24 -105 133 31
5351 31 60 -35 34 51 202 24 96 -68 86 122 129 4 -191 -6 -107 10 -45 -139 -16 86 135 -70 -40 -103 -164
5376 -164 9 87 -89 -106 39 82 -116 -88 51 -97 -115 -17 46 167 -184 67 33 -77 50 66 29 89 19 50
5400 50 144 65 -3 -5 -8 -26 8 -22 -50 -1 -14 -96 62 123 -136 -10 -2 -34 -84 -64 53 44 -134 -96 17 123 106 -77
5428 -77 55 48 -15 7 67 -3 -79 -35 -127 -103 2 101 12 61 60 60 -28 75 -32 140 40 88 36 -21 18 8 -63 63
5456 63 71 86 -65 113 26 43 -34 156 83 -19 -33 167 -20 -24 8 57 36 -1 129 -118 -35 -33 -33 117 67 10 18 35
5484 35 13 53 -44 5 -52 38 151 -34 100 48 156 -93 51 148 -187 -77 -81 -58 -48 1 73 2 42 -29 126 61
5510 61 3 -7 20 -42 58 1 -75 -99 18 71 5 -13 97 -78 131 40 64 181 -35 127 -62 -19 75 -36 -99
5535 -99 -39 86 174 -51 74 29 -5 58 -77 55 -19 12 -64 65 -16 35 279 -76 -16 55 58 1 61 -58 14 -60
5561 -60 38 37 68 1 -149 183 63 -52 13 -81 -43 -16 -25 75 18 60 154 -53 -95 14 83 59 46 -36 38 208 -6
5588 -6 -98 -33 94 30 18 241 -227 -32 109 151 -99 106 -249 78 -116 35 81 -51 48 -7 -124 8 114
5611 114 50 -28 -46 -110 -131 204 79 -86 224 141 -34 -104 74 -31 -75 110 76 45 -75 -130 -10 -107 74 -75
5635 -75 11 -23 21 100 -96 -69 129 -67 114 100 41 -81 72 80 -105 -147 268 118 0 -29 -25 95 72 50 -4 61
5661 61 -52 12 -121 -115 13 -199 131 -24 109 79 8 -4 1 -47 141 -169 -68 -55 -110 102 82 -53 -83 -132 -151
5686 -151 -6 114 95 -73 -16 -68 111 -42 -5 -11 -34 -40 -13 -87 -17 109 -111 43 126 119 -57 61 8 9 -41 55 19
5713 19 -159 21 -21 26 29 -120 96 18 -59 121 82 51 -142 -124 -56 -40 189 58 71 -182 -40 -21 147 -4 -16
5738 -16 -100 76 30 101 40 32 60 -71 21 -121 128 57 128 -90 81 -82 -127 60 -4 114 20 145 -67 -2 -178
5763 -178 -95 -59 -100 -48 -94 -22 -159 59 6 -29 128 -5 -40 -62 -49 28 -18 -103 4 145 -169 160 -24 -104 -54
5788 -54 -16 -13 52 25 86 29 -10 64 -107 27 165 -11 31 -129 -24 -71 -80 140 -59 140 13 -147 -80 -4 105
5813 105 -38 76 23 -40 158 95 251 103 -3 32 56 -8 -115 -61 -80 23 -24 -112 45 45 -123 66 157 -49
5837 -49 10 15 -25 -86 27 141 11 -100 -39 -126 102 -31 -105 50 -34 29 195 -154 -88 14 -120 -5 71 -32
5861 -32 -61 -7 193 11 88 85 -74 134 -21 -31 -6 7 19 -117 -5 47 28 -30 -55 109 -37 -48 -147 -76 -42 57
5887 57 -59 -34 140 -44 -67 29 -13 -41 77 86 -20 -38 -55 34 65 -3 -134 12 127 -15 103 -46 97 18 2
5912 2 20 -32 21 -39 -136 -23 -36 -106 134 66 -148 -73 119 89 -19 -71 -148 -45 -24 59 91 -10 -28 -81 46 -10 26
5939 26 42 -69 69 -40 98 204 -75 35 149 166 75 49 62 -55 -50 -59 -113 47 -33 166 -86 44 -47 -3 -13
5964 -13 -178 -157 134 -16 -95 -73 27 128 -13 186 182 -31 -116 -62 27 185 -115 21 -32 -26 -113 -62 -119 -59 97
5989 97 -136 160 -14 -35 -197 65 7 86 101 46 15 -198 -42 10 -95 -34 39 67 78 105 -44 55 -61 112 78
6014 78 -51 139 -156 115 -13 85 108 -10 192 52 78 -77 31 -17 -9 31 93 62 148 -25 20 39 -81 66
6038 66 27 41 -67 160 -75 -35 -45 -111 160 -221 -31 151 105 122 -4 -45 -103 -9 -104 -93 35 123 -83 -136 18
6063 18 -139 81 25 46 273 125 -143 -40 9 65 187 -10 116 17 48 104 94 36 -48 63 12 56 44 80 -152
6088 -152 8 39 -32 -65 -11 -30 98 -129 -24 13 -10 -6 -28 -60 25 173 -201 -57 8 -58 -99 85 63 -53 -7 26
6114 26 114 120 -79 104 85 -49 42 -132 -169 -138 58 -60 -68 -24 119 5 -20 -9 93 26 -5 75 -15 103 135 -38
6140 -38 98 16 -101 8 52 -33 43 55 60 1 -49 -66 24 83 -5 -58 59 49 -93 -85 5 46 32 -35 -38 -81 -80 8 -26 104
6170 104 88 99 -186 58 133 26 107 35 7 42 -74 97 -123 -29 38 65 95 150 42 -27 -25 68 -55 126 26
6195 26 -91 -127 163 -26 -33 -132 -33 42 -105 31 -3 -103 93 -70 -13 11 -13 -16 47 98 -111 -1 55 -87 -63 62
6221 62 62 -142 30 114 -134 -9 52 167 -61 96 -111 44 -88 22 36 -81 155 42 -30 78 -25 -39 -4
6244 -4 -23 -60 -21 10 -50 -94 -6 -58 -45 -92 20 -16 -143 38 -70 -237 7 30 -188 10 124 67 -30 -49 145 -109
6270 -109 -138 176 -64 -34 -142 -72 -115 205 170 67 -179 112 -74 174 -96 187 -87 64 54 128 -53 -77 44
6293 44 41 73 184 -108 -50 -58 2 -77 -44 -55 -26 -102 -72 39 94 89 59 44 99 11 18 -43 -132 -6 172 168 -3 -60 91
6322 91 -73 83 9 -58 19 -66 113 58 -1 62 5 -48 109 63 -81 -94 -163 51 39 77 -97 -97 37 -1 110 -111
6348 -111 -10 26 -49 50 50 -12 61 50 -105 -29 17 -62 -59 -125 -56 -67 -19 86 -82 -83 15 77 104 -35 16 -132 11 -44
6376 -44 -38 39 -59 -26 -150 99 266 219 -15 -15 -100 -37 -106 77 67 42 -88 -111 -10 3 -6 49 -76 -141 -4 118 246
6403 246 -58 1 69 57 24 114 -198 -34 -38 -60 55 91 51 -9 -30 -27 -3 -179 54 -25 -55 -9 208 -189 15 -43
6429 -43 -111 26 15 -60 -38 77 -119 -12 -103 77 -49 -39 21 -20 13 94 32 -11 83 205 -18 -9 104 44 114 81
6455 81 116 -19 -95 -173 -68 -3 62 16 82 10 -117 100 142 112 -6 46 -4 91 -110 -5 -147 -99 0 50 -43 -32
6481 -32 -103 -14 91 -5 32 106 -146 -151 29 39 -38 -151 50 -9 78 29 -63 101 -132 42 137 15 -49 -229 -3
6506 -3 -151 30 -2 -45 -8 -13 19 48 -102 -16 17 15 44 57 183 -4 -17 -42 -59 -63 72 -33 -59 -145 101 91 -132 -140
6534 -140 -80 4 -79 45 -87 130 -57 -93 292 44 -65 153 -153 -40 -34 -10 64 -19 65 -65 111 43 68 168
6558 168 158 -37 -62 -116 -187 48 -172 69 -38 -4 22 71 58 31 74 2 114 -2 25 38 -2 -21 -28 -93 -27 -64 49
6585 49 -95 65 -31 -93 16 44 100 -23 -102 -48 103 -131 101 150 -100 25 -156 -26 -9 -12 7 146 -97 -30
6609 -30 -75 -38 -10 0 46 158 -166 9 -83 -118 -91 -63 28 -39 11 -75 17 82 47 -131 6 -60 2 -42 1 -88 -178 95
6637 95 15 -56 34 13 -92 -13 -53 -47 74 22 44 -1 -143 47 73 -29 -30 -6 -83 127 36 -97 64 86 4 -125 -23
6664 -23 -149 -122 98 98 -74 -50 -36 -65 -99 30 -39 -34 89 -78 -122 36 41 -117 -40 -69 93 -53 -27 113 8 39
6690 39 37 -60 250 99 81 -127 59 -18 64 67 -134 52 -50 34 52 -104 -91 40 -63 49 153 19 -73 113
6714 113 56 30 24 -79 66 -9 41 -14 108 30 110 82 -91 -87 -49 72 8 87 68 0 -5 -90 105 112 2 -21 54 85
6742 85 98 -2 -44 -51 81 -55 75 34 -84 65 45 -118 98 -157 116 123 -37 250 -61 -5 32 -163 174 -43
6766 -43 -64 -23 -8 -47 64 -60 -60 -150 -46 -150 55 -54 138 45 37 14 -80 -2 -24 31 105 23 -66 -57 -173 -98 -194 -156
6794 -156 66 178 12 -45 -128 -49 90 0 -396 -9 216 156 -86 -14 0 -86 30 43 -138 -135 111 43 -82 153
6818 153 61 -30 51 -126 92 79 -5 -121 -116 -88 94 116 -137 145 -70 85 41 204 -13 -57 -128 -195 13 14 -74
6843 -74 -61 157 -15 -10 -108 -101 -198 -82 -61 91 -22 -74 140 -60 -38 -24 85 -30 -55 -47 103 -7 -12 -26 56 110 -43
6870 -43 142 123 64 21 65 -34 233 93 -8 -19 -86 -144 1 52 -66 -87 -76 -5 -26 13 102 -125 -42 -45 47 120 -98
6897 -98 -42 16 -102 -42 22 14 -56 -20 -111 -92 24 13 -36 101 -110 -148 137 32 -41 -81 23 -170 64 -48 -64 8
6923 8 -11 165 171 -3 -48 13 -27 109 18 -15 -81 0 86 -57 -10 -68 57 41 36 80 2 -49 -24 -9 -56 125 66 -78
6951 -78 102 -8 -16 -14 -4 -77 -63 64 -60 2 166 -14 -15 -124 79 61 -152 97 -1 -185 2 -152 133 12
6975 12 -139 26 -135 -39 -157 -105 126 -111 61 -26 136 -134 -28 184 -49 -55 24 56 -46 87 73 116 -72
6998 -72 9 66 1 -9 -43 -64 3 31 31 2 -30 -11 -6 -22 53 -10 15 69 -1 80 35 -90 146 -143 20 -7 23 -79 28
7027 28 81 69 13 -54 -120 -123 -91 -132 8 30 -175 136 -28 -137 -78 -39 14 3 -36 -47 -66 23 64 12 93 -60 -61 23
7055 23 -97 53 -25 34 -15 -19 -34 -95 -52 -68 29 -37 -34 80 75 -72 5 -44 13 34 36 -176 -22 -37 59 -26 -210 -42
7083 -42 84 85 -76 -114 -59 -58 26 45 -17 -4 130 -17 -64 60 8 66 150 -47 -39 30 11 33 18 -32 75 -80 68
7110 68 -54 -86 -97 41 47 -67 -149 -68 105 60 134 -52 -86 0 21 -99 -43 -156 1 -181 46 -117 11 5 170
7135 170 -69 -68 57 -152 -17 -106 -88 -178 87 72 53 -188 84 -105 49 18 10 103 147 43 -56 27 -30 -75 49
7160 49 60 -47 -54 -86 -47 75 -79 17 173 152 -63 -75 -83 -70 -11 72 15 -47 22 -69 46 41 -80 8 76 -119 -21 116
7188 116 -110 190 50 -16 57 -45 31 -170 245 -14 -36 4 -30 -26 30 -37 60 109 -51 35 -170 -6 195 83
7212 83 -33 189 -110 -42 136 -217 -82 8 -133 19 -10 -153 -121 -9 -40 -36 55 -141 49 73 81 29 25 48 -22 -11
7238 -11 -172 100 13 4 -183 75 -86 -42 48 34 -46 -68 -31 14 80 40 81 -155 65 141 -52 -145 0 75 -3 -34
7264 -34 6 -18 13 -142 -60 4 -43 -30 33 89 11 204 -59 -45 14 -18 159 104 17 89 19 -15 82 -92 -5 -45 -91 -74
7292 -74 -27 55 -66 -16 43 -17 80 -12 49 -62 74 11 -135 -77 75 16 1 -14 7 52 50 -11 -167 54 5 -79 -86 -2
7320 -2 -34 -20 -40 88 -29 86 141 -26 -124 -17 29 136 -37 -104 86 -101 -98 4 5 69 152 -78 -44 -41 -42 -4 -92
7347 -92 -8 34 51 -34 5 79 117 -18 -119 -67 85 -180 -62 29 -40 -39 132 45 82 -81 75 154 -104 -14 126 199
7373 199 15 27 -40 57 -104 77 -99 44 -66 -174 50 -56 -79 -56 -43 75 -79 -127 75 11 115 -10 -46
7396 -46 -80 -136 60 8 95 36 -114 -2 96 -50 -9 25 -9 104 69 -53 -23 17 -123 -39 9 -14 149 -95 -144 -89
7422 -89 -4 -125 -39 -58 28 -36 28 42 86 84 30 -82 146 -36 131 -129 41 -155 25 79 -1 -66 5 40 -65 40
7448 40 -32 155 -13 44 30 -97 190 129 -32 173 20 101 -30 113 3 -147 -51 52 -94 -100 77 -31 -12
7471 -12 -7 29 -131 -149 -124 -36 46 -22 -50 68 -49 63 -47 145 139 -104 12 -9 -145 -43 -84 82 -9 10 -56 98
7497 98 34 -57 19 -15 145 6 -112 -131 7 -99 -12 20 133 -66 -24 -48 -75 54 -78 22 95 -99 8 -100
7521 -100 94 86 -101 -14 85 -5 131 20 -160 -50 -67 36 107 -104 106 -41 -19 -133 43 -181 182 -38 4
7544 4 3 -98 154 0 142 -94 151 -129 -138 -12 169 -30 -9 113 -73 -30 -77 32 -58 -2 -15 4 -5 38 184
7569 184 -6 -46 20 -125 -76 -28 -215 23 13 160 -5 -88 -103 -3 -117 22 74 -13 -9 50 113 73 35 1 19 -97
7595 -97 -46 72 84 -147 35 -67 57 32 -52 35 -60 -56 200 -61 -46 -7 24 -152 102 -15 17 69 9 -30 -158
7620 -158 -36 -81 -88 114 -59 53 34 26 -48 -156 149 109 11 -78 43 19 51 44 76 -53 -10 5 -116 146 60 25
7646 25 -75 19 9 55 120 61 24 -38 91 37 -45 -40 37 -57 -164 25 -30 13 -236 -11 -146 106 14 38 -12 121
7672 121 -18 -41 66 18 -13 -157 25 -59 -59 5 110 -70 -6 178 -188 47 -26 -98 3 28 110 39 -15 -54 63
7697 63 31 93 -88 -54 150 117 39 -47 -41 103 75 -31 128 55 -89 -11 92 -8 9 -37 24 119 -120 -67 52 68
7723 68 8 -36 31 -110 -19 101 64 90 -80 98 -4 83 74 -27 -11 -25 78 19 -61 -32 -126 -22 120 -137 -48 33
7749 33 80 -5 74 -91 -57 -65 -27 81 -6 38 -61 6 77 200 -87 88 6 32 50 -50 29 -24 -71 32 -144 -11
7775 -11 28 -15 26 63 28 129 -122 58 87 45 71 67 151 166 -4 -59 -181 167 18 18 -108 -53 124 49 -10 -51 10
7802 10 136 66 180 -21 47 -64 -90 39 58 71 167 -65 -57 131 -7 168 190 -42 -25 -66 -69 157 -149 41 43
7827 43 76 39 -143 23 -90 -23 -80 -14 -44 24 109 173 1 14 132 12 12 -36 69 -6 -199 -58 14 -143 -17
7852 -17 -2 12 -77 -99 90 38 77 45 22 -14 66 24 105 101 47 37 -28 140 -14 -39 -138 -9 -25 72 28 -81 -71 -61
7880 -61 45 83 102 94 -155 59 -63 17 -100 -65 -68 -92 65 39 201 55 45 35 -17 32 -114 -36 -14 -96 11 -23
7906 -23 42 -63 -69 -105 30 -6 37 37 0 76 -46 12 -15 11 -53 -122 42 68 -176 -65 34 33 13 154 12 -160 -143
7933 -143 -110 17 -97 14 -54 -45 -93 -86 25 89 50 25 7 28 -102 25 -9 -135 -17 29 -9 -19 -122 108 8
7958 8 123 -67 -31 -53 -95 46 53 36 -19 -9 -163 190 59 49 7 -35 52 -11 -185 29 16 -25 4 75 -120 -90 153
7985 153 -9 19 -54 -27 64 -87 26 -8 156 101 -86 71 -23 88 -63 -13 72 -158 -36 -11 -33 -44 -58 36 71
8010 71 1 -21 145 65 3 -62 -18 -83 10 -120 74 109 -87 -1 -91 -42 -169 -74 -33 170 145 -14 -201 42 52 -124
8036 -124 42 45 118 129 11 103 87 -26 -98 -74 7 -26 -92 -77 97 -38 -153 -9 15 6 -135 -59 -119 29 4 14
8062 14 -23 104 -1 60 101 -100 48 -39 163 81 70 96 -36 -50 67 145 -1 60 32 -30 27 -122 -16 38 72
8087 72 2 -51 -68 -39 -34 -30 -76 -42 -181 -93 -14 -246 -7 -139 65 59 -25 -91 -187 138 109 114 -14 44 24 31 -88 -29 57
8116 57 0 -54 63 79 -40 -6 -123 -6 -177 68 94 -110 46 -15 140 105 20 -166 27 -70 48 69 -51 -40
8140 -40 -72 -33 -127 111 -18 111 -32 -37 -105 35 -106 54 -26 40 70 59 -49 141 6 -133 94 -2 -80 -147 65
8165 65 13 41 39 152 -40 -70 -39 -25 -52 82 -29 76 -36 31 96 -58 -47 -3 53 27 111 -23 -139 64 46 3
8191C
##END NTUPLES=NMR FID
##END=
