##TITLE=1H_LR-746-R3a-CHL
 CDCl3
 8 sc, 
 8.04.2022
##JCAMPDX= 6.0         $$ Bruker NMR JCAMP-DX V2.0
##DATA TYPE= NMR FID
##DATA CLASS= NTUPLES
##ORIGIN= UXNMR, Bruker Analytische Messtechnik GmbH
##OWNER= root
$$ XWIN-NMR		Version 3.5
$$ Fri Apr  8 11:37:58 2022 Russian Standard Time (UT+4h)  she@DPX200
##.OBSERVE FREQUENCY= 200.13135
##.OBSERVE NUCLEUS= ^1H
##.DELAY= (6, 6)
##.ACQUISITION MODE= SIMULTANEOUS
##.ACQUISITION SCHEME= undefined
##.AVERAGES= 8
##.DIGITISER RES= 18
##SPECTROMETER/DATA SYSTEM= spect
##.PULSE SEQUENCE= zg30
##.SOLVENT NAME= CDCl3
##.SHIFT REFERENCE= (INTERNAL, CDCl3, 0, 15.7039)
##AUDIT TRAIL= $$ (NUMBER, WHEN, WHO, WHERE, WHAT)
$$ ##TITLE= Audit trail, XWIN-NMR		Version 3.5
$$ ##JCAMPDX= 5.01
$$ ##ORIGIN= Bruker BioSpin GmbH
$$ ##OWNER= she
$$ F:/spectra/data/she/nmr/H-F/1/audita.txt
$$ ##AUDIT TRAIL=  $$ (NUMBER, WHEN, WHO, WHERE, WHAT)
(   1,<2022-04-08 11:36:48.31 +0400>,<she>,<DPX200>,
      <created by zg, POWCHK disabled, PULCHK disabled
       configuration hash MD5:
       00 E9 B6 7A A2 85 ED C7 34 08 36 98 17 FE 4E 26
       data hash MD5: 16K
       23 45 73 76 C5 1D 87 A7 2F EF DC 2F 79 0A DC 2E>)
$$ ##END=
$$ 
$$ hash MD5
$$ BE DB 5C 88 37 AA FE FD 98 DA 8F E7 0F 5F 00 DC
##$RELAX= 
##$RELAX= 
##$RELAX= 
##$RELAX= 
##$RELAX= 
##$RELAX= 
$$ Bruker specific parameters
$$ --------------------------
##$DU= <F:/spectra>
##$EXPNO= 1
##$NAME= <H-F>
##$PROCNO= 1
##$TYPE= <nmr>
##$USER= <she>
##$AMP= (0..31)
100 100 100 100 100 100 100 100 100 100 100 100 100 100 100 100 100 100 
100 100 100 100 100 100 100 100 100 100 100 100 100 100 
##$AQSEQ= 0
##$AQ_mod= 1
##$AUNM= <au_zg>
##$AUTOPOS= <>
##$BF1= 200.13
##$BF2= 200.13
##$BF3= 200.13
##$BF4= 200.13
##$BF5= 200.13
##$BF6= 200.13
##$BF7= 200.13
##$BF8= 200.13
##$BYTORDA= 1
##$CFDGTYP= 0
##$CFRGTYP= 5
##$CHEMSTR= <none>
##$CNST= (0..31)
1 1 145 1 1 1 1 1 1 1 1 1 1 1 1 1 1 1 1 1 1 1 1 1 1 1 1 1 1 1 1 1 
##$CPDPRG= <>
##$CPDPRG1= <>
##$CPDPRG2= <>
##$CPDPRG3= <>
##$CPDPRG4= <mlev>
##$CPDPRG5= <mlev>
##$CPDPRG6= <mlev>
##$CPDPRG7= <mlev>
##$CPDPRG8= <mlev>
##$CPDPRGB= <>
##$CPDPRGT= <>
##$D= (0..31)
0 1.2 0 0 0 0 0 0 0 0.06 0 0.03 0 0 0 0 0.0002 0 0 0 0 0 0 0 0 0 0 0 0 
0 0 0 
##$DATE= 1649403407
##$DBL= (0..7)
120 120 120 120 120 120 120 120 
##$DBP= (0..7)
150 150 150 150 150 150 150 150 
##$DBP07= 0
##$DBPNAM0= <>
##$DBPNAM1= <>
##$DBPNAM2= <>
##$DBPNAM3= <>
##$DBPNAM4= <>
##$DBPNAM5= <>
##$DBPNAM6= <>
##$DBPNAM7= <>
##$DBPOAL= (0..7)
0.5 0.5 0.5 0.5 0.5 0.5 0.5 0.5 
##$DBPOFFS= (0..7)
0 0 0 0 0 0 0 0 
##$DE= 6
##$DECBNUC= <off>
##$DECIM= 32
##$DECNUC= <off>
##$DECSTAT= 4
##$DIGMOD= 1
##$DIGTYP= 9
##$DL= (0..7)
0 120 120 120 120 120 120 120 
##$DP= (0..7)
150 150 150 150 150 150 150 150 
##$DP07= 0
##$DPNAME0= <>
##$DPNAME1= <>
##$DPNAME2= <>
##$DPNAME3= <>
##$DPNAME4= <>
##$DPNAME5= <>
##$DPNAME6= <>
##$DPNAME7= <>
##$DPOAL= (0..7)
0.5 0.5 0.5 0.5 0.5 0.5 0.5 0.5 
##$DPOFFS= (0..7)
0 0 0 0 0 0 0 0 
##$DQDMODE= 0
##$DR= 18
##$DS= 0
##$DSLIST= <SSSSSSSSSSSSSSS>
$$ [...]
##$SUBNAM2= <"">
##$SUBNAM3= <"">
##$SUBNAM4= <"">
##$SUBNAM5= <"">
##$SUBNAM6= <"">
##$SUBNAM7= <"">
##$SUBNAM8= <"">
##$SUBNAM9= <"">
##$SW= 18.05172834244
##$SWIBOX= (0..15)
0 0 2 0 0 0 0 0 0 0 0 0 0 0 0 0 
##$SW_h= 3612.71676300578
##$TD= 16384
##$TD0= 1
##$TE= 0
##$TE2= 300
##$TE3= 300
##$TEG= 300
##$TL= (0..7)
0 120 120 120 120 120 120 120 
##$TP= (0..7)
150 150 150 150 150 150 150 150 
##$TP07= 0
##$TPNAME0= <>
##$TPNAME1= <>
##$TPNAME2= <>
##$TPNAME3= <>
##$TPNAME4= <>
##$TPNAME5= <>
##$TPNAME6= <>
##$TPNAME7= <>
##$TPOAL= (0..7)
0.5 0.5 0.5 0.5 0.5 0.5 0.5 0.5 
##$TPOFFS= (0..7)
0 0 0 0 0 0 0 0 
##$TUNHIN= 0
##$TUNHOUT= 0
##$TUNXOUT= 0
##$USERA1= <user>
##$USERA2= <user>
##$USERA3= <user>
##$USERA4= <user>
##$USERA5= <user>
##$V9= 5
##$VALIST= <valist>
##$VCLIST= <CCCCCCCCCCCCCCC>
##$VD= 0
##$VDLIST= <DDDDDDDDDDDDDDD>
##$VPLIST= <PPPPPPPPPPPPPPP>
##$VTLIST= <TTTTTTTTTTTTTTT>
##$WBST= 1024
##$WBSW= 4
##$XGAIN= (0..3)
0 0 0 0 
##$XL= 0
##$YL= 0
##$YMAX_a= 802656
##$YMIN_a= -919738
##$ZGOPTNS= <>
##$ZL1= 120
##$ZL2= 120
##$ZL3= 120
##$ZL4= 120
##$ABSF1= 10
##$ABSF2= 0
##$ABSG= 5
##$ABSL= 3
##$ALPHA= 0
##$AQORDER= 0
##$ASSFAC= 0
##$ASSFACI= 0
##$ASSFACX= 0
##$ASSWID= 0
##$AUNMP= <proc_1d>
##$AZFE= 0.1
##$AZFW= 0.1
##$BCFW= 1
##$BC_mod= 2
##$BYTORDP= 1
##$COROFFS= 0
##$CY= 11.3945322036743
##$DATMOD= 1
##$DC= 2
##$DFILT= <>
##$DTYPP= 0
##$F1P= 2.36226072786647
##$F2P= -0.459571619588291
##$FCOR= 0.5
##$FTSIZE= 0
##$FT_mod= 4
##$GAMMA= 1
##$GB= 0.15
##$INTBC= 1
##$INTSCL= 1
##$ISEN= 128
##$LB= 0.24
##$LEV0= 0
##$LPBIN= 0
##$MAXI= 10000
##$MC2= 0
##$MEAN= 0
##$ME_mod= 0
##$MI= 1.114404
##$NCOEF= 0
##$NC_proc= 0
##$NLEV= 6
##$NOISF1= 3.799351
##$NOISF2= 2.8
##$NSP= 1
##$NTH_PI= 0
##$NZP= 0
##$OFFSET= 15.70392
##$PC= 1
##$PHC0= -18386.87
##$PHC1= 7.800781
##$PH_mod= 1
##$PKNL= yes
##$PPARMOD= 0
##$PSCAL= 0
##$PSIGN= 0
##$REVERSE= no
##$SF= 200.130013532006
##$SI= 16384
##$SIGF1= 3
##$SIGF2= 2
##$SINO= 400
##$SIOLD= 16384
##$SREGLST= <1H.CDCl3>
##$SSB= 0
##$STSI= 0
##$STSR= 0
##$SW_p= 3612.71676300578
##$SYMM= 0
##$S_DEV= 0
##$TDeff= 0
##$TDoff= 0
##$TI= <>
##$TILT= no
##$TM1= 0
##$TM2= 0
##$TOPLEV= 0
##$USERP1= <user>
##$USERP2= <user>
##$USERP3= <user>
##$USERP4= <user>
##$USERP5= <user>
##$WDW= 1
##$XDIM= 8192
##$YMAX_p= 0
##$YMIN_p= 0
$$ End of Bruker specific parameters
$$ ---------------------------------
##NTUPLES= NMR FID
##VAR_NAME=  TIME,          FID/REAL,        FID/IMAG
##SYMBOL=    X,             R,               I
##VAR_TYPE=  INDEPENDENT,   DEPENDENT,       DEPENDENT
##VAR_FORM=  AFFN,          ASDF,            ASDF
##VAR_DIM=   8192,          8192,            8192
##UNITS=     SECONDS,       ARBITRARY UNITS, ARBITRARY UNITS
##FACTOR=    0.0002768,     1,               1
##FIRST=     0,             0,               0
##LAST=      2.2672688,     0,               0
##MIN=       0,             -919738,         0
##MAX=       2.2672688,     802656,          0
$$ Real data points
##PAGE= N=1
##DATA TABLE= (X++(R..R)), XYDATA
0@%%%%%%%Qj6J6j6K4m0N6o4P3r7J26j55J82k17K65l14L71m40N11n94O94q02R22
30D93j055J203j371J557j760J984k231K506k809L135l491L883m312M781n292N847
46C068o456P126p857Q656r533J0500j1573J2763j4089J5581j7269J9196k1420
59a1307K4018k7103L0841l5481M1409m9292O0357p7122J05827j68029N34438m26403
71B153p09456Q09779l20298o9974R23221r5942j047321L60491K98101o88333L40766
82a96813R99469n72019o20567M11137k25393l76187R93027L67843j013026j12555
92c45084N45356m72324o1504Q32607j85984o24112M23630L734o97290M50121P44409
103F13559n27165l11781M03868l52093k96764P76973J33761p09491K15221L80704
$$ plain form
0 0 0 0 0 0 0 0 0 8 -8 8 -8 16 -24 32 -32 41 -56 70 -85 97 -120 145 -169 202 -238 273 -321 373 -429 493
30 493 -562 641 -730 827 -933 1051 -1180 1326 -1483 1652 -1839 2044 -2268 2513 -2779 3068
46 3068 -3388 3738 -4119 4537 -4996 5504 -6069 6694 -7395 8186 -9083 10113 -11307
59 -11307 12711 -14392 16449 -19032 22377 -26915 33442 -43680 62147 -105882 428556 2153
71 2153 -707303 102476 -217822 -287796 635425 539483 -507838 -147347 150754 -537579 -196813
82 -196813 802656 230637 -389930 21207 -204186 -580373 412654 780497 -232529 -345084
92 -345084 200272 -272052 -333556 499051 313067 -311045 112585 116319 -580971 -130850 613559
103 613559 86394 -225387 178481 -173612 -470376 306597 440358 -269133 -53912 326792
113C26792n92314p1997O43746j92817l14019M65891j27715o33403L77520M77240
123C58924m32112l1449M12775l83724k98253N25316J6847m09474L71415K33879
133C64144n86961n3961M53654j95236j17445M49263j60369n06658K74845K46423
143A67699l24913J51338L52545l92448k51424L77281l3977k32320L58186R6402
153B68369m75838L9753L13721k28541m1029L83749j54658l52282K33239J07026
163I3509k57329J90231K38739l45255j16568L23917q9358j97861K66513L9968
173A46506k91903J28682J67599k76970M47L19787j38421k22615K07233K8154k00304
184a31805J59876J11601k67452L1049K77226j49302j91005J83439L1570j26984
$$ plain form
113 326792 -265522 -337519 306227 113410 -200609 265282 137567 -495836 -118316 358924
123 358924 -73188 -104637 308138 -75586 -373839 151477 168324 -241150 130265 364144
133 364144 -222817 -276778 176876 -18360 -135805 313458 153089 -353569 -78724 167699
143 167699 -157214 -5876 346669 -45779 -297203 80078 46101 -186219 171967 268369
153 268369 -207469 -167716 146005 -82536 -123565 260184 105526 -246756 -13517 93509
163 93509 -163820 26411 265150 -80105 -196673 127244 37886 -159975 106538 146506
173 146506 -145397 -16715 150884 -126086 -125639 194148 55727 -166888 40345 68499 -131805
184 -131805 28071 139672 -127780 -96731 180495 31193 -159812 23627 55197 -71787
194g1787J47475L5547k53479N2511K30161j29579j14322J74052j1068j41361R7337
205A5487K1568j48294J20255J72086j90096j45171J47997N0155m1146P7975n4330
216B6486j59958J00063J37898j24816n4255J28488j9531q6652N0896p085n3360
227f1826J20887O1811j75431o4839J43626M9998m3783n059n8513m3362J09815
238C3324N1383j17382k8482R0166m575m8542J6936o301p018O5452o786j09528
250g1353N143J17071J8666o8608l5636o403L2532O7972j2739q9180m220O7919
262B1164N440l2388N63J979J409J9745j9370m2086L3286O6519j9219o7474j3104
275d3536L6137L9489J0609m1973m8294J9465N0262J029k7594p278K723L468O919
$$ plain form
194 -71787 75688 111235 -142244 -89733 140428 10849 -103473 70579 59511 -81850 15487
205 15487 37055 -111239 9016 181102 -8994 -154165 -6168 43987 2841 80816 26486
216 26486 -133472 -33409 104489 -20327 -74582 53906 34375 -52277 -1381 -8466 -61826
227 -61826 59061 120872 -54559 -119398 24228 74226 30443 25384 -33129 -76491 33324
238 33324 84707 -32675 -61157 29009 24434 -24108 -7172 -13473 -20491 44961 38175 -71353
250 -71353 -66210 50861 69527 919 -34717 -41120 -8588 59384 46645 -42535 -46755 21164
262 21164 26604 -5784 -5221 -3242 -1833 17912 -1458 -43544 -10258 56261 37042 -30432 -43536
275 -43536 -7399 32090 42699 726 -47568 -28103 22159 23188 -4406 -11684 -8961 -5493 1426
288A426n983n980K0852J6364k7326k9875J7145L6569Q834k3232k8935l914K5812
301A757K2510o305j8695j0719l54P489J0403K840n478p154o539k836P216J4555
315H690M046j3236j4567J662J2658Q314J417j528o915j0663r96J4644J6437j802
329A8161k0961j7231P469K3265J1416j3073k1704m488J5213J2527o026r824J758
342c498P605k816j1957j825J9239J7524j6440l2836j680L2043K2653j0639l1277
355a3904j7239K2338L5596n270l3134n474K1219Q651p247j0772l315J8397J5689
368B5535k8340l2431K3545M0781n194l0578k0768N86L4583L0333l0982m2898K0721
381a5107L5020j0653j5996O87l24J6138J4889l5350k8319M4974L5363l5498k8423
$$ plain form
288 1426 -4557 -10537 10315 26679 -647 -30522 -13377 23192 32026 8794 -20141 -24055 1757
301 1757 24267 17962 -733 -11452 -11806 -4317 6086 8926 3448 -3706 -10245 -13081 -5865 8690
315 8690 12736 -500 -15067 -13405 -747 7567 8984 7456 541 -10122 -11118 3526 19963 18161
329 18161 -2800 -20031 -12562 10703 22119 9046 -12658 -17146 -1933 10594 4568 -5256 -3498
342 -3498 4107 1291 -10666 -12491 6748 24272 7832 -25004 -26684 5359 28012 17373 -13904
355 -13904 -31143 -8805 26791 21521 -11613 -17087 4132 12783 5536 -5236 -8551 9846 25535
368 25535 -2805 -35236 -11691 29090 23896 -6682 -27450 -26864 7719 38052 7070 -35828 -15107
381 -15107 19913 9260 -6736 -6049 -6373 9765 24654 -10696 -39015 5959 41322 5824 -22599
394b2599R555P131K0909J7778m3247l1838N4274L0615m8726j7638K4098l399J0387
407G300K2262m3513l2050N8862K0498n8231K092M2018j8382o656K2156m0149j3844
420c7637Q1605Q821q4599J320M5478k2209J0727M2109n2222l8466O4967r08o4709
433d5723M5024N2449n8203j5462L4938m3693k261R4384j8913r3373L5510L9326
445B4003n6471K4582O3213o2807l1182P1885l2865o8904Q3094M8875q1406M327
457a3656M5413p1717m880J07276k6336p7519O2096J2463r4434L9157Q2894o4341
469c584j9704P5115n9873p7535R3425M0193p7385L7932M8349j04983k0933J07518
481C8535j9314m6680Q4503j4757j22654M4339Q5294o2923R581Q9275q5073r2865
$$ plain form
394 -22599 -13044 -5913 14996 32774 -10473 -42311 11963 42578 -6148 -23786 312 -3087 7300
407 7300 29562 -13951 -46001 12861 33359 -24872 -22780 19238 856 -5800 16356 -23793 -37637
420 -37637 43968 52789 -31810 -30490 14988 -7221 3506 45615 -6607 -45073 19894 18986 -45723
433 -45723 -699 51750 -6453 -21915 13023 -30670 -32931 61453 42540 -50833 -15323 24003
445 24003 -32468 -7886 55327 -7480 -38662 33223 358 -68546 14548 63423 -17983 -13656
457 -13656 31757 -39960 -44840 62436 36100 -41419 20677 33140 -61294 -22137 60757 -3584
469 -3584 -23288 51827 -8046 -85581 7844 48037 -29348 8584 56933 -48050 -68983 38535
481 38535 19221 -27459 57044 42287 -80367 -36028 49266 -13657 -4076 85199 126 -92739
493i2739R1674K7740o4477Q0473M7759j43443l0239J11367k9514k9697J14004
504H2908k7241j42586M9980P0392q1786M1393J22276j00168j06895Q7593L577
515e57o2054J20232N5085j60149k2157J01207o4305k0270J47303k2724j35990
526f4379N4327K8493j08725P6344J46164j04720r4189Q0526m0177o7672J47744
537E3736N7783j49311L099P4500j09786r952J71416k1469j15855O5850p739j29205
549a16933R4850J45594j05109n8189R0067p7758q4845J50912N1943j22021M3952
560A2463N4294j53111j0129J72502k6388q0939Q9883l9130j48612R9290J24329
571I4452j03297o582R9632j13185r0166J46838K8478r8294Q4960L8549j68192
$$ plain form
493 -92739 -1065 26675 -37802 42671 90430 -53013 -83252 28115 -1399 -31096 82908
504 82908 55667 -86919 -36939 33453 -48333 -6940 115336 15168 -91727 -4134 -557
515 -557 -62611 57621 112706 -47443 -69600 31607 -32698 -52968 94335 71611 -64379
526 -64379 -10052 18441 -90284 -13940 132224 27504 -66685 13841 -26336 -94008 53736
537 53736 111519 -37792 -34693 39807 -69979 -79931 91485 70016 -45839 20011 12272 -116933
549 -116933 -22083 123511 18402 -39787 50280 -27478 -112323 38589 90532 -31489 12463
560 12463 66757 -86354 -96483 76019 49631 -31308 58575 19445 -129167 -29877 94452
571 94452 -8845 -15427 84205 -28980 -119146 27692 56170 -42124 42836 81385 -86807
582h6807K602J48480n1651m5148J16678n1454j43321R2385Q0730j00629L7799
593c36J03046j22954p8402J24078m002p6479J07669L0721j54152J2217J07648
604D9054p2548j6053J27742n2291j22610Q3370M0180r8689O3007R9580j17351
615a6609n5520J08302l4663p0060J18617K6924j33209K9470P9467r4795m418J28909
627H2415n3482r5980R0445R124j08970P1546Q9118j07850k2970R9926o5324o6694
639g8696J19958J5601j09333N1984N4126j07836J0282J14899o0394o1482R4547
650D3656j8881r9597P9648O2066j00370R781Q5248p9073m5799J06616j1183q4810
662e2698O9946L2946j01881K2493Q4492o7772k8664Q9443l4912p6810P7344K8491
$$ plain form
582 -86807 -84205 64275 12624 -32524 84154 32700 -110621 -18236 62494 -38135 -336
593 -336 102710 -20244 -98646 25432 21430 -55049 52620 83341 -70811 -58594 49054
604 49054 -23494 -39547 88195 35904 -86706 -3336 36844 -61845 1162 100742 -16609
615 -16609 -72129 36173 1510 -68550 50067 76991 -56218 -26748 52719 -42076 -46494 82415
627 82415 28933 -67047 23398 32522 -76448 -4902 84216 -23634 -46604 53322 -12002 -78696
639 -78696 41262 56863 -52470 -486 53640 -54196 -43914 70985 10591 -50891 43656
650 43656 24775 -74822 4826 66892 -33478 -23697 61551 -17522 -63321 43295 32112 -52698
662 -52698 17248 50194 -51687 -29194 55298 -12474 -41138 48305 13393 -63417 13927 42418
674D2418q7902L3738O8815p7110k4468Q4619l0787n5206P5581J0215q6392L4764
686a1715N8319o5351p372P0148m2221m5573P0236l42p2501M3722M6641o6659m417
699b7085O0475l7928l1414O3639p622o1712M2481L6148n7797J562M9558l5450
711e145j9543N3337j6428n0182M4654K8172n3982L599M1889l0956j4101M3225
723B4539j8132l8779M1185J9063m6747N553L2605k6539p298L4342k0645k6564
735b7417M0355R936m4013Q265L0386k1033l764K5268k1540j8997L6080N934l5306
748a5846R543K1572j9351k600J8669j6523q582L0129l579l2517J1060K0224j3623
761a424j128J0941j5969m594K3775l867k1389J0933J2702j3489j816Q915p792
$$ plain form
674 42418 -45484 -11746 57069 -20041 -44509 40110 9323 -45883 29698 39913 -46479 -11715
686 -11715 46604 -18747 -26119 44029 1808 -43765 26471 26129 -46372 -2650 43991 -22668 -27085
699 -27085 33390 -4538 -35952 27687 20065 -41647 834 36982 -20815 -19253 30305 -5145
711 -5145 -24688 28649 12221 -37961 6693 34865 -19117 -15518 26371 -4585 -18686 24539
723 24539 6407 -32372 8813 27876 -18871 -13318 19287 -7252 -14550 19792 -853 -27417
735 -27417 12938 22874 -21139 -12874 17512 -3521 -7285 17983 -3557 -22554 13526 19460 -15846
748 -15846 -6303 15269 -4082 -6682 11987 -4536 -13118 17011 13432 -19085 -8025 12199 -1424
761 -1424 -2552 8389 -7580 -12174 11601 7734 -13655 -2722 9980 -3509 -5325 3590 -4202
774d202J079J5674q951j6949J0905J1584q448j236K758o925K934J1664o987j0496
788g596Q344M938p937n4M805l268L83M282n538m940O830K720n069j200J302n00
804b498L532L014m467k837L561J07j147L367J829m124j665K120K079l89j728k539
820a785J80J761J10q09N23L28k08j388k544k28M748M119l683p113O18P581M808
837G018m855q072l11P970L625m017m058R98M745J421m683m163K826Q218J079j0065
853b324p041P399J2216k003j3487o664P767J0609J62j0231o099P204Q742k847
867C403q002p57O602O200k612j1920k537J5238J0355j3491j4829M127J2961O679
881A1417n704j3688k896J5365P866j2848q612O956O580N27m474j0735J457J9315
$$ plain form
774 -4202 -3123 12551 3600 -13349 -2444 9140 692 -544 2214 -4711 -1777 9887 2900 -7596
788 -7596 748 5686 -2251 -2305 2500 -768 -385 3897 -1641 -6581 249 2969 -2100 -3300 -1998 -2498
804 -2498 1034 4048 -419 -3256 305 412 -735 2632 4461 337 -1328 792 2871 2482 754 -1785
820 -1785 -1605 156 266 -543 -20 308 100 -1288 -3832 -4060 688 4807 1124 -5989 -5371 2210 7018
837 7018 2163 -5909 -6220 1750 5375 1358 -2700 -1702 3043 4464 -219 -4382 -1556 6662 7741 -2324
853 -2324 -9365 -1966 10250 8247 -5240 -11904 -4137 6472 6634 -3597 -9696 -2492 6250 3403
867 3403 -4599 -5356 1246 7446 4834 -7086 -9623 5615 15970 2479 -12350 -8223 4738 11417
881 11417 5713 -7975 -10871 4494 12360 -488 -9100 -2144 4436 4963 489 -10246 -8789 10526
895A0526L222k2450q016J7150Q964m104o850r002L143J9070P23k1938k269J7323
909E492L648o104l181p264J927J8042l344k2730N074K1011n304j3146L60q99N858
924e60J6747r299k6552P275K3479m575p636M099q630l432J6321l302j6702J5196
938B429J6442k0622j3583J3349K903K146J3963j2295k5534J4034K0550j1642l706
951a566J1866j1923j1416J5154n84j1932J7571J0124k6782p334J9701l171m153
964d445J7326o855k2678J3447J3752j7089L027K0415j4853j5989J8595K78j7472
977a2541J6717J3546k2557k436J7758j7560j0751L0675L378k6446P942R341k3456
990a6390P552K9183j7342j6486K4661o621l1289K1682K6871j9389p97J1231l3467
$$ plain form
895 10526 13748 -8702 -16718 432 9396 5292 -1558 -10560 -7417 11653 12376 -9562 -11831 5492
909 5492 9140 3036 -145 -7409 -5482 12560 9216 -13514 -8440 12571 7267 -5879 -5519 -6418 -560
924 -560 16187 6888 -19664 -12389 11090 6515 -1121 2978 -5652 -9084 7237 3935 -12767 2429
938 2429 18871 -1751 -15334 -1985 918 3064 17027 4732 -20802 -6768 13782 2140 -1566
951 -1566 10300 -1623 -13039 2115 1531 -10401 7170 17294 -9488 -16822 2879 -292 -4445
964 -4445 12881 6026 -16652 -3205 10547 -6542 -3515 16900 2047 -13942 4653 4931 -12541
977 -12541 4176 17722 -4835 -7271 10487 -7073 -17824 12851 16229 -10217 -2275 7066 -16390
990 -16390 -8838 20345 3003 -13483 11178 4557 -26732 -5050 21821 2432 1635 12866 -20601
1003b0601q205M9578M219l5786J2587Q508l2712J1549L3577k2768q022L4578k3635
1016B867m4801L5619L3916k3821K437P556m3801P70N7116j1482l6949L0210P445
1029A7082m3383J3233K9523k5497Q988L8447m2865m3750M9267K7327l0539J0307
1041H140P303m3475J1333M7226l0485k6372M8191J875m9215J4139K1456k6240
1053a6124K0796L5105n0721l2097N4216R902l8518K0271J4923l5842J2958K9111
1065B3980m2432j0556O1127m747n1956J6395J5926k6112K5434L0227n0546j7224
1077c0484N2385r835m0341L2728J8379l5472J1853J7885m4178M279O0225j9706
1089A7718m7372K7971J1922l0888K5680K3578m6781k299M8542k5203l5407M3009
$$ plain form
1003 -20601 -28806 20772 24991 -10795 1792 10300 -22412 -10863 22714 -54 -8076 26502 2867
1016 2867 -41934 -6315 27601 3780 6217 13773 -30028 -29258 27858 16376 -20573 9637 17082
1029 17082 -26301 -13068 16455 -9042 -54 38393 -4472 -48222 1045 28372 -2167 8140
1041 8140 15443 -28032 -16699 30527 42 -26330 21861 23736 -25479 -11340 10116 -16124
1053 -16124 4672 39777 -10944 -43041 11175 21077 -17441 2830 17753 -18089 -5131 23980
1065 23980 -18452 -29008 32119 27372 -24584 -8189 7737 -18375 7059 37286 -13260 -30484
1077 -30484 21901 12066 -28275 4453 22832 -12640 -787 17098 -27080 -22801 37424 17718
1089 17718 -29654 -1683 10239 -20649 5031 28609 -18172 -20471 28071 2868 -32539 10470
1101A0470J2861l8518J5147J7101m0382J0592M9623l0996l6371L9364O247l5397
1113b0259K4986J8009m3503O224M2284l1304k4268M4742j535l9951K4852J8208
1125A8485l7335J2353L5935l7247j9614M5609n380l4124L0898J0729m3877J4263
1137i305L6347l2782j1500L9515j8470l2225L8865J1076m0881J4568K7451l5801
1149a3142l875L9597k0461k5454L7532J290m0881K0585K7042l2202j702L0580
1161A8909k4186j5615L9895m379l8891K1423K3380k8315J413K3364k5034q691
1173a6727L6977r734l3485K3829J7961k8492J316J9363j8602n9K9856j9423l1483
1186b8703K8166K0413k3723P58J0265k0027L920K8576j6913k2603K6222R886k6646
$$ plain form
1101 10470 23331 -15187 -40 17061 -23321 -12729 36894 5898 -30473 8891 15138 -20259
1113 -20259 4727 22736 -20767 -14543 27741 -3563 -27831 16911 15376 -24575 277 18485
1125 18485 -18850 -6497 29438 -7809 -27423 18186 12806 -21318 9580 20309 -23568 -9305
1137 -9305 27042 -5740 -17240 22275 3805 -28420 10445 21521 -19360 -4792 22659 -13142
1149 -13142 -17017 22580 2119 -23335 14197 15487 -25394 -4809 22233 -9969 -11671 18909
1161 18909 -5277 -20892 19003 14624 -24267 -2844 20536 -7779 -6366 16998 -8036 -16727
1173 -16727 20250 10516 -22969 860 18821 -9671 -8355 11008 -7594 -7653 22203 2780 -28703
1186 -28703 -537 19876 -3847 -3089 7176 -12851 -8931 19645 2732 -19871 6351 16237 -10409
1199a0409J797J5117r833O587J5569k5554j7877L1581J2955k3382j372P491j0518
1212g848P394J4507j9181j0753K5979L072k4942J895J3500l527M459M574k0689
1225a1560l741K7368K513k3357J128J1756l264K829K841j5873L91K2709l115k1531
1239a0906L879J2384l135N12k73j1474L724J7914p239j8392P392J2666l620k555
1253H77j879q515N659J5622p259j4382O780Q462m672j350J226m029M815P575r633
1268g03r223J0149Q433n844l788j307k482N710O988p421p132O422L168m502J99
1283a333J837j968J810J827n410j647P123J970n018j517J435k66K676K187l425
1298B81k464L024K40j475J832P02l053l24J834m60p0P97j481j342K064N67j775
$$ plain form
1199 -10409 -8612 6505 -3328 3259 18828 -6726 -24603 6978 19933 -3449 -4821 2670 -7848
1212 -7848 -454 14053 -5128 -15881 10098 13170 -11772 -9877 3623 96 4555 9129 -11560
1225 -11560 -15301 12067 14580 -8777 -7649 4107 843 3672 6513 -9360 -8969 13740 10625 -10906
1239 -10906 -7027 5357 2222 2734 2461 -9013 -5289 12625 5386 -13006 -5614 7052 3432 877
1253 877 -1002 -9517 -3858 11764 4505 -9877 -3097 5365 693 -657 569 -3460 1355 8930 -703
1268 -703 -9926 223 8656 2812 -976 -2283 -4765 945 7933 512 -6620 -198 2970 -1532 -1333
1283 -1333 504 -1464 346 2173 -3237 -4884 2239 4209 -809 -2326 -891 -1157 1519 3706 281
1298 281 -2183 841 1081 -394 1438 2140 -913 -1237 597 137 67 864 -617 -1959 105 672 -1103
1315a103Q1J906n26j353p70M73K227J959k824l702J233M503J475k772l742O00
1331b335M190J762k715l447J491L543K65l884k311L084M090j047n709k213M404
1346h32N437j523o319k958N170N880j722o457j617M910N209k620o265P9N994L113
1362E479m129n792Q96P305L073o158o835K770O829K429n561o051J177Q182K217
1377E831p268m976M255N442K3n220l688L408P733r38q946k014P410M495k165n215
1393a833l918M809P979k677r152O40O966J121l167k861j716M258O052m796q637
1408f932L454P938j355m113j670j182M178N686n575q097N888P102l810l361O25
1423a224p45K731M974n616n780O346M652o055j630L350j978K270L976p095n476
$$ plain form
1315 -1103 -1022 884 358 -995 -1765 -1292 935 2894 70 -3632 -2399 2104 3579 807 -2935 -2335
1331 -2335 1855 3617 902 -2545 -1054 2489 2754 -1130 -3441 -357 3733 2686 -3023 -5236 -832
1346 -832 4605 3082 -3237 -6195 -1025 4855 3133 -3324 -4941 -31 5178 2558 -3707 -3628 2366 5479
1362 5479 1350 -4442 -3546 3759 6832 674 -6161 -3391 3438 5867 306 -5745 -4568 3614 5831
1377 5831 -1437 -6413 -2158 3284 3307 -1913 -5601 -2193 5540 4602 -4344 -6358 1052 5547 3382 -1833
1393 -1833 -5751 -942 7037 4360 -4792 -4152 2814 3935 768 -2093 -3809 449 6501 1705 -6932
1408 -6932 -3478 4460 3105 -1008 -2678 -3860 318 6004 429 -7668 -1780 5322 1512 -1849 -1224
1423 -1224 -1969 762 5736 120 -5660 686 5338 -717 -2347 1003 -975 1295 5271 -1824 -7300
1438g300R323M086p890n86L889m552J352O216n045m825Q207O04r006L378O119
1453C970n089J87N515o931m255J0860J295r073M125M258q812J021Q866n326m134
1468c523P702k474q545P056N035r013K222P424q718m283J0528j403o769Q563J111
1483D913j2540L570J1450p755l740R496l913q270R706J547j0726O398R660j2173
1497b377m835J1249k477n494R679j559j3587P199J0492j1066l269J1855m350p668
1511f208Q605j064j0040J0932Q342j5561l590J3441l410n019J0058l683j2346
1524i543J1487P317j4712K90J3734o764p404R457l633q701J3630M612j7631P03
1538g158J3891o881m724J0611n264r375J2572K845j5633N416J3508r993n997R984
$$ plain form
1438 -7300 2023 6109 -1781 -2367 1522 -3030 -1678 4538 -507 -5332 2875 3479 -5527 -2149 3970
1453 3970 -1119 -932 4583 -2348 -6603 4257 5552 -3521 604 4862 -3950 -2929 5937 611 -3523
1468 -3523 4179 1705 -6840 216 5251 -3762 -1540 5884 -2834 -7117 3411 2008 -4761 3802 4913
1483 4913 -7627 -4057 7393 -362 -4102 5394 1481 -6789 2917 4464 -6262 136 9796 -2377
1497 -2377 -7212 4037 1560 -3934 5745 4186 -9401 -2202 8290 -2776 -6045 5810 1460 -6208
1511 -6208 2397 1333 -8707 2225 10567 -4994 -8584 4857 1447 -3572 6486 2803 -9543
1524 -9543 1944 9261 -5451 -5161 8573 1809 -5595 3862 229 -8472 5158 9770 -7861 -7158
1538 -7158 6733 -148 -4872 5739 475 -8900 3672 6517 -9116 -3700 9808 -185 -6182 3802
1552C802m554n554J3452J40j6569N903J2486j0046l340J0238n248p002J1400q19
1566D289j3567Q472J0950j2110m423J0150m616m841J2027k131j3700P534R923
1579G957j1144j490J1190o105o529J0499j800j0947J0289P891j3298j624J0473
1592E362n872m383J1584l021j1765Q706O205j2089J286J1516p413o125R779l136
1606F34q807J0547N220j2760J131R590p873l213J1671l155r647Q430L178j1015
1620f069L764J0344q137m128R263m445p480J0090L447j1119L039O832r355j209
1634e163J0999l694p752P847Q68j0120N349P979q376j657Q728n349o403R395J537
1649D188p740M428M177r981J010R996m859n260Q159j093r093N529N572p506J190
$$ plain form
1552 3802 -752 -6306 7146 7286 -9283 -3380 9106 -940 -4280 5958 710 -6292 5108 4289
1566 4289 -9278 -806 10144 -1966 -6389 3761 -855 -5696 6331 4200 -9500 -1966 7957
1579 7957 -3187 -4677 6513 408 -6121 4378 2578 -8369 1920 9811 -3487 -5111 5362
1592 5362 -510 -4893 6691 3670 -8095 611 6816 -5273 -3987 7529 116 -6009 3770 634
1606 634 -8173 2374 7594 -5166 -4035 5555 -2318 -5531 6140 2985 -6662 1768 4946 -6069
1620 -6069 -2305 8039 -98 -4226 5037 592 -6888 3202 6649 -4470 -1431 5401 -3954 -5163
1634 -5163 5836 2142 -5610 2237 3105 -7015 -1666 6313 -2063 -3720 5008 -341 -6744 2651 4188
1649 4188 -3552 876 5053 -4928 -3918 6078 1219 -4041 4118 3025 -6068 -539 5033 -2473 -1283
1664a283O827o817n483Q883N70o380M912K131q280J938P313n027l017P773j801
1679B259p797N155L378n678K726N933p275l468P275o09m356M993R95o978K289
1694a158M515m968p85O778k970n875M339J377m513L601M070o450j586N701j931
1709A45l475N309P91n534K390K833m724R76N479l299l959M354K89m060L310K598
1725C423m825k94L838k687k336M919k23m213K613J196m207J301L962k972j678
1740b183L498j068l062L340J624l419P70K256k689m97L643j172k362K534L39l133
1756a581J322K107k226l89K043j474j659K552L92k614J021J345k159J21K162j019
1772e6j126K193n89j807J200R81j166J95J375j261o97J612o5j178Q20P34j548
$$ plain form
1664 -1283 5544 -1273 -6756 2127 2697 -3683 1229 3360 -4920 -2982 4331 -696 -3713 4060 2259
1679 2259 -5538 -383 2995 -2683 43 5976 -1299 -4767 2508 1899 -2457 2536 3531 -3447 -1158
1694 -1158 3357 -1611 -2396 4382 1412 -4463 -124 1253 -3260 341 4411 -2039 -3625 2076 145
1709 145 -3330 1979 2770 -2764 -374 2459 -2265 -1289 4190 891 -3068 1286 1575 -2485 825 3423
1725 3423 -1402 -1696 2142 -545 -2881 2038 1815 -2398 215 1411 -2796 -1495 2467 -505 -2183
1740 -2183 1315 247 -2815 525 2149 -1270 -500 1756 -933 -1430 2213 1041 -1321 1213 1552 -1581
1756 -1581 -259 1848 -378 -767 1276 -198 -1857 695 1087 -1527 -506 839 -1320 -1199 963 -56
1772 -56 -1182 1011 422 -1385 -185 796 -370 -175 1200 -61 -758 854 789 -389 431 1165 -383
1789c83K35J003p22m83R30o09r49P85L42o93J58O68n30m09P39l03m54R25k79k72
1809c01O7O43l72j74N47j4l54L36n5m34M78M14n58n33L23J32j60J01k53m09P86
1830B10N6p98l10L18N23j96j18m22J06Q52K96p91k76M67M61J92n34n04O31Q97
1850A060m20q03l39R44K10l3p39o94J278J14l48q29l77P38Q39q00p56R8R62M85
1870E90o51p68J90R73P1l09o90M16P30P04r95j118M77J557m01q46m26L14J000
1889H18P1j340o34R13R69p01r76R3O20P92k04j109o36J440P90q50o11P4R29N22
1909I70n88j168J21J814J16j219j52K32M17L76k08j476J92J500j14j323j8K58
1927b70J30K56k57q45L27J354n17r24L55O61l09J0L42q42L26J118m15r69M81O48
$$ plain form
1789 -383 -148 855 133 -350 580 -29 -978 -193 149 -544 -386 282 -248 -657 82 -221 -675 250 -29 -301
1809 -301 -234 409 37 -137 410 396 42 378 323 -111 367 781 223 -310 13 145 -15 86 -167 -576 210
1830 210 266 -532 -842 -524 -1 -197 -315 -737 -631 221 517 -274 -550 -83 378 570 36 -468 163 1060
1850 1060 640 -163 -502 442 652 619 -120 -814 464 578 230 -599 -976 -238 601 -199 -955 -857 105 590
1870 590 -61 -829 -639 334 405 96 -594 -178 552 1256 261 -857 -380 1177 776 -70 -496 -182 818
1889 818 889 -451 -1085 -172 797 96 -880 -787 -167 625 421 -688 -1324 116 906 56 -555 -481 448 970
1909 970 382 -786 -665 1149 1265 46 -106 126 543 919 711 -765 -573 927 813 -510 -528 -270
1927 -270 -140 116 -141 -986 -659 695 178 -746 -391 270 -39 -29 313 -529 -203 915 500 -469 12 660
1947F60m28L22j79m66p6J034m99r67P35J70q12J17O86r93q6J058o83n70J205N1
1967B79j142Q66O81j340j16J338n49l89J254n44j251J320R04j542q9J210r76l80
1985d66J289j088p72J783L76k329J02J819p69k79O50j084q38K815k96k518O73
2002i32K220j572o1Q42j027j81K443o18k677J320J733q03q11O70j205J51K246
2019A738j143k807K014J910j961p60R98q15M44J934j744k133K113J958k289j88
2035g31J162r57M59J763k141j995L362J765k748p12J056r27J250J638k228k216
2051b200K751J012k874M80J710j021j04J028k104j048L999N32l811J79J799j035
2067g07P13J870k592j138L589j83l187J297K288j726k38J172k205k67L983j227
$$ plain form
1947 660 232 554 375 -91 -167 867 368 -599 136 306 -506 -389 297 -696 -782 276 -407 -977 228 279
1967 279 -863 3 684 -656 -772 566 17 -372 882 338 -913 407 1311 -231 -320 890 -86 -466
1985 -466 823 -265 -1037 746 1122 -1207 -1105 714 -55 -334 316 -768 -1606 1209 913 -1605 -932
2002 -932 1288 -284 -345 497 -530 -711 1732 1114 -1563 -243 1490 687 -124 546 -659 -508 1738
2019 1738 595 -2212 -198 1712 -249 -1009 -11 -826 -382 1552 -192 -2325 -212 1746 -543 -731
2035 -731 431 -526 -67 1696 -445 -2440 922 2687 -61 -773 283 -644 606 2244 16 -2200
2051 -2200 551 1563 -1311 -831 879 -142 -246 782 -1322 -2370 1629 2161 -1650 -1471 328 -707
2067 -707 6 1876 -716 -1854 1735 1552 -1635 -338 1950 224 -14 1158 -1047 -1314 2669 1442
2083A442l412J493J648k039O31J731k536o77L414j437l076K853J866k996M31J810
2099A146k882P26L681k303k502L370M46l208J503K134l014K23L222k697j967L741
2115A619m25k692J954J280l728Q80L036k501j235L578j310l634L241J468l119
2130a588J440K228l295r55L520p27k041L381j95l873J486K510k311n4K675k460
2146b59k029L491M9k856K013J647l394l45K731j814m94L330j480l674K527K160
2162A603k345L53J907k636j73L221j148k694K835J474l112k56J925j026k29K485
2178B184k282k430K903J534k772J46J576j841J08K250j760j899L084O94l231Q68
2194h68J840j213j5J629k013j143L389Lk824P96J700j309L50J217k324r56L247
$$ plain form
2083 1442 -1970 -477 1171 -868 -237 1494 -1042 -1719 1695 258 -2818 35 1901 -1095 -664 1146
2099 1146 -1736 -1010 2671 368 -2134 1236 1682 -1526 -23 2111 -903 -680 2542 -155 -2122 1619
2115 1619 1194 -1498 456 1736 -1992 -1112 1924 -577 -1812 1766 456 -3178 63 1531 -1588
2130 -1588 -148 2080 -1215 -2170 1350 623 -1418 1963 1768 -2105 -619 1891 -420 -474 2201 -259
2146 -259 -2288 1203 1252 -1604 409 2056 -1338 -1683 1048 -766 -1260 2070 590 -3084 -557 1603
2162 1603 -742 -389 1518 -1118 -1291 1930 782 -1912 923 2397 -715 -971 954 -72 -301 2184
2178 2184 -98 -2528 375 1909 -863 -717 859 -982 -874 1376 -384 -2283 801 1495 -1736 -868
2194 -868 972 -241 -256 1373 -640 -1783 1606 1609 -1215 -419 1281 -28 322 1539 -785 -1741 1506
2211A506Q0k797Q36J357j776K29J662j847k67K439j207k584J604J925j330J43
2227b7M77j725K13L116j086k277J455J027j712K73J502j284j33J700j789j612
2243a882K606J029j992M8j04p86Q45J763j347j601J591j11j016R00Q93j085l7
2260b86J035j673j30K266k73j346K55M98q69Q68Q31j148o89J347j08j179Q39K86
2278E24j166M74O76q79l00J389j161m48Q89L19n84L20K67j009K53P29J22j90m
2297B21pp47L96J106o62j97p7j03j76P37K23p08R7k96j86J27P64k40o74L12l17
2318d07m95J007M08n86p78L40K71O38J78n03o51L59P74p13L09M76j76l55l04J04
2338a04L25O10j83j118k82N80O99p3p69j88l3O02J20q26M04L5l3k63p5N17N46
$$ plain form
2211 1506 1586 -1211 -375 982 -794 -565 1097 -750 -1017 1422 215 -2369 -765 1160 -170 -27
2227 -27 450 -1275 -1062 2054 968 -1309 146 1173 -539 -266 1236 -48 -181 1519 -270 -1882
2243 -1882 724 1753 -239 -191 -295 -1081 -236 1527 180 -1421 170 59 -957 -57 836 -249 -286
2260 -286 749 -924 -1054 1212 939 -407 -152 346 -523 345 1176 28 -661 686 578 -601 238 524
2278 524 -642 -168 508 -371 -671 718 -443 -891 -2 317 -267 53 320 -689 -436 293 415 225 221
2297 221 214 -533 -137 969 307 110 33 -70 -246 491 714 6 103 -193 -379 -252 512 272 -402 -90 -407
2318 -407 -902 105 513 -73 -851 -511 -240 398 576 73 -578 -219 555 -158 151 627 451 96 -208 -104
2338 -104 221 831 648 -470 -752 -172 527 454 -315 -503 -536 66 186 -640 -236 -201 -234 -497 -572 -55 491
2359D91n0p73o52O31J246Q4n96q31j81J073O20n56n90k04N93l01j22J0O18j67
2379C43m11p57J64O86O19j94j188pM63O78j04l70o60N90N17j26j88J98L54k72
2399C35m91j21L59R87m04j140q36J138P30J00n85o92k3O45L07n24j17K28k62K
2419c64K32P6M3N17l01j001O69R67k90l53l32l26J91J149k79r02N07J29n70J32
2439a06Q65o39n22M82l83n04P88O97q45m64N23m64K69Q83n03m89K65J04l69P36
2459C24M65r37l79R13N4n87Q39n0j266N04J061r20m63R33l87r47R93K02p70N43
2479A25L23j634J74J892m35j012L84O2o73J256Q46j821l05J549l72j018J432K01
2497I74j387Q64Jj716O60K551j204j800P35l0l07J823j78k119J84J457j053n33
$$ plain form
2359 491 441 -332 -984 -353 893 977 381 -450 -631 442 1062 506 -84 -288 305 4 -118 -108 510 343
2379 343 -68 -825 -661 25 644 450 -738 -745 -282 396 292 -78 -738 -148 369 243 55 253 607 335
2399 335 -156 -277 82 1069 665 -475 -1311 -173 557 657 72 -620 -643 2 309 -215 -332 -104 -366 -364
2419 -364 -132 -56 -13 504 203 -798 -129 838 548 195 -137 -463 -272 877 598 -304 203 332 -238 -106
2439 -106 759 120 -402 80 -303 -807 -19 678 -167 -631 -108 -572 -303 580 77 -412 -147 -43 -412 324
2459 324 789 -148 -527 386 440 -147 692 642 -624 -120 941 21 -442 491 104 -843 150 352 -418 125
2479 125 448 -1186 -1012 880 445 -567 -183 -121 -794 462 1308 -513 -818 731 359 -659 773 974
2497 974 -413 451 452 -1264 -604 1947 743 -1057 -322 -352 -659 1164 986 -1133 -949 508 -545 -1078
2515a078J985J7j764Q06k27j197J466K121k157j572J719R2m42J305j46j855P86
2532a41J846k121r39K533j93j884J280J24k042J748J466k446p19K360o14j396
2548a138J302k21j281J989Q34k523n34K577m77j197J598k98j783J553Q80k401
2564a120M76K815j492k192J687j80j101J887R88l409L01K419j496p08K124j79
2580H20k223J568J69j869J224K357k106j505K227o22r24K036L99k941J005K029
2596A644k080m12K158p57j658J786K10k322J322J580k547qK269j361j160J838
2612E02K25k389J558J512k431l06K315p30j030K067L0k755J274J204j748O38K339
2629B275k069j751K234k29j596J557Q75k061j61J694j498m20K462l98k499J234
$$ plain form
2515 -1078 907 924 -840 -34 -261 -1458 8 2129 -28 -1600 119 211 -231 1074 928 -927 -141
2532 -141 1705 -416 -1355 1178 985 -899 381 505 -1537 211 1677 -769 -1488 872 258 -1138
2548 -1138 164 -57 -1338 651 1485 -1038 -1572 1005 528 -669 929 631 -1152 401 1281 -1120
2564 -1120 -644 2171 679 -1513 174 -6 -1107 780 1768 -1641 -1340 1079 -417 -1125 999 820
2580 820 -1403 165 334 -1535 -311 2046 -60 -1565 662 40 -884 1152 1551 -1390 -385 1644
2596 1644 -436 -848 1310 553 -1105 681 891 -1431 -109 1471 -1076 -1084 1185 -176 -1336 502
2612 502 727 -1662 -104 1408 -1023 -1329 986 256 -774 1293 1323 -1432 -158 1046 -702 -64 2275
2629 2275 206 -1545 689 460 -1136 421 1296 -765 -926 768 -730 -1150 1312 914 -1585 -351
2645c51R90j383K39J983j718q74K158p34j852J842J070j904K68J541j980k11K420
2662A504p58j872J338Q40j777K32J439j417r4K089r48k461J823J082j836O77J004
2679H65j797j22K100j090j193K343L17k334K17J288j311Q99J934j892j883J858
2695A99N10j252P57J048j849k6J327j491n03K600j52k576P88R33j041P94J363
2712A429j528j248K172l47j504J342Q87j612L64Q69j708O3K452p95j755P72N15
2729C68j052P53R47j316l03J584q27j464J371P14j270N27L89j295M1J397m74r67
2747h77J468k76r52M24Q86r01K33R61r34p33Q75N97q18M49J40j057Q8J004p61
2766a84m35R21o9q42K34N03p62M94M99n97n19P42P5l06L66K16q54J99P92n40k73
$$ plain form
2645 -351 639 -744 -505 1478 -240 -1114 1044 310 -1542 300 1370 -534 -266 1275 -705 -916 1504
2662 1504 746 -1126 212 1052 -725 -493 946 -471 -565 1524 576 -1885 -62 1020 -816 -139 865
2679 865 -932 -1054 1046 -44 -1237 1106 1423 -911 -694 594 -717 182 2116 224 -1659 199
2695 199 709 -543 214 1262 -587 -613 714 -777 -1280 1320 1168 -1408 -620 313 -728 66 1429
2712 1429 -99 -1347 825 478 -1026 316 1203 -409 -45 824 -884 -821 1631 836 -919 -147 368
2729 368 -684 69 1016 -300 -603 981 154 -1310 61 775 -495 32 421 -874 -833 564 90 -877
2747 -877 591 315 -637 -213 673 -228 5 966 32 -701 174 771 -47 402 542 -515 -427 577 -184
2766 -184 -619 302 233 -609 -375 128 -634 -140 359 -238 -757 -15 60 -246 120 336 -518 -319 473 -67 -340
2787c40R38k48q06O93J84m89J96M53m52n00O24l20k63O76k08o21J32N31n34M8
2807c06M62j50j16Q8O9j82K14R0l69K95L4k56K26K47ll96L12Q9n37J32P0k7k95
2830c09N20r2l68Q7L19o12K11L17k88j80L08P0j52J46J36Rj44K60k01NJ74k90
2852g4J33L57m54K76n1q1L4j13J00k92J14p1Q7J5J65r3n30R8K08M2O5j30K89K0
2876A14k23M0K7P6M05k48k42J53P0j41o1K82j09r1p8J82k42L04l24J64K4l50l7
2899c05K61l8Jj06j13J67K36p8Ll65K68L14k90L96k01Q6j69o0P4O5J34k20J59
2922B19j57nm7m5j0Q4k42K84r1j56q2N5k85L69OJ2l48N52k40j06N15l2p9m86L38
2947B3N6j6L59J2m69M6J62l68K68K43j88m42K94K9o5%J76Jj93K15l92j49N67k19
$$ plain form
2787 -340 598 350 -456 237 421 -68 128 581 129 -371 253 -67 -330 346 138 -483 -351 180 -354 -306
2807 -306 156 6 -110 -22 47 -135 79 169 -200 95 129 -127 99 346 343 -53 259 348 -189 -57 13 -14 -309
2830 -309 211 119 -249 -162 157 -455 -244 73 -215 -395 -87 -17 -169 -23 113 122 -22 238 37 42 216 -74
2852 -74 59 416 -38 238 187 106 140 27 127 -165 -51 -122 -35 -20 145 52 -478 -380 -172 -130 -65 -195 94 114
2876 114 -109 -69 -42 34 439 191 -51 102 172 31 -30 252 143 52 -26 156 -86 218 -106 58 82 -268 -305
2899 -305 -44 -82 -81 -187 -300 -133 103 25 28 -337 -69 245 -45 351 150 236 67 7 81 146 280 60 219
2922 219 62 57 10 -35 -45 39 -203 81 -10 -166 -248 -193 -478 -109 -103 -91 -439 113 -127 -233 282 250 171 -315 23
2947 23 79 63 422 434 -35 11 173 -195 73 316 128 -314 -20 9 -56 -56 120 121 -72 143 -249 -398 169 -50
2971e0J75O7k16j31o6Q91n89j93K98j78p3K29K75n33M14L07q35n15O82J6K3J79
2993A77m9m02L51K47m79l62Q97l60m13J30k06K58R47j0q72n20P16K07p1L18q4
3014D20o22L02k24l61O45L96n4r14j50J01N72O59k66q99j47M44j03p0N17M71n55
3035A62k14k97l70N71J343q81p78J29J93M5M52J4o20N97L25q36p06Q72L01J54
3055D56p4m69r85O86J011n22l58L10p4n45J98J09K38P24l9j244p96J241O09k47
3075B29P02o93j188N80O90m16J07R42m77j173K41K90J33R54K3j828l07J102K08
3094A19J10O68q71p55L82K27k12L98O51m67r90M71L03q4O07K85j092J6M60m44
3114b18J18R09l55n39J22J26n29K40N89m23q7J17m64k79M26N96l08J54mq75J53
$$ plain form
2971 -50 125 192 -24 -155 -221 670 81 -112 186 8 -65 164 439 -94 320 627 -208 -723 -41 -25 -2 177
2993 177 128 -274 77 324 -155 -517 380 20 -393 -263 -469 -211 736 726 -146 -666 50 257 186 504 420
3014 420 -202 100 -124 -485 160 556 502 -412 -562 -461 111 770 504 -395 -542 -98 -201 -271 246 717 162
3035 162 -52 -349 -719 -148 1195 314 -464 -335 -142 -97 355 369 -251 346 671 -165 -871 1 302 456
3055 456 382 -87 -1072 -386 625 103 -255 55 -19 -564 -366 -257 -19 705 666 -578 -1374 -133 476 229
3075 229 931 238 -950 -370 320 -96 11 953 476 -697 -456 -166 -33 921 944 -884 -1191 -89 119
3094 119 229 897 26 -729 -347 -120 -332 66 717 250 -740 -269 34 -50 557 842 -250 -234 226 -218
3114 -218 -100 809 454 -85 37 163 -366 -126 463 40 -47 70 -394 -673 -247 349 41 195 191 -684 -531
3135e31N19M75n65N38J7j077j98P82K38L44J25q29r35P87R17J92o38J76p94j10
3155e67M55O6K3P37j55j259o71R21P93N01l61q70o13Q91R00p83k47O18l42k55
3175b18L17l34M5J098j10j079n95J170o0j07o7m97r4R95j29j103l5J237n1l62
3195B1k27q41O07J340l37j056J00N91k99j66K29j37R67M14j218j403P28J373J96
3214H82n49m23p99N85O52k05n24P89P1j110l51O25N49M60k04j072r02J490J171
3233A135n77p54r7l8K74M83j40k09M01J52q53j53M69K51L5j62q03LJ193j10q64
3254c64k01M88J36K76k02k60n19N78K82j33J05J28m75l18L09N65L5K66o30l87
3274c21M1M60L88k27m76l3j97P2N60J90l28k07o87K53P95K21l40m94k11J69J98
$$ plain form
3135 -531 -12 463 -102 436 453 -624 -822 -40 198 542 667 -162 -1097 -310 607 799 161 337 -457 -567
3155 -567 -112 -46 -23 714 559 -700 -1371 -450 343 844 483 -387 -1000 -109 791 8 -239 379 37 -218
3175 -218 99 -235 -190 908 798 -281 -876 294 234 127 60 -437 -531 464 335 -768 -803 434 383 21
3195 21 -206 -1047 -440 900 563 -493 -393 198 -101 -267 -38 -175 792 1206 -12 -1415 -687 686 882
3214 882 333 -90 -889 -304 348 143 -381 408 479 -631 -982 -357 192 652 448 -624 -1526 -36 1135
3233 1135 558 -196 -293 -331 -57 426 286 77 478 630 -223 -376 93 344 379 217 -586 -583 610 500 -364
3254 -364 -565 -77 59 335 133 -127 -646 -68 214 81 186 314 -161 -479 -170 395 430 696 66 -321
3274 -321 -280 180 568 341 -135 -168 -365 -293 267 457 129 -78 -765 -512 283 504 164 -330 -541 -372 -174
3295a74K63p6J52j49n16K83L59L90n9m05o92N6P86N64k95o62l26M20K60k7j85
3316c3j29J6J80k11k59O02O9l06m30l23Q61O71m9j279m75R58P80Q6o49o20N12
3337b8L52J99m76j41P04jr04j57Q9Q80L72r67j095L29J201M46p98j118J03R25
3357h5O66l76o49J46K73L64k93n34Q41K92j87q48n66R54J087n24r64n41O45J040
3377G41K39j277m10M78N82j55n45j18O24o0n69l65P66P32J12q91j160P26Q80M72
3397H02o78m55l49R80J38l71k51J00M94l19m65l7Q51j9m69o28J21N10O80M5j241
3418e61l25O03N21L04k87p37L76RR4j1J34J34K5l76k6P5P47k47n81l84R3O14M12
3441F06l46l30k65L4L02M21k25l17m12J82K85M55%n31k00o2N29k8K59L6k62k50
$$ plain form
3295 -174 89 13 165 16 -500 -217 142 532 473 68 -624 -568 218 782 487 -175 -501 -81 179 152 -33
3316 -33 -162 -146 34 -177 -436 166 235 -71 -501 -824 37 708 659 -620 -1095 -137 643 729 80 -540 -28
3337 -28 324 523 47 -94 610 609 -295 -452 -363 517 889 -78 -1173 -844 357 803 5 -1113 -1010 -85
3357 -85 581 205 -444 -298 -25 339 46 -488 353 645 458 -390 -956 -2 1085 561 -403 -944 -299 741
3377 741 980 -297 -707 -229 353 198 -347 -465 159 99 -470 -835 -69 663 775 -116 -1276 -550 330 802
3397 802 124 -331 -680 300 438 67 -184 -84 410 91 -374 -411 440 421 -48 -676 -555 -45 635 680 -561
3418 -561 -886 -283 238 542 255 -482 -106 -97 -3 -14 120 254 279 -97 -123 -48 699 452 -129 -513 -420 194 606
3441 606 260 -70 -335 -301 1 422 197 -120 -532 -350 -65 390 390 -141 -341 -403 126 98 357 393 131 -119
3463a19j76J48M83L03Q2j021j96M56N03L17o00m14r2J46L43J68k90J56pn34M8
3484b96M0P54J25o65o29J17J099K72j030k16j77Q52N24l72q21PR27j87k90k03
3504a69Q5K80qk94j87L17O32l98r02l78J484M26r9j104r30Q53J044J69p24m13
3524c16r0L23O9k48L95L93L84j377q01Q17J364K48n16j314m89J216Q79m21p61
3543b45K92J58m51k27J10M75N94m03q58n08R43P19k01p29j88r5R40J18p29o5R41
3564E91n6k53l58l24O68K91j36n38N3K17j28l80J23J59N39J98r58p93L97J278
3584E90J03o24n38k33J15P43L42L3p4k52p40K1O34N41J30k71q25n42N10O09M30
3605G02k63l79n10m79R10K24J70l38j86m17J10M86N8K58l46L32p05p6K88N22j
$$ plain form
3463 -119 -295 -147 336 639 721 -300 -496 -40 463 780 180 -234 -326 -180 163 331 41 197 190 -344 -296
3484 -296 -256 498 623 -42 -671 -554 545 817 -213 -429 -606 246 770 398 -423 -416 511 324 34 -169
3504 -169 -84 196 188 -106 -293 24 656 258 -644 -1022 462 888 789 -315 -1245 -392 652 821 97 -316
3524 -316 -406 -83 -14 -262 133 526 910 -467 -1268 -451 913 1161 645 -669 -1158 58 937 516 -245
3543 -245 47 205 -246 -473 -363 112 706 303 -555 -1063 -120 599 398 -331 -519 -614 326 444 -285 -350 591
3564 591 535 282 -76 -400 268 559 423 -115 -62 155 27 -353 -230 -71 468 666 -292 -1085 -688 590
3584 590 693 69 -469 -702 -587 156 498 531 457 205 -535 -514 120 661 791 520 -305 -847 -337 272 702
3605 702 439 60 -450 -929 -19 205 375 37 -149 -566 -456 30 88 346 0 332 -373 -449 -161 361 360
3626C60L4o82l94N63N86j42l12mr3K23j81l84M43N72r6n54n09K1L79J47L41j94
3648A24j85j0L9l58J21Q10J61k91q65l63P10J020j80r74k43J87M37J57j43j27
3668B7k0K90n46n14M74R69P0p57q47J49M09J027l04p05j15J39J33J22l74K33M16
3689B76p2o27j23N52L31J34q64k07N76O37j38n34l93N21M58m19l38k86M69L22
3709B75j61k67j15K72N8k33k15k7N70M28n16n94L8N44N53l8q64m3K18M26q0l42
3731a13K56Oj46j49m3K34N35j41o31k26J47L06lq5p4P3J20o5j43K70P7J30r1M7
3755B91k91J76mj28l9p8M4J52k56J63n3L00k43k15m3M4P0J74M1k2j8j52j79J80
3779h6P1K22l68P4j53J26q1K46J20M4q8j29L4L38n6K5m62j14K04L9N20n13M5m19
$$ plain form
3626 360 394 -288 -682 -119 467 325 13 9 -84 139 -42 -426 17 589 493 -61 -570 -549 -170 -23 318 124
3648 124 -61 -71 -32 -390 -269 541 702 411 -454 -817 -107 913 733 -241 -484 -297 140 297 154 27
3668 27 7 297 -249 -763 -289 680 750 -7 -854 -705 -296 731 427 -278 -393 -254 -121 1 -373 -140 276
3689 276 204 -423 -546 6 337 471 -393 -600 -24 613 475 -59 -452 69 527 108 -230 -516 -47 275
3709 275 114 -153 -268 4 62 -171 -386 -413 157 585 69 -525 -487 57 610 572 -292 -335 -117 309 229 -113
3731 -113 143 149 3 -146 -189 45 580 439 -192 -418 -271 35 32 -53 -127 -54 66 1 -142 128 205 335 244 291
3755 291 0 176 172 44 5 -73 -29 123 -133 30 -23 277 34 -181 -224 -180 -110 64 105 83 65 -87 -266 -86
3779 -86 -15 207 -161 -87 -240 -114 -195 51 171 215 127 -2 32 370 314 339 -123 -237 -33 6 526 13 58 -361
3803c61N23K9j70j80K84l64J36Q0J0M2K93j69m14j5O10j37l20o2m4K82R8j68j18
3826a35L3L34k2j63k86J44L43j78j52m01M80K02j60j27k80m0M26J58j80l17K85
3847c6k3J70l6j3k09K87n5jQ4l3N6K1j16q6m6K88K18p07j68K59L55l25M9k57L57
3872C3J54l57O5kK99k46p1Lm0L94k11r2j13l6M41Rn9j36J80M6j21k01k10K45K74
3897B48j53l49J06NO7o3K45k2l07K88P2j88o6Q0J92j1k88N1J48j14k08K21Q3k7
3921A0K27k34k28K69j09Q6j27J09J34j02QJ21k66J01j13n4P9q6L27k42J03q7J9
3944e5J34m2j6R2N5k7N1j64L2m8J01L1J4j74nJ30M4l30K20l0k93K04k77K71R8
3969A6o9O7No1K41k00J23J93l42OK1J08J33Q3k8l95J46j15L2J56P2j21o0N3jm1
$$ plain form
3803 -361 162 191 21 -159 125 -239 -103 -23 -13 29 322 153 -261 -276 334 197 -123 -185 -229 53 151 -17 -135
3826 -135 -102 232 210 47 -239 -95 248 70 -82 -483 -3 199 39 -88 -368 -408 18 176 -4 -321 -36
3847 -36 -59 111 75 62 -147 140 85 84 168 135 191 212 96 10 -36 252 470 -237 -405 -146 209 -116 -67 -324 33
3872 33 187 -170 -105 -107 192 -54 -125 -122 -162 232 21 -71 -184 -220 221 230 171 35 215 261 140 -61 -271 -26 248
3897 248 95 -254 -148 -143 -76 -139 106 84 -223 65 137 -51 -117 -37 155 144 -144 -93 55 -59 -267 -46 37 10
3921 10 237 3 -225 44 -65 21 -106 3 137 35 43 164 -102 -1 -114 -168 -89 -175 152 -90 13 -74 -55
3944 -55 79 37 21 113 168 141 192 28 60 12 113 144 158 -16 -21 109 153 -177 43 13 -280 -76 -353 -82 16
3969 16 -53 14 19 -42 199 -1 122 315 -27 -21 0 108 241 324 296 -99 47 -68 -36 120 192 71 11 64 63 22
3995B2J75q8k6l43R2j84J62J51J90k12n2kl7j77N01k31R3j33J48k44K12J58k75
4018a00M03p0k28k12L02K3J12j74j67NJ08J82k20k0J5j01j81M7L06P4J54j52m42
4041c36J02K64J39k21K00n8j05M2Q8j85NL58j68l07O4J72L9K79k03l53p4M17o8
4064I1l96N08j52j57J23k35KJ05K34k43Q4O4n1m9K52j22j79O7Q4j41k6M91k37
4087A17j32J5Pk81l9N57l21l5L77m61K9J41r9K43k22J44k63q8K65J00K4K24k16
4110H6m89P40m06J05L8K56l97J72P8m41J03K93K00m28M5l4k46L59K22j82k92q1
4132b99J34N5P5K3j89K31P8j62k69L38J82r1l9N5l82J82M92m78k82M70K57m66
4154h5K71l00J7K40L23p07l49M47M36l56qk08O3L49l5n73k19J054K57p23k68J28
$$ plain form
3995 22 197 109 83 -260 -168 -352 -190 -39 151 -61 -113 -115 -152 -329 172 -59 34 -99 49 -195 17 175 -100
4018 -100 303 233 5 -207 95 118 230 56 -111 -106 2 184 -36 -56 -41 -142 -323 -276 30 104 258 106 -336
4041 -336 -234 30 169 -52 148 90 -15 27 115 -70 -65 293 125 -182 -118 54 93 372 169 -184 -258 159 91
4064 91 -305 203 51 -106 17 -218 -216 -111 123 -120 -36 28 -23 -72 180 58 -121 -54 30 -111 -137 354 117
4087 117 -15 0 7 -274 -313 244 -77 -112 265 -196 -167 -26 -125 118 -104 40 -223 -311 -46 54 78 302 86
4110 86 -403 337 -69 36 74 330 -67 105 183 -258 -155 138 338 -90 -45 -79 -325 34 256 74 -218 -299
4132 -299 -165 -110 -35 -12 -201 30 108 -54 -323 15 197 106 67 122 -260 -78 414 -64 -346 124 381 -85
4154 -85 186 -114 -97 143 466 -241 -590 -143 293 -63 -71 -279 -216 133 98 -475 -694 360 617 -106 -374 -246
4176b46J13O03J41q24j46N22J7l7j93J72m3P7O0q22L71P50k26o36L2L96%J77M4
4199C02n52L35L82k99n02j02O51J73j61R3q23J98R56k66m33K61L1j54q5n3k91
4220c39O44L22q58n48P19K18J98J52k65q78M51N75o68P0O44r9l07l33J28J41N71
4241E38J64r56k56O21M83n08L96l41n02K57J25l41K60M12k65m56L1K97l22M97
4261A34J97l59k51L45j45%J28j2k90J28K16k93J00L53j33r7K21k16k08M29L7j15
4283A69j58m5k24K14K49J13l78o7L74k24m3J56l51J01L06l51n56N37N34P3m37
4304hk53J26K61J79l84O5L05K4m43j46P1K47M44k27n96k03P19L21j68n31k71L79
4326h9J67l23J75j09O05o6n73j09K45L95j85M3p69J02O74L48p33k34M93K5K98
$$ plain form
4176 -246 -133 470 611 -213 -359 163 180 143 -50 122 79 156 216 -606 -235 515 289 -347 -315 81 81 258 302
4199 302 -250 85 467 168 -334 -436 215 388 227 320 -503 -305 651 385 -48 213 244 90 5 -48 -339
4220 -339 305 627 -231 -779 -60 158 356 508 243 -635 -184 391 -277 -207 437 338 31 -302 -174 -33 538
4241 538 702 -254 -510 111 594 86 482 141 -361 -104 21 -320 -60 352 87 -369 -338 -41 -363 134
4261 134 331 -28 -279 66 -79 -79 49 37 -253 -125 91 -202 -102 251 118 21 242 26 -182 247 284 169
4283 169 11 -34 -258 -44 205 318 -60 -127 247 23 -20 136 -215 -114 192 -159 -715 -178 356 429 -8
4304 -8 -261 -135 126 305 -79 -14 291 315 -128 -274 -203 44 488 261 -335 -538 181 502 334 -197 -468 -89
4326 -89 78 -245 -70 -179 426 360 -213 -322 -77 318 133 176 -593 -491 183 531 -202 -436 57 82 380
4347C80l20n77M29O86l37n10l02N25M44l63m20J35L46K02j1p51R7M42K67j32m72
4368b42J19K69J33j12l25n0M87J53n57J55j34M20J87m38m37J77M99nn32j67j14
4389e14P35k9m70k48L20N94k50l05jJ52K67Ml26k71L23L20k7m69j48M79J71J19
4411D26m61l99M51K85l50m6j62L72k18j8K07k04R7L61l00k5j67J11J18J6j82p1
4433a59pM09j96k15J61r1m8K56J00l02L11j14J6j76J12M0m3n5J23l33K5P4L98
4456B86k43j33k42K94L47k12k21k81J03K71K22j89l12M56J57k43m73K81K37J62
4476B67j01m29r9P33l6l63n92N22L96o3j62j74k95O12J73o12m9N04j38R4l17j63
4498b92J87P22l26p67j99P28N58l32n16k34K86Q78l49o25M7M56l0j74l64k11N89
$$ plain form
4347 380 60 -517 -88 598 261 -249 -551 -26 418 55 -365 -230 116 318 307 -444 -347 95 362 230 -242
4368 -242 -123 146 279 167 -158 -208 279 432 -125 30 -104 316 503 65 -372 -195 304 299 -233 -400 -514
4389 -514 221 192 -278 -526 -206 388 138 -167 -168 -16 251 255 -71 -342 -19 301 274 -195 -343 136 307 426
4411 426 -35 -434 17 302 -48 -94 -256 116 -102 -120 87 -117 -20 341 41 16 -151 -40 78 94 -88 -159
4433 -159 -166 243 47 -168 -7 -98 -146 110 210 -92 219 105 121 -55 57 97 54 -1 122 -211 -186 -112 286
4456 286 43 -90 -332 -38 309 97 -124 -405 -302 -31 191 2 -310 146 303 60 -413 -132 105 267
4476 267 166 -263 -362 371 335 -28 -620 -98 298 235 73 -101 -396 216 389 -223 -272 232 94 188 -129 -292
4498 -292 -105 617 291 -476 -675 53 611 279 -237 -471 -185 693 344 -281 -234 222 192 18 -346 -557 32
4519C2L95l76p75M90N41j34l05j44J38L48J75k37o55N16N12l85J0j34k16O53j08
4540C41l84k91N59K28n14k06J97L3K27L48o04o50J122j76l62J0J1L0R8L81o76
4561b78L2P93l7n94o2K93l20L04M8m25m8O62k07m35K21K87l94K01J66m53k15P09
4583B48R9n75K57J79n55K65J65m79M41L27l14n54N50K80m28K06K18n25q1M22j34
4604A2j37O32k71q17M79L95n03J54L73l49l78M24L6j78K87M99j101p4K83J4J45
4625g5M36m69k84M06L71o15J04M44q1m07J07j77k3O46O4p39j70O10j44j32N97
4646D69l35p53R77m17p33N07R47m05l37j1l44m1R66l84m18L46K44l81j60K51J24
4667A12K04L29n96p63L36R07k04k47J19n92J77N36k00m03N70J72q92k98N50K65
$$ plain form
4519 32 427 51 -724 -234 307 173 -132 -276 -138 210 385 148 -507 9 521 136 146 12 -204 449 341
4540 341 -43 -334 225 453 -61 -267 -70 -37 190 538 -66 -716 406 230 -132 -122 -111 -81 17 398 -278
4561 -278 -246 547 510 -84 -146 147 -173 131 179 -246 -294 368 161 -274 -53 234 -160 41 207 -246 -461 248
4583 248 347 -228 29 208 -347 -82 83 -396 45 372 58 -496 54 334 -94 112 330 -195 -276 146 12
4604 12 -125 507 236 -581 -102 293 -210 -56 317 -32 -410 14 50 -128 159 658 -443 -517 -234 -220 -75
4625 -75 361 -108 -392 14 385 -230 -126 318 237 -170 -63 -240 -263 383 447 -292 -462 148 4 -128 469
4646 469 134 -619 358 -59 -792 -285 662 257 -80 -91 -435 -476 490 106 -312 34 278 -103 -263 -12 112
4667 112 316 645 49 -714 -378 529 325 78 197 -395 -218 318 118 -285 285 457 -435 -733 -183 82
4687H2K59K77p74p24P26N75j72j01J67m66j69O08n31j72J206m1j164k01N70N1
4707FL29K52p42n23R03k5n63L82K98m9k75L30n20k51R26K45q86k56N58k76K4Q07
4729F94o51l75O17k13o96M10N79k84j40R6k69j64N60O8k85K33J99q46K41N07k35
4750D6n3J24R8r02Q21J54j63J4l6l13J11M29j93p3L8q0l08j17N58J0p1L4j02k85
4774b59K26J92k78K79K73n78k82M98K3r7K30q7m02J40N13n40l33P10j38j20J34
4795A04l75J91M31J89q05j5O65j49k46J02j24j81M14j02n11K85M92j84m83J57
4815a45N8J65K35N4n89K74K85j88l27L93N4O8k99j00k97K34M34m3m71k7J63L36
4837B67j55p5l52L80M7k51k52K71L40j40p9j17k28M18K64k74l58R1L70j78J21
$$ plain form
4687 82 341 618 -156 -880 -154 421 249 148 315 -151 -320 288 -243 -415 791 750 -414 -615 -45 6
4707 6 335 587 -155 -678 225 200 -363 19 317 268 -7 323 -197 -448 478 723 -163 -419 139 -137 -113 694
4729 694 43 -332 285 72 -624 -214 365 81 -59 37 -232 -396 164 232 -53 180 379 -467 -226 281 46
4750 46 -7 117 215 -687 134 288 125 139 103 -210 -99 330 137 64 102 22 -286 -403 155 165 94 128 26 -259
4774 -259 -33 159 -119 160 433 -145 -427 71 94 -3 227 140 -262 -122 391 -149 -482 228 90 -30 104
4795 104 -271 -80 351 540 -265 -280 385 236 -10 92 -32 -213 201 99 -412 -127 365 181 -302 -145
4815 -145 -87 78 313 367 -222 52 337 149 -178 215 269 337 38 -62 -359 -125 309 266 -205 -232 -69 267
4837 267 112 37 -315 65 112 -139 -391 -120 220 80 1 -116 -344 74 338 64 -294 -203 167 -11 110
4858A10l49O3L85r9k84m6K30M44k48m3l38K01K5N6ok18K45J22l65Q8j46P9J95
4881A01j11k06r5L20q3J25j34j08O04m1k58j27J1J74KJk69K31j55M3k16J27j67
4904b31J94k25L27K07m24K1K4m0P8j07k5K39l14L99j42N0K51l78K48K7r3pl1n1
4928cJ47k82J52j5o7R1j74K15K8n0p6J91k20R4j09N8L3j26J32K4j63J98R2P7k51
4953dj32L02K39k10k20J36j7J34P2l23k04M82k43J93O1m42o6L92j08j27J54m8
4975B1l0r7L02j02j39L75l54j11J57l7r3J52l6k98Q9M75j97j87J19L9n2n8J9P3
4999C0M9J97m69J11L51l36j8K83j60k14J91J78k11q2L16k0k52J16J6j24K23K6
5021B01j96l7J53J81k68jo7o8LK09m3j86K71j64lj28J03J13j84L02l65L5K16L2
$$ plain form
4858 110 -239 -176 209 110 -174 -220 10 454 206 163 -175 26 51 107 101 -117 128 250 -115 -27 -173 -94 101
4881 101 -10 -216 -311 9 -74 51 -83 -191 413 372 114 -13 -2 172 174 175 -94 137 -18 25 -191 -64 -231
4904 -231 -37 -262 65 272 -152 -131 -107 -147 -69 -176 -201 38 -276 123 -19 31 282 -96 152 179 86 79 48 -3
4928 -3 144 -138 14 -1 -68 23 -151 64 92 42 -34 157 -63 31 -78 -20 13 -113 19 43 -120 78 170 247 -4
4953 -4 -136 166 405 195 -25 111 94 228 300 -23 -227 255 12 205 266 -176 -242 150 42 -85 69 21
4975 21 -9 -106 196 94 -45 330 -24 -135 22 -15 -108 44 8 -290 -201 274 77 -110 9 48 -4 -62 -43 30
4999 30 79 276 -193 -82 269 -67 -85 198 38 -176 15 193 -18 -100 216 196 -56 60 76 -48 175 201
5021 201 5 -32 121 302 34 33 -34 -102 -99 110 67 -119 152 -12 -15 -143 -40 73 -111 191 -174 -139 77 109
5045A09k56R7P7m19O32j33j82P7J97k05k07J96J5k13N10k08m31J95M28k98n9K60
5067A82j29p6J77n6l34N25l95k5N7J43k09j5K07P7k54j7L30m35M24J69p4k91n3
5090g2J56k24J35L15m76J01K24j80p1J75J14k19L08n8o37L02L37l43J4K74l62
5111a87k29O03L0l72K47K49m36k62N65n7k74L31j54n48M21L35n34R1O88n70l71
5132d34P24l1l46M8J16k82j77N68k84o6O10k85o18M07L43q5k19M43k29l90M32
5153B45Kn28P15O8j070K40L75k80K38L39l73l66N34K2o31M77M00k89m50M09k46
5174a69p6O66k7o69j60M95l40m8P28j29n52N44q0p75M61P10n19j1j9n37m7J089
5196E35j57n11j42K53k18r0O51j44m48M20j39n88Q60Rj71j06R7l57k0N35j30m73
$$ plain form
5045 109 -147 -50 27 -392 240 107 -75 2 199 -6 -213 -17 -2 -215 295 87 -344 -149 279 -19 -78 182
5067 182 53 -23 154 98 -236 289 -106 -131 -74 69 -140 -155 52 129 -125 -142 188 -247 177 346 272 -19 -72
5090 -72 84 -140 -5 310 -166 -65 159 -21 -92 83 197 -22 286 228 -409 -107 230 -113 -99 175 -187
5111 -187 -416 187 217 -155 92 341 -95 -357 208 151 -123 208 54 -494 -73 262 -272 -181 507 -63 -434
5132 -434 290 259 -87 -39 77 -205 -382 186 -98 -164 446 161 -457 -50 293 208 -11 432 203 -187 245
5153 245 247 -281 434 502 -568 -328 47 -233 5 344 -29 -395 139 161 -470 7 407 118 -332 77 -169
5174 -169 -245 421 394 -275 -435 60 -280 -328 400 271 -281 263 183 -592 -131 579 60 49 30 -507 -554 535
5196 535 378 -133 -275 -22 -240 -330 321 177 -271 149 10 -578 282 291 120 14 111 -246 -266 269 139 -334
5218c34J60N37q74L72L34m75K17Q2qn62N47J94l85R9M95p64m9N37l82K31K37p7
5240A32o21K32L87l34P6M92m90l16L90n2P5L28J4n52J15L66j00j63L26N2p68L75
5262c6lp5j2N00n07J4J06j87Q5L01J5o69K26K84k27PL82m4l21L62l27j26L20K37
5286C05n62J02L04l16m6K12O9l97K12OJ22o1J99k3j18J54j64o5k5K06k9k49K73
5309A09j48k6J99k13kO7L63m78k44N97p6j09Lj49k04L29N63p93J08M43j95m08
5331b64M18l64K73p9J61m62P4L11R3j51Rj88Q7M18j0m33O4K04N6l28KL81k40K49
5355B81k81k67K04J86P4n11J71N0J38q3j16J49K3l7J03k51J08J82RP7j49j34J44
5378G0K91l75j71O1NK46j33j40L7n9L84j1l49J7j70J85L15j57k55K66n4j65K4
$$ plain form
5218 -334 -174 363 -511 -139 195 -280 -63 19 11 -551 -4 190 -195 -96 399 -365 -414 123 -259 -28 209 132
5240 132 -489 -257 130 -204 -128 364 -126 -442 -52 -104 -29 299 313 -239 -124 242 142 -21 305 357 -411 -36
5262 -36 -39 -114 -126 374 -133 -119 -13 -200 -115 186 201 -468 -242 42 -185 -178 204 160 -161 201 -126 -252 68 305
5286 305 -257 -155 149 -167 -213 -1 68 -329 -117 -111 11 -50 149 126 8 162 -2 -67 -92 114 85 -164 109
5309 109 -39 -65 134 -79 -81 -14 349 -129 -373 224 148 39 42 -107 -311 18 581 -212 -104 339 144 -264
5331 -264 154 -210 63 -16 145 -317 -243 68 161 10 19 -169 -82 336 326 -107 -43 161 217 -111 -109 272 32 281
5355 281 0 -267 -63 123 197 -314 -143 -93 45 -38 -154 -5 18 -19 84 -167 -59 123 132 209 60 -74 70
5378 70 361 -14 -185 -124 -119 127 -6 -146 -109 -168 216 205 -144 -127 -297 -112 203 46 -209 57 3 -162 -138
5401a38J67K3l80K49j76J45K39l9o3j20R1p2J06M4j64M1J1N1J5M5o4j53P5K4L8
5426ep1K39o8r0j65M1O2J01O1m2p5m3L7n6K64r4k23k9M4K88j10k79J01J85R4k29
5452f2J14l3jj56l8J76K4K41l61L9P2j97M02k97k28K57k9K4J21j96K0K30L5l18
5476a61n1K69K04j9k65k64L01J28Q5m37J10O7L34m31K8o1K46l8n0Nj82L87Q6k88
5500CK4k93K40L82j65l38k83M92J61k76k88K84j2N37l85k88L4O68o43K16j47M1
5522c6j18L46l34j46M17L48n43k09L10j53J0L64j77l50L21L08j59n35O01k53j59
5543a47K9m9j29K78L88m08k49K55J32K9O5j52l06M02n4k77l5L46km79M60O8l06
5566a41R7L62n13j4O68m20n1p7J12m24M07J78m60L19K75k87l95O87k27l98N69
$$ plain form
5401 -138 29 52 -328 -79 -255 -110 129 90 27 -93 -2 -74 32 76 -88 -47 -36 15 30 75 11 -142 -67 -43 -5
5426 -5 -76 163 95 5 -160 -119 -57 44 105 63 -12 -55 -18 -74 190 96 -127 -156 -112 176 66 -213 -112 73 167 -62
5452 -62 52 19 18 -138 -176 0 24 265 -96 -57 15 -182 220 -77 -305 -48 -77 -53 68 -128 -108 122 157 -161
5476 -161 -212 57 261 242 -23 -287 14 142 227 -210 -100 -33 301 -130 -102 -163 83 45 -5 0 -182 205 291 3
5500 3 27 -266 -26 356 191 -147 -430 62 223 -53 -341 -57 -69 468 83 -205 -171 497 -146 70 -77 -36
5522 -36 -154 192 -142 -288 129 477 -66 -275 35 -118 -108 256 79 -271 50 358 199 -336 265 12 -147
5543 -147 -118 -167 -296 -18 370 -38 -287 -32 100 129 194 42 -264 138 84 -193 -228 118 116 -363 97 165 -141
5566 -141 -44 318 -195 -209 459 39 -12 -89 23 -401 6 184 -276 43 318 31 -364 323 96 -302 267
5587B67p7m74K37K60k24l58N76k88k07M98M0n35M5K96j07J5M52l0r39O23K62o38
5609c06N48L27o96q6K38k82N7M72Q5o58Q6L37k06K68J78k62m44L12K75m58K28
5630A3K84o70N24J01l66j16Q48m56m54K53J02m48N91L77p79j03L02R5n94M46J24
5651G4m73N29J12o38j20Q42q7p21N22Q2n01P38On35k8M64O0q44N38K49j98m7Q9
5674A13n05N5N28n6l15L04j04l93N73J73n10M43L32q44o70J015q8K5J56ko33M8
5696c55Q20l45l55M79k83k15L19M3l57M72J90p08j30M75J85k14K31j79p96N17
5716b06O51o38J3M01L2n71K07L02k87L27j5n75J63L07l0j46J33L91m98r5Q1j38
5738a91k47R08m24l48L73m9l30M47p8l72J65K87k94k98O45j9n91M14K26n51J19
$$ plain form
5587 267 190 -284 -47 213 -11 -369 207 -81 -288 210 250 -285 -240 56 -51 -36 416 386 -553 70 332 -306
5609 -306 242 569 -127 -213 25 -257 -200 272 357 -301 -215 122 -84 184 362 100 -344 -32 243 -215 13
5630 13 297 -373 151 252 -114 -230 618 162 -292 -39 63 -385 206 583 -196 -299 3 98 -496 -50 74
5651 74 -399 130 242 -396 -516 326 239 -482 40 122 -379 359 365 -170 -198 266 326 -518 20 269 71 24 113
5674 113 -392 -337 191 135 -180 124 20 -373 200 373 -137 306 638 -206 -876 139 51 76 232 230 -403 -355
5696 -355 465 120 -235 244 -39 -254 65 108 -249 223 413 -295 -425 50 235 21 252 73 -723 -206
5716 -206 445 -193 -180 221 253 -318 -111 191 -96 231 216 -359 -196 111 81 -65 68 459 -39 -134 -53 -191
5738 -191 -438 470 46 -302 71 22 -308 139 61 -311 -146 141 -153 -451 194 175 -416 -2 224 -327 -208
5759b08M29j98k13K04j89K1QN38n14Q2L00l36p6M84j39m58j4N74l82k9K32n4l09
5782b47L84j96m25P92J21l71rL7j93m9L97n9l02N0J85k09J53K29l67L18J6k46
5804Il23M55K47m90K8L49j65j32O7j91Q8L06rm09N1P8J26k29M15l28k43K82j2
5827c0k47K58K44l43Q4j0j86L49J71k91j16n1J27J46nm2k57J41K16m60J41J56
5849eL05m00N2k2J8R0K31n9m37J77J84k66J52K93m76N6J03j56J46k3M3o0j42K19
5873B3j63K24R4q3l09K04J91j57J25j90j10K01j12J69Ok8j5j34J22j05K2k9m3
5896i7J33N6N1p1p5Oj5j51J93L1Mj97J70q1l8K83N4k21Q4j84l7L66r9k04J07q7
5922a9j4Q1N9Rp9k65K23m0K08n3j23j30J86M8r9n8nK1K89l24J67l2r3KJ47j17
$$ plain form
5759 -208 221 23 -190 14 -175 -154 -146 392 -122 -40 260 -76 -152 332 193 -265 -279 295 -87 -116 116 62 -247
5782 -247 137 -59 -484 308 429 58 49 86 -107 -156 241 182 -120 -70 115 -94 59 288 -79 239 255 9
5804 9 -314 141 388 -102 -74 275 110 -22 45 -146 -58 248 239 -170 -119 -41 85 -144 271 -57 -300 -18 -30
5827 -30 -277 -19 225 -118 -34 -44 -230 119 290 -1 -117 -168 -41 105 100 58 -199 -58 158 -302 -161 -5
5849 -5 300 -100 -48 -70 -52 38 269 210 -227 -50 134 -132 20 313 -163 -107 -4 -160 -14 -37 6 -54 -196 23
5873 23 -140 84 178 95 -214 -10 181 24 149 -41 -151 50 -62 107 113 85 70 -64 58 -47 -25 -54 -97
5896 -97 36 92 143 72 -3 3 -12 -163 30 61 65 -132 38 -43 -81 202 256 35 119 -65 -102 264 165 -39 68 -19
5922 -19 -33 48 107 116 37 -228 -5 -45 163 110 -13 -143 43 91 -8 -66 -71 -50 239 -85 82 50 -43 -41 106 -11
5948a1O6J76j04k93J71j91J33M4l1r4K20r1%M5N0l15K51L05k65n8p3K47l94K26
5972A4M7O3j88J32j74j99K20J98j84j53L50j95J76l13Q8J13O7j44k16L74j01J1
5994a4J41j64k24K00J85j86J49q1j78Q6L15k58k05J70L47p7k11J10j48j79J58
6015f4j98J88o6K58M1k01R7p6n5L9J88k98r5M12m8r8K62j17k28J51j50Q7J03j74
6039d2j77K17O7P3k33L7K64m26L22j2j61jK06j63j64K93P8l55L05R3m15L61j72
6062ej72J54P1l95J74Q2J2r9J38K86m91K48mj02J2J86j31j99K7J97J65l3j17j31
6086a27j3L25k0k95K31p7k39L48k13j80K3L81j01j83K58o0j53J97k09Nj50J96
6108e6k12J38J70P1l68L38J10j76l17L51m2l87N59o3k37K07J53k82J13j5k14N4
$$ plain form
5948 -11 55 231 127 -166 5 -186 -53 -9 -40 -134 86 -5 -5 40 90 -225 26 331 66 8 -65 182 -212 14
5972 14 61 124 -64 68 -106 -305 -85 113 -71 -224 126 -69 107 -206 -118 -5 62 -82 -298 76 -25 -14
5994 -14 127 -37 -261 -61 124 -62 87 6 -172 -86 229 -29 -234 -64 283 206 -5 105 -43 -222 -64
6015 -64 -262 -74 -140 118 159 -42 55 -21 -76 -37 151 -147 -242 170 122 24 286 169 -59 92 -58 29 132 -42
6039 -42 -219 -2 65 138 -95 -58 206 -220 102 90 -71 -72 134 -29 -193 100 178 -177 128 221 -194 167 -5
6062 -5 -177 -23 48 -347 -173 -91 -79 -178 -40 246 -245 3 -1 -103 -91 95 -36 -235 -208 -11 154 121 4 -127
6086 -127 -140 185 165 -130 101 24 -215 133 -80 -260 -237 144 43 -140 118 58 -95 102 -107 -102 -252 -56
6108 -56 -268 -130 40 111 -257 81 191 15 -302 49 7 -380 179 116 -121 86 239 -43 70 55 -159 -105
6130a05L36k22q1P2J67l84J78K02k61J6L56l48O2R1P2l93M61r2j74j96J83L90
6152C30m16J38J56n37K63L38l76J5K33M9m13K35L4k05K69L0l62j89M38q5o7K04
6174H2p3j90Q5J35k03K29R0j51j34K97k67rj7J81k08P9o7k6j13M79l06J07J56
6197A56j67qJK44m40m1N81k70m49K80K23l18NM33l04M7N56m72N7J25q0m46K86
6220aM17n95K4M12m48P2J09j04r1M15j56l40K75K38j60j77J24k3l40M66N9m87
6242c11K46M3r7J63J43ql16M67m45o3K22J30l98l8M25j75l9kK42k54J04L14l39
6265A4j9J29q7k47J35J46o9J6J39q7l23M09q2l03M76J01k54JK6l99K52K86l17
6288e7n7LK20k07J83M2q8J75j56j35jJ67K0k61K16J94m51L60l96Q4k0M33l05k16
$$ plain form
6130 -105 231 9 -72 0 167 -217 -39 163 -98 -82 274 -74 -12 79 151 -242 219 127 -47 -243 -60 330
6152 330 -86 52 208 -329 -66 272 -104 -89 144 193 -220 15 49 -156 113 143 -219 -408 30 -55 -122 82
6174 82 9 -181 -96 39 -164 65 155 4 -130 167 -100 -109 -126 55 -153 -74 -141 -167 -280 199 -107 0 156
6197 156 -11 -19 -18 226 -214 -255 326 56 -393 -113 110 -208 -203 230 -74 -27 529 57 114 239 159 -287 -1
6220 -1 416 -179 -155 257 -191 -119 -10 -114 -205 210 54 -286 -11 227 67 -110 14 -9 -349 117 176 -311
6242 -311 -65 -22 -119 44 187 179 -137 330 -115 -178 44 174 -224 -262 163 -12 -51 -53 189 -65 39 353 14
6265 14 -5 124 37 -210 -75 71 2 18 157 70 -253 156 74 -229 247 348 94 95 121 -278 -26 260 -57
6288 -57 -114 -111 109 -98 85 127 39 214 58 -77 -78 89 109 -152 64 258 -193 167 -229 -145 -165 268 -37 -253
6312b53M06jl43J42J91l19K6J17j45K06J77j22l51L75m1j42k8K59j30j03J86K4
6334A31k92R6J26j67K34L8j97l03M51j29p0J29r3Ln6J17j14N2J38oj19j1KK18
6358A78k02P2o4j85J62j29J38J33r7J40j26J83l01r5M36k14j55R5N8p6L1KR2q1
6382eJ76j38L9q4m6J65k71M1K50j6q1M3Q7j93n7J77k2j38J37Mkq2j72J97k05K81
6408H5j57K67k13J3Jk57J67J56J63m88J12L01m68M98k53J2J09l3m4J09PO9qj39
6432IOo7O5l6L9j2L47k15k53J98m8j27Q9q4M9P5p1L3k6j5J22J01j51n0j42Q7n
6459h2K37k58R3K87l91J42k4J00o5O7k12K83l27J11J45j67K08k19N11m87j01k7
6481a76J37J64j89K72j23j58Qp0J00O1O3J52l60J75j32Q1j22J93L3n0m45L72m2
$$ plain form
6312 -253 153 152 -191 -49 142 -177 -151 -34 -179 27 204 82 -269 106 65 -77 -105 154 24 -79 107 131
6334 131 -161 -65 61 -106 128 166 -31 -334 117 -12 -82 47 -46 -43 -99 18 -96 -44 94 88 -31 -42 -40 178
6358 178 -24 48 -16 -201 -39 -168 -30 103 6 146 20 203 -98 -193 243 29 -126 -31 27 -49 -18 -16 76 -5
6382 -5 171 33 72 -12 -58 107 -164 -123 127 111 30 73 160 -33 -90 87 65 -73 64 68 66 -16 -188 9 -196 85
6408 85 -72 195 -18 -5 -4 -261 -94 62 225 -263 -151 150 -318 180 -73 -61 48 15 -29 80 87 156 148 9
6432 9 15 -52 13 -23 16 4 351 136 -117 81 33 -94 -5 -89 -40 35 -36 -3 -29 -44 78 179 28 -22 -164 -77 -82
6459 -82 155 -103 -10 277 -114 28 4 104 39 106 -106 177 -150 -39 106 -61 147 -72 439 -48 -149 -176
6481 -176 -39 125 -64 208 85 -73 -65 -135 -35 26 89 241 -119 56 -76 5 -117 76 109 59 -386 -14 -56
6504e6L89k34k00M2J52k6p2R0j01k52M40j77K53j86K7K9m3r8P7j28p0K0J15r1
6528a00J54N5j67J03j06J98l84P34o72K71k8J36r6QN7k71K1N2J42K7o4k01j42
6551b73K70k7p1J92j23n8K50P7n80M90Rk62J61J88Nm12L0K86m56J83J61J67j57
6574E0J71j11l67K43J51k23L41j41j20m37O40n7k40J69J83n19O8N30j80j24jj81
6596a55p0M23l7M4k40N09n09l1L63l13k56J35L47j08k23N60m41q4Q9J00l53J84
6618f6J50k99K6L35k67M1N11m60j18J13Q8p7m5M33p31j05N84k9k66O33k66m50
6640b65K71J86k58J89K58n18k15P62r4m82J55K82o95N33K18j42m81N78l99k37
6660c54P21Qq17K28N91m56j02M57o7n16N04o6k33J03L94o11q9L26k36J18N05j3
$$ plain form
6504 -56 333 99 -101 -59 93 67 -5 85 -16 -268 172 -5 248 62 89 118 75 -23 54 -74 -144 -124 -9 -100
6528 -100 54 109 -58 45 -61 137 -247 487 -185 86 58 194 98 106 163 -108 -87 -35 107 134 70 -131 -273
6551 -273 -3 -30 -101 91 -32 -90 160 237 -343 147 156 -106 55 243 248 -164 -134 152 -304 -121 40 207 50
6574 50 221 110 -257 -14 137 -86 255 114 -6 -443 197 140 -100 69 252 -267 -199 331 151 27 26 -155
6596 -155 -225 198 161 205 -35 474 -35 -66 297 -16 -272 -137 210 102 -121 439 -2 -86 3 103 -250 -66
6618 -66 84 -215 -189 146 -121 -80 431 -29 -147 -34 54 -23 -68 365 -366 -471 113 84 -182 451 185 -265
6640 -265 6 192 -66 123 381 -137 -352 410 316 -166 -11 271 -424 109 327 185 -296 282 -117 -354
6660 -354 367 375 -442 -214 377 -79 -181 276 209 -307 197 131 -102 1 395 -216 -305 21 -215 -97 408 395
6682C95q12J20N28k30p1O22p37k59P77l83R0J24k9m42J23N02k07k25K54j73n39
6703e72M91M61m88j5L59l26k78O55j39m08L59L66q32O5P25o00p9P98n99m31Q09
6724C21j01m49K67L48q40M77L19m72j88K39L08o36M70N31q59R1P34m52k59M99
6744C48j67o48N85K11m76kN64m04n74O88J47k86L13j44m63m1O57p8l19M15l59
6765c3k81M34K60k26k76N39o24N3K30J63k06K72m6n76J08N96m72r2L20p6m00N89
6787B56L3m09p3L66l13j80N05m17j06M56k06k78M55J93m85j03L46N1l33N38o0
6808B36n04J92K08m05K94K5l12K95R7j41l31L06K68n46L27p2J09l48K11M84n65
6829a72M18j44l0k37M55m44j15N62l10j63M1J07k44M88J08l19J2K26m65Q3N00
$$ plain form
6682 395 -417 -297 231 1 -70 552 -185 -444 333 -50 40 164 135 -307 -184 318 111 -114 140 -33 -572
6703 -572 -81 380 -108 -123 236 -90 -368 287 148 -260 99 465 -367 -302 423 -177 -256 542 -57 -488 321
6724 321 220 -229 38 386 -454 23 342 -130 -318 -79 229 -407 63 594 -265 -174 560 108 -151 348
6744 348 181 -467 118 329 -147 -149 415 11 -563 125 272 -14 299 155 -308 -349 308 230 -89 326 -33
6765 -33 -314 120 380 154 -122 417 -207 -154 76 239 33 305 259 -317 -209 387 -85 -177 143 67 -333 256
6787 256 289 -120 -193 173 -140 -320 185 -232 -338 118 -88 -366 89 282 -203 -306 40 91 -242 296 236
6808 236 -268 -76 132 -273 21 46 -266 29 126 -15 -346 -40 228 -318 9 -63 46 -302 -91 393 -172
6829 -172 246 102 72 -165 290 -154 -269 293 -17 -180 -139 -32 -276 212 320 1 13 239 -226 -143 357
6850C57r4n53O9L33k87L10J14k67j88L58k33j59J51M43l45k79N65k47j99K70j59
6871d0L6k8K94q9k16O4j79j91L61K2q7J71J27j08l84L19j85N2k2R5l20K14K71
6894A77j93l5L8p9J00K21J30n02L00m9j70K3M30m44j69J03K71j72j52M94l97q1
6916a56L72N9j56o3p2P0J39N9j97J90k85K02l31L20j37m49O16n0j96j04K57N5
6938A43k25LL1j04J66o7N6K03k69R2l47K60p8Q5k1j6l7P4L28k71k07J02J68p3
6962dK01q2kmj27J77K60k00k24P5n5l1K8J38j72o1q1J44Q0m4j28j1j07M0K25M6
6988H1r1K28k03k17J48oJ39l1j57N9k8P4k97L34L5j55n1K03k55L66k49K01l07
7011a79J09L1N7j27j07J6K39j40Q4L0k73M25k02j40M89l82Q7R7q8l0K45qm4k78
$$ plain form
6850 357 263 -290 -221 112 -175 135 249 -18 -206 152 -81 -240 -89 354 9 -270 295 48 -151 119 -40
6871 -40 -4 -32 262 173 -43 21 -158 -349 12 34 -53 118 245 137 -247 72 -113 -61 -83 12 -308 -94 177
6894 177 -16 -51 -13 -92 8 229 359 -143 157 108 -62 -39 391 -53 -222 -119 152 -20 -172 322 -75 -156
6916 -156 216 275 119 56 -16 54 193 252 55 245 -40 162 -169 151 14 -435 181 131 -65 -169 88 143
6938 143 -82 -79 -48 -152 14 -53 3 206 -63 29 -318 -58 -136 -51 -72 -88 -125 -51 277 6 -201 -99 69 -4
6962 -4 197 115 113 109 -18 159 419 219 -5 70 15 -16 12 150 -22 -83 -164 -20 60 16 -112 -123 -230 -190 35 81
6988 81 -10 218 15 -202 -54 -60 79 48 -109 -50 -78 -4 -301 33 68 -87 -138 65 -190 176 -73 128 -179
7011 -179 -70 -39 18 -109 -216 -200 39 -101 -17 13 -260 165 -37 -177 312 -70 17 114 26 -4 241 233 189 -89
7035h9O6K24l70L46j38j36j23L16J9p4J27l54R6J87l06L14L6o1j36k0N72o18J54
7058C2j22m3K88j30J39r2j18K04j90k56K50J81k85L5L74l79P2K58k55j94N04k42
7080C1j21r1L35m30L1K44q9M3J57O3j40J14N5m03J9O07n16L4m8J71k40P6R7m11
7104d12K39L79k79j0K94j36l55M02m8j03j57K03K8J7N8o1o2K49lo71L27J76j79
7127a04N8J74j78n35N89K1m14M78J95p29M38K37n47N8O08k44l88Q7M16n31L56
7148D5K21k83k70O51l65l58N67L49n69l32O91m27K72m1j85j14K95j39l82M86J58
7169B70m15Q5K06j44j93J94L40n12K94J79n72J71L34k3l75K31j12l25L79M04l28
7190H8j84M47k19n53N48K72n69M57Np83J75N64j14l93M67k21l09K47J88m03j23
$$ plain form
7035 -89 -23 201 -169 177 39 -97 -220 96 115 41 168 -186 -90 97 -209 105 141 80 -56 -76 496 -122 32
7058 32 -90 -133 155 25 164 72 -46 158 -32 -288 -38 143 -142 -107 267 -112 -40 218 -37 -231 273 31
7080 31 -90 -181 154 -276 -245 -1 -90 -47 110 173 33 147 202 -201 -182 425 -91 -57 -105 66 -174 -98 -1 -412
7104 -412 -173 206 -73 -83 211 75 -280 122 74 -29 -186 17 45 62 120 59 -3 246 243 -428 -101 75 -104
7127 -104 -46 128 -50 -585 4 25 -389 89 284 -445 -7 230 -317 -259 349 105 -283 -196 220 -311 45
7148 45 266 -17 -287 364 -1 -359 208 557 -12 -344 347 -80 192 151 -34 -148 147 8 -374 112 270
7169 270 -145 -60 146 2 -191 3 343 -169 125 304 -268 -97 237 214 -161 70 -42 -367 12 416 88
7190 88 -96 351 132 -421 127 399 -170 287 292 -491 -316 248 134 -259 208 -13 -322 -75 113 -290 -413
7211d13P81n62n4M16k6l90L56k8m07L36L48m67j53O25k24n47O68k0m00O1M66l33
7233C3k57L45j33j13N72r9p47L20K77k23j94R32p38j79N94j81p64N13N50n93o4
7254a49K63l10l0L27K06n78K56M21o80K9O32k65m93Q29k64l10L97J7n27j55Q11
7275D27m83j34N36l22j58O9N38n70J14J29m21M3K65j15k70N81j06l20K76l3k15
7296a69j39N59k58j47K24K32n53M9N57n91M7L29n9l16J72R9m84M76K48l57o8N74
7318D25m97j49L82o2m84M12J96o64L47L10k14r2L29k8m81M45n7j41o3K79l18K21
7340I6j13J82j70K73l31P4R4j53L8l23N10r3k96L30R3k88J57J04j92j30K67j07
7362B2k47L05K27l86J36pk26K13N6M3j08J41j25j35r6L96kl83K93j54j71K27j41
$$ plain form
7211 -413 368 -194 -248 168 142 -248 108 80 -327 9 357 -110 -263 362 138 -409 259 239 -161 -100 366 33
7233 33 -224 121 -12 -125 447 348 -399 -79 198 -25 -219 713 -25 -204 390 209 -555 -42 508 -85 -149
7254 -149 114 -196 -226 101 307 -271 -15 406 -274 -245 387 122 -371 458 194 -116 281 298 -229 -384 427
7275 427 -56 -190 346 24 -134 -65 473 -97 17 146 -275 -232 33 -82 -352 229 123 -197 79 46 -169
7296 -169 -308 251 -7 -154 70 302 -251 -202 355 -236 -189 140 81 -235 -63 36 -448 28 276 -81 -149 425
7318 425 -72 -221 161 99 -385 27 223 -441 -94 216 2 -90 239 211 -270 175 118 -23 -86 193 -125 96
7340 96 -17 165 -5 268 -63 11 105 -48 -10 -333 177 84 -212 118 211 -77 80 184 -8 -138 129 22
7362 22 -225 80 307 -79 57 50 -176 37 93 136 28 169 44 -91 -187 209 207 -176 117 -37 -208 19 -122
7385a22J85r6O3P9m27M59M8l09M43j79j35m5Pj08J4L0J97m41K81K27j94j32J13
7408d2m1P2K26k09K14l11J23J62n1L7j59J22P6j69j26L23j84m55M58N8o1r6L2
7431ak07J3OK00P4k68K1J78j42p6P5J24j43J24O9j39J46k56K07r7rP0J59n0p9
7456aL26m04K40j7ok34O7J12j27J13n0n7R9j49J31p4M9k37J65K69j00j16j59J88
7480B8L9K49o42M52j46j16KJ27o7J4J57j76m3J25Q8j34j75L68j09L5l31N7K18
7503B0k75L82j70J9J23k20J1K78k49J3K84k71p9K49mj51MP9j29J86ml08L24K65
7527C77k70j44J42l9j35k1J0M7J94l08j77K80R1J57j80Q4N6l87J87J10m5J13r6
7550D6j27k03J58J97r6j04M17l38q6O9K26j63J25k46nJ65J34j66J7Rq3r2K38J05
$$ plain form
7385 -122 63 -33 30 109 -318 141 189 -120 323 144 9 -36 -29 -137 -123 -93 104 -337 -56 171 -23 -155 -42
7408 -42 -83 -11 215 6 220 -91 32 194 143 180 21 143 219 50 -76 247 63 -392 66 124 63 -33 -1
7431 -1 -208 -195 -189 11 85 -183 -162 16 -126 -202 -127 -3 -146 -22 47 -92 54 -202 5 -92 -101 -31 128 78 -1
7456 -1 325 -79 161 144 138 -96 -29 83 -44 69 19 -38 61 -88 43 -31 18 -219 -54 215 115 -1 -160 28
7480 28 67 316 -326 126 -20 -136 -134 -7 -74 -60 97 -79 -122 3 91 -43 -218 150 41 76 -255 -198 20
7503 20 -255 127 -43 -24 99 -121 -110 168 -81 -68 216 -55 -134 115 111 -40 -36 43 -86 100 96 -212 112 377
7527 377 107 -37 105 66 -69 -90 -80 -33 161 -147 -324 -44 47 204 24 108 164 -223 -36 74 29 142 46
7550 46 -81 -284 -126 71 -25 -129 288 -50 -136 -67 159 -4 121 -125 -130 35 169 3 20 29 -54 -146 92 197
7574A97m72K01J55K9l32K45kk54J84K61m62L38Q7m8J24l68k5j03J72k6J34K23
7596B58p2k58k32K84J4k45M93j73j90J41L1l42K57M41n22NL63l55j66O21p1k51
7618C1j46K74l32O2K22j8m4rq6k32M56km77J63K04k81LM42j74j70M09j79l74M1
7642b17M73k15j90J02J55k18m3L18l41J28N57o68L5J84O6k08L43l46k76K58K98
7663A95l28m1M65J19o65K45J99n35K44L16l74K19K36j33m03M50ol28K46j84p7
7684a40K7J53Q7l78M01r3k66K30K92m70j72L46j06O6M02j29l81K40K57o77K86
7705b5M52l60l08L50J35n28L36J90k82j04K53m87M9L95j3l32L6N31n45K54M06
7726D03m86j39K43k34P1J39R4k87O0M83m09k89O04k50m80N24K07m00P5L06m17
$$ plain form
7574 197 -275 -74 81 110 -222 23 21 -233 -49 212 -250 88 175 127 251 -117 -142 -245 -73 -99 35 258
7596 258 186 -72 -304 -20 -6 -251 242 69 -121 20 51 -291 -34 407 -115 -110 253 -102 -268 353 282 31
7618 31 -115 159 -173 -111 111 93 49 40 -46 -278 178 176 -301 -138 66 -215 -212 230 56 -114 295 116 -258 -217
7642 -217 256 41 -149 -47 108 -110 -153 165 -176 -48 509 -159 -124 60 126 -82 261 -85 -361 -103 195
7663 195 -133 -174 291 410 -255 -10 189 -346 -102 214 -160 59 295 162 -241 209 203 -125 121 -63 -140
7684 -140 -113 40 127 -251 150 57 -209 21 313 -157 -329 17 -89 -23 379 250 -131 109 366 -311 -25
7705 -25 427 67 -241 109 244 -284 52 242 -40 -144 109 -378 -329 66 53 -279 -243 288 -257 -3 403
7726 403 -83 -222 21 -213 -142 -3 91 -196 -136 347 -62 -351 253 3 -477 47 254 -146 -71 235 -182
7747a82O3L15J53p18L20K93m35J75K23l86K10J12l60k84M69K88m15K93J15m10
7767a61j7K92k78k97P67k61j90J40K25j98k31K89j3l18O09l14k06lK41j82o0N81
7789D15o84J94M25k53j83Q0J4j37n0N63m35j18J10M9k91J86L39m22J59J85k95
7810a49k15P28k06l72M29J37n33K4N78n97OJ35j55L7K78J34l27K0K99l93K83R6
7832B37j76j57M85l00k36J81N5R2l94L29N0l77M21j09j58J50K7j81M1K00k50j74
7854b44K83R0j18J03j33Lj02L29n9k29K86J74m05J79j83P2J32k58P4JJ53nl99
7877b56L46K0j59J76o1j49O0m4J9k08J55L55j62k37K37l75L59j8O4j02J98p2j90
7900d4K37n6L5k12P0r4P7K34j16j50K81j64j07J55j40R3k42J50M4O8j33J8l4J60
$$ plain form
7747 -182 -119 196 349 -369 -49 244 -191 -16 207 -179 31 143 -217 -501 -32 256 -159 134 249 -161
7767 -161 -178 114 -164 -461 306 45 -145 -5 220 22 -209 80 67 -251 358 44 -162 -165 76 -106 -166 415
7789 415 -269 -75 350 97 -86 -6 8 -129 -179 384 -51 -169 -59 -10 -301 -115 224 -198 -39 146 -149
7810 -149 -364 364 158 -214 215 352 -181 -157 421 -176 -170 -35 -190 -153 125 259 -68 -48 251 -142 141 237
7832 237 61 -96 389 89 -147 34 89 181 -213 116 166 -211 210 101 -57 93 120 -61 -20 180 -70 -244
7854 -244 39 129 11 114 -19 -16 -118 211 152 -77 209 383 -22 157 -26 46 178 -80 -6 -5 148 143 -256
7877 -256 90 110 -49 127 66 -83 -23 -67 -48 -256 -101 254 92 -145 92 -283 76 58 122 20 218 146 -44
7900 -44 193 137 172 -40 30 -64 13 247 131 -19 262 98 -9 146 6 99 -143 7 51 119 -14 4 -30 130
7924A30p2J93j18k83J47M4p9J24J9l00Q1J10l9j1K9N4N0q9j82K86Rk26K46l19
7948a96J28k6K93k41j79lL27j02l1l1R8O9j82R6l7K1L12m1l81K15jR9j54P1j80
7973e6J22K65l40J14j79j4J21j50L95k50j3r3J54k07J72j42J97m4Q5j51j18J85
7995E3m39L93N3l20J21J98J2Mm6O7n2J10l03K1O2L5K46l81K00r0J50p2J96m60
8019b42K86M3K8k17K3J07j57J41l1%J9K75k18p3K56k37mr2L58k37J80j08j67M4
8043b3K07q7j20j8Q1n7k8J24Lj44RJ87j49m6P2k20K10j23k1J31J64L9l97K30k56
8068b32k1K77l9J41m76O77l83n5J61j59l7L7L97k66q8L59l42N6J32k49J3K15j20
8091bj2p7J69n5J4j92R2K25j34L01k89k58N76l40k08J87Q3p6N1J75k40J04P6j12
$$ plain form
7924 130 58 251 133 -150 -3 41 -38 86 105 -195 -114 -4 -43 -54 -25 29 79 -10 -192 94 103 -123 123 -196
7948 -196 -68 -94 199 -42 -221 -224 103 1 -30 -61 37 106 -76 20 -17 4 316 275 -106 109 108 207 53 124 -56
7973 -56 66 331 -9 105 -74 -88 33 -117 278 28 15 -78 76 -131 41 -101 96 52 137 -14 -132 53
7995 53 -386 7 60 -260 -139 59 71 75 29 96 44 154 -149 -128 -66 -31 215 -166 34 -56 94 22 218 -242
8019 -242 44 87 115 -102 -79 28 -129 12 -19 -19 0 275 57 -16 240 3 -1 -93 265 28 208 100 -67 -23
8043 -23 184 97 -23 -41 40 -17 -45 79 82 -62 -53 134 -15 -61 11 -209 1 -122 -143 -12 152 191 -206 24 -232
8068 -232 -253 24 -15 126 -350 327 -56 -111 50 -109 -146 -109 288 22 -66 293 -49 7 139 -110 -97 118 -2
8091 -2 -14 -91 78 23 37 -155 -63 162 28 329 40 -218 358 18 -190 -3 80 4 55 230 -10 94 170 58
8115E8k51K10L01l99J46N9l28m6M57m4l18L95j83j67J60N8k64J34K33q9l22N05
8137C05k96k76L88rr3j4k8k93J41K77K57m09K74j32k45n8K93j95j04L12o6k39
8159b10q7M88q4p7K71n49R6N03k02k38J69j39j94K71L00l53j48K47j05P5J7J4
8181F5k73L92k97l2j32N19k6n17M54j09
$$ plain form
8115 58 -193 17 318 -81 65 124 -204 -250 207 163 -155 240 57 -110 50 108 -156 -22 211 122 -200 305
8137 305 9 -267 121 112 19 5 -23 -316 -175 102 359 -50 224 92 -153 -211 82 -113 -217 95 29 -210
8159 -210 -297 191 107 30 301 -248 -152 351 149 -89 80 -59 -253 18 318 -35 -183 64 -41 34 51 65
8181 65 -208 184 -113 -145 -277 242 216 -301 153 44
8191D4
$$ Imaginary data points
##PAGE= N=2
##DATA TABLE= (X++(I..I)), XYDATA
0@%%%%%%Qq%%Qj6J6j6K4l2M0n6O4p2Q8j06J28j50J71k00K35k71L10l53M02m60
32b46N25n90O63p46Q39r40J045j161J293j438J594j762J943k145K369k611K875
49A507l165L486l842M238m677N170n734O379p122P987r016J0268j1822J3808j6435
64h970K0085k5508L4358n1111R3085l76945o04732J074362J16863m58078N97635
75D11044J5403j014289K97574O84858n94069k1235R10810m48534q14893M97851
85g5480J52270m69651O63815M52588j003303k64939P56751k58869l12962P62706
95D02926J6615p55088K58655K38897o25898K89530Q59807m63115n97104L87318
105A2543r5158l47629O95841L15015p82143m5784M73532m46490j57573P56760
$$ plain form
0 0 0 0 0 0 0 0 8 0 0 0 8 -8 8 -8 16 -16 24 -32 32 -40 48 -58 70 -80 91 -109 126 -145 165 -188 214 -246
32 -246 279 -311 352 -394 445 -495 550 -611 682 -756 838 -924 1019 -1126 1243 -1368 1507
49 1507 -1658 1828 -2014 2224 -2453 2717 -3017 3362 -3760 4227 -4789 5479 -6343 7465 -8970
64 -8970 11115 -14393 19965 -31146 61939 -315006 -919738 154624 271487 -186591 411044
75 411044 426447 -587842 -290268 394590 -199479 -220714 690096 241562 -573331 -75480
85 -75480 76790 -392861 270954 723542 -279761 -544700 212051 -46818 -359780 402926
95 402926 419541 -335547 -76892 162005 -463893 -174363 685444 222329 -374775 12543
105 12543 -82615 -430244 265597 580612 -201531 -247315 226217 -220273 -377846 378914
115C78914k4774n59865K45772L5185n45754L63016O52357m47077l51880L67825
125A13719j90910l01851N61813J80786n52279J12069L12957m58695p3484N83987
135B88112j09553l67531L03016J1m42432K71387L78674l75361r3534L67062k34436
146a4585k72766M00358O2916l67535K09615K21420l89729k4707L69661j93962
156F86j94252L64933q686l72734J66229J82267k83703P7015L20058k51266k11260
167b10713K93294k7329k56131K50897J73268l00746p121J88986k17104l5685L73567
178B25183o1757l29404J21649J06462j82137J30098J95330k52316j01843K47766
188I9031q0292j89991K21343J09338k14687J5558Q3491j67638N8714K64596j34253
$$ plain form
115 378914 354140 -205725 40047 75232 -470522 -107506 544851 97774 -254106 113719
125 113719 -77191 -379042 182771 363557 -188722 -76653 236304 -222391 -295875 288112
135 288112 178559 -188972 114044 114055 -328377 -56990 321684 -53677 -147211 219851 -14585
146 -14585 -287351 113007 175923 -191612 18003 239423 -150306 -175013 194648 686
156 686 -193566 171367 162681 -210053 -43824 138443 -145260 -68245 251813 547 -210713
167 -210713 82581 55252 -200879 50018 223286 -77460 -84581 104405 -112699 -148384 225183
178 225183 163426 -165978 -44329 62133 -120004 10094 205424 -46892 -148735 99031
188 99031 18739 -171252 50091 159429 -55258 -39700 43791 -123847 -65133 199463 65210
199F5210k29938J45175Q3853j17698Q0128O2008j76962K7231J87522j18123j34398
210a25992J67300N8059j34423K1774L1759r0392Q0056J18661j58659j06317J66076
221B7902N7448j02766Q909j130p1208R2695J03637j33277q3614J26997L3202q4119
233b5324J3199K1105k8040N1434J6716j17636o452J44378J5446j04180k5673J1670
245c3357J3209P6170J4964j13041l1099R9061K2619o0121m918J9847j498J1973
257A3809j7787m9371L4475Q1671k5404q4489o135M5507L5281K0180l3426o5362
269e1051J4793P6631O377n2450j2043J9021N555l050j1938q147K6123K1871l6223
282d531l9802K1936M3623R692k0663l3426j4288L5111M1395j4017m0602o667J8307
$$ plain form
199 65210 -164728 -19553 64300 -53398 26730 88738 -88224 -60993 126529 8406 -125992
210 -125992 41308 99367 -35056 -13282 18477 -71915 8141 126802 -31857 -138174 27902
221 27902 85350 -17416 -8507 -9637 -80845 11850 115487 -17790 -101404 25593 58795 -25324
233 -25324 -12125 8980 -19060 32374 49090 -68546 -74998 69380 84826 -19354 -45027 -33357
245 -33357 -20148 56022 70986 -42055 -73154 25907 48526 -11595 -16513 3334 1836 13809
257 13809 -3978 -53349 -18874 62797 37393 -47096 -53231 -7724 27557 47737 14311 -51051
269 -51051 -36258 40373 46750 -5700 -17743 1278 6833 3783 -8155 -16302 9821 31692 -4531
282 -4531 -44333 -22397 21226 30918 10255 -23171 -37459 -2348 39047 25030 -15572 -22239 -3932
295c932Q512k108j135R76J100o655j1647M581K1364R884j3205j8367n437J2641
309c428K0252O460j5722j9709k619J1678J0158L028l976j1376j2718J166J8229
322A423J3614p732j7593n894J0144J1622K317m100j746k55m317m319M526J3862
336A1552P082j3394k3184l389K5627K2812r033l0197j5167J8949K8492j512k6232
349g594r336J5664R746p822r647J464J4976Q985k1402k6056J8057L8500k9l1849
363f343k0548P734L2431K2995k6229l9887J3188L8430j756k2846o641L597J2876
376G001J0487k4082k3640L2305L2332l1698l4398J2858K3342J7273M195m0465
388a4490l3221M4660M7010l0778l3542J1829N866L719J6575k0384k2990M1821
$$ plain form
295 -3932 4580 2472 1337 2313 3413 -3242 -14889 -10308 11056 20940 7735 -10632 -16069 -3428
309 -3428 16824 23284 7562 -12147 -14766 -3088 7070 10098 6122 -5254 -17972 -16806 1423
322 1423 15037 7305 -10288 -16182 -6038 5584 7901 3801 2055 1800 -2517 -6836 -2310 11552
336 11552 18634 5240 -17944 -21333 4294 27106 18073 -12124 -27291 -8342 20150 18638 -7594
349 -7594 -16930 -1266 8480 658 -8989 -7525 7451 16436 -4966 -31022 -12965 25535 25506 -6343
363 -6343 -26891 -19157 13274 36269 10040 -29847 -16659 21771 20015 -2831 -9472 -5875 7001
376 7001 17488 -6594 -30234 2071 34403 2705 -31693 -18835 4507 21780 25975 -14490
388 -14490 -47711 -3051 43959 13181 -20361 -8532 -2666 1053 17628 -2756 -25746 16075
400A6075K0094n9255j8376N1931J5206j2367J517l6432k6464O5107L8045o2398
412g317k0558M1666j3167j7406L1587j4935k6566N2407P310q1849N953P4746j5616
425A6255k6246K8663l0209l4324O9220K0243p4853J7759O1692m9404k9730M9531
437A8597k0503k6550P0923m406r4058K9322O5711n3772r381O7372l9805m8234
449d4784O7173o409p6926O5127O9158q2870k7252N9127m5164k3739J02175m528
461E1088r8817L8564M0484q2568K1636J02371n1567n9644O4672k5842p6455Q9431
473A3353O8463r2281j0120N8175p7149l0869J19720M084q6372M6662J1669j07107
485h1772L8206J16527n5188m4725P4372n1612r2448R9247O7905q2947K3008N5076
$$ plain form
400 16075 36169 -23086 -41462 10469 25675 13308 14825 -21607 -48071 17036 55081 -7317
412 -7317 -27875 13791 624 -16782 14805 -130 -26696 25711 33021 -48828 -42875 31871 16255
425 16255 -9991 18672 -11537 -45861 23359 43602 -31251 -13492 48200 -1204 -30934 18597
437 18597 -1906 -28456 42467 38061 -55997 -26675 39036 -14736 -24117 43255 3450 -44784
449 -44784 22389 15980 -60946 4181 73339 -9531 -36783 22344 -22820 -46559 55616 51088
461 51088 -47729 -9165 31319 -51249 -29613 72758 21191 -38453 26219 377 -76078 13353
473 13353 81816 -10465 -20585 37590 -39559 -70428 49292 53376 -32996 13666 25335 -81772
485 -81772 -43566 72961 17773 -26952 47420 -4192 -96640 2607 70512 -12435 10573 65649
497F5649j19129l9158J38049K686p4969P2511j525j37013M0701J14955o6201j3926
509a7370J05947p7811j23916R7458O0870p4468O4089O0755j52295m6578J36586
520C3267j7628n7623J15665l071j56195L5229Q7285p9138L3135J37467r9659j35340
532a06606R2052L0635p0602J06152O7016j64472l8267J14184n5308l5880J53981
543I2885p455j59538L7758N5824r6125O2426J49198j08115j15509R6680j0005
554a976q5412J28167P5289j47862j1550Q7995j02470k7636J77945o903j38008
565e2421N5150J7958j24563P8730J49461j05699p3820J00826o0095r8030J42580
576C0077O6920j28660K5269O6989j36250j6838J71898k4127j01814Q4921q279
$$ plain form
497 65649 -53480 -92638 45411 48097 -26872 45639 44114 -92899 -52198 62757 -3444 -17370
509 -17370 88577 10766 -113150 -15692 45178 -29290 34799 95554 -56741 -103319 33267
520 33267 15639 -41984 73681 70610 -85585 -50356 36929 -42209 -9074 128393 28734 -106606
532 -106606 -14554 16081 -54521 51631 118647 -45825 -84092 30092 -25216 -61096 92885
543 92885 85430 -74108 -36350 19474 -76651 -14225 134973 26858 -88651 8029 -1976
554 -1976 -87388 40779 116068 -31794 -43344 44651 -57819 -85455 92490 85587 -52421
565 -52421 2729 20687 -103876 -25146 124315 18616 -55204 45622 -14473 -112503 30077
576 30077 96997 -31663 -6394 60595 -75655 -92493 79405 55278 -46536 38385 30106
587C0106j38724P8188J23353r7701k2613J03059q9460r6890J33154M3728j02153
598c5953N8342N2370j42998j0899J40683m0308o2420J04177k3730j36735P0974
609b6497Q8834r2062J3809J02688r8994q4647J19227J4387q9794Q2752M9393j35860
621e6764m81J12525o2650m1092J18919k7800j21573P4017N5617j02692L5153J04760
633H7939r6701o1298J08109k1746q5685R9836M3529j22667J7012Q4824q3669k1292
645e1809J19142l7800r4734Q0174K2086j01794N3580Q6380r5097k8167R7048m6873
657B136o7807R9682J8903j00771M2622O0920r1437m948R9233m7351n9756Q1910
669C3336m678q8913N8720N5695q6245L135Q1383n9970m9331Q5729k243p2607N6631
$$ plain form
587 30106 -108618 -30430 92923 -4778 -27391 75668 -13792 -110682 22472 66200 -35953
598 -35953 22389 74759 -68239 -79138 61545 21237 -41183 62994 39264 -97471 -26497
609 -26497 62337 -29725 -15916 86772 -12222 -96869 22358 36745 -53049 29703 79096 -56764
621 -56764 -57245 55280 -7370 -48462 70457 42657 -78916 -4899 50718 -51974 -16821 87939
633 87939 -8762 -70060 38049 16303 -69382 30454 73983 -48684 -31672 53152 -30517 -51809
645 -51809 67333 29533 -65201 14973 37059 -64735 -11155 75225 -19872 -48039 49009 2136
657 2136 -65671 34011 52914 -47857 -5235 55685 -35752 -40700 58533 11182 -48574 33336
669 33336 28658 -60255 -1535 54160 -32085 -28950 52433 -7537 -56868 28861 26618 -45989 10642
682A0642L3871q6458J3592P7647n1893l3519P1189j9013o1670N9861K4164p4611
694c6198K3200O1932n9340k7416O7345j7576m8016N2424J1318o6230K6721N1881
706D0045n2393j8111N5692j9491l6156M7949K140n4378L1406M0562n1241j1441
718b5417N0932j8738k9966L8260k582m2248L3117L0691m7994q196M1643j6470
730C032j9306L2833p992l3727L0806J9739m3564P66L8649j7271j9550K4053q006
743D62k1863L1211J1714l9066J354L1229j3675j1556K0331q890j5268K5289M252
756A5524l1453P067K6144j4421j0706J4140o662q633J9346j481k4727R179J9735
769A3052j2581q540J0000m376k719J4362m241j8184Q656J3600r610m147P769k909
$$ plain form
682 10642 44513 -41945 -28353 49294 -2599 -36118 35071 16058 -45612 14249 38413 -36198
694 -36198 -12998 48934 -10406 -37822 29523 11947 -36069 16355 27673 -38557 -11836 40045
706 40045 -12348 -30459 25233 5742 -30414 17535 19675 -34703 -3297 37265 -13976 -25417
718 -25417 25515 6777 -23189 15071 12489 -29759 3358 34049 -13945 -22141 19502 3032
730 3032 -16274 16559 8567 -25160 5646 25385 -18179 -17413 21236 3965 -15585 8468 462
743 462 -21401 9810 21524 -17542 -16188 15041 1366 -10190 10141 1251 -14017 11272 15524
756 15524 -15929 -8862 17282 2861 -7845 6295 -367 -9000 10346 8865 -15862 -6683 13052
769 13052 471 -8069 1931 -2445 -5164 9198 4957 -13227 -4571 9029 -581 -4728 3041 132
783A32k466P956n217r502J0583Q627j0673m499O153l53P02M886m821p942N023
798a411M918l908k32K752k741j340K269k147q06M496q35n254J905L818o47j206
814c69J651r28k853k51K471L083J365k946l473R84L536J882j654l939k218L796
830A37M341j690n010p93M004R68m697l609M572O280j569p660k775O541O836n73
846E303p714n446M674R572K778r148o813N299Q902k215r577j269Q810M974o140
861A990r284J58J1504N929r344j1772K133J1077O634m817j2543l517J4213R916
875A2277j0998j2265O604J0894k44o637o971L511J3012J507j7238o991J4717J0646
889A1824m519r830r046L510J9245N119k2035r215J6130P901q092l991j075K289
$$ plain form
783 132 -2334 5622 405 -9097 1486 10113 -560 -5059 1094 741 1443 6329 1508 -6434 -1411
798 -1411 3507 -401 -633 2119 -622 -1962 307 -1840 -2646 1850 1015 -4239 -2334 1484 837 -369
814 -369 1282 354 -2499 -2750 -279 2804 4169 1223 -2250 -1266 2270 4152 2498 -1441 -3659 137
830 137 4478 2788 -2222 -3015 989 1957 -2740 -6349 -1777 4503 2934 -4726 -7501 -960 5876 5303
846 5303 -2411 -7857 -3183 6389 9167 19 -6794 -1495 7407 5192 -4385 -5654 3156 8130 1990
861 1990 -7294 -7136 4368 10297 953 -10819 -8686 2391 9025 4208 -8335 -11852 2361 12277
875 12277 1279 -10986 -4382 6512 6268 -369 -7340 -3829 9183 10690 -6548 -13539 1178 11824
889 11824 7305 -2525 -11571 -8061 11184 16303 -5732 -14947 1183 9084 992 -2999 -4074 -1785
903a785R790l517j9267K719K3532J665j6562o379J89P062J7805k475k5270K58
917a2235K2009j365j3306M407L554k340P034n666j8563J1204K4455j1009j9625
930a1446N206L497o47J2939l281k1151R097K1059j4639j4828J5085M402p141R030
944G182l379j9133J1278K0589j5452j0885J6748k277j3573R930K894j2901J3947
957D968J4685k4146j3907K0250K239q103J4836q73k5309N495J7615j2346o04K2575
971A7375j2000k4677J4049J0598j2655J2966J5793k5656j4013K0748k638r050
983i160K6756L499l6359%K1872j0832J937K5698j8266k8404K2669J0108k5083
996a5565J5370K6171k6585j5766J9240j1974q744M0727K597m6764O616K7404k1409
$$ plain form
903 -1785 8005 4488 -14779 -12060 11472 13137 -3425 -9804 -9615 -2553 15252 12777 -12493 -12235
917 -12235 9774 8409 -4897 -490 3064 724 7758 2092 -16471 -5267 19188 8179 -11446
930 -11446 -6240 -2743 -3390 9549 6268 -14883 -5786 15273 634 -14194 891 5293 -1848 7182
944 7182 3803 -15330 -4052 16537 1085 -9800 6948 4671 -8902 1028 3922 -8979 4968
957 4968 19653 -4493 -18400 1850 4089 -4014 10822 9949 -15360 -9865 7750 -4596 -5200 17375
971 17375 5375 -19302 -5253 5345 -7310 5656 21449 -4207 -18220 2528 -110 -9160
983 -9160 17596 21095 -15264 -15264 6608 -4224 -2287 23411 5145 -23259 -590 9518 -15565
996 -15565 -195 25976 -609 -16375 2865 -9109 -17853 22874 25471 -21293 -14677 12727 -8682
1009h682m89L1735j9721k1082L3873n674m3039K8205L9214l0439j3286J8802k5674
1022a6257o850N0196n683m6005K4800K2524m2773o16L8194j6355o627L4596l0804
1035a660m8476M7140M0711l6333o234J7443l3790j986M9875j5944l3903M0835
1047A7678R204n7051O313M2358j5754J515K8478m4267l8646N8374K7662m4814
1059h950M167K2016l4990o63L9678k3476k0431M9864k192o1420J4731M1380j9988
1072b74K251K4990m2754k2927N8892P353m9821J8302K7323l5389Q50L1728k9366
1085h842j1178N0895j2550n3847K8717L1758l4203K954K7756l5902j0049N1528
1097B7037j4039m8087L4051K7097l8789M605K8167l3713n984M8159j7397m1636
$$ plain form
1009 -8682 -9171 22564 2843 -18239 15634 9960 -33079 -4874 34340 3901 -9385 9417 -16257
1022 -16257 -23107 27089 21406 -24599 201 22725 -20048 -20664 17530 1175 -5452 29144 -1660
1035 -1660 -50136 -2996 37715 1382 -4852 12591 -21199 -23185 26690 10746 -23157 17678
1047 17678 26882 -30169 -23856 18502 2748 4263 32741 -11526 -50172 8202 35864 -8950
1059 -8950 -4783 17233 -17757 -18420 21258 -2218 -22649 27215 25023 -36397 -21666 19714 -274
1072 -274 1977 26967 -15787 -38714 20178 27531 -22290 -3988 23335 -12054 -11204 20524 -8842
1085 -8842 -20020 30875 18325 -35522 -6805 24953 -9250 -6296 21460 -14442 -24491 27037
1097 27037 12998 -35089 -1038 26059 -12730 -8125 20042 -13671 -19655 28504 11107 -30529
1109c0529L7098J8288m3112R451L1690l2218n420M1971k4007l6982M2296J6115
1121B4641m2122J2126K6240l6112j901M3068k2738k9995M0089L622m2241K2837
1133b486K7161l8618p35L8319k6249k2514M2369j831l9716K6249K0684m0237O090
1146a1514L8539k7579k0280L6594q258l0556L3509J3960m4849O289L4987k5150
1158d308j1270L3988j4267k8405L1740Q246l7454J6154L1587l0362j4150K8832
1170A0331j0526j3595L2631l463m0670J7232K9797k4031p710K3248j4577j2253
1182a3586K7610o578l0856K4149K3555k9872r294K1489q820l933K2765j3947k6832
1195b4150K5438J9900k7747o498J9261o658k275J5995j5576j8861K6910J4868
$$ plain form
1109 -30529 6569 24857 -18255 -8804 22886 -9332 -14752 27219 3212 -33770 8526 24641
1121 24641 -17481 -5355 20885 -15227 -17128 25940 3202 -26793 13296 16918 -25323 -2486
1133 -2486 24675 -13943 -14678 23641 -2608 -25122 17247 15416 -24300 1949 22633 -17604 -11514
1146 -11514 27025 -554 -20834 15760 7502 -23054 10455 24415 -20434 -14145 20842 -4308
1158 -4308 -15578 18410 4143 -24262 7478 15724 -21730 -5576 26011 -4351 -18501 10331
1170 10331 -195 -13790 18841 15378 -25292 -8060 21737 -2294 -10004 13244 -1333 -13586
1182 -13586 14024 7446 -23410 739 24294 -5578 -14872 6617 -2203 -6136 16629 2682 -24150
1195 -24150 1288 21188 -6559 -13057 6204 -454 -2729 13266 -2310 -21171 5739 20607
1207B0607k7426m168J8218o140l193J1289j3279j0160K5602P086k9897l164J9862
1220E237o84k161M863j5538p898K4996M882k3774J207J6854n548o289M709p049
1234f193J314J9498m195k5996L793K0354j093n404n62r299R47J7717l285j7838
1248a0242O463J3445p540o954L534k223L740J0426r201j5550R426J3924o048o676
1262c476J208k403L728Q669o457j0369Q138Q668p085l993L762p4J220L771o458
1277a151n644Q828N087p325m020L528M76J557K277n313m045O088L068m423p01
1292a713K368j505l16K311j713p52K954l49l768P51L195q27L2J050j970j200K069
1309F17R95m24R56j109l248Q74L461M22k204k195m41J620K273j127k989O25K709
$$ plain form
1207 20607 -6819 -10987 7231 1091 -2102 9187 -4092 -14252 11350 18436 -11461 -14625 5237
1220 5237 4553 2392 7255 -8283 -16181 8815 13697 -10077 -8870 7984 2436 -3853 856 -6193
1234 -6193 -4879 14619 10424 -15572 -11779 8575 7482 2078 1516 -7783 -6836 10881 7596 -10242
1248 -10242 -3779 9666 2126 -4828 -1294 -3517 223 10649 1448 -14102 -4676 9248 3200 -3476
1262 -3476 -2268 -4671 -943 7726 1269 -9100 -962 7706 621 -3372 390 316 1536 5307 -1151
1277 -1151 -6795 2033 7120 -205 -4225 -697 -221 1336 3613 -1700 -5745 343 3411 -1012 -1713
1292 -1713 655 -850 -1166 1145 -568 -1320 1634 1285 -2483 -1732 1463 636 668 1718 -252 -1452 617
1309 617 1612 1188 2144 1035 -2213 -1339 2122 2544 340 -1855 -2296 -676 1597 470 -2519 -1894 815
1326H15K49k699r09K299K963m87m147j657L710M525j168n469k470M142N159j318
1342C538n590j892M145L927j858n212n32M808L114m127n163J041O543K614n145
1357B11o561J638P876K483n653n696J587P095K609o071m945L505O649k55n997
1372a525l113L737O619p60q127l115O919N585k939o371k721M656O937j590r236
1387e044j279P680L392l986m207p71M561M977l626q097K401R088J53o483k605
1402c846J292M673M809n427q197L412R033j888n626l22N48K448L289m712o273
1417f787O239O996n407o146K997J889J487L017n261o129O624O453o117l331M510
1432A034o40o88L811l946m940Q032M308r217j809O667j822j969N094l822n936
$$ plain form
1326 815 1064 -1635 -2544 -245 2718 2231 -1916 -3573 137 4662 3494 -1975 -4445 -303 4856 3538
1342 3538 -2052 -3944 201 4128 2270 -2942 -3474 1334 4448 321 -4842 -3801 2742 5356 211
1357 211 -6350 -4712 3164 5647 -6 -5702 -4115 2980 5589 -482 -5427 -1922 4727 4472 -1525
1372 -1525 -4638 -901 5718 4958 -3169 -6284 635 6220 3281 -3090 -5811 -1155 5782 4192 -5044
1387 -5044 -6323 1357 4749 763 -3444 -4215 346 5323 1697 -6400 -3999 5089 5242 -1241 -3846
1402 -3846 -2554 2119 6928 1501 -6696 -3284 5749 3861 -1765 -2087 -1539 909 4198 -514 -6787
1417 -6787 -548 6448 1041 -5105 -2108 -219 1268 4285 -976 -7105 -481 5972 -145 -3476 1034
1432 1034 394 -294 3517 -429 -5369 2663 6971 -2246 -4055 2612 790 -1179 3915 93 -5843
1447e843P386L196r068R55P847m661l025O007l821n332Q983K966r856J825P046
1462D605o979j617R008k823o183O760P82r442N303P230q122j158Q226o198o620
1477g228J0371J949q935M864L638j1471J299J2645n238p798Q717q25r439P747
1491B96N485j0046K401J0090r901p658J2683K446q851O060J778j2725M676J3434
1505A0168r592p417J1618j177j0450P310L851j0097O013R286j4132o140J5501
1518D742K15r696P076M28j1868Q202J0625j3422l834J4927l961j0879Q954K195
1532C704r986R416O850j6576k115J7200m475r902R511q14j0180R113O427j4937
1546f764R28J5315p782j0489J0418P16q224R338L554j5430K457J5278q149q040
$$ plain form
1447 -5843 1543 4739 -4329 -3374 4473 -188 -3213 2794 -1027 -6359 2624 5590 -4266 -2441 4605
1462 4605 -2374 -3991 5017 2194 -3989 2771 3553 -5889 -586 6644 -1478 -2636 5590 -608 -7228
1477 -7228 3143 5092 -3843 1021 4659 -6812 -5513 7132 1894 -5904 2813 1988 -7451 296
1491 296 5781 -4265 -1864 8226 -1675 -9333 3350 5796 -3055 3005 4783 -7942 -3266 10168
1505 10168 576 -6841 4777 3600 -6850 460 4311 -5786 227 9513 -4619 -10759 4742
1518 4742 4957 -4739 2337 2765 -9103 -901 9724 -3698 -7532 7395 3434 -7445 1509 3704
1532 3704 -6282 3134 9984 -6592 -8707 8493 4018 -5884 3627 2813 -7367 1746 8173 -6764
1546 -6764 -5836 9479 1697 -8792 1626 2342 -5882 3456 7010 -8420 -5963 9315 1166 -6874
1560f874J0664q53r116Q998L341j3277M788J3209j0649q599J1241J83p702Q675
1574D029J475j3604M511J2649r925n901J1639k527r488Q506K662j0675O181R989
1588I521j2596n187J2691j937p648R277M74j2047O026R349j0472k425J2211m719
1602B518r498Q966J626r392P224O899j2704k295J1808m653o631J0371J0j1636
1616g387O416O579j0290P35J1268o430p717R523k44q372P775N734j1345j03R120
1631E262o153m475J0945j074j0506O276M273r183K334R367p599m763Q896k539
1645A061q033Q172M412r119J186O373p780j319J0702l142p823O550K205q605L446
1660a714P953o886k115P679m812o058Q066L109p649J985M013p196j5Q517l784
$$ plain form
1560 -6874 3790 2937 -6179 2819 6160 -7117 -2329 10880 231 -8368 2873 3056 -4646 4029
1574 4029 5504 -8100 -3589 9060 -865 -6766 4873 2346 -7142 1364 4026 -6649 -468 9521
1588 9521 -3075 -8262 4429 2492 -5156 4121 4595 -7452 -1426 7923 -2549 -4974 7237 2518
1602 2518 -6980 1986 3612 -5780 1444 8343 -4361 -6656 5152 499 -6132 4239 4249 -7387
1616 -7387 -971 5608 -4682 -3947 7321 891 -6826 2697 2453 -5919 1856 7590 -3755 -3858 5262
1631 5262 -891 -5366 5579 4505 -6001 275 4548 -4635 -2301 7066 -533 -5296 3600 1061
1645 1061 -6972 1200 5612 -3507 -2321 4052 -3728 -5047 5655 2513 -5310 1240 3445 -5160 -1714
1660 -1714 6239 -647 -2762 4917 105 -5953 2113 5222 -2427 -442 3571 -3625 -3640 4877 1093
1675A093n364O842J16q067L462O234n697k81N882n373m579P325K203o564L055
1690B87L016o240M27O568l871l081O424j007o946L727M064m799J331M380n523
1705a243l253O431l00m413L889J526n814R49M305l329j083N262j951n335M194
1720a65K386m205K196L737m801j496M610j411l083M161Q81m627J202K726l600
1735a489L09L992k387l077L343J73l315K608J768l549k00K831j560j424L200J12
1751A335l073J665J651k915O97K818j829j363K561r77j927K029J487k638J31J538
1767A190j847m11K357j040j462J586L10k350R31J583j318l51J391r70q33J528
1783B94L34j266L32Q40j009j48J268k54o75J137j92j068P47P19q68l77P21p58
$$ plain form
1675 1093 -4271 2571 2687 -5380 -1918 4316 -1381 -1662 4220 -1153 -5732 1593 3796 -2768 287
1690 287 3303 -2937 -2510 4058 187 -2894 3530 2523 -4423 -696 3368 -1431 -100 4280 -1243
1705 -1243 -4496 1935 1635 -2778 1111 2637 -3177 -2228 2077 -1252 -2335 2927 976 -4359 -165
1720 -165 2221 -1984 212 3949 -852 -2348 2262 851 -2232 1929 2810 -1817 -615 2111 -1489
1735 -1489 -1180 2812 425 -2652 691 864 -2451 157 1925 -1624 -1824 1007 -553 -1977 1223 1335
1751 1335 -1738 -73 1578 -1337 -640 2178 349 -1014 1547 570 -1357 672 2159 -479 -348 1190
1767 1190 -657 -1068 1289 249 -1213 373 683 -1667 -736 847 -471 -822 569 -401 -1234 294
1783 294 628 -638 -306 534 -475 -623 645 391 -284 853 661 -407 340 1059 191 -186 535 -223
1801b23r1O12k77k92K50r6o70K33P27n79k23O19k51l93M67K76l99N82M20m41n78
1822c27O50M31k73pl29M1K38K34m60o73M93L85k05m66k12k09Q71j02n88l78N17
1843c69N83l2p18o3M66P03l17o57j22O74N77o02n01o6R85N24n98r65J38R02M35
1864I77n98q47R9R23M09j177p66K00J285Mj030l42N45N62K84j080o20Q24J286
1883I38k43j030j12Q30P36p1j470m22J333O85n92j243L95L48N40m27r44r7Q92
1902D6N84j092n38K40J134n2m08j071K14J484K68j492j55Q17O22j53l96n59K27
1921b80J352j58j489N9J108O9l62k41o13K88R70j72j336L18O40j31m38K61m67
1940f22j41J302l30j155O07P99n99j14K26r2p9R30m59q58Q89N57p48j15R93j141
$$ plain form
1801 -223 -314 298 21 -271 -21 -117 -787 -554 173 -406 -629 -10 -261 -654 -187 89 -310 272 692 251 -327
1822 -327 323 754 481 474 145 186 424 658 198 -475 18 403 198 -268 -480 -689 182 80 -508 -886 -369
1843 -369 214 182 -536 -599 -133 570 253 -404 -526 148 725 123 -378 -444 541 1065 467 -498 -360 542 977
1864 977 379 -468 -369 554 963 -214 -980 -780 505 509 -521 -863 -318 244 528 -552 -1172 -348 938
1883 938 695 -335 -447 383 1119 1048 -422 -844 489 1174 582 -661 -266 82 622 195 -749 -846 46
1902 46 630 -462 -1000 -760 374 322 -86 -1157 -943 541 809 -683 -838 -21 601 448 52 -507 -280
1921 -280 1072 914 -575 -516 592 661 299 58 -555 -267 703 531 -805 -487 153 22 -416 -155 -622
1940 -622 -763 539 209 -946 -339 460 -139 -253 -27 -119 -198 732 273 -585 304 861 113 -2 991 -150
1960a50k55J249p02r31Q28N21j381N61R08q90q13J355j56q37R12m6j365J136J020
$$ plain form
1960 -150 -405 844 142 -789 39 560 -821 -260 648 -242 -1055 300 144 -693 219 173 -1192 -56 964
$$ [...]
8191b18
##END NTUPLES=NMR FID
##END=
