##TITLE=1H_LR-746-R3-CHL
 CDCl3
 8 sc, 
 6.04.2022
##JCAMPDX= 6.0         $$ Bruker NMR JCAMP-DX V2.0
##DATA TYPE= NMR FID
##DATA CLASS= NTUPLES
##ORIGIN= UXNMR, Bruker Analytische Messtechnik GmbH
##OWNER= root
$$ XWIN-NMR		Version 3.5
$$ Wed Apr  6 10:45:47 2022 Russian Standard Time (UT+4h)  she@DPX200
##.OBSERVE FREQUENCY= 200.131346
##.OBSERVE NUCLEUS= ^1H
##.DELAY= (6, 6)
##.ACQUISITION MODE= SIMULTANEOUS
##.ACQUISITION SCHEME= undefined
##.AVERAGES= 8
##.DIGITISER RES= 18
##SPECTROMETER/DATA SYSTEM= spect
##.PULSE SEQUENCE= zg30
##.SOLVENT NAME= CDCl3
##.SHIFT REFERENCE= (INTERNAL, CDCl3, 0, 15.7039)
##AUDIT TRAIL= $$ (NUMBER, WHEN, WHO, WHERE, WHAT)
$$ ##TITLE= Audit trail, XWIN-NMR		Version 3.5
$$ ##JCAMPDX= 5.01
$$ ##ORIGIN= Bruker BioSpin GmbH
$$ ##OWNER= she
$$ F:/spectra/data/she/nmr/H-F/1/audita.txt
$$ ##AUDIT TRAIL=  $$ (NUMBER, WHEN, WHO, WHERE, WHAT)
(   1,<2022-04-06 10:44:25.42 +0400>,<she>,<DPX200>,
      <created by zg, POWCHK disabled, PULCHK disabled
       configuration hash MD5:
       00 E9 B6 7A A2 85 ED C7 34 08 36 98 17 FE 4E 26
       data hash MD5: 16K
       0A 5F 42 00 D1 A8 F6 4F C0 18 C3 E3 AA FC 6E 5F>)
$$ ##END=
$$ 
$$ hash MD5
$$ FF C5 A3 0E 59 17 CA 5A 25 3F 25 5B 53 F9 EB 97
##$RELAX= 
##$RELAX= 
##$RELAX= 
##$RELAX= 
##$RELAX= 
##$RELAX= 
$$ Bruker specific parameters
$$ --------------------------
##$DU= <F:/spectra>
##$EXPNO= 1
##$NAME= <H-F>
##$PROCNO= 1
##$TYPE= <nmr>
##$USER= <she>
##$AMP= (0..31)
100 100 100 100 100 100 100 100 100 100 100 100 100 100 100 100 100 100 
100 100 100 100 100 100 100 100 100 100 100 100 100 100 
##$AQSEQ= 0
##$AQ_mod= 1
##$AUNM= <au_zg>
##$AUTOPOS= <>
##$BF1= 200.13
##$BF2= 200.13
##$BF3= 200.13
##$BF4= 200.13
##$BF5= 200.13
##$BF6= 200.13
##$BF7= 200.13
##$BF8= 200.13
##$BYTORDA= 1
##$CFDGTYP= 0
##$CFRGTYP= 5
##$CHEMSTR= <none>
##$CNST= (0..31)
1 1 145 1 1 1 1 1 1 1 1 1 1 1 1 1 1 1 1 1 1 1 1 1 1 1 1 1 1 1 1 1 
##$CPDPRG= <>
##$CPDPRG1= <>
##$CPDPRG2= <>
##$CPDPRG3= <>
##$CPDPRG4= <mlev>
##$CPDPRG5= <mlev>
##$CPDPRG6= <mlev>
##$CPDPRG7= <mlev>
##$CPDPRG8= <mlev>
##$CPDPRGB= <>
##$CPDPRGT= <>
##$D= (0..31)
0 1.2 0 0 0 0 0 0 0 0.06 0 0.03 0 0 0 0 0.0002 0 0 0 0 0 0 0 0 0 0 0 0 
0 0 0 
##$DATE= 1649227464
##$DBL= (0..7)
120 120 120 120 120 120 120 120 
##$DBP= (0..7)
150 150 150 150 150 150 150 150 
##$DBP07= 0
##$DBPNAM0= <>
##$DBPNAM1= <>
##$DBPNAM2= <>
##$DBPNAM3= <>
##$DBPNAM4= <>
##$DBPNAM5= <>
##$DBPNAM6= <>
##$DBPNAM7= <>
##$DBPOAL= (0..7)
0.5 0.5 0.5 0.5 0.5 0.5 0.5 0.5 
##$DBPOFFS= (0..7)
0 0 0 0 0 0 0 0 
##$DE= 6
##$DECBNUC= <off>
##$DECIM= 32
##$DECNUC= <off>
##$DECSTAT= 4
##$DIGMOD= 1
##$DIGTYP= 9
##$DL= (0..7)
0 120 120 120 120 120 120 120 
##$DP= (0..7)
150 150 150 150 150 150 150 150 
##$DP07= 0
##$DPNAME0= <>
##$DPNAME1= <>
##$DPNAME2= <>
##$DPNAME3= <>
##$DPNAME4= <>
##$DPNAME5= <>
##$DPNAME6= <>
##$DPNAME7= <>
##$DPOAL= (0..7)
0.5 0.5 0.5 0.5 0.5 0.5 0.5 0.5 
##$DPOFFS= (0..7)
0 0 0 0 0 0 0 0 
##$DQDMODE= 0
##$DR= 18
##$DS= 0
##$DSLIST= <SSSSSSSSSSSSSSS>
$$ [...]
##$SUBNAM2= <"">
##$SUBNAM3= <"">
##$SUBNAM4= <"">
##$SUBNAM5= <"">
##$SUBNAM6= <"">
##$SUBNAM7= <"">
##$SUBNAM8= <"">
##$SUBNAM9= <"">
##$SW= 18.0517287032376
##$SWIBOX= (0..15)
0 0 2 0 0 0 0 0 0 0 0 0 0 0 0 0 
##$SW_h= 3612.71676300578
##$TD= 16384
##$TD0= 1
##$TE= 0
##$TE2= 300
##$TE3= 300
##$TEG= 300
##$TL= (0..7)
0 120 120 120 120 120 120 120 
##$TP= (0..7)
150 150 150 150 150 150 150 150 
##$TP07= 0
##$TPNAME0= <>
##$TPNAME1= <>
##$TPNAME2= <>
##$TPNAME3= <>
##$TPNAME4= <>
##$TPNAME5= <>
##$TPNAME6= <>
##$TPNAME7= <>
##$TPOAL= (0..7)
0.5 0.5 0.5 0.5 0.5 0.5 0.5 0.5 
##$TPOFFS= (0..7)
0 0 0 0 0 0 0 0 
##$TUNHIN= 0
##$TUNHOUT= 0
##$TUNXOUT= 0
##$USERA1= <user>
##$USERA2= <user>
##$USERA3= <user>
##$USERA4= <user>
##$USERA5= <user>
##$V9= 5
##$VALIST= <valist>
##$VCLIST= <CCCCCCCCCCCCCCC>
##$VD= 0
##$VDLIST= <DDDDDDDDDDDDDDD>
##$VPLIST= <PPPPPPPPPPPPPPP>
##$VTLIST= <TTTTTTTTTTTTTTT>
##$WBST= 1024
##$WBSW= 4
##$XGAIN= (0..3)
0 0 0 0 
##$XL= 0
##$YL= 0
##$YMAX_a= 742880
##$YMIN_a= -851472
##$ZGOPTNS= <>
##$ZL1= 120
##$ZL2= 120
##$ZL3= 120
##$ZL4= 120
##$ABSF1= 10
##$ABSF2= 0
##$ABSG= 5
##$ABSL= 3
##$ALPHA= 0
##$AQORDER= 0
##$ASSFAC= 0
##$ASSFACI= 0
##$ASSFACX= 0
##$ASSWID= 0
##$AUNMP= <proc_1d>
##$AZFE= 0.1
##$AZFW= 0.1
##$BCFW= 1
##$BC_mod= 2
##$BYTORDP= 1
##$COROFFS= 0
##$CY= 11.3945322036743
##$DATMOD= 1
##$DC= 2
##$DFILT= <>
##$DTYPP= 0
##$F1P= 2.36226072786647
##$F2P= -0.459571619588291
##$FCOR= 0.5
##$FTSIZE= 0
##$FT_mod= 4
##$GAMMA= 1
##$GB= 0.15
##$INTBC= 1
##$INTSCL= 1
##$ISEN= 128
##$LB= 0.24
##$LEV0= 0
##$LPBIN= 0
##$MAXI= 10000
##$MC2= 0
##$MEAN= 0
##$ME_mod= 0
##$MI= 1.114404
##$NCOEF= 0
##$NC_proc= 0
##$NLEV= 6
##$NOISF1= 3.799351
##$NOISF2= 2.8
##$NSP= 1
##$NTH_PI= 0
##$NZP= 0
##$OFFSET= 15.70392
##$PC= 1
##$PHC0= -17669.29
##$PHC1= 11.00078
##$PH_mod= 1
##$PKNL= yes
##$PPARMOD= 0
##$PSCAL= 0
##$PSIGN= 0
##$REVERSE= no
##$SF= 200.130013532006
##$SI= 16384
##$SIGF1= 3
##$SIGF2= 2
##$SINO= 400
##$SIOLD= 16384
##$SREGLST= <1H.CDCl3>
##$SSB= 0
##$STSI= 0
##$STSR= 0
##$SW_p= 3612.71676300578
##$SYMM= 0
##$S_DEV= 0
##$TDeff= 0
##$TDoff= 0
##$TI= <>
##$TILT= no
##$TM1= 0
##$TM2= 0
##$TOPLEV= 0
##$USERP1= <user>
##$USERP2= <user>
##$USERP3= <user>
##$USERP4= <user>
##$USERP5= <user>
##$WDW= 1
##$XDIM= 8192
##$YMAX_p= 0
##$YMIN_p= 0
$$ End of Bruker specific parameters
$$ ---------------------------------
##NTUPLES= NMR FID
##VAR_NAME=  TIME,          FID/REAL,        FID/IMAG
##SYMBOL=    X,             R,               I
##VAR_TYPE=  INDEPENDENT,   DEPENDENT,       DEPENDENT
##VAR_FORM=  AFFN,          ASDF,            ASDF
##VAR_DIM=   8192,          8192,            8192
##UNITS=     SECONDS,       ARBITRARY UNITS, ARBITRARY UNITS
##FACTOR=    0.0002768,     1,               1
##FIRST=     0,             0,               0
##LAST=      2.2672688,     0,               0
##MIN=       0,             -851472,         0
##MAX=       2.2672688,     742880,          0
$$ Real data points
##PAGE= N=1
##DATA TABLE= (X++(R..R)), XYDATA
0 0 0 0 0 0 0 0 0 8 -8 8 -8 16 -24 24 -32 40 -48 64 -79 89 -110 130 -156 187 -218 251 -295 341 -394 451
30 451 -515 587 -671 759 -856 963 -1082 1218 -1359 1514 -1688 1874 -2080 2305 -2548 2814
46 2814 -3107 3427 -3777 4160 -4580 5047 -5566 6139 -6782 7505 -8329 9274 -10369 11656
60 11656 -13199 15086 -17456 20529 -24692 30685 -40097 57079 -97362 397090 3439 -668747
72 -668747 74054 -190243 -280287 554627 533252 -424291 -142471 170829 -465413 -254680
82 -254680 704860 295211 -327362 6741 -150292 -589991 241095 742880 -122423 -359790
92 -359790 184278 -175944 -406439 323847 356259 -224081 93769 234539 -470831 -315573
102 -315573 474408 213518 -164562 193256 -18125 -501553 50196 427507 -139996 -108584
112 -108584 373016 -85553 -464133 74246 172488 -149022 217252 320837 -372322 -368866
122 -368866 225142 70863 -109969 297931 128685 -398133 -97717 204612 -134180 7368
132 7368 423926 -5304 -397352 1053 100016 -132212 194564 324925 -225781 -281956 130203
143 130203 -10462 -120881 268058 160264 -299200 -102857 138362 -128532 -33965 293552
153 293552 -13913 -270864 68114 88830 -185058 63089 241459 -118465 -137297 154751
163 154751 -30706 -161392 169178 128514 -189888 8940 182025 -124305 -125405 154056
173 154056 5695 -105703 155094 54775 -253877 -31349 187368 -49964 -61544 130173
183 130173 -60622 -166394 105005 75769 -141291 57407 175800 -120109 -149680 88393
193 88393 31804 -14806 145749 5876 -217040 2689 175799 -25589 -54772 79197 -37232
204 -37232 -84535 89755 25149 -122257 48876 125372 -100518 -115825 62782 31858 -12161
215 -12161 60173 -41319 -131644 60494 136630 -59516 -88521 38559 13375 1494 73224
226 73224 -17678 -101298 47066 100891 -55080 -61132 59294 31491 -21579 4372 -32995 -40639
238 -40639 77493 67865 -92589 -91954 34690 49712 17928 8972 -55804 -67884 48731 73301
250 73301 -38397 -50409 30256 24527 -14616 -3678 -2819 6769 48728 16278 -66167 -35619 57937
263 57937 55374 -3435 -31616 -40573 -8338 55869 38012 -48006 -52793 12514 24205 -5129 -10004
276 -10004 -6408 -2975 7614 -6437 -28370 75 38858 17413 -24835 -26822 -598 29231 39949
289 39949 3610 -40865 -22237 28667 34204 3772 -12122 -9779 -3725 2411 3470 347 974 -3017
303 -3017 -14628 -16384 -2387 10410 9589 -4098 -19896 -19267 2236 19884 13457 -4762 -12871 -6745
317 -6745 4419 13414 17104 9516 -7480 -14782 49 20408 20102 322 -15824 -12656 2706 11565
331 11565 5343 -6779 -10040 -5504 -3870 -7406 -5308 5652 9304 -6294 -22985 -14516 12852 27162
345 27162 8151 -24615 -26434 10519 36063 17292 -13367 -17404 814 19831 17452 -6787 -15012
358 -15012 9033 18212 -7694 -21100 -1240 15966 12039 -8942 -33665 -21136 27160 35007 -15660
371 -15660 -41727 -13623 16137 23659 10016 -21908 -25765 17096 30043 -9412 -17615 15675 20773
384 20773 2372 -6496 -16981 -6315 37265 32280 -32429 -41580 12718 27179 4571 -5974 -22872
397 -22872 -23045 23884 27790 -33327 -34828 23241 21064 -12103 -4960 -9790 -19146 24898 33992 -29012
411 -29012 -25077 40638 20244 -28959 -4138 10031 -2880 33313 29833 -52604 -43744 43888 29860
424 29860 -19849 6832 -1846 -45408 2538 35931 -25836 -16325 50360 -4515 -66392 -2112
436 -2112 27339 -6674 30220 33629 -60252 -43966 53923 21646 -25350 36027 22232 -53305
448 -53305 -3675 38481 -30687 -5175 76127 -2109 -74844 5374 19769 -36281 28989 59742
460 59742 -49104 -50439 36793 -15283 -49067 57317 49903 -55950 -15550 27210 -52438 -18152
472 -18152 92118 22619 -55981 17239 6998 -70642 19022 93707 -8846 -31939 33340 -38867
484 -38867 -75107 58511 73917 -35350 -3237 25629 -83062 -55915 84162 40111 -35184
495 -35184 31199 -5519 -112102 -7754 100322 3556 -18555 55210 -37029 -103119 39225
506 39225 73869 -27175 30160 69082 -83937 -91340 65890 40279 -23697 69237 28847 -122227
518 -122227 -39045 76215 -18253 -15554 98736 -5752 -121065 -1641 33369 -50788 51107
529 51107 116683 -64800 -110082 34127 5106 -38830 99980 77562 -99128 -47077 47431
540 47431 -52416 -17375 139978 36569 -106220 -8094 9364 -81391 45756 141248 -37146
551 -37146 -91850 33037 -30885 -87135 86377 101882 -67840 -26720 36101 -98379 -57515
562 -57515 138376 61238 -72869 19460 2215 -120211 16659 141786 -10569 -46490 64315
573 64315 -43671 -120510 66928 100794 -45664 11871 57454 -109250 -84789 105969 42076
584 42076 -54681 56378 19012 -134174 -21827 98893 -19669 -18137 93339 -31869 -128999
595 -128999 32794 68749 -41363 39564 86203 -83970 -87248 68698 18478 -40174 83412
606 83412 48429 -110386 -33837 63387 -33662 -10121 105395 -9032 -111236 15372 34715
617 34715 -61290 31895 95083 -57859 -76008 49075 -8482 -58666 74884 62829 -79753
628 -79753 -19447 53999 -50565 -27131 100504 15072 -76067 28955 26201 -77101 16010
639 16010 95139 -32665 -50754 50548 -19115 -74221 55356 59133 -61213 -8593 46158
650 46158 -58857 -40689 78468 10815 -59908 34970 23818 -74613 5709 75241 -28727
661 -28727 -30887 60444 -10539 -65388 43479 45675 -49515 6104 51939 -45443 -35034 58403
673 58403 -1535 -49891 40371 25874 -65707 -3637 49582 -32778 -22687 53777 -13128 -58500
685 -58500 33050 31784 -45962 4570 43807 -31578 -20786 48068 -5924 -38758 38801 26351
697 26351 -45884 2766 40650 -24362 -15208 40647 -11070 -40052 31047 22227 -43023 -4322
709 -4322 30898 -20808 -15019 28832 -12402 -31753 27874 16416 -37724 -1269 30525 -13868
721 -13868 -10104 26210 -8353 -22876 29714 19028 -31026 -1128 28365 -8211 -9711 18473
733 18473 -6724 -16310 23441 8974 -33334 -4788 22576 -7553 -9932 11570 -10234 -17168 17794
746 17794 7281 -25830 -909 21944 -6076 -11308 9181 -1148 -3933 20122 5757 -22907
758 -22907 -449 21252 759 -5084 8284 -2661 -6740 10925 1813 -16986 690 14102 -6279
771 -6279 -12530 1360 -1228 -2392 7568 -2968 -17569 -459 13320 -812 -6955 2345 828 248
785 248 7390 1695 -6469 3739 9490 -698 -2159 5502 2877 -187 2541 -1909 -5948 2190 5809
800 5809 -4175 -7628 -1251 298 -1088 -437 -2698 -5260 -2696 -182 282 2269 1905 -2843 -2663 2775
816 2775 4375 2353 1363 488 75 2257 3914 2557 155 871 1873 -77 -3698 -1933 4081 3956
832 3956 -4905 -10089 -3550 5380 4540 -3919 -9669 -5399 3540 6457 398 -6323 -4566 3658 7332
847 7332 850 -5019 775 9473 6601 -5237 -7963 4483 14731 5797 -9610 -10414 2519 10925
861 10925 5545 -6920 -14153 -5194 9780 7372 -8878 -12036 503 7982 1487 -8963 -9823 4481
875 4481 14642 1068 -14705 -4359 13682 12468 15 -8864 -9748 5711 20874 6092 -17465
888 -17465 -9136 11623 10861 -378 -8431 -11099 1512 13358 -3330 -18860 702 16471 -875
901 -875 -14110 -8747 -4005 8838 19390 -4303 -27424 -2556 24121 9856 -5028 -3648 -6982
914 -6982 1154 16652 332 -15872 9884 21196 -9134 -17222 1507 1706 4913 15690 -9073
927 -9073 -29735 3529 23059 -6110 -13145 3502 -4797 -4871 12820 -4614 -20586 13675 24723
940 24723 -12343 -13052 10079 -2414 -4541 19350 3765 -16915 11378 16323 -20927 -11595 21547
953 21547 5623 -7068 8354 -11622 -28509 13297 27793 -10566 -10638 7554 -18166 -19346 21576
966 21576 14775 -12002 6719 5443 -29285 -7038 32273 7687 -9570 13068 -5116 -29232
978 -29232 10054 30680 -3886 -2413 13882 -20426 -26282 22990 20763 -15516 1485 9068 -25623
991 -25623 -12207 22921 -3603 -15364 23998 7562 -38079 -7780 23530 -3959 1432 25427
1003 25427 -14293 -30141 21375 17759 -24085 8175 32955 -12958 -17731 12185 -14731 -14032 46059
1016 46059 22577 -46726 -17818 20841 -12365 -2696 33986 -9737 -32692 18777 4288 -43155
1028 -43155 10881 50364 -9052 -25628 4800 -20856 -11796 55994 24690 -49780 -9826 29941
1040 29941 -15628 -7868 35457 -3992 -21998 26865 -515 -50386 11462 51176 -12858 -24585
1052 -24585 10157 -18067 -15785 41622 7629 -50123 6836 39895 -24609 -25126 23296 -2180
1064 -2180 -9335 37083 626 -53299 7837 45878 -13373 -15506 26057 -7055 -19923 26245
1076 26245 949 -38115 23046 43943 -32295 -34654 19520 798 -8005 31689 -2260 -49894
1088 -49894 6134 36203 -21599 -16551 30345 -2291 -22768 17532 842 -29941 24260 39084
1100 39084 -30567 -27438 28142 5650 -13798 23998 3666 -36772 10426 33280 -23926 -19558
1112 -19558 28447 -1148 -25185 16652 7120 -30389 8666 26739 -28105 -19086 33167 1945
1124 1945 -26378 16040 9702 -27998 10885 32348 -22243 -17980 29224 -786 -22999 24554
1136 24554 15627 -31275 1805 26042 -19847 -11180 31305 -7583 -31925 19787 15163 -30261
1148 -30261 2208 24606 -22655 -14264 28348 -5794 -25277 23026 11756 -33271 4481 32023
1160 32023 -13374 -12440 20871 -10284 -18043 33537 16876 -34684 -3443 23944 -11831 -5423 23786
1173 23786 -10683 -22325 21523 5461 -33476 6075 30694 -13578 -17740 8232 -11808 -8282
1185 -8282 32798 6594 -37399 -1891 25286 -6743 -5433 16021 -7688 -9627 23040 1007
1197 1007 -29206 10487 30850 -9443 -15777 5698 -5804 -1789 22462 -3529 -31140 5821
1209 5821 24829 -9995 -15983 4172 -2920 276 17552 -7260 -28050 7967 25693 -6788 -12626
1222 -12626 7325 1698 -676 11099 -5053 -16017 15676 23937 -12478 -19754 4045 7684 6643
1235 6643 10114 -11350 -22907 7767 19358 -8408 -13013 5894 1869 -5245 1010 -5662 -8254
1248 -8254 13918 13755 -15626 -15699 8807 11235 3663 2595 -7927 -9783 12353 15311 -8704 -9424
1262 -9424 8102 5180 -2844 438 -3067 -4931 7616 5681 -11919 -8303 7877 4144 -5285 -3554
1276 -3554 -4269 -2720 8158 5056 -10018 -6458 7188 5031 -867 1370 -707 -2282 4376 4923 -2228
1291 -2228 131 5541 -500 -4262 996 2400 28 1861 -894 -6137 -2670 3219 386 -2448 -887
1306 -887 -2668 -4593 347 3160 729 -1265 -2216 -2924 1222 5658 2500 -2653 -1453 2090 3214 2138
1322 2138 180 -930 1580 2735 -1037 -3629 281 3958 1595 -4180 -6557 -1408 4925 3634 -4279
1337 -4279 -8287 -2544 5031 4912 -2590 -6906 -1565 5310 4507 -2527 -4125 1823 6847 3056 -4419
1352 -4419 -4563 4318 9262 2431 -7052 -6599 3635 9386 2260 -8670 -8254 2044 7430 1611 -8080
1367 -8080 -7645 2165 6835 -982 -7605 -3802 4656 6452 -695 -8041 -3316 8563 9556 -2580 -9166
1382 -9166 -1207 8184 8703 361 -8486 -4907 7882 8506 -3962 -7999 -429 4273 2737 -2759 -8174
1397 -8174 -2873 8396 4326 -9675 -8783 3128 6313 2177 -2571 -7937 -2262 10682 6324 -8202
1411 -8202 -4666 6441 5092 1077 289 -4264 -1121 9917 4329 -9760 -3633 7053 1261 -3301
1425 -3301 -660 -4361 -2403 7826 845 -12990 -3490 8633 835 -3533 1135 -4341 -4056 8814
1439 8814 4306 -8437 868 8641 -3445 -3843 6618 1429 -1987 8187 1094 -12069 1157 11703
1453 11703 -2521 -4569 5463 -4630 -8941 6446 3986 -9304 1384 6741 -9606 -6546 9058
1466 9058 -112 -6999 7596 3330 -11652 1450 10437 -5011 -1506 12430 -2113 -10874 7252
1479 7252 6422 -7535 3537 9040 -9134 -4836 10576 -3714 -10489 10051 6374 -13108 -2569
1492 -2569 5483 -9075 -1323 14966 -4534 -15483 6580 7022 -10387 2481 11407 -7009 -3557
1505 -3557 12059 -5120 -11630 14926 12523 -12746 -2989 8150 -7585 -783 16374 -4512 -16724
1518 -16724 9277 7543 -15565 -921 12146 -7547 -5578 10501 -8883 -14768 15902 11416 -16552
1531 -16552 -2612 10866 -8468 -2123 16415 -4972 -13030 15362 8303 -18159 1129 16724
1543 16724 -6137 -3969 11715 -9389 -13595 17715 9373 -19265 -1313 12053 -10650 -5209 13540
1556 13540 -7201 -13005 14721 5006 -20323 1548 16379 -7699 -4547 12585 -7510 -11488 17611
1569 17611 8430 -16718 3010 14684 -10002 -5812 14073 -3871 -10037 14028 2815 -20191
1581 -20191 2755 16169 -9031 -6872 10426 -7961 -12721 14070 5906 -16897 3110 13029 -12270
1594 -12270 -7139 14620 -1581 -8586 13371 3286 -17451 4774 16590 -7910 -4477 13046
1606 13046 -5463 -12632 12420 6368 -13907 4090 11685 -13582 -8837 12546 -2004 -9921 10897
1619 10897 2609 -17729 1345 12287 -8498 -3196 14211 -4751 -13877 9792 7294 -9849 6515
1632 6515 12476 -11477 -7459 13117 -541 -8014 11830 4530 -14988 361 9571 -8975 -2978
1645 -2978 13301 -5039 -14121 6495 3872 -11887 4505 11362 -10029 -6809 9412 -3484 -8474
1658 -8474 12519 7445 -11506 358 8013 -7328 -299 14588 -1980 -10166 7254 3055 -11079
1671 -11079 4142 11140 -7165 -5680 7025 -5618 -9480 9476 5852 -10303 -1295 4811 -8376
1684 -8376 -2748 10608 -1128 -7183 6395 1816 -10162 2948 10871 -3443 -1942 7792 -3634
1697 -3634 -7393 8346 6186 -6079 1725 5371 -7354 -4272 7343 -1127 -5064 5022 -26 -10705
1711 -10705 -126 6597 -3772 -1886 5788 -3570 -7219 4791 3996 -4709 2453 5879 -4880 -3044
1725 -3044 6486 946 -2183 5991 2490 -6288 -45 4897 -2934 -708 6053 -1528 -6309 1589 1198
1740 1198 -4623 905 3636 -4791 -4098 3056 -1132 -3276 4042 2558 -4633 -80 3105 -2226 190
1755 190 6036 723 -3267 2334 1913 -2451 1614 3573 -1932 -1604 2684 -1430 -2980 2321 1435 -3489
1771 -3489 -1392 440 -2955 -1414 2815 -772 -3031 974 408 -2458 423 2360 -841 182 2327
1786 2327 -100 -1043 2378 2115 -852 484 1498 -761 -174 1784 352 -1320 373 -452 -2165 -754
1802 -754 277 -1214 -1258 361 -955 -1529 95 63 -1118 335 856 -488 -191 1215 1671 454 414 359
1820 359 415 1336 922 -115 176 1346 664 -355 -656 -658 -270 237 -609 -1838 -1534 51 241 -871 -1865
1839 -1865 -1045 401 938 -608 -1495 22 1665 1540 240 -619 176 1878 2045 234 -973 358 1976
1856 1976 1605 -1103 -1967 -66 1570 449 -1840 -2176 -314 877 90 -2265 -2497 -195 1308 413
1872 413 -1906 -1925 446 2318 1025 -1756 -1114 1864 3058 910 -948 -476 2053 2867 237 -2059
1888 -2059 -458 1405 1562 -211 -2038 -1921 637 1933 -1494 -3804 -1055 1177 538 -1289 -1897 -1540
1904 -1540 1179 2481 -873 -2582 1058 2612 1286 -76 -301 -113 2320 3242 -1279 -2559 1655 2690
1920 2690 -205 -705 -731 -1244 884 1435 -2696 -3428 925 1319 -1858 -1292 -112 -1475 561 1990 -2115
1937 -2115 -2327 2485 2043 -1164 241 1884 -310 928 2753 -1079 -1458 2842 1956 -2082 433 1679
1953 1679 -1658 -570 2006 -1949 -2988 1551 206 -3278 54 1702 -3298 -1326 2712 -977 -2653
1968 -2653 2492 979 -2773 1881 3363 -2378 -702 4509 -31 -2234 2906 1441 -2229 1823 2845
1983 2845 -4430 -1701 4544 -740 -4024 1514 -88 -3807 1750 1923 -5700 -2062 5254 -1095 -5039
1998 -5039 1809 1276 -2291 3507 2805 -5526 -802 7650 -212 -4418 3042 2407 -2216 2981 2268 -6566
2014 -6566 167 8324 -1329 -7089 1510 1455 -2938 2434 1052 -7568 -784 7609 -2895 -7190 3347
2029 3347 3198 -2925 1915 862 -6467 2044 9980 -2001 -6969 3657 3750 -2387 3286 2185 -5736
2044 -5736 1339 7614 -4780 -7056 5457 3845 -4184 92 -645 -6719 2326 8135 -4747 -7856
2058 -7856 4352 2848 -4088 1346 1752 -4565 2650 7243 -5385 -6226 7415 5073 -3588 967 1360
2073 1360 -4523 2416 7218 -4379 -5608 5911 2609 -6656 -600 2335 -3580 1720 4633 -6387
2087 -6387 -7027 6188 3646 -4906 1002 2274 -4861 177 5811 -3189 -3145 7690 2068 -7046 958
2102 958 4582 -2016 1999 5523 -5071 -5265 5879 2258 -5367 2306 3075 -6080 -2020 4220 -3482
2117 -3482 -3199 6028 49 -7519 1046 3712 -4100 671 5890 -3565 -4568 5048 1249 -4092 4337
2132 4337 4559 -5457 -700 5695 -1971 -3009 5274 543 -5084 2388 2400 -6158 -427 6319 -2867
2147 -2867 -5333 2539 -664 -4130 3639 2321 -6194 -312 5930 -2762 -3938 4179 1767 -1915 3394
2162 3394 611 -5699 1960 7922 -1363 -4488 2228 604 -1669 3617 828 -5409 1102 5148 -3705
2177 -3705 -5362 2581 2036 -1801 601 -1840 -5648 2296 6732 -2741 -4978 2170 2255 -577 1698 17
2193 17 -2866 3047 5353 -3364 -4467 3833 3738 -769 -196 -1868 -3009 3395 4444 -4338 -5431 2344
2209 2344 2763 -1908 -1199 -1703 -1998 3051 3490 -4545 -4364 3653 3551 -1143 -792 -433 -543 3319 3202 -3234
2227 -3234 -2103 4610 3276 -2187 -1921 -320 287 3194 1861 -4589 -3689 2840 1983 -2543 -1591 -247
2243 -247 -760 1095 330 -3542 -1009 4130 1637 -3191 -1560 862 1555 2526 993 -2591 -841 3727
2259 3727 2116 -1612 -430 1059 -134 664 -100 -2002 -718 2196 67 -2917 -972 398 -228 -316
2275 -316 -526 -1808 -361 1873 85 -1556 -13 1195 295 808 772 -393 113 1320 421 -198 1229
2292 1229 660 -823 -102 757 -76 -516 144 -750 -880 -169 -533 -1119 -147 522 -959 -1832 -480 360 851
2311 851 262 -1016 -1097 1175 2262 665 -701 -170 1166 1673 525 -395 -254 1263 1498 -457 -1508
2328 -1508 -65 1452 917 -1092 -2498 -902 1278 1222 -1612 -2805 -928 1420 1314 -1103 -2084 -169
2344 -169 2155 1678 -667 -1408 752 2585 1636 -1146 -1489 986 2931 1000 -2278 -2373 909 2773 604
2361 604 -2531 -2226 435 2323 -42 -2561 -2536 520 1985 -291 -2578 -1563 1627 1903 -226 -2385
2377 -2385 -891 2321 2930 69 -2547 -472 2416 2720 -278 -2124 -707 1714 2092 -828 -2274 -688
2393 -688 1206 1273 -1390 -2334 -527 1708 649 -1858 -2352 161 1896 939 -1237 -2344 112 2477
2409 2477 1506 -862 -1145 979 1946 1276 -560 -923 1055 2056 511 -1477 -522 680 1136 -488 -1615
2426 -1615 -1402 143 822 -663 -1932 -922 436 482 111 -738 -683 375 1047 33 -399 746 1200 487
2444 487 430 493 290 693 954 -251 -636 500 550 -376 -181 -205 -1232 -528 349 -530 -739 -137 -800 -1226
2464 -1226 100 816 -238 -594 337 219 103 796 369 -212 656 1238 -555 -372 1189 1270 147 49 -751
2483 -751 -631 795 1036 -1143 -1781 432 460 -567 -441 -1089 -1095 835 1137 -1542 -1615 825 969 -217 289
2502 289 -82 -53 1796 1503 -1283 -805 2386 1779 -337 -573 -798 -172 1914 1162 -2078 -1748 968 598
2520 598 -1245 -928 -689 -568 959 -265 -2664 -1253 2405 1170 -1153 -818 61 529 1995 1124 -1525
2537 -1525 -128 2601 990 -1483 -16 803 544 1470 80 -2170 -714 2132 364 -2095 -791 34
2553 34 -317 294 -626 -2257 -145 2251 -101 -2227 -401 494 485 1089 585 -1226 533 2415 164 -1358
2571 -1358 1006 1398 205 341 -262 -1362 692 2215 -211 -2036 -199 289 -690 -35 14 -1397 -392
2588 -392 1011 -876 -1607 624 1200 -411 8 214 -793 477 1781 -47 -577 1259 1124 -718 148
2605 148 997 -312 284 1235 -949 -1414 390 328 -838 -178 267 -1243 -882 527 -931 -899 791 -29
2623 -29 -1376 397 955 -842 15 1626 133 -589 1065 550 -272 1342 1582 -438 -336 810 -361
2640 -361 -361 786 -182 -1158 255 184 -1545 -739 829 -387 -979 -92 -594 -498 717 493 -909 10 1351
2659 1351 263 -246 653 328 327 1423 748 -690 -32 1158 483 -207 150 -298 -569 221 -259 -1291 -309
2678 -309 820 -393 -1245 -619 -671 -167 885 -2 -1144 -136 1098 339 -43 531 404 373 738 -86 -642
2697 -642 546 1402 269 -478 -290 -32 140 203 -225 -947 -304 287 -645 -1248 -307 -36 110 96 -570 -861
2717 -861 440 803 0 -219 427 461 368 666 432 -39 615 686 -60 -185 253 440 266 107 -502 -689 -84
2738 -84 164 -723 -473 -203 -270 -544 -526 -713 -170 211 7 -329 -211 310 493 373 654 228 366 459 642
2759 642 197 295 324 167 128 -88 -157 -272 54 2 -641 -194 -118 -396 -387 -319 -391 -255 -105 -94 -496 -28 327 -76
2783 -76 318 158 207 287 312 489 106 459 500 112 5 235 13 -173 -193 -329 -274 -270 -441 -506 -276 -228 -596 -327
2807 -327 -207 -128 -271 -199 -239 -53 259 115 255 253 143 528 390 261 382 619 438 322 -24 114 18 -65
2829 -65 -174 -337 -183 -383 29 -565 -646 -324 -426 -361 -178 24 -197 -196 251 313 134 113 313 423 413 451 328
2852 328 376 536 403 467 236 113 -74 -228 -149 -205 -237 -402 -395 -222 -298 -568 -526 -516 -325 -304 -63 -422 5 253
2876 253 -65 289 249 339 607 563 459 495 270 190 165 258 42 302 -10 -34 -321 -300 -192 -125 -323 -688 -487
2899 -487 -171 -434 -256 -372 -16 -257 301 4 -20 100 158 350 357 285 198 348 150 408 20 138 202 117 -92
2922 -92 -130 -252 -207 -215 -438 -415 -243 -292 -170 -179 -252 -293 -129 101 69 134 89 151 4 276 441 392 364 39 292 250
2948 250 116 266 439 118 -130 -223 -42 -175 -283 -252 -358 -475 -316 -317 -429 -287 -311 -135 -166 117 -162 107
2970 107 332 308 247 423 138 103 324 354 250 317 646 107 -79 -66 -180 -111 -76 -293 -449 -546 -160 -382 -582
2993 -582 -172 -337 -345 -16 -253 -328 195 473 225 -68 37 443 469 508 562 120 340 308 139 244 25 177
3015 177 -41 60 -319 -577 -217 61 -230 -575 -263 -464 -433 9 -227 -336 115 232 -252 -418 285 631
3035 631 556 604 227 -61 409 660 361 256 158 224 -75 11 -4 36 75 -46 -536 -592 -139 113 68 -188 -602
3058 -602 -515 -163 12 -90 -156 286 472 -13 180 124 40 634 710 314 -230 168 83 -196 74 254 39 -160
3080 -160 -10 -824 -612 373 575 -353 -501 -540 -643 -48 651 -129 -255 66 -181 -520 606 896 438 191
3100 191 376 -373 165 1079 847 -95 15 93 -425 -365 475 -26 -391 -4 -449 -901 -95 33 -207 -198 -107 -420
3122 -420 -412 187 134 90 366 344 -137 39 683 321 112 908 181 64 143 20 -67 343 534 -85 -545 -477 -379
3145 -379 -326 163 135 -561 -759 -255 -716 -313 185 -55 -372 -235 4 -224 858 972 428 112 369 126
3165 126 306 423 358 -155 -75 -2 -158 -274 204 -24 -623 -151 -552 -299 -550 -390 -291 -454 208 152 -221 -148
3187 -148 -19 242 529 642 292 -202 69 298 329 773 738 -10 -418 170 -173 -167 373 154 -477 -777 -355
3208 -355 -347 -89 269 -408 -785 -580 -126 -319 269 296 -237 -295 204 80 342 762 426 -173 294 378 125 226
3230 226 465 -3 -79 367 86 -118 35 -190 -538 -364 199 -369 -545 -157 -330 -279 291 400 -474 -216 93
3251 93 -17 374 876 307 -351 48 113 357 788 694 -220 -223 75 294 432 444 -26 -754 -443 -77 -51 119
3273 119 213 -477 -614 -188 -4 41 147 -240 -308 -224 379 376 387 285 104 194 70 740 163 271 92 -317 -74
3296 -74 253 98 -306 -602 -474 -356 -147 56 -229 -767 -698 -331 -151 413 304 -171 -250 -111 41 490 594
3317 594 203 -175 -91 195 667 590 211 -216 -255 110 492 222 -113 -522 -569 -178 107 -107 -312 -366 -216 -527
3339 -527 -313 71 310 -138 -277 -232 -136 593 845 77 -197 146 415 827 703 34 -247 46 49 222 -141
3360 -141 -215 38 -389 -390 -439 192 78 -297 -813 -798 -113 40 76 -249 -614 -436 325 859 462 161 111 116 13
3383 13 223 344 387 70 18 -214 283 159 170 -255 -679 -374 -67 170 -5 -620 -795 -295 -46 154 -115
3404 -115 -102 -245 87 16 321 664 282 61 37 -38 431 863 572 -32 -436 -25 458 504 108 -571 -353 -487
3426 -487 -137 108 69 -204 -580 -363 -123 151 129 154 -308 -252 -210 354 657 87 -26 -145 107 499 564 371
3448 371 -89 -138 -148 55 368 281 -320 -728 -715 -126 -34 86 -190 -705 -723 -121 4 400 207 -87 -642 -335
3470 -335 385 809 673 202 -162 -410 269 894 455 116 27 -68 329 298 -16 -228 -2 -201 -325 -262 -144
3491 -144 -120 -203 -241 -464 -281 507 138 -381 -261 115 405 600 219 -488 -456 510 589 511 287 -15 -219 -213 527
3514 527 238 296 431 -271 -996 -377 238 501 58 -309 -1104 -728 330 491 125 -163 -194 -319 -139 -34
3534 -34 111 518 600 211 -718 88 1020 768 333 -28 -372 137 471 -28 -581 -342 219 -16 -134 -707 -459
3555 -459 -173 289 212 -544 -444 -141 -117 -96 6 849 397 237 -558 -738 401 1522 909 62 -431 -555
3575 -555 -75 1046 727 -148 -506 -374 -846 -459 351 391 147 -353 -1049 -924 147 880 314 -448 -189 -590
3595 -590 -98 588 772 472 306 464 -505 -247 448 361 258 492 48 -314 -111 128 -218 309 573 -126
3615 -126 -902 -446 -425 70 745 250 -153 -624 -387 -483 325 1149 772 -34 -493 -258 76 980 1373 197
3635 197 -595 -242 -119 -29 497 581 -115 -325 -452 -727 -190 588 614 -388 -734 -913 -411 373 264 -226 -189
3656 -189 241 -30 -53 87 476 416 313 10 -298 247 592 414 -278 -159 187 184 -44 -324 -594 2 367
3677 367 -154 -943 -672 -206 158 103 -62 -433 -237 184 170 -163 256 646 250 -73 -469 -160 503 856 225
3698 225 -629 -356 152 252 27 -185 -453 -285 134 -207 -558 -341 282 -68 -261 -283 -126 38 89 -459 -412
3719 -412 452 657 69 -19 -333 -11 478 627 228 -531 78 370 318 -70 244 32 -14 -450 -466 -252 38
3740 38 215 -115 -372 -524 -138 240 100 -88 -66 -78 -280 17 158 255 279 134 130 -126 75 130 302 -76 -180
3763 -180 246 -247 228 -59 142 -150 143 -13 -275 -340 -125 -97 77 176 -233 -284 -122 -122 267 410 240 14
3785 14 -140 164 102 590 271 45 196 -16 56 93 9 381 127 -670 -293 -307 67 75 -248 -366 -308 -372 -191
3808 -191 -196 -40 -7 145 65 -174 110 372 429 387 -27 119 96 356 147 77 -11 149 178 56 -264 -275 -70 39
3832 39 -392 -576 -846 -179 -204 -155 -331 -125 22 64 -13 -307 53 286 456 -102 9 25 355 508 232 31
3854 31 -9 287 320 82 199 19 160 -194 -204 -176 -140 -118 -22 -88 -152 -69 -3 -189 -169 -370 -133 198 117 -65 30
3879 30 -5 434 247 -24 79 180 126 -46 -109 130 65 25 -50 -25 -126 -414 -144 -133 -385 -278 -296 -285 -167 -329
3903 -329 -216 -112 209 231 280 246 62 205 72 220 457 26 256 292 4 233 165 3 -94 -503 -217 -165
3925 -165 -96 -134 -57 52 -243 -300 -126 -183 -164 259 -199 111 -67 237 -33 40 42 286 222 308 443 -17 -166 67
3949 67 11 -36 264 -126 65 -163 -137 -125 -155 -60 -513 -212 -187 -378 -364 125 107 -68 -95 130 -47 -125 200 391
3973 391 156 281 248 141 -9 72 230 30 -94 287 221 127 38 -8 33 16 -249 -272 -290 -24 -198 43 -116
3996 -116 -677 -275 -68 5 -4 131 74 -66 -96 203 39 319 426 33 -94 -110 174 201 546 329 -372 -331 -45
4019 -45 -222 -277 143 133 -136 -175 -120 -516 22 582 -276 -495 100 -153 73 263 238 46 152 580 -238 -281
4041 -281 516 520 210 158 -218 -490 12 210 -383 -77 238 -245 -634 -111 137 104 354 197 -652 -386 341
4062 341 261 120 364 255 -68 167 221 153 297 582 316 -378 69 52 62 422 296 -612 -489 354 -80 -297
4084 -297 203 -115 -361 -383 -103 -295 -239 526 147 -284 583 -7 -291 -10 500 118 167 738 -48 -204 389
4105 389 157 -188 301 652 -299 -487 333 -243 -184 544 57 -958 -342 222 -379 -265 417 -328 -831 395
4125 395 -95 -682 377 788 -251 -5 604 277 -123 777 45 -263 621 680 -534 -481 346 -23 -485 469
4145 469 -359 -1173 30 653 -497 -78 587 -303 -591 356 -165 -436 967 678 -894 -746 421 279
4163 279 465 857 -151 -802 613 819 -313 189 643 -495 -565 56 -740 -503 994 594 -1124 -683
4181 -683 324 -127 -323 192 -471 -473 386 221 -937 -113 883 5 -133 140 -287 -463 808 531 -589
4200 -589 94 845 -147 -833 -176 63 256 822 -70 -1534 -901 633 52 48 226 -522 -711 271 613 -181
4220 -181 394 968 -216 -892 206 428 589 899 217 -1305 -394 906 290 -270 119 74 -595 111 -316
4239 -316 -515 102 754 -286 -504 275 -263 -312 222 516 -627 -127 381 -275 -309 760 386 26 278 -170
4259 -170 -681 316 946 365 -29 267 -504 -715 426 713 -4 -142 -203 -1115 -831 540 482 32 176 -521
4279 -521 -970 -197 756 258 377 410 -482 -466 570 940 95 -150 65 -405 -168 584 -85 -364 294 145
4299 145 -319 -451 163 -175 -59 101 -668 -581 555 383 -578 -460 389 199 227 -97 -772 -73 632 748
4319 748 -75 -208 60 237 37 362 9 226 440 163 -718 -259 454 657 -72 -909 -1129 9 765 272
4339 272 -669 -920 -53 253 -23 133 -208 22 561 30 -365 -93 705 660 -425 -706 -188 740 889 50
4359 50 -790 -529 528 348 -202 -547 -475 75 117 -275 -526 -138 213 133 -508 -343 294 577 184 -423 -733
4380 -733 71 994 489 -191 -635 319 561 645 -151 -283 -105 146 -131 -88 -66 228 202 -347 -495 -413 363 454
4402 454 -234 -916 -525 186 667 362 -605 -637 15 706 446 145 -109 -201 17 53 264 131 156 72 -407 -431
4424 -431 175 24 179 -374 -773 -388 286 175 -56 -488 -603 -334 -101 159 382 -12 -306 -118 5 535
4444 535 394 102 -210 -153 393 337 537 160 73 -236 -208 -78 73 291 -165 -753 -694 -14 340 218 -317 -737
4466 -737 -495 560 686 -72 -300 256 227 270 41 -167 35 491 168 -452 115 463 609 -91 -633 -713 96
4487 96 1122 128 -1037 -496 253 326 18 -192 -653 -75 332 19 -664 8 862 165 -535 -527 -47 601 1190
4508 1190 -117 -1356 -103 973 611 -167 -375 -627 344 838 -88 -879 82 562 -132 -505 -185 -11
4526 -11 293 357 -624 -987 608 1338 -213 -802 -243 348 445 748 -34 -950 335 1183 49 75 394 0
4546 0 -76 175 -436 -578 797 647 -1074 -908 400 122 213 251 -856 -1229 583 1111 -561 -314 391 -472
4566 -472 -22 622 50 -255 579 354 -978 -228 916 297 -342 84 -547 -752 815 1048 -648 -674 343
4585 343 -288 -461 951 51 -750 172 41 -889 -46 1104 -312 -354 666 -351 -752 556 741 -704
4603 -704 164 807 -463 -539 769 220 -618 648 682 -918 -450 351 -717 -21 1316 -130 -1720 -440
4621 -440 220 -544 400 1014 -618 -1111 599 -121 -723 1245 1230 -757 -968 141 -396 797 2362 304
4639 304 -1878 -638 555 -466 731 1267 -666 -973 112 -611 -1338 1097 1386 -674 -1028 -411 -1153
4656 -1153 499 2055 271 -1220 130 738 -693 73 1274 -39 349 751 -909 -1663 1127 1974
4672 1974 64 -243 -211 -1446 -565 1197 45 -763 934 511 -1706 -822 704 532 945 1121 -1379
4689 -1379 -2032 706 1678 95 433 674 -1114 -904 536 -119 117 1707 948 -2036 -1313 516 241
4706 241 766 1129 -996 -1966 178 433 -427 363 986 -715 -1305 -69 -493 -310 1678 887 -1609 -750
4724 -750 593 41 634 1334 -269 -985 274 111 -898 661 1570 197 -750 -71 -741 -797 1262 1005
4742 1005 -618 -407 345 -1003 -519 1004 523 -180 329 -270 -1573 15 1384 525 -96 646 -553
4759 -553 -1128 789 1106 -67 268 432 -1356 -572 825 528 -337 362 -36 -1072 -203 639 -468 89
4777 89 762 -577 -919 167 487 -84 252 410 -745 -237 591 146 -370 644 670 -499 -273 60 -349
4796 -349 16 1040 -260 -673 27 67 -135 -10 422 -402 -231 132 -499 -624 352 847 -347 -690 -100
4815 -100 -166 369 935 65 -682 327 333 -99 212 412 169 117 -184 -850 -568 817 437 -371 -426 -285 -43
4836 -43 317 275 -152 -913 264 503 -213 -193 375 287 194 53 -374 -189 472 452 -281 -105 115 77 77 34 -331
4859 -331 -140 448 387 -623 -497 470 192 229 151 -382 -361 173 127 -187 -23 215 156 -166 75 -159 185 292
4881 292 105 -471 -277 153 200 136 -103 -52 162 410 155 -268 -148 -25 47 -189 -254 -44 90 329 -298 -454
4903 -454 -179 177 244 -103 -40 -117 209 96 173 302 108 100 195 -191 256 76 259 257 52 34 96 14 40 -218
4927 -218 309 -216 -81 2 -14 -271 -61 -150 -61 64 88 -8 -82 -20 -98 149 -34 105 -267 136 236 49 40 117
4951 117 195 2 20 -75 -390 -120 -73 -270 -257 -91 27 -258 -463 -6 -184 -127 163 -4 -210 401 260 -164
4973 -164 -25 231 300 -8 100 -151 -464 367 124 -226 85 199 -249 27 492 -272 -425 287 198 -437 -370
4994 -370 17 -272 -164 365 -155 -223 61 122 -197 -29 388 -43 19 162 -228 -64 781 263 -89 -25 227
5015 227 -158 -171 124 -276 -295 343 90 -405 -219 276 -88 113 264 -256 -507 321 -42 -236 259 533 -345
5036 -345 -202 542 -219 -287 327 253 -503 14 243 -314 -124 640 -51 -361 118 30 -661 222 691 -146 -433
5057 -433 1 -392 -569 621 333 -517 -40 210 -701 -267 873 130 -309 611 141 -696 341 610 -29
5076 -29 -80 701 -106 -718 348 328 -502 229 240 -1221 -605 622 -127 -393 767 159 -1242 -315 492 -34
5096 -34 11 1012 -160 -957 297 322 -308 769 886 -976 -908 479 -183 -610 1197 485 -1378 -134
5114 -134 285 -756 140 1233 -193 -1265 70 -139 -694 654 1325 -726 -634 586 -644 -484 1277
5131 1277 882 -884 212 266 -1012 -152 1690 389 -744 255 -346 -1260 538 1301 -502 -297 480
5148 480 -908 -1176 870 805 -504 692 75 -1822 -614 1474 292 -518 596 -234 -1192 225 1211
5165 1211 -107 224 1209 -1063 -1524 651 820 -200 705 445 -1682 -1107 972 235 -210 1043 -60
5182 -60 -1884 -404 411 -304 501 1691 -670 -1890 43 161 -93 1058 1000 -1219 -673 772 -123 -428
5200 -428 1365 462 -1290 -269 226 -828 308 1790 -293 -1549 -97 -38 -773 790 1345 -813 -620
5217 -620 226 -594 -779 1277 934 -835 -224 -79 -1044 253 1697 312 -675 496 -126 -1157 561
5234 561 1270 -316 -276 660 -908 -1131 1373 824 -689 -46 172 -1187 -500 1141 -34 -527 693 -271
5252 -271 -1324 155 684 -33 227 945 -756 -758 779 625 -462 645 590 -1209 -639 837 115 -337
5270 -337 913 46 -1354 -48 492 -479 -147 863 -320 -918 212 -22 -404 653 653 -643 -380 653
5288 653 -170 -113 727 404 -506 254 404 -781 -109 1107 204 -712 -388 -83 -507 844 425 -973 -288
5307 -288 390 -245 -476 330 234 -443 178 -91 -1043 114 1001 288 -746 -60 78 94 477 98 -707 226
5327 226 660 78 -881 41 531 -98 177 -276 -722 -234 887 -220 -716 -157 166 -2 106 -194 -274 -36
5347 -36 430 -260 -561 327 458 19 198 185 -494 223 698 -229 -529 527 390 -73 -35 -181 -239 314 457
5368 457 -469 -657 36 642 -164 -124 -333 -141 260 295 -275 -119 297 278 11 -153 67 35 445 222 -340
5389 -340 -369 94 238 205 -240 -210 37 150 307 -345 -335 -78 384 -13 -603 186 124 -169 -29 -332 123 163
5411 163 144 3 11 141 5 -82 297 -49 -196 18 35 -160 -17 -31 -144 44 144 -37 -371 139 -210 -13
5433 -13 178 -1 -141 -16 66 232 -168 38 20 68 312 84 -65 80 322 45 -87 -20 -14 155 -21 -95 -462
5456 -462 -110 236 152 -310 -257 58 116 5 -178 -186 -101 400 -138 -295 -149 92 329 315 -174 -656 287 549
5478 549 118 -472 -249 112 146 369 -188 -380 -15 693 111 -682 -134 230 42 -27 -149 -422 210 597 -375
5499 -375 -553 44 330 66 -102 -368 -312 512 769 -480 -711 238 501 269 69 -156 -251 477 598 -553
5519 -553 -467 300 368 -173 -380 19 -112 638 457 -551 -803 313 160 -177 91 -210 -221 309 248 -520 -241
5540 -241 728 694 -259 -1 -45 -299 334 539 -431 -381 683 39 -775 -23 225 -131 416 195 -706 -682 547
5561 547 168 -513 -58 144 -446 81 365 -341 -181 814 -123 -614 140 486 133 476 727 -597 -426 735
5581 735 -121 -323 690 31 -1017 -98 411 -439 -52 710 -286 -818 380 344 -753 358 806 -484
5599 -484 -398 461 -127 -228 932 563 -941 -75 843 -655 -309 899 170 -506 336 -140 -1136 150 1246
5618 1246 -282 -725 359 -234 -627 528 128 -944 199 849 -917 -981 1146 566 -29 447 -109 -1202
5636 -1202 525 1366 -308 -770 550 -199 -919 449 486 -491 404 930 -1410 -1254 772 514 -241 247
5654 247 -30 -1191 437 1258 -544 -372 862 162 -861 21 267 -693 912 1054 -1215 -1092 760
5671 760 406 -264 569 31 -930 301 572 -906 -385 1421 388 -1038 -278 -15 -450 721 1096 -1219
5689 -1219 -1403 995 72 -545 690 438 -454 174 389 -976 -83 1548 546 -841 6 106 -638 831
5707 831 917 -905 -464 525 -186 -1054 817 594 -754 175 -45 -1181 -401 1495 67 -839 155 189 -757
5726 -757 471 1114 -559 -134 734 -384 -1029 544 692 -347 330 560 -1013 -601 842 209 -630 592
5744 592 -114 -983 -238 623 -456 -233 822 -391 -1105 701 573 -432 344 681 -650 -601 640 271
5762 271 -183 793 125 -962 10 413 -385 58 807 -173 -942 172 190 -565 328 564 -492 -620 368
5781 368 -75 -173 505 -76 -1011 284 842 -281 -553 528 -126 -356 428 -39 -458 484 843 -532 -637
5800 -637 666 7 -408 444 160 -553 157 329 -818 -764 744 351 -287 118 -218 -510 446 433 -472 -395
5820 -395 533 362 -283 10 -50 -33 433 220 -747 -591 682 282 -264 -160 -49 -97 477 355 -716 -465
5840 -465 663 62 -346 -213 -143 152 174 -24 -561 98 830 159 -124 0 167 315 274 294 -260 -231 354
5861 354 -27 -770 -143 143 -217 68 -198 -435 -70 367 -4 -565 -2 211 37 8 -312 -555 155 386
5881 386 -167 -434 199 220 148 110 53 -266 123 259 -93 -99 253 439 -123 -121 -64 -219 56 218 -70 -363 -86
5904 -86 33 0 -183 40 -187 -147 239 313 -183 35 26 70 81 304 9 -151 -89 -52 -19 -200 224 106 -98 70
5928 70 -174 -246 233 -139 -170 46 -13 -97 -177 11 -10 -226 -74 141 -4 206 100 -63 279 277 -187 -154 178
5951 178 240 56 -436 -201 151 26 167 -80 -229 -83 217 -170 -46 -380 -494 -155 79 115 -94 194 175
5972 175 -53 2 88 -114 270 -100 -141 -34 262 256 -122 -86 179 -49 311 53 -250 -109 222 20 -153 181
5994 181 -186 -93 84 -34 -419 5 50 -183 -251 106 313 37 410 96 -324 -101 110 135 33 208 226 -13
6016 -13 19 24 -109 141 105 -194 -510 95 -36 -409 37 -70 -274 -140 563 60 -275 133 350 3 24 270
6038 270 -459 107 428 159 -235 389 77 -339 -21 86 -126 59 535 30 -683 52 134 -200 215 234 -412
6059 -412 -410 114 -283 -329 339 -112 -602 -54 36 -300 87 623 -116 -377 498 232 -418 445 598 -255 -117
6080 -117 403 -132 -305 418 352 -847 70 -20 -495 -57 527 -39 -531 322 223 -569 246 574 -342 -586 736
6101 736 -190 -256 567 124 -531 253 221 -392 -117 569 -214 -452 398 9 -846 268 524 -626 -128 287
6121 287 -207 -562 335 195 -530 195 244 -674 -309 767 -183 -276 576 118 -742 394 643 -452 46 869
6141 869 -364 -421 603 157 -353 336 441 -1055 -323 747 -292 -507 740 11 -844 185 605 -459
6159 -459 209 880 -228 -631 732 260 -530 594 576 -491 -449 739 -220 -471 733 176 -769 -90 663
6178 663 -710 -17 653 -369 -843 331 52 -615 412 664 -601 -305 573 -555 -618 713 326 -713
6196 -713 114 495 -625 242 882 -121 -471 200 165 -582 495 565 -736 -422 568 -523 -648 896 331
6215 331 -984 -25 578 -819 -140 874 -125 -496 598 71 -693 682 766 -360 -118 640 -370 -487
6233 -487 863 552 -716 401 407 -781 -255 638 -249 -490 418 -247 -967 -6 625 -480 -12 556 -332
6252 -332 -664 646 409 -494 345 287 -723 -86 749 -309 45 752 76 -593 -13 421 -597 -84 795
6271 795 -402 -698 422 295 -659 88 498 -340 -194 416 -284 -323 686 156 -450 50 354 -355 318
6290 318 631 -150 -292 376 363 -520 276 717 -444 -399 314 -183 -396 541 126 -514 138 107 -351 -136 493
6311 493 -378 -350 231 49 -563 249 526 -25 -202 347 218 17 250 118 -282 44 528 -202 -181 351 195
6332 195 -28 173 -452 -688 -94 237 -422 -438 504 -123 -137 272 -169 -339 81 405 -262 -165 134 261 -29
6353 -29 167 24 -129 241 313 -252 -325 407 206 -462 330 -55 -162 245 67 -251 -367 187 38 -137 109
6374 109 -148 -282 266 172 186 -135 245 -110 -359 195 68 -49 143 71 -234 -83 308 -15 -6 180 163 -193
6396 -193 85 94 -323 -326 -141 -139 -134 336 -124 -394 34 44 -306 -153 282 -79 -216 232 218 -239 111 183 -169 -168
6420 -168 146 -131 -326 161 -28 -166 -110 32 -61 -329 -219 -115 -218 -13 6 -122 -52 -12 26 190 15 -83
6442 -83 220 -13 104 37 -85 181 172 -116 -28 109 -24 196 8 -414 44 55 -90 -55 84 -252 -331 112 -203
6465 -203 -454 -88 206 168 -186 -288 51 309 208 -204 -233 -58 289 291 -346 -214 14 292 160 -67 -75 145
6487 145 318 -79 -186 -38 -19 180 -55 -4 -116 286 358 -142 -382 -171 79 41 164 -228 -161 276 261 -198
6509 -198 -39 227 222 196 5 30 -136 467 261 -456 -354 -8 128 -93 -142 -166 -307 55 181 -208 -40 121
6531 121 246 -199 70 -93 -237 344 260 -44 102 651 25 -138 102 -65 60 434 326 -525 -305 23
6551 23 5 -171 273 -222 -231 -85 84 -317 -98 465 49 -546 362 27 -188 111 118 -365 -100 337 99 -365
6573 -365 322 -42 -407 149 429 -337 58 325 -108 -357 416 282 -286 5 -118 -755 -131 382 -15 -518
6593 -518 125 3 -345 207 347 -255 -268 144 -123 -189 608 -98 -895 186 447 -5 1 374 -144 69 373
6614 373 -213 -546 319 129 -344 -295 399 72 -419 289 -267 -816 578 575 -458 -257 448 -229 50 830
6634 830 -161 -542 548 722 -390 -146 376 -267 -222 139 -141 -320 360 455 -760 -437 268 -92 -51 342
6654 342 -205 -756 468 414 -297 -168 607 -168 -389 356 200 -385 626 342 -979 -128 653 106 64 604
6674 604 -256 -383 324 494 -384 60 552 -327 -247 301 -123 -174 555 252 -651 -95 530 -84 -326 617 93
6695 93 -471 660 435 -727 -146 520 -318 -299 354 -227 -660 481 240 -495 -130 330 -644 -665 460 126
6715 126 -295 98 213 -729 112 829 -98 -39 484 -117 -429 407 495 -517 119 460 -417 -300 414 133
6735 133 -512 339 346 -326 248 526 38 -316 387 -327 -632 407 251 -359 -128 415 -252 -271 468 -35 -439
6756 -439 268 375 -294 123 533 -383 20 414 195 -431 206 189 -365 -254 321 -237 -234 501 -52 -463 384
6777 384 358 -121 -61 200 -361 106 575 116 -509 426 290 -420 29 693 -31 -43 260 -150 -64 403 378 -188
6799 -188 -510 393 247 -74 257 -404 -325 294 524 -549 -255 70 -262 -296 236 -196 -244 383 123 -261 -461
6820 -461 220 206 -150 170 -130 -270 226 469 -349 -350 243 -27 -229 82 -202 -405 320 -81 -420 -124 142
6841 142 -245 -358 -16 -132 -214 483 217 -105 -60 311 224 -57 168 2 -89 203 140 -46 -84 96 11 -276
6863 -276 340 94 -97 224 34 -289 -146 244 10 -473 -162 135 -147 165 -39 -44 -22 -26 -104 -74 60 199
6885 199 125 93 186 20 180 24 5 -351 195 91 -219 -17 152 -133 11 139 -198 -140 -45 -88 -225 169
6907 169 -92 -52 -172 -94 84 -28 234 142 9 -57 139 54 1 153 -12 -312 91 -120 -104 252 89 189
6929 189 -233 45 -63 71 38 -246 -315 -55 6 40 -92 -40 203 -90 444 27 8 281 31 -347 -225 70
6951 70 59 72 -126 -167 -190 246 99 -150 -52 108 -94 118 -93 -315 -82 -29 -31 -80 -355 174 64 -336 -66
6974 -66 -54 118 147 -31 -78 45 420 229 -58 -245 23 60 -6 -92 -374 -144 154 45 -78 -16 -35 -96 114
6997 114 -183 -108 -126 309 5 -152 -332 124 74 51 -144 -106 86 174 5 62 3 -36 127 145 102 -237 160 164
7021 164 118 -302 -234 -18 -92 -153 -19 -193 2 -3 102 -126 -70 122 -21 -74 72 -59 157 377 34 -87 255
7044 255 74 -24 134 -102 -300 -283 159 -200 -62 10 -76 -316 146 103 -186 106 8 -69 -110 100 196 -34 48
7067 48 44 -90 -38 187 73 -293 -40 -83 -247 228 122 -105 -54 221 154 -117 126 -17 -186 6 235 -139
7089 -139 58 -49 -204 -77 -61 65 131 175 88 -157 -96 308 161 -84 358 319 -23 152 203 -198 107 255
7111 255 81 -66 11 -167 -235 -222 125 -53 -83 357 -21 -237 150 -4 -110 39 6 -209 -99 229 24 97
7133 97 347 18 34 212 163 -165 283 171 -124 -330 197 80 -110 130 -24 -371 -33 33 -49 -39 191 105
7155 105 -3 -97 64 -15 -120 476 162 -48 407 289 -248 44 221 102 -98 233 -34 47 140 176 -282 -45
7177 -45 208 -412 -89 146 -386 -110 27 -19 -332 102 245 -270 -76 218 100 -450 609 164 25 328
7197 328 28 -118 -44 561 390 -236 229 -172 -248 118 230 -22 -85 207 -205 -353 249 130 -156 -23 -148
7218 -148 -260 -302 114 -78 -185 304 25 -190 7 373 -63 11 433 -16 -253 338 -12 -223 77 83 -275
7239 -275 -6 198 -310 -55 173 -205 -338 14 51 -253 -261 274 -30 -284 -129 263 -265 -195 356 4 -14 191
7261 191 28 -336 251 60 -149 46 409 -171 293 -163 -172 -324 213 55 -106 111 232 -306 -67 72 -82
7282 -82 98 94 104 -71 261 93 -138 2 377 88 -350 456 476 -16 58 76 87 -23 177 -136 -269 -103 74
7305 74 181 33 134 -46 -29 -74 -92 -294 96 76 -82 22 226 100 -51 197 66 -203 196 144 -49 157
7327 157 265 -44 13 518 -49 -227 -152 -104 -205 -125 146 -36 -45 65 -110 -175 -179 -55 -193 111 139 92 -270 139
7351 139 152 -499 77 258 -169 141 247 135 44 -63 -93 -90 227 -62 -164 -2 319 -26 -59 260 -100 91
7373 91 -234 49 -284 92 344 -125 -131 4 -104 -210 25 74 240 -32 273 -52 -24 17 92 48 -84 153 -329
7396 -329 -267 -64 -111 48 49 -243 -333 78 -211 -87 -81 -96 -49 -159 59 -32 -239 -317 -22 -147 139 183 37 -59
7420 -59 133 97 -49 113 112 50 1 149 -125 -216 19 210 8 101 -74 -82 14 -40 -137 -29 25 -49 90 112 164 196
7446 196 75 -181 51 -98 -75 197 -121 2 90 -72 63 35 -92 -92 -110 57 190 -19 -100 -61 -31 59 129 57
7470 57 -221 -62 57 33 146 129 -96 145 -11 109 -111 40 28 91 -18 -123 108 143 29 -108 -140 -225 -62
7493 -62 23 143 41 -199 152 -3 -254 -84 -17 -155 275 23 -72 -275 48 187 -139 -96 249 234 62 -101
7515 -101 -95 -92 323 260 -48 -25 127 67 -262 10 51 105 69 -85 30 44 -43 144 -240 169 -132 -49 36 114 -39
7540 -39 -98 -298 66 82 -60 43 67 62 33 -15 93 230 -47 2 322 85 -176 -8 92 -423 51 -86 -239
7563 -239 -99 152 -185 139 173 -100 -197 207 21 3 77 85 -283 -45 358 -67 102 -124 -132 37 46 305 -28
7586 -28 88 -35 -245 26 352 -275 -226 28 155 7 -144 282 210 -90 -96 58 -176 -8 183 191 44 414
7608 414 112 -172 -64 28 -90 269 -262 -419 -5 233 -5 -234 -374 -134 -262 216 194 -329 21 215 2
7629 2 -50 124 -158 -254 159 64 18 -206 244 177 1 311 -59 106 121 -69 -429 -60 92 118 -180 196 -95
7652 -95 -15 -138 -10 -193 -46 275 -62 -112 99 424 -109 254 -193 -184 232 405 175 -73 246 -42 -50 23 169
7675 169 -379 -27 397 -131 -228 430 145 -514 -4 153 -337 -86 104 -92 -259 234 148 -110 102 45 -372
7696 -372 -172 560 -69 -315 47 33 -220 289 207 -133 44 246 -190 -163 239 206 -339 -85 114 -65 -137 630
7718 630 86 -197 110 -113 -140 61 262 71 -236 51 -20 -254 127 -27 -346 138 306 117 4 154 -325
7739 -325 6 94 -169 -180 258 186 -325 -97 258 -102 -194 161 50 -344 302 124 -340 -162 189 202 -391 417
7761 417 147 -347 79 138 167 91 190 198 -403 -167 -127 -119 283 261 -365 -93 262 -111 -104 60 -180 -351 248 98
7785 98 -247 -84 331 -11 -207 47 -32 -228 118 98 -477 18 151 17 -484 -26 -286 -99 187 143 -390
7806 -390 -132 169 -384 -139 103 200 -167 -8 71 -260 150 406 -101 -146 129 -40 -46 104 -212 -472 -245 273
7828 273 -192 -78 47 328 -279 -196 47 -213 -61 203 -53 -359 188 43 -164 108 117 -235 -152 221 -267
7849 -267 -31 353 32 -206 365 117 -201 -220 51 137 -52 113 154 -72 -269 52 12 161 238 -201 -201 19
7871 19 134 -43 -108 -75 -94 -178 149 -155 96 164 -59 -132 -64 204 170 223 12 18 -176 67 -36 137 38 60 -112
7896 -112 -57 342 140 -67 232 -214 -120 121 -3 -189 -91 -5 -48 450 321 -32 -42 347 89 -29 -255 57
7918 57 -99 -68 112 94 -95 233 -114 26 90 -51 255 -116 -260 -103 -211 269 52 -114 -109 166 19 -227
7940 -227 -53 71 14 94 -29 -80 -99 57 333 33 -18 65 -102 224 24 -89 -3 58 -9 -283 55 1 36 66
7964 66 -219 -270 167 76 -129 -354 -150 70 -64 50 80 141 23 253 -43 -31 -80 41 73 -100 25 -19 -90
7987 -90 282 51 -202 261 224 195 -96 -162 -216 21 77 12 -76 -243 -24 9 -205 -10 -226 -26 178 -13 -4 -131
8011 -131 143 -37 -86 208 -20 77 -30 -87 108 -50 23 148 -155 134 -176 -164 216 -69 -25 102 -65 -172
8033 -172 -239 -30 -137 -19 -99 -41 258 119 40 -97 -3 77 2 -117 76 -5 31 124 2 -143 46 -12 -119 28
8057 28 157 -128 76 89 46 -211 -219 80 106 -192 -84 -122 -111 241 14 -44 30 63 -57 -73 31 256 83 -10
8081 -10 95 -66 101 311 147 -194 97 95 -10 84 -2 -16 140 -122 -348 165 16 -134 10 -69 98 -7
8103 -7 -4 43 126 -85 102 -21 -44 15 114 -10 294 -2 -402 -120 100 -392 -140 64 5 31 47 17 -95 149
8127 149 320 -87 -191 133 -198 -290 57 153 -209 60 134 -554 113 183 -33 27 -18 23 -66 35 318 -122 122
8150 122 81 -26 -207 -41 -18 -111 118 117 -89 -520 21 7 -189 91 78 -4 -186 255 -97 69 136 160 -369
8173 -369 -217 -37 -168 -123 207 62 -255 190 -128 -213 1 -83 -156 43 45 -92 -226 420
8191D20
$$ Imaginary data points
##PAGE= N=2
##DATA TABLE= (X++(I..I)), XYDATA
0 0 0 0 0 0 0 0 1 0 0 0 8 -8 8 -8 16 -16 24 -24 32 -36 45 -53 64 -72 81 -97 114 -130 149 -167 192 -222 250
33 250 -279 316 -356 398 -446 495 -551 612 -679 754 -830 917 -1012 1117 -1229 1353 -1490
50 -1490 1642 -1813 1998 -2206 2444 -2710 3022 -3380 3801 -4308 4931 -5709 6715 -8074 10006
65 10006 -12966 17997 -28127 56081 -286621 -851472 133112 266855 -178800 343710 418230
76 418230 -493195 -287032 347373 -180997 -270923 605581 328923 -466673 -113851 60423
86 60423 -396025 160714 732561 -104196 -524096 125815 -16792 -403970 263978 491644
96 491644 -195507 -129300 144739 -420125 -334245 569626 399417 -271733 -61102 -41167 -442294
107 -442294 74401 611910 7211 -276683 178521 -85843 -449770 171982 442377 -79466
117 -79466 -32997 150241 -359442 -325510 393751 273250 -210755 38007 65732 -357700 -61928
128 -61928 357607 -37296 -163118 246128 -244 -380715 46085 252802 -116491 17806
138 17806 258866 -162685 -269234 184962 96063 -170124 161853 209733 -241386 -136382
148 -136382 174332 -75241 -98858 274331 73034 -285391 -13567 108618 -169565 22053
158 22053 292162 -63437 -236737 65083 2809 -148705 174686 209279 -194672 -122780 138204
169 138204 -68973 -98452 218770 90203 -176981 21944 67690 -171375 21006 261979
179 261979 -40344 -189316 62927 22202 -103816 117214 102528 -189576 -53137 172653
189 172653 -51112 -137426 97276 43310 -98219 63125 55078 -148310 242 166756 -56122
200 -56122 -119779 101973 62083 -69890 37242 14555 -122166 49187 182698 -55987 -151446
211 -151446 37531 49924 -19493 62387 11770 -122563 -1144 98082 -60530 -77805 86451
222 86451 45385 -66053 -13516 -15490 -54571 77494 115277 -85269 -124208 52157 82714
233 82714 7901 10666 -24934 -62772 40881 80957 -43601 -55743 54143 34925 -36477 -11916
245 -11916 -3099 -14269 44020 31804 -84593 -68685 64606 68336 -24971 -49464 -33984 -4602
257 -4602 54260 42277 -47876 -49219 30938 36554 -5519 -2418 4666 -94 17736 6204 -37461
270 -37461 -8514 59956 33864 -41982 -45268 1636 32362 33225 -6474 -53283 -32694 26469 30349
283 30349 -6357 -20273 -14833 -6041 8285 5737 -10115 1793 21549 1207 -25809 -6554 28178
296 28178 28645 1629 -21220 -18903 8694 30680 19179 -7525 -19457 -11789 4151 14531 7719
309 7719 -7976 -14991 -11884 -6409 988 8068 3873 -10998 -18837 -8198 9432 12904 3163 -4417
323 -4417 -4532 -2905 914 9945 16695 10647 -5264 -13951 -3773 17272 24520 6479 -19114 -22798
337 -22798 2140 23470 13323 -14227 -23552 -8416 7946 5154 -9447 -11190 4145 7908 -11434
350 -11434 -19527 1655 21657 14818 -9288 -26575 -10284 30663 38111 -5043 -32886 -9001 21961
363 21961 25482 7125 -17763 -18341 14445 23316 -12418 -25142 5125 17152 -1937 -16367 -20753
376 -20753 -6345 26295 19765 -32854 -38390 15593 34586 4958 -15544 -22314 -10304 31968 37552
389 37552 -18601 -33465 15701 26103 -3559 -3192 2691 -2840 15659 12747 -35970 -26196 41888
402 41888 34115 -28303 -31865 -11725 -7135 27640 34445 -33744 -46461 22628 22120 -26077 -1242
415 -1242 23138 -6937 3053 17214 -33723 -23706 59175 37425 -39002 -13445 16750 -15824
427 -15824 9244 41243 -22133 -33202 40820 11141 -59397 -3977 39594 -10577 -693 23555
439 23555 -46926 -46786 50398 28069 -41233 13766 30312 -48437 -20414 43974 -10055 -11472 68061
452 68061 6014 -83461 -2186 50947 -10897 18548 57368 -45107 -69155 37518 21095 -35830
464 -35830 44688 48435 -72203 -48310 37700 -16148 -17459 77559 14388 -89469 -11193 33035
476 33035 -39138 13647 88959 -17081 -69777 22034 1908 -48836 58701 82593 -48002
487 -48002 -40432 32779 -40018 -39768 91060 52854 -62340 -7794 10235 -80896 -5030 111402
499 111402 8244 -63344 20844 -19318 -92463 37530 97772 -27640 -20201 45739 -68425
510 -68425 -89248 83213 81848 -34371 19755 23717 -107769 -37796 112095 25013 -37468 62055
522 62055 -3368 -126067 -1834 86835 -16558 13251 82201 -73805 -131798 46989 64254
533 64254 -31710 51747 55272 -115830 -74798 76143 4416 -24449 106740 27297 -134739
544 -134739 -27299 63744 -29198 30491 124594 -42802 -127163 32206 32116 -57149 70001 103708
556 103708 -84337 -76813 44544 -42316 -46947 130046 64468 -116663 -32956 28804 -77583
567 -77583 11763 146014 -9558 -102284 31271 -4679 -95980 67497 128566 -51720 -47084
578 -47084 48853 -67431 -71439 122979 77298 -79559 4392 30786 -106329 -21358 127698
589 127698 6115 -61558 52129 -18604 -124857 32180 107083 -35147 -15899 60798 -73770
600 -73770 -96353 81643 62284 -50161 37290 44514 -105517 -43841 95979 9010 -29706
611 -29706 77316 -602 -117517 11408 79750 -34677 3573 82151 -52687 -96948 51144
622 51144 34359 -55219 44968 61679 -87716 -51017 65481 -16807 -39943 82008 22160
633 22160 -95465 4365 53263 -52077 1273 96449 -22625 -76515 43144 17773 -61250
644 -61250 45035 74237 -60627 -37665 53524 -28482 -45346 73608 26551 -76080 7481
655 7481 38653 -61064 -10583 78512 -19433 -58504 43869 8096 -66585 29927 61129 -46956
667 -46956 -19249 54696 -25570 -43004 58362 21444 -53434 24526 41234 -54993 -14844 61122
679 61122 -14639 -37629 44643 2636 -62399 20828 44349 -43843 -16222 44601 -22637 -37434
691 -37434 39249 6679 -45379 23976 34119 -45060 -11914 47244 -11305 -25615 37412 4393
703 4393 -40813 24448 35294 -35503 -10975 39932 -9190 -24331 26183 1195 -32666 18815
715 18815 21618 -38597 -11491 34606 -8334 -23770 17457 -3028 -27967 20208 23071 -31143
727 -31143 -10993 30280 -3376 -16883 18558 5364 -16209 16695 13958 -27014 -3046 33239
739 33239 92 -17641 8576 -870 -14091 15533 11171 -26821 -8869 21854 -4153 -17806
751 -17806 6437 1329 -11308 8298 4817 -21030 -2189 22746 -414 -13517 6813 5712 -3860
764 -3860 9096 4650 -14161 2363 21209 366 -12186 2815 3476 -2873 6005 869 -14295
777 -14295 -2811 10752 -3632 -11187 1975 2699 -5228 -2239 -3040 -7673 3755 10656 -2596 -8435
791 -8435 1837 4485 2233 4950 1612 -4802 1578 8363 1784 -1305 3892 2351 -3083 -1429 798
806 798 39 33 -1258 -4258 -3147 -92 -1254 -2144 -712 -2600 -4932 -2480 2155 2719 356 -1228 -2276
823 -2276 -495 4918 7154 2492 -4178 -2545 5332 8727 1912 -4207 -1020 4169 2193 -2904 -3725
838 -3725 528 3105 -683 -7153 -7427 72 6622 2750 -8522 -12097 -1120 11002 7225 -7355
852 -7355 -11412 1429 12423 6605 -5206 -4776 5401 8276 1995 -4078 -3072 5340 11208 1828
866 1828 -12729 -8426 9693 12894 -3114 -16264 -12558 5801 15983 918 -17899 -10260 7877
879 7877 6889 -3670 -6421 -3924 3859 11134 -330 -14413 102 20083 9530 -10468 -11271 -866
893 -866 13182 18419 -2627 -22005 -2407 19368 4509 -12253 -6535 -1861 1962 10016 -3770
906 -3770 -21381 -487 20021 -1041 -18258 -3894 4044 4247 8762 -5367 -18050 9911 27267
919 27267 -5051 -21456 939 8386 6475 16179 -684 -24091 512 22438 -4420 -12928 10029
932 10029 2738 -12662 343 -2762 -13562 14929 23766 -20689 -29733 6754 9060 -158 15830
945 15830 1575 -26565 -434 21228 -7781 -6890 23513 4279 -19091 3714 5928 -11020 15662
958 15662 25095 -18277 -22053 13571 1660 -12916 15673 10055 -22161 -3037 12889 -18265 -11934
971 -11934 24127 3188 -20077 8242 5225 -25336 2017 28832 -2859 -8979 15596 -9875
983 -9875 -26294 19657 28553 -10381 -1662 13490 -21265 -18244 25547 11857 -11989 15479 3828
996 3828 -43468 -13315 35614 9537 -8773 9422 -19666 -37841 19426 33481 -16142 -5358
1008 -5358 22073 -18942 -27018 21429 12061 -9218 28039 13081 -49790 -15249 44816 8146
1020 8146 -14258 18366 -7348 -32948 20521 22242 -35592 -3991 43616 -10561 -36500 9217
1032 9217 -1445 -16378 34710 19727 -50760 -14456 40197 -9144 -23887 29099 10092 -22329
1044 -22329 17711 6657 -45741 7519 61488 -2977 -36151 7616 -4470 -17279 36261 21239
1056 21239 -43770 -5180 36640 -24280 -33817 31949 17313 -19616 11033 -4449 -49792 9563
1068 9563 59719 -9376 -37423 13414 2327 -18772 26659 16365 -35399 6065 40311 -24371
1080 -24371 -32142 33478 18169 -20350 11734 4303 -37187 8701 43318 -21904 -34359 26302
1092 26302 11451 -23824 8798 5069 -32986 9706 41025 -22418 -33454 25873 10476 -23510
1104 -23510 15781 17738 -27062 1065 30998 -19941 -22812 36999 16052 -29206 2806 11451
1116 11451 -23819 7458 35713 -20220 -31637 23807 8231 -27392 12724 18515 -29878 -7923
1128 -7923 28020 -13982 -20139 29657 5185 -34404 10537 24386 -21006 -1433 29562 -16311
1140 -16311 -22411 30133 10487 -26283 14588 18918 -31913 -6598 34638 -7155 -20642 20546
1152 20546 -3519 -31423 18214 24575 -28924 -9343 25892 -14565 -21296 24466 4996 -22873
1164 -22873 16567 14453 -33789 -3157 37490 -3576 -19413 15349 -1174 -17416 23930 16382
1176 16382 -32715 -4280 32673 -6460 -20092 12441 -2110 -15756 19718 9775 -32482 -3257
1188 -3257 28014 -10460 -20626 13289 3660 -10221 13946 -309 -31353 7447 38580 -4408
1200 -4408 -23386 4187 1314 -2971 21841 6584 -25732 1649 23846 -10362 -17588 13711 9166
1213 9166 -6224 3452 -8761 -23402 12204 30679 -10906 -27054 1808 6852 -172 9421 -2373
1226 -2373 -18525 6735 20949 -9656 -16822 11391 12156 -1774 1681 -4750 -10920 13124 20564
1239 20564 -12203 -18641 9529 11975 -3798 -2860 -5947 -9266 10077 14570 -13600 -18274 6889
1252 6889 8815 -3504 -1184 -2683 -6630 6880 8884 -11318 -8482 14555 10144 -7539 -5345 -394
1266 -394 1266 11943 9247 -11406 -11154 8162 8318 -2353 -1089 -1361 -4984 1781 3006 -7236 -3884
1281 -3884 7698 797 -9450 -3734 2249 1389 3372 880 -7210 -3805 6812 5008 -1777 369
1295 369 618 -1428 3046 4682 -226 -787 1948 -683 -2156 2980 2445 -2864 -2185 -7 -1211 -1220 496
1312 496 -1622 -2559 -390 -1574 -3067 610 3328 270 -3156 -2708 857 5254 4889 -1014 -4869 -220
1328 -220 6229 5379 -590 -3370 -502 4302 3049 -2465 -3987 808 3833 -177 -6078 -5253 2069 5984
1344 5984 -354 -8599 -7060 2616 7881 2073 -7255 -6746 2879 8512 2481 -5368 -3934 4343 7724
1359 7724 982 -5566 -1838 6774 7288 -2010 -8315 -2739 7760 7895 -3852 -11180 -3679 6675 6584
1374 6584 -3147 -10139 -4913 6129 6731 -4402 -8772 -342 6641 3495 -3056 -6058 200 9596 6368
1389 6368 -6427 -7118 5202 9825 2814 -4563 -6872 -110 10204 5901 -8571 -8532 3614 5615
1403 5615 -986 -3831 -5268 -2139 6125 1594 -10338 -4833 8594 4525 -4755 -4066 -2324 1794 10247
1418 10247 4217 -10306 -4632 9856 4990 -2379 992 -526 -2077 5699 2687 -9046 -1479 10230
1432 10230 -433 -8801 -813 -204 -2663 5501 1863 -11509 -3102 9088 -1769 -6609 4255 1566
1446 1566 -4849 5057 3673 -9443 283 13095 -953 -6359 6589 1570 -7256 5458 6885 -7496
1460 -7496 -282 8788 -6534 -9128 8353 2552 -8408 3873 3375 -12886 -3103 10763 -3053
1473 -3053 -5755 8642 -1631 -13569 5112 10721 -5670 157 9256 -6983 -6817 12005 3080
1486 3080 -8750 8450 8323 -12566 -4381 10757 -2603 -3529 11299 -3437 -17241 5037 11276
1499 11276 -9944 -3878 9536 -6356 -8914 9528 -954 -12578 10070 12596 -14171 -7133 12248
1512 12248 -1189 -3731 13652 -513 -15429 8747 13737 -12717 -4260 15148 -2671 -9216 8720
1525 8720 -2979 -14472 12072 13524 -17503 -8814 12430 -4933 -7954 12569 -1351 -16124 9767
1538 9767 10525 -17866 -2670 20017 -2594 -10423 9889 -1946 -12079 16590 14199 -18405 -5191
1551 -5191 16535 -4604 -8564 13442 -867 -14852 10105 8187 -19685 -2410 18600 -6348
1563 -6348 -12703 8953 -2586 -12813 13115 10327 -18222 -3160 16869 -6234 -9652 14108 2000
1576 2000 -11865 10376 8030 -16523 1521 19824 -5931 -11826 10524 -486 -12259 11436
1588 11436 9076 -17251 -2541 14278 -9509 -11683 12873 1843 -13168 7391 5453 -16701
1600 -16701 622 18140 -5908 -10473 11661 -307 -12659 10981 11611 -12049 191 14004
1612 14004 -9060 -10348 14404 4244 -11186 6602 5823 -15833 -1578 15165 -5419 -9196 10274
1625 10274 -2681 -16281 6774 10707 -10611 -732 11175 -10088 -10285 13503 4905 -9830 7195
1638 7195 7648 -13410 -1333 14380 -3141 -5335 12128 -1019 -14289 6562 9759 -9520 195
1651 195 11135 -8905 -11029 9088 817 -10316 7889 7365 -13865 -4781 9690 -4307 -4011 12084
1665 12084 -590 -12733 5171 7920 -8273 1844 13097 -4736 -8121 8085 702 -7880 8753
1678 8753 8456 -10834 -4488 7118 -4751 -4586 9743 -98 -10642 2458 3257 -10088 259 10724
1692 10724 -3686 -6792 5217 -1003 -7483 7051 8326 -6700 -1523 6798 -3844 -3845 9373 2852
1706 2852 -5829 3694 2720 -8494 -163 9029 -1840 -4912 3966 -1907 -8048 3207 4954 -5707
1720 -5707 -1694 4481 -4756 -5207 5587 2186 -4102 3046 2918 -6387 -439 7196 -349 -1596 5724
1735 5724 330 -5608 2393 4778 -2488 505 4434 -3439 -4710 3645 959 -4077 1665 1788 -5776
1750 -5776 -2520 2866 -1773 -1693 4081 -201 -5082 848 2524 -2091 599 4155 -975 -1986 3492
1765 3492 1139 -1785 2963 3030 -2600 -1169 2518 -731 -723 2625 -104 -3652 -235 543 -3065 -764
1781 -764 1585 -1492 -2192 1148 -692 -2205 1325 1836 -1755 -421 1616 -49 -16 2555 1243 -413
1797 -413 1063 1209 -578 412 1826 -129 -371 688 -297 -1442 -146 11 -1639 -880 107 -1437 -1585
1814 -1585 165 108 -1210 -959 -409 -13 524 816 -174 15 1512 1252 189 262 707 960 1051 700 -826
1833 -826 -329 1314 1187 -849 -1470 -739 650 104 -1387 -2179 -688 747 -169 -1650 -1654 -470 1170 753
1851 753 -808 -1229 849 2256 1310 -440 -879 1532 2832 1040 -918 -904 1241 1984 566 -1717 -1465
1868 -1465 566 1492 -564 -2456 -2031 308 1249 -704 -2603 -1670 1247 1616 -772 -2363 -645 2081
1884 2081 2325 -372 -2181 239 2797 2136 137 -854 -354 2178 2463 -755 -2815 92 2604 555
1900 555 -1828 -1764 -1142 683 946 -2471 -3494 378 2011 -299 -1866 -912 -242 1387 1936 -1619 -2532
1917 -2532 2230 3419 5 -790 633 720 1560 2160 -1502 -1880 2383 2144 -1668 -1405 489 -840 -221
1934 -221 967 -2306 -3040 1318 1555 -2769 -1642 719 -812 -374 1863 -971 -2076 2638 2463 -1747
1950 -1747 -59 3036 -195 -259 2600 56 -2018 2257 2096 -2346 -178 2425 -1970 -2096 2126 -577
1966 -577 -3699 531 1083 -3283 -329 2624 -2789 -2392 3561 429 -3443 1486 2535 -1946 1184 3592
1982 3592 -2669 -1437 5649 1338 -3955 1915 2736 -2540 954 3145 -4092 -2210 5215 -167 -6034
1997 -6034 428 2365 -2802 379 1877 -5597 -2573 6445 91 -6118 1901 3589 -2624 845 2997
2012 2997 -3907 -70 8451 -187 -7255 2255 5508 -1407 580 1985 -5622 -1138 7783 -1499 -8330
2027 -8330 2200 4547 -4089 -1439 1129 -5003 -157 7994 -2554 -9208 3011 5683 -2797 71
2041 71 2596 -4083 674 7905 -2442 -7284 6037 6948 -4271 -1602 1794 -3657 1626 8260 -3577
2056 -3577 -8777 4200 4676 -5582 -1188 2816 -3618 -519 4971 -5299 -7426 6882 6168 -5484
2070 -5484 -2386 2385 -2518 1530 7625 -2359 -6139 5981 4332 -5682 -592 5514 -1085 -272 3942
2085 3942 -4628 -6002 6791 5105 -6548 -2568 2833 -3673 -1515 5011 -2554 -5457 5192 2449
2099 2449 -7623 -577 6015 -1451 -1197 4720 -2984 -4805 6676 4452 -5083 869 5176 -3586 -2011
2114 -2011 5425 -1128 -3969 4840 1909 -7707 -483 4812 -3526 -2156 4977 -2724 -6704 3295 2451
2129 2451 -4900 1835 4564 -5608 -2969 6015 395 -3554 5036 2517 -5362 1253 4519 -3383 -269
2144 -269 6976 -1410 -6141 2380 2633 -3207 2092 2694 -6305 -2695 5456 -1262 -5551 3114 2013 -4286
2160 -4286 332 1786 -4400 743 6960 -1887 -6088 2726 3645 -1541 1762 1767 -4147 1218 6570 -1997
2176 -1997 -5592 3352 3748 -2346 -388 -93 -4326 1302 5447 -3068 -6432 2253 2726 -3052 -982 -85
2192 -85 -2385 1958 4348 -3665 -5319 4148 5242 -1224 -1295 -149 -1295 3280 5131 -2595 -4041 3465
2208 3465 3644 -2421 -1593 470 -494 1714 1441 -5018 -4486 4120 3858 -3160 -3193 -750 -11 2216 2179 -3508
2226 -3508 -3144 3803 3290 -2715 -1561 2076 1608 1890 1140 -3032 -1611 5207 3236 -2937 -2053 1253
2242 1253 1217 841 68 -3286 -1838 3534 1314 -4125 -2357 1171 765 -142 -171 -2205 -780 3108 1290
2259 1290 -2552 -316 2797 1083 -40 -61 -1208 777 3617 1160 -2425 -747 1504 526 88 295
2275 295 -1290 -1275 650 -512 -2042 -220 829 -1108 -1405 -276 -744 -78 1270 -151 -1316 322
2291 322 1034 272 702 1489 107 -304 919 724 613 651 105 -960 63 1098 -272 -1337 -671 -57
2309 -57 -333 -319 -953 -1243 38 580 -786 -1728 170 1048 674 -681 -1253 -35 1907 2050 -385 -1412
2327 -1412 331 2562 1538 -298 -1163 127 1726 1163 -1134 -1904 157 1581 51 -2080 -1850 168
2343 168 1739 167 -2461 -2330 545 2278 203 -2211 -2005 1021 2708 964 -1514 -904 1735 2617
2359 2617 436 -1692 -704 2238 2299 -476 -2495 -1068 2331 1696 -1163 -3208 -1782 1674 1693 -1299
2375 -1299 -3286 -1614 1703 1864 -969 -2575 -499 2037 1648 -846 -1892 550 2773 1943 -1040 -1852
2391 -1852 1037 2793 1667 -1314 -2315 508 2492 911 -1893 -2109 -118 1248 92 -1826 -1951
2406 -1951 100 1249 -338 -2273 -1104 1072 1461 -55 -1507 -854 1417 2502 332 -1460 -82
2421 -82 1537 1638 561 -572 -353 586 1271 -229 -1236 -253 731 -264 -1097 -1196 -726 507 544 -1158 -1944
2440 -1944 -193 704 -102 -212 -272 -395 249 1145 326 -158 749 890 10 381 825 206 262 649 225 -436
2460 -436 536 216 -777 -372 202 -793 -1004 13 -154 -919 -864 -177 -553 226 694 -735 -1116 793 1319
2479 1319 431 266 149 -287 1111 1873 -177 -637 1069 840 -685 -669 7 94 726 455 -1866 -2109 878
2498 878 1200 -974 -1185 -807 -802 738 920 -1608 -1158 2000 1465 -1153 -602 310 607 1601 1155 -1496 -431
2517 -431 2423 1424 -1038 -594 314 523 927 -85 -2495 -966 2134 749 -2231 -1518 -28 -68 641
2534 641 218 -1649 -653 2166 424 -2045 -353 1626 1133 904 176 -1495 251 3317 1139 -1853
2550 -1853 -148 1227 328 322 -273 -1422 -60 1622 -640 -2718 -452 1048 -58 -409 -628 -1698 -166
2567 -166 1973 -92 -1787 553 1663 -149 28 193 -188 844 2261 302 -1615 951 1731 -461
2583 -461 -118 482 -665 -248 842 -991 -1847 479 991 -668 -1086 -555 -1015 -164 1056 -273 -1249 536
2601 536 677 -870 -103 1181 226 118 1148 -61 -826 1349 1123 -466 186 893 -614 -614 1065 -237
2619 -237 -984 99 120 -1471 -607 113 -949 -805 586 -159 -1185 165 418 -743 640 1273 -538
2636 -538 -269 1186 617 -497 1244 856 -245 601 748 -785 -509 1188 434 -939 -386 -397 -810 162
2654 162 286 -1470 -996 559 -208 -1098 115 7 -252 675 496 -938 -405 1775 655 -263 451 182
2672 182 140 775 692 -420 137 1131 -175 -1185 -383 130 -108 181 -408 -1310 -678 713 -362 -922 -469
2691 -469 47 -60 49 -402 -527 378 1175 201 -584 278 876 747 457 398 -270 689 891 94 -893 557
2711 557 347 -165 -528 -894 -884 -395 506 -521 -1215 -263 83 -23 -171 -166 -124 259 550 -7 -452 566 889
2732 889 303 375 -109 274 588 1004 266 65 348 126 43 -237 -205 -364 -89 3 -735 -645 -97 -79 -410 -223
2754 -223 -279 -240 15 399 -19 79 575 253 -88 546 461 540 587 159 245 128 141 -37 -233 -276 70 -489 -446
2777 -446 -632 -542 -136 -174 -385 -476 -497 -370 -229 -249 -246 56 277 296 298 450 450 340 322 503 336 391 249 402 183
2802 183 -131 202 -101 -212 -135 -218 -92 -448 -418 -257 -406 -204 -391 -389 -259 -278 -122 -26 256 -114 283 427
2824 427 131 -7 327 643 528 365 546 367 232 151 -142 20 -222 -277 -288 -314 -409 -412 -298 -377 -290 -381 -143
2847 -143 -247 -220 -127 39 -95 77 285 448 283 141 375 459 262 350 470 41 349 279 -52 -81 -391 -164
2869 -164 -118 -530 -552 -170 -422 -367 -426 -671 -286 -301 -242 -52 -300 -2 -6 220 336 156 318 602 431 423 367 498
2893 498 454 411 -174 15 109 -24 82 -248 -305 -145 -243 -399 -403 -380 -548 -163 -196 -503 -396 -149 -61 188 27
2916 27 226 312 554 402 171 331 602 192 284 264 34 174 311 171 -203 -274 -212 -265 -426 -278 -354 -174 -298
2939 -298 -366 -425 -283 -82 -146 -267 -29 209 207 283 384 476 356 320 358 324 471 83 110 -97 90 -130 -210 -285
2963 -285 -226 -427 -393 -303 -617 -214 -288 -231 -347 -278 -337 -206 26 174 30 332 604 529 146 390 227 421 372
2986 372 451 -10 125 384 59 -231 28 -206 -214 -474 -314 -235 -134 112 -497 -642 -364 -148 13 78 -44 -219
3008 -219 93 453 92 -12 321 402 438 100 146 63 336 565 -332 -290 -240 130 -218 -25 -453 -498 -104 -132 -514
3031 -514 -495 -60 219 -204 -342 -143 -344 249 186 -115 -38 534 266 188 344 445 406 407 280 116 -348 169
3053 169 433 10 -167 -233 -631 -316 -85 -384 -118 -106 -247 -500 -834 -245 69 377 259 67 -266 219 658
3074 658 414 445 369 -23 180 311 361 174 400 361 -488 -300 -110 44 25 140 -568 -531 -397 -194 -569 -236
3096 -236 77 -455 -309 173 -465 -266 386 370 -108 475 321 -162 -86 945 721 302 512 -17 -491 191
3116 191 625 167 -120 -117 -557 -923 224 333 -78 -140 -224 -988 -446 382 250 6 335 -249 -500 58 786
3137 786 284 407 323 7 3 235 670 -57 501 172 -480 -129 306 -136 -496 92 -290 -791 -209 -213 -840 -323
3159 -323 79 -329 -284 133 -273 -40 328 412 473 183 234 -196 -7 357 597 139 104 -193 -397 82 402 354
3181 354 -524 -357 -326 -555 -307 331 -134 -151 -585 -584 -657 397 694 -176 -335 112 -108 43 587 71 20 288
3203 288 792 142 47 508 -204 -147 459 -28 -370 31 -230 -615 -254 328 -361 -813 -1 -558 -795 456
3223 456 185 -377 -191 3 -94 410 1006 478 -8 300 223 81 552 977 296 -147 -237 -273 -181 316 126 -472
3245 -472 -199 -324 -437 -356 638 -208 -794 -395 -140 -257 153 291 -212 -221 214 178 380 544 408 126 410
3266 410 574 400 333 124 -311 46 263 270 -166 -238 -433 -706 116 51 27 -209 -501 -449 -269 252 170 -96 -411
3289 -411 -178 55 409 792 397 -107 112 341 272 590 573 -2 -400 -13 270 319 46 -139 -563 -577 -333
3310 -333 -52 5 -43 -714 -611 -404 193 -46 -259 -242 -263 -72 418 555 413 62 -72 104 323 559 657 16
3332 16 -214 -263 -89 126 565 -151 -780 -545 -170 -13 96 -494 -503 -322 -250 134 -107 -54 -231 -350 104 247
3354 247 588 693 321 -175 -112 504 809 467 87 -427 -186 336 625 95 -337 -503 -437 -401 97 -179 -296
3375 -296 -34 -614 -565 -139 323 241 -73 -581 -194 365 747 514 -25 -300 89 524 443 587 211 35 -358
3396 -358 -44 -30 498 195 -243 -780 -415 -228 416 210 -596 -843 -475 139 336 53 -220 -614 -123 543
3416 543 718 394 184 170 18 273 333 589 459 75 -346 -385 337 477 152 -315 -570 -516 -147 208 -89
3437 -89 -117 -726 -691 -32 211 336 108 -303 -503 -36 285 570 396 177 -162 181 326 670 429 303 -231
3458 -231 -218 73 344 113 -177 -436 -470 -127 142 -209 -275 -558 -459 6 172 -211 -357 -331 -191 -48 110 605
3480 605 226 179 -87 -122 385 845 611 -192 -706 31 256 650 466 -277 -920 -517 -7 -7 -128 154 -210
3501 -210 -595 -169 -306 113 821 73 -497 -532 345 566 623 362 -499 -90 435 707 107 -127 153 215 -90
3522 -90 113 -332 -90 175 39 -420 -12 38 -358 -704 -654 -336 377 513 11 -1007 -247 355 778 457 429
3543 429 -82 -271 373 574 329 646 621 -316 -812 -251 377 748 763 -405 -1273 -784 481 286 353 -13
3563 -13 -569 -549 -78 -77 -28 244 494 -442 -480 -123 151 446 466 284 -53 232 508 231 -168 468 691 335
3585 335 138 -288 -504 -116 547 135 -192 -402 -820 -805 65 425 283 -44 -195 -949 -642 775 1133 761
3605 761 291 -455 -816 -38 927 1081 519 224 -582 -686 166 593 676 388 -549 -1126 -692 189 92 -112 39
3626 39 -480 -814 -444 165 4 403 372 -149 -695 68 457 -142 442 587 277 170 68 -161 82 643 612
3647 612 -233 -524 -364 -467 -200 435 -38 -341 -251 -615 -839 -192 673 637 -309 -712 -613 76 779 751 -73
3668 -73 -164 -402 95 275 630 257 78 237 -111 -565 -2 477 377 -74 -603 -574 33 493 1 -813 -373
3689 -373 67 -96 -137 -169 -301 -160 406 111 -366 200 657 146 -27 72 394 414 284 -129 -289 -28 685
3710 685 214 -134 -377 -547 -13 296 -73 -417 -248 -202 -375 -298 -91 285 262 -90 -301 -278 584 503 122 61
3732 61 98 355 472 242 -23 -118 50 461 78 -88 -424 -24 73 189 -198 -296 -143 -288 -289 -114 142 437
3754 437 10 -81 -360 -421 426 452 181 -10 -76 2 310 622 420 470 -103 -270 -50 157 455 85 41 -194
3776 -194 -332 -309 -67 -25 -135 -335 -316 -517 -140 8 29 -67 -313 -30 211 244 346 92 282 237 306 354 143
3799 143 1 233 185 -168 -233 182 -91 87 -364 -127 -342 -118 -273 -444 -386 -156 205 38 -191 -483 -59
3820 -59 131 205 88 -23 282 368 -103 215 313 600 406 115 -6 219 292 100 27 -124 -254 90 2 -258
3842 -258 -172 -232 -3 135 72 -381 45 127 -20 -165 -86 108 211 226 -21 57 89 366 81 82 -59 100 345
3865 345 164 29 -6 -225 110 115 -145 -154 -116 -285 -24 -394 -23 -213 3 -166 -196 -83 223 276 194 12 77
3888 77 175 158 30 322 353 37 18 291 100 -87 337 35 -217 29 204 20 19 -246 -326 -135 -42 -215 -99
3911 -99 -169 -54 220 185 191 68 -79 16 229 103 296 440 195 307 125 93 -88 77 -172 -6 -151 57
3933 57 -122 68 -73 -131 -85 -235 -295 -221 -86 -213 -43 -12 -60 -69 -132 418 446 227 354 -21 348 86 259 223
3957 223 409 62 -6 66 -28 -263 -131 126 -9 -40 115 -123 -499 -201 76 -147 28 -276 -267 -38 282 163
3979 163 219 -75 -73 -84 191 546 12 102 -63 -60 -148 214 135 71 -165 -138 -640 -386 38 -45 -267 -311 72 -238
4003 -238 -128 -152 -6 49 244 -162 -437 255 390 274 489 307 -399 43 274 -105 -66 490 385 26 -218
4024 -218 -12 -472 358 354 -319 -678 -245 -7 -437 -66 245 -268 -105 -15 -427 -14 628 608 -119 -179 -41 -62
4046 -62 469 686 26 -201 326 -126 -281 99 213 -17 95 119 -325 -375 131 -144 -434 16 -71 -196 -173 128
4068 128 -271 -117 224 56 -341 -7 274 10 431 612 -186 2 614 253 -208 213 321 -402 -254 -59
4088 -59 -329 -163 543 3 -705 -121 -78 -278 73 531 -270 -422 97 -26 -465 84 308 -208 137 207 -211
4109 -211 -217 781 279 -343 624 431 -424 -57 428 -285 -309 430 -94 -938 60 -82 -801 43 629 -287 -698
4130 -698 214 4 -283 824 274 -550 162 745 -338 -336 1079 338 -97 517 20 -609 401 1174 -538
4149 -538 -602 238 -118 -430 381 94 -831 166 439 -1132 -759 459 8 -329 326 -263 -788 663 628 -617
4169 -617 -187 1254 291 -280 122 -15 -321 1124 947 -493 -1024 307 21 -62 437 -40 -764 -66 -209
4188 -209 -846 -156 1162 190 -623 -335 -210 -33 764 858 -595 -406 373 67 -95 348 224 68 359 35
4208 35 -756 -273 1097 339 -470 -185 -288 -519 296 251 -673 -224 679 -173 -1055 -25 302 -130 509 334
4228 334 -930 -117 761 97 -155 794 522 -423 24 183 -332 503 1132 -57 -1122 -239 264 156 569
4247 569 448 -1009 -987 196 -181 -5 555 124 -947 -511 10 -122 485 929 84 -730 91 202 -35
4266 -35 504 386 -437 -303 495 247 -306 531 39 -567 -186 214 -559 -474 345 -144 -123 80 -189 -955 10
4287 10 564 5 259 456 -163 -378 403 137 246 611 676 -470 -502 503 484 520 184 -769 -607 387 499
4308 499 -247 -74 -97 -313 -316 -224 -14 188 647 -67 -852 -646 614 730 120 -342 -576 -194 998 450 -327
4329 -327 -105 497 424 188 -26 -254 107 281 -391 -746 -336 525 346 -348 -919 -455 471 545 -227 -1155 -500
4350 -500 1005 608 -1 -542 -300 322 644 249 -284 189 729 5 -497 -460 117 715 371 -722 -866 31
4370 31 749 334 -775 -832 -218 322 344 -93 -581 -185 427 -2 -473 -129 513 343 -191 -373 86 570 805
4391 805 70 -705 -354 485 714 426 -465 -717 243 496 46 -386 -338 -137 -153 -395 -326 35 185 -86 -470
4412 -470 -317 170 615 414 -313 -424 -33 308 380 157 -265 8 -166 -1 356 440 38 -117 -135 -63 116
4433 116 173 -242 -448 -358 -217 -80 191 249 -309 -313 -229 -28 189 458 176 -209 -220 295 709 414 229 -336
4455 -336 -307 609 458 185 -240 -13 -154 23 -9 80 -62 212 -235 -633 -210 530 554 -313 -741 -578 73
4476 73 740 425 -544 -602 285 430 167 -73 -128 68 330 -254 -518 351 690 223 -507 -353 80 308 499
4497 499 -351 -1411 -427 1124 485 -374 -758 -427 233 788 -68 -694 306 754 -153 -860 290 443 280
4516 280 234 -610 -849 556 1347 179 -861 -507 -117 311 468 -123 -897 -53 431 -184 -638 139 208 -357
4536 -357 -34 -323 -402 548 872 -588 -1050 117 449 223 607 -420 -862 531 1038 -432 -330 481 122
4555 122 -401 135 -143 -521 571 391 -1234 -698 708 208 -380 170 -535 -740 667 695 -864 -675 815
4574 815 324 3 599 -27 -793 363 589 -486 -143 1011 -49 -735 277 341 -708 343 377 -1098
4592 -1098 -447 1046 556 -605 231 -380 -1170 127 1045 -146 -13 408 -737 -725 1063 1016 -478 225
4610 225 342 -1178 -325 1244 664 -58 581 -413 -1511 23 1138 123 -329 200 -989 -1296 1048
4627 1048 446 -867 381 789 -1015 -829 691 -181 42 1238 33 -1840 -41 1000 8 315 908
4644 908 -324 -1122 445 -14 -1129 1462 1883 -613 -1565 -324 -701 413 1791 240 -1776 -487
4660 -487 275 -643 99 1755 266 -790 -173 -1007 -1259 1509 2514 -139 -1642 -387 -419 116 2067
4677 2067 646 -1206 -192 252 -1368 -362 1726 735 -352 -243 -1142 -1523 1011 1982 -523 -919 249
4694 249 -613 -669 843 367 -331 1094 659 -1494 -756 1342 952 464 714 -760 -1385 469 1282 -271
4712 -271 28 1117 -511 -1575 -164 117 -249 1503 749 -1843 -1728 770 571 507 1283 -419 -1656
4729 -1656 66 365 -195 754 1575 37 -1176 4 243 99 1435 895 -1239 -1080 356 -42 -68 943
4747 943 350 -899 -151 257 -1034 65 1306 -104 -633 187 -291 -725 662 948 -275 -377 479 -829
4765 -829 -402 1028 569 -316 333 334 -996 -107 870 138 -142 669 -429 -1279 -120 618 -352 -188 167
4784 167 -847 -665 665 194 -379 404 298 -640 -671 358 20 380 715 -151 -1119 38 860 85 215
4803 215 271 -398 -357 107 155 -414 525 571 -751 -653 -37 -211 117 420 -320 -867 294 546 -354 -416 326
4824 326 196 143 351 -227 -372 592 755 -176 -681 95 169 -44 280 -316 -231 180 394 -727 -922 255
4844 255 278 -119 -343 -397 -382 314 244 -500 -366 119 365 -49 165 127 -71 438 55 -458 -392 538 408 -57
4866 -57 -200 -259 -12 388 161 -315 -306 239 -6 141 -119 -246 -98 65 -160 -169 -197 539 364 -250 -91 -108 58
4889 58 431 -92 -259 143 398 254 18 -234 85 67 182 235 -377 -365 18 29 -100 -138 -194 -170 54 -139 -90
4912 -90 172 203 92 89 183 -93 175 233 122 -137 201 119 209 -2 -72 -157 -222 61 214 138 -2 -9 43 -103 -82
4937 -82 -10 -225 82 76 -112 -117 407 -11 -101 36 -43 -60 66 99 -213 -236 112 -21 43 161 154 -227 228 269 -156
4962 -156 -128 259 133 19 39 -306 -159 178 69 -290 -194 -50 -51 -62 -94 -99 -83 120 287 -220 -120 236 65
4985 65 -283 126 40 133 426 292 -188 -39 218 57 -170 78 -37 -186 22 42 -423 -168 233 -146 -346
5006 -346 163 -92 -138 179 455 -190 107 351 149 -306 391 122 -51 50 259 -198 -98 487 -81 -338
5026 -338 18 46 -574 261 340 -405 193 298 -340 -532 188 98 -20 166 242 -504 -169 396 -1 -151 616
5047 616 294 -502 200 174 -303 111 594 -255 -486 413 146 -596 206 323 -734 -305 358 -555 -494 879
5067 879 133 -565 224 353 -417 38 829 -33 -493 401 -153 -598 613 837 -308 -56 419 -615 -521
5086 -521 939 503 -535 322 138 -1226 -278 843 -109 -453 305 -371 -1273 156 870 -390 315 757
5104 757 -730 -989 891 686 -104 1061 572 -1199 -547 903 -210 -153 993 -150 -1434 -44 695
5121 695 -632 359 1200 -1016 -1063 354 99 -787 1191 582 -1335 -313 577 -932 123 1703 330
5138 330 -1172 -208 26 -702 603 1588 -402 -862 499 -383 -606 1131 1272 -668 -98 151 -1186 -542
5156 -542 1720 340 -995 -261 -190 -1249 483 1625 -254 -534 650 -726 -1420 647 1390 -330 127
5173 127 602 -1284 -660 1722 925 -601 697 290 -1333 -84 1023 -204 -55 895 -1023 -1717 257
5190 257 1344 -299 173 536 -1642 -1131 1004 328 -440 862 272 -1536 -496 502 -51 373 1643
5207 1643 -471 -1989 136 549 -44 709 955 -849 -1204 528 -72 -799 1232 921 -1303 -635 80
5224 80 -595 37 1300 -78 -1582 102 466 -836 327 1365 -402 -714 542 -442 -894 1122 982
5241 982 -657 -522 365 -738 -305 1487 449 -1115 201 -222 -1353 54 1207 -140 -382 575 -387
5258 -387 -992 638 901 -311 -18 366 -793 -551 1155 438 -185 457 243 -901 19 996 -195 -291
5276 -291 662 -184 -1178 255 324 -355 421 446 -1178 -748 628 379 -361 277 389 -683 -127 223 -441
5295 -441 73 742 35 -895 176 295 99 442 344 -897 -419 833 132 -658 367 458 -331 2 -39 -600
5315 -600 -4 844 -114 -1016 242 360 -277 59 400 -386 -131 743 -77 -586 324 607 311 266 -65 -355
5335 -355 289 882 -116 -611 -43 330 -260 -275 18 -217 223 499 -129 -769 45 459 141 -286 -326 -96 217
5356 217 839 -119 -441 78 604 132 -381 71 174 594 471 -402 -689 523 598 -326 -276 -249 -121 162 171
5377 171 -463 -284 148 296 -107 -263 25 -14 151 21 -35 -324 449 258 -46 -53 96 -65 244 182 -215 -405
5399 -405 119 221 -176 -335 138 -61 -119 -159 -196 -257 279 103 13 11 39 -10 -63 17 -134 -7 265 94 -143 129
5423 129 158 -69 -34 156 69 42 16 159 -219 52 65 -105 -221 90 14 -205 -140 -252 46 -115 106 -240 -141
5446 -141 289 140 -127 -135 204 457 132 -67 6 67 566 126 -209 -51 221 252 -34 23 -386 36 339 -163
5468 -163 -616 -140 -35 245 -186 -244 -480 114 652 9 -651 3 371 476 -188 -235 -282 465 496 -163 -488
5489 -488 -93 627 371 -204 -149 -253 210 641 -107 -893 141 600 53 -472 -451 -94 313 462 -472 -659
5509 -659 185 740 55 -363 -70 84 406 469 -389 -214 599 687 -361 -327 123 189 697 102 -703 -570 612
5530 612 338 -353 -260 450 -173 126 266 -599 -326 606 560 -602 -146 186 188 370 438 -356 -439 711 506
5551 506 -628 -36 575 95 15 278 -771 -423 696 192 -642 -301 562 -525 50 356 -276 -94 524
5570 524 -31 -899 27 727 100 66 426 -266 -452 604 409 -355 470 492 -521 -399 603 -43 -384 562
5590 562 105 -1100 -170 384 -395 -78 666 -583 -948 369 191 -429 514 416 -854 -461 846 -62 -376
5609 -376 816 -30 -809 143 394 -687 191 1212 -369 -1287 319 326 -511 440 278 -870 -365 572 -456
5628 -456 -862 992 768 -637 3 -122 -962 194 1472 -239 -988 573 99 -684 199 850 -526 374
5646 374 787 -1168 -993 1229 1213 -486 -70 -102 -1451 227 1264 -598 -937 827 136 -1275 101
5663 101 762 -169 520 805 -1204 -1109 952 797 -339 204 373 -791 92 1125 -295 -480 1267 316
5681 316 -1350 -209 941 -140 478 802 -1089 -1097 1084 690 -820 83 693 -662 -163 452 -673 -201
5699 -201 1412 499 -1308 -69 650 -442 552 953 -580 -675 877 155 -1089 599 1008 -546 -332
5716 -332 422 -809 -401 1573 322 -1236 -87 314 -461 124 1095 -480 -486 582 4 -851 562 1247
5734 1247 -297 -278 499 -528 -276 1267 563 -768 140 450 -689 -103 808 -319 -640 564 -142 -948
5752 -948 222 639 -839 -39 639 -449 -434 849 164 -335 439 270 -704 -74 1243 -251 -250 851 130
5771 130 -892 267 423 -265 230 1023 -397 -883 393 461 -355 203 244 -876 -61 562 -306 -644 787
5790 787 157 -438 -162 413 -161 457 665 -463 -963 329 303 -150 200 264 -353 69 480 -521 -424 520
5810 520 249 -694 -138 -116 -88 243 284 -792 -461 407 443 -587 -80 152 16 215 541 -769 -512 688
5830 688 489 -451 -213 361 -222 168 460 -502 -376 740 290 -302 -195 135 -23 107 169 -543 -466 615
5850 615 212 -506 -140 13 -46 -129 457 -239 78 718 229 -479 -31 592 149 83 31 -257 78 374 130
5871 130 -364 -377 273 -37 -6 -59 -291 -245 261 -88 -267 -8 218 -26 -310 -240 48 91 320 116 -366 180
5893 180 709 273 -58 -77 -77 -3 172 144 -330 -233 -74 104 42 170 -137 -151 178 -133 -225 -241 78 14 69 177
5917 177 -306 57 90 97 -189 -206 142 352 -34 531 191 -108 15 137 -147 -169 54 -180 78 -122 -140 -279
5939 -279 17 33 -357 -173 51 -204 -44 12 -463 -162 139 308 89 -244 -78 148 242 345 -303 -227 209
5960 209 84 -12 -88 191 -101 59 19 -279 -202 107 122 -170 -433 -6 -85 156 23 -232 -160 178 229 -99 -43
5983 -43 -127 232 -12 -16 -89 48 214 165 -78 31 121 118 140 -8 -335 -95 200 120 -252 -98 -23 -50 -24 134 -358
6008 -358 -141 312 -25 -294 53 353 -171 109 27 72 214 396 194 -338 -32 334 -199 32 189 -422 -121
6029 -121 282 -57 -213 274 147 -258 -152 66 -245 -194 665 -239 -206 91 306 -212 -9 287 -194 63 412
6050 412 -115 -445 281 452 -382 22 192 -200 -178 558 87 -269 100 54 -577 -136 120 -192 -27 132 27
6071 27 -569 135 359 -450 6 517 -462 -362 408 180 -143 587 292 -592 -115 381 123 -284 663 -172
6091 -172 -846 242 115 -594 194 653 -183 -635 434 -251 -677 243 294 -727 29 542 -489 -467 904
6110 904 351 -335 364 201 -539 231 854 -390 -354 729 -134 -489 556 535 -580 -133 688 -611 -437
6129 -437 689 57 -944 62 205 -635 119 868 -577 -164 601 -161 -523 747 621 -251 176 580
6147 580 -518 -316 881 -91 -614 483 330 -805 -62 951 -351 -298 374 -274 -801 521 607 -887
6165 -887 216 638 -695 -359 678 328 -524 366 249 -677 102 588 -261 -135 712 -321 -847 246
6183 246 367 -472 139 583 -659 -555 925 78 -756 541 383 -774 -291 561 -393 -297 749 -115 -712
6202 -712 391 606 -588 377 963 -577 -546 665 86 -404 672 408 -731 103 667 -419 -393 901
6220 901 -112 -834 96 346 -530 47 771 -447 -385 514 49 -537 414 569 -494 -64 668 -379 -36
6239 -36 922 162 -567 421 279 -811 317 917 -440 -575 398 98 -763 394 273 -618 -82 484 -252
6258 -252 -524 616 214 -388 317 107 -476 10 830 50 -262 498 -205 -818 527 625 -401 510 679
6277 679 -507 -477 549 -35 -499 303 -12 -913 -7 462 -149 -408 541 128 -731 520 342 -587 -26
6296 -26 479 -314 -275 613 160 -200 466 386 -678 -17 649 -248 -228 385 59 -393 178 -42 -440 21 570
6317 570 -321 -369 128 -54 -305 319 167 -473 271 535 -362 -405 473 -29 -337 224 161 -226 251 265 -274
6338 -274 -213 291 -93 -221 293 76 -395 89 214 -225 -452 201 -29 -162 -127 85 -502 77 395 -188 -203
6359 -203 307 292 -180 455 116 -313 78 376 4 9 459 104 -416 16 -72 -42 164 177 -330 -238 303 22
6381 22 -116 -88 171 -187 -24 383 -59 -125 145 157 -121 -94 217 33 78 122 -141 -194 283 83 -172 -241 -89
6404 -89 39 1 114 -130 -302 46 -98 -27 70 118 -266 -283 191 119 -18 11 -201 8 185 85 -219 24 53
6427 53 47 -50 139 85 -196 -13 -110 -259 -177 236 139 -419 -105 -34 169 56 176 -343 -79 160 -16 -233 -307
6450 -307 359 -69 152 -248 12 20 51 -52 -238 -159 299 76 55 -166 -443 -227 213 91 -56 -132 203 0
6472 0 -100 -207 -93 -90 233 -300 -405 108 140 171 23 -309 38 120 466 93 -223 150 313 173 -61 -130 -102
6495 -102 402 100 -98 -198 -43 113 -186 -218 -104 -96 133 307 -134 -100 245 351 31 105 -104 -176 397 167
6517 167 -90 -134 269 11 78 35 -33 -47 -144 100 -381 -89 299 114 -18 -293 -75 -338 412 313 -374 -40
6539 -40 96 -32 -145 192 17 -105 -12 232 -96 251 334 151 -373 -21 102 -82 276 62 -243 -106 259
6560 259 10 -228 121 -129 -277 181 197 -150 -33 388 -246 -302 309 67 -370 155 160 -83 70 453 -15
6581 -15 -333 164 -83 -298 407 273 -39 -13 247 -1 -181 505 -58 -664 -209 211 -507 -164 245 -30 -418
6602 -418 266 65 -421 119 608 -187 -147 603 113 -320 73 194 -333 380 707 -346 -295 320 -122 -133 432
6623 432 -8 -715 95 373 -681 -278 471 181 -178 -63 -104 -603 341 667 -460 -669 246 202 38 503
6643 503 301 -680 -97 268 -463 -284 603 178 -260 75 -68 -357 513 376 -706 -485 614 154 -421
6662 -421 220 -178 -638 196 405 -577 -186 563 122 -184 216 168 -448 301 304 -556 -115 708 -86 -677 -50
6683 -50 211 -373 396 244 -700 -332 492 -15 -341 386 194 -645 -39 246 -368 91 752 -75 -746 135
6703 135 230 -193 550 284 -699 -332 557 -240 -465 406 130 -380 -265 358 -346 -382 552 -193 -487 370 113
6724 113 -655 -19 441 -292 -49 374 -174 -513 243 279 -399 175 304 -452 -149 135 -32 -202 328 178
6744 178 -350 204 597 -474 226 473 -267 -569 473 144 -658 315 347 -492 -143 468 200 -266 255 -148
6764 -148 -484 354 713 -111 -114 313 -4 -327 367 -188 -441 222 138 -362 -275 213 54 -359 314 78 -683
6785 -683 265 675 -293 -468 454 161 -247 320 -181 -363 425 594 -269 -87 418 -224 -202 259 151 -381
6805 -381 195 185 -371 -316 429 150 -390 3 -253 52 105 264 -451 -510 198 -81 -56 195 -167 -353 235 146
6827 146 -220 50 765 391 -187 -216 60 -38 338 124 -424 -115 580 -44 -260 -10 -189 -113 110 138 -370
6848 -370 -58 310 -9 -651 74 288 243 174 39 -244 9 485 96 -181 106 44 139 -142 323 -216 -108
6869 -108 516 -215 -215 155 85 -250 -77 27 -187 -210 18 -80 -408 -35 60 -92 35 -161 -166 -134 308 138 76
6892 76 92 227 169 -173 221 20 -71 64 -99 -127 97 -1 46 -107 60 -157 56 59 -35 -54 62 78 -9 282
6916 282 344 -159 -67 240 -146 129 116 -3 -144 312 123 149 -67 68 26 106 60 -297 -115 73 29 -121 -319
6939 -319 -11 160 -174 -410 -88 91 146 -151 -106 -167 128 414 155 -38 173 194 118 88 47 -123 65 167
6961 167 -312 -105 19 -42 145 81 26 -115 -28 -121 -53 -147 46 -161 -133 -137 -150 -186 132 163 -235 39 -149 49
6985 49 36 47 70 -104 111 213 -94 -262 -45 84 12 184 -124 -90 19 177 -465 -35 -22 -71 -69 -19 -317 -20
7009 -20 98 -306 -290 -14 182 40 34 97 34 -213 -33 189 102 174 209 -198 63 98 -63 -65 204 -149 -189 -15
7033 -15 -31 -256 -107 38 -154 -13 328 -17 -214 148 301 83 -82 60 226 297 69 16 -68 129 321 251
7055 251 -184 -130 -177 -42 94 -82 -41 -55 -109 -288 -242 158 -268 28 98 -56 114 -201 321 63 5 -52 -289
7078 -289 -184 129 28 -376 195 -14 -191 -33 155 -197 -208 142 -95 -372 -100 0 -128 -150 87 -350 -70
7099 -70 243 256 -147 200 136 -154 155 257 -142 -158 124 63 40 50 248 75 -6 178 -477 -250 235 -6 -234
7122 -234 264 236 -211 57 32 -286 -291 291 -35 -377 -50 -55 -40 89 215 -281 36 316 70 -160 66 170
7144 170 -163 216 25 -119 18 252 215 -213 281 -26 -479 7 38 -24 65 64 41 -457 371 289 -114 -138 73
7167 73 -28 -195 491 197 -64 299 152 -297 -128 267 20 -73 490 -48 -503 180 179 -193 60 395 -337
7188 -337 -323 306 -172 -243 178 212 -215 15 -41 -365 14 -9 27 -346 178 -8 -319 69 16 284 -157 67
7210 67 -161 -242 311 148 -269 83 255 -185 -404 234 72 -328 -43 -124 -370 -129 341 -136 -40 23 -156 17
7232 17 176 286 -61 76 147 -18 24 169 147 -451 218 375 -110 72 245 -340 -205 338 3 -285 71
7253 71 395 -65 -28 66 -39 -171 47 -105 -402 69 146 -27 55 329 97 38 177 -280 -179 -21 188 -202
7275 -202 -104 53 -136 -182 96 135 -138 24 67 -197 -113 37 -252 -229 220 87 -227 16 437 -342 8 228
7297 228 -195 -13 213 -164 -87 138 168 -166 113 276 -142 75 282 -114 -449 62 111 -133 -30 34 -33 -255
7319 -255 104 187 -204 -13 137 11 124 248 -31 -65 8 133 -114 -43 347 -29 29 205 122 -20 115 -116
7341 -116 -260 -64 7 -355 -145 -40 -234 -196 -107 -64 -226 21 67 -285 100 20 94 -74 24 -12 46 -1 104 22
7365 22 -55 232 -40 -152 153 96 -135 -7 158 -366 -108 216 81 -236 -34 -146 -105 49 -171 -4 -61 30
7387 30 -71 113 -68 165 74 143 -67 -14 146 258 141 -62 32 -157 -23 172 -65 -172 -70 -168 -90 -74 -71
7410 -71 175 -60 -87 43 -138 -291 43 237 -127 123 227 31 37 36 -23 -77 285 -52 135 -67 32 143 74
7433 74 182 -29 -75 -122 41 25 111 -200 -48 -94 74 35 299 119 222 78 -209 -21 138 196 -178 232 -1
7456 -1 -70 64 29 7 -53 68 235 329 -111 -99 -110 24 -33 115 199 -13 -95 -66 67 -147 -36 139 -211 55
7480 55 -236 -34 -82 -142 -118 -104 -73 144 -43 -17 102 -65 1 -80 -218 295 179 -198 -86 258 -85 -95 -113 -44
7504 -44 79 -83 74 47 -149 -234 42 172 285 169 -240 164 119 -66 81 38 -30 -131 -93 216 55 -162
7526 -162 154 -85 -187 80 161 191 42 41 -172 -26 70 -128 -65 126 -28 -79 -78 -158 340 257 203 -28 -33 75 252
7551 252 18 -48 213 -95 -6 -41 145 -259 162 127 -112 -41 226 -228 -162 -128 17 107 130 96 -312 25 68 122
7575 122 95 23 -202 1 190 209 161 -134 23 119 -109 133 -33 60 -83 21 -99 -108 156 -122 -226 36 52
7598 52 -176 70 179 -188 47 78 -95 -280 129 -30 -168 -124 31 0 130 151 -466 -204 157 201 -108 2
7620 2 364 -231 74 25 -34 -84 92 10 -170 81 115 -162 61 169 -171 14 140 52 -214 228 -65 -140 -93
7643 -93 28 -32 -149 131 -253 -186 41 312 88 20 449 51 -247 105 -46 -322 128 221 -142 -99 26 -456
7665 -456 -119 440 41 -90 58 198 -309 -19 160 -141 -49 414 -165 -166 42 54 -63 -26 58 -87 46 128
7687 128 223 -385 264 139 -395 -504 -90 -332 15 79 -303 -242 202 309 -285 -31 188 -206 -151 385 -58
7708 -58 -213 198 85 -108 215 198 -207 -192 265 51 -140 149 87 -239 173 260 -51 -165 277 -225 -285 147
7730 147 79 -15 -88 -16 -181 -92 322 -50 -248 368 284 -81 -66 121 -275 110 259 -99 -347 105 189 -115 129
7753 129 203 -81 -98 138 -22 -277 -28 159 -270 50 303 -156 -114 319 293 -67 225 -169 -3 184 386
7774 386 -130 -256 135 -28 -186 75 298 -413 76 -217 -276 -259 256 148 -283 -34 -3 -6 75 207 -139 -251
7796 -251 155 -109 -85 -83 349 73 -133 130 -104 127 442 -161 -167 129 91 -180 -101 114 -352 475 74 155 -249
7819 -249 24 148 101 181 360 -354 -109 283 -113 -271 113 194 41 33 139 78 48 206 0 -258 66 303
7841 303 -67 254 -41 -152 -167 28 -300 -129 421 195 -107 -43 136 49 -161 150 -272 -214 -23 239 -20
7862 -20 117 236 -149 -72 196 -14 -201 -158 217 3 24 -36 10 -22 132 37 -65 189 118 -173 -139 35 -76
7885 -76 -159 227 74 -82 28 150 60 87 169 12 209 -15 79 115 265 57 -149 -67 305 82 -45 50 134
7908 134 -211 -245 192 261 8 140 -138 -147 83 -32 73 105 181 -201 -146 35 -60 -50 215 56 42 -22 -32 77
7932 77 -34 50 -286 -157 407 95 -130 10 29 124 44 -2 -66 -183 54 54 -96 77 12 -106 -98 183 40 -12
7956 -12 88 -167 -371 80 161 147 -238 31 101 39 310 61 -327 142 -21 -220 -36 -32 47 -137 -89 -147 -303
7979 -303 11 30 -30 152 -6 -197 122 192 -123 -181 129 176 35 -31 39 -45 -25 -30 99 -81 -121 -183 0 -207
8003 -207 -28 94 199 35 124 -169 -175 98 -34 -319 -127 23 135 192 -154 107 139 214 -15 -126 182 186 8
8026 8 -139 -85 -17 -37 303 82 -269 103 -121 82 257 -128 -196 326 220 -33 -171 192 -38 44 50 -72 -44
8049 -44 187 30 -283 108 93 83 82 66 -113 -264 8 -121 76 -126 -164 -153 40 65 27 -320 233 6 -175
8072 -175 -95 180 -185 -210 202 -100 -125 324 -146 47 34 -151 -27 89 49 -84 -194 239 259 -37 -87 -42 -129
8095 -129 -262 223 -133 3 -60 -16 -143 128 143 -33 152 35 38 -376 -73 89 17 161 -172 -26 -151 -37
8117 -37 211 -350 -37 97 25 58 183 126 -24 338 29 -203 197 -137 -435 -44 66 -71 -24 284 -23 -244
8139 -244 39 195 -311 -67 108 -326 20 249 103 -160 154 279 -347 -59 92 7 73 279 -290 -174 191
8160 191 192 -302 -152 72 -168 -129 119 172 -145 292 84 -345 -73 301 11 151 374 -62 -202 367 84
8181 84 -202 327 391 -101 -118 164 -159 -382 432 97
8191I7
##END NTUPLES=NMR FID
##END=
