##TITLE=1H_LR-746-R3-BZL
 CCl4
 8 sc, 
 6.04.2022
##JCAMPDX= 6.0         $$ Bruker NMR JCAMP-DX V2.0
##DATA TYPE= NMR FID
##DATA CLASS= NTUPLES
##ORIGIN= UXNMR, Bruker Analytische Messtechnik GmbH
##OWNER= root
$$ XWIN-NMR		Version 3.5
$$ Wed Apr  6 14:27:37 2022 Russian Standard Time (UT+4h)  she@DPX200
##.OBSERVE FREQUENCY= 200.131346
##.OBSERVE NUCLEUS= ^1H
##.DELAY= (6, 6)
##.ACQUISITION MODE= SIMULTANEOUS
##.ACQUISITION SCHEME= undefined
##.AVERAGES= 8
##.DIGITISER RES= 18
##SPECTROMETER/DATA SYSTEM= spect
##.PULSE SEQUENCE= zg30
##.SOLVENT NAME= DMSO
##.SHIFT REFERENCE= (INTERNAL, DMSO, 0, 15.7039)
##AUDIT TRAIL= $$ (NUMBER, WHEN, WHO, WHERE, WHAT)
$$ ##TITLE= Audit trail, XWIN-NMR		Version 3.5
$$ ##JCAMPDX= 5.01
$$ ##ORIGIN= Bruker BioSpin GmbH
$$ ##OWNER= she
$$ F:/spectra/data/she/nmr/H-F/1/audita.txt
$$ ##AUDIT TRAIL=  $$ (NUMBER, WHEN, WHO, WHERE, WHAT)
(   1,<2022-04-06 14:26:31.57 +0400>,<she>,<DPX200>,
      <created by zg, POWCHK disabled, PULCHK disabled
       configuration hash MD5:
       00 E9 B6 7A A2 85 ED C7 34 08 36 98 17 FE 4E 26
       data hash MD5: 16K
       B2 27 25 74 29 00 B3 B2 5A 2A 87 D7 36 29 2D 82>)
$$ ##END=
$$ 
$$ hash MD5
$$ FC 4A CE 34 1E 5A DB 20 4F 73 0E 21 B8 C1 58 8F
##$RELAX= 
##$RELAX= 
##$RELAX= 
##$RELAX= 
##$RELAX= 
##$RELAX= 
$$ Bruker specific parameters
$$ --------------------------
##$DU= <F:/spectra>
##$EXPNO= 1
##$NAME= <H-F>
##$PROCNO= 1
##$TYPE= <nmr>
##$USER= <she>
##$AMP= (0..31)
100 100 100 100 100 100 100 100 100 100 100 100 100 100 100 100 100 100 
100 100 100 100 100 100 100 100 100 100 100 100 100 100 
##$AQSEQ= 0
##$AQ_mod= 1
##$AUNM= <au_zg>
##$AUTOPOS= <>
##$BF1= 200.13
##$BF2= 200.13
##$BF3= 200.13
##$BF4= 200.13
##$BF5= 200.13
##$BF6= 200.13
##$BF7= 200.13
##$BF8= 200.13
##$BYTORDA= 1
##$CFDGTYP= 0
##$CFRGTYP= 5
##$CHEMSTR= <none>
##$CNST= (0..31)
1 1 145 1 1 1 1 1 1 1 1 1 1 1 1 1 1 1 1 1 1 1 1 1 1 1 1 1 1 1 1 1 
##$CPDPRG= <>
##$CPDPRG1= <>
##$CPDPRG2= <>
##$CPDPRG3= <>
##$CPDPRG4= <mlev>
##$CPDPRG5= <mlev>
##$CPDPRG6= <mlev>
##$CPDPRG7= <mlev>
##$CPDPRG8= <mlev>
##$CPDPRGB= <>
##$CPDPRGT= <>
##$D= (0..31)
0 1.2 0 0 0 0 0 0 0 0.06 0 0.03 0 0 0 0 0.0002 0 0 0 0 0 0 0 0 0 0 0 0 
0 0 0 
##$DATE= 1649240791
##$DBL= (0..7)
120 120 120 120 120 120 120 120 
##$DBP= (0..7)
150 150 150 150 150 150 150 150 
##$DBP07= 0
##$DBPNAM0= <>
##$DBPNAM1= <>
##$DBPNAM2= <>
##$DBPNAM3= <>
##$DBPNAM4= <>
##$DBPNAM5= <>
##$DBPNAM6= <>
##$DBPNAM7= <>
##$DBPOAL= (0..7)
0.5 0.5 0.5 0.5 0.5 0.5 0.5 0.5 
##$DBPOFFS= (0..7)
0 0 0 0 0 0 0 0 
##$DE= 6
##$DECBNUC= <off>
##$DECIM= 32
##$DECNUC= <off>
##$DECSTAT= 4
##$DIGMOD= 1
##$DIGTYP= 9
##$DL= (0..7)
0 120 120 120 120 120 120 120 
##$DP= (0..7)
150 150 150 150 150 150 150 150 
##$DP07= 0
##$DPNAME0= <>
##$DPNAME1= <>
##$DPNAME2= <>
##$DPNAME3= <>
##$DPNAME4= <>
##$DPNAME5= <>
##$DPNAME6= <>
##$DPNAME7= <>
##$DPOAL= (0..7)
0.5 0.5 0.5 0.5 0.5 0.5 0.5 0.5 
##$DPOFFS= (0..7)
0 0 0 0 0 0 0 0 
##$DQDMODE= 0
##$DR= 18
##$DS= 0
##$DSLIST= <SSSSSSSSSSSSSSS>
$$ [...]
##$SUBNAM2= <"">
##$SUBNAM3= <"">
##$SUBNAM4= <"">
##$SUBNAM5= <"">
##$SUBNAM6= <"">
##$SUBNAM7= <"">
##$SUBNAM8= <"">
##$SUBNAM9= <"">
##$SW= 18.0517287032376
##$SWIBOX= (0..15)
0 0 2 0 0 0 0 0 0 0 0 0 0 0 0 0 
##$SW_h= 3612.71676300578
##$TD= 16384
##$TD0= 1
##$TE= 0
##$TE2= 300
##$TE3= 300
##$TEG= 300
##$TL= (0..7)
0 120 120 120 120 120 120 120 
##$TP= (0..7)
150 150 150 150 150 150 150 150 
##$TP07= 0
##$TPNAME0= <>
##$TPNAME1= <>
##$TPNAME2= <>
##$TPNAME3= <>
##$TPNAME4= <>
##$TPNAME5= <>
##$TPNAME6= <>
##$TPNAME7= <>
##$TPOAL= (0..7)
0.5 0.5 0.5 0.5 0.5 0.5 0.5 0.5 
##$TPOFFS= (0..7)
0 0 0 0 0 0 0 0 
##$TUNHIN= 0
##$TUNHOUT= 0
##$TUNXOUT= 0
##$USERA1= <user>
##$USERA2= <user>
##$USERA3= <user>
##$USERA4= <user>
##$USERA5= <user>
##$V9= 5
##$VALIST= <valist>
##$VCLIST= <CCCCCCCCCCCCCCC>
##$VD= 0
##$VDLIST= <DDDDDDDDDDDDDDD>
##$VPLIST= <PPPPPPPPPPPPPPP>
##$VTLIST= <TTTTTTTTTTTTTTT>
##$WBST= 1024
##$WBSW= 4
##$XGAIN= (0..3)
0 0 0 0 
##$XL= 0
##$YL= 0
##$YMAX_a= 397682
##$YMIN_a= -443536
##$ZGOPTNS= <>
##$ZL1= 120
##$ZL2= 120
##$ZL3= 120
##$ZL4= 120
##$ABSF1= 10
##$ABSF2= 0
##$ABSG= 5
##$ABSL= 3
##$ALPHA= 0
##$AQORDER= 0
##$ASSFAC= 0
##$ASSFACI= 0
##$ASSFACX= 0
##$ASSWID= 0
##$AUNMP= <proc_1d>
##$AZFE= 0.1
##$AZFW= 0.1
##$BCFW= 1
##$BC_mod= 2
##$BYTORDP= 1
##$COROFFS= 0
##$CY= 11.3945322036743
##$DATMOD= 1
##$DC= 2
##$DFILT= <>
##$DTYPP= 0
##$F1P= 2.36226072786647
##$F2P= -0.459571619588291
##$FCOR= 0.5
##$FTSIZE= 0
##$FT_mod= 4
##$GAMMA= 1
##$GB= 0.15
##$INTBC= 1
##$INTSCL= 1
##$ISEN= 128
##$LB= 0.24
##$LEV0= 0
##$LPBIN= 0
##$MAXI= 10000
##$MC2= 0
##$MEAN= 0
##$ME_mod= 0
##$MI= 1.114404
##$NCOEF= 0
##$NC_proc= 0
##$NLEV= 6
##$NOISF1= 3.799351
##$NOISF2= 2.8
##$NSP= 1
##$NTH_PI= 0
##$NZP= 0
##$OFFSET= 15.70392
##$PC= 1
##$PHC0= -18029.59
##$PHC1= 13.00078
##$PH_mod= 1
##$PKNL= yes
##$PPARMOD= 0
##$PSCAL= 0
##$PSIGN= 0
##$REVERSE= no
##$SF= 200.130013532006
##$SI= 16384
##$SIGF1= 3
##$SIGF2= 2
##$SINO= 400
##$SIOLD= 16384
##$SREGLST= <1H.CDCl3>
##$SSB= 0
##$STSI= 0
##$STSR= 0
##$SW_p= 3612.71676300578
##$SYMM= 0
##$S_DEV= 0
##$TDeff= 0
##$TDoff= 0
##$TI= <>
##$TILT= no
##$TM1= 0
##$TM2= 0
##$TOPLEV= 0
##$USERP1= <user>
##$USERP2= <user>
##$USERP3= <user>
##$USERP4= <user>
##$USERP5= <user>
##$WDW= 1
##$XDIM= 8192
##$YMAX_p= 0
##$YMIN_p= 0
$$ End of Bruker specific parameters
$$ ---------------------------------
##NTUPLES= NMR FID
##VAR_NAME=  TIME,          FID/REAL,        FID/IMAG
##SYMBOL=    X,             R,               I
##VAR_TYPE=  INDEPENDENT,   DEPENDENT,       DEPENDENT
##VAR_FORM=  AFFN,          ASDF,            ASDF
##VAR_DIM=   8192,          8192,            8192
##UNITS=     SECONDS,       ARBITRARY UNITS, ARBITRARY UNITS
##FACTOR=    0.0002768,     1,               1
##FIRST=     0,             0,               0
##LAST=      2.2672688,     0,               0
##MIN=       0,             -443536,         0
##MAX=       2.2672688,     397682,          0
$$ Real data points
##PAGE= N=1
##DATA TABLE= (X++(R..R)), XYDATA
$$ [...]
2330h4Pj10K54J28l46Q1L02j72J36Q1l02l5RR0l51N18k74k16L66m8R2j62J8P3
$$ -84 -77 -187 67 195 -151 -70 232 60 196 277 -25 -60 -51 39 -312 206 -68 -284 82 34 126 -36 -18 55
2354E5j05L1j31j5M48k87J48r9k62J73O9j57J75j28K70l88L45p8k13N04m01L6
$$ 55 -50 -19 -150 -165 283 -4 144 45 -217 -44 25 -132 43 -85 185 -203 142 64 -149 355 -46 -10
2376a0J85l79n1K08N0J19k10K33n52O87k03k25M84m20J71k3m29L96j33N67q03
$$ -10 175 -204 -255 -47 3 122 -88 145 -407 280 77 -148 336 -84 87 64 -365 31 -102 465 -338
2397c38J54L96n09K64o9j5L40j56L60o39N16J73o63K42J46k36K94n81K85l31L57
$$ -338 -184 212 -297 -33 -102 -117 223 67 427 -212 304 477 -186 56 202 -34 260 -321 -36 -367 -10
2418a0K53l68N78m90n2K06l44M65m42J86K76p55P56l38n2O86j092M02J82k24L02
$$ -10 243 -125 453 -37 -89 117 -227 238 -204 -18 258 -497 259 -79 -131 555 -537 -135 47 -177 125
2439A25l08L68m30NO50q63Q05l04j06L52p91O09j01j83M40p16Q34n97j11J247
$$ 125 -183 185 -245 -240 410 -453 352 48 -58 294 -497 112 11 -172 268 -448 386 -211 -322 925
2459I25j352R68p90K51O82j643J339l83j33O34j639J770r61K24M16j175J867j185
$$ 925 -427 541 -249 2 684 -959 380 -3 -136 498 -1141 629 -332 -108 308 -867 1000 -185
2477a85R5R16j458J030q15M48Q95k124J630o94K35N77j853K264q71q83J278j091
$$ -185 -90 826 -632 398 -417 31 926 -1198 432 -262 -27 550 -1303 961 90 -793 485 -606
2495f06J700j654j79J927j727R21r94N43J174k507J454P7p7K38j644K782j265
$$ -606 1094 -560 -739 1188 -539 382 -612 -69 1105 -1402 52 129 52 290 -1354 1428 163
2512A63r90J308r89J545j775k17K280j796O19j122J096J647l866K364K45m21K58
$$ 163 -827 481 -508 1037 -738 -955 1325 -471 148 -974 122 1769 -2097 267 512 91 349
2529C49k234L258p11k043J477l26K102k956o61L839k237p1j025J580J832m573
$$ 349 -1885 1373 662 -1381 96 -230 1872 -1084 -1745 2094 -143 -214 -1239 341 2173 -2400
2545b400K372J071p37R1k779M548r74l216K007r0K277l635p39M835k702n22r44
$$ -2400 -28 1043 306 397 -2382 2166 1192 -2024 -17 -107 2170 -1465 -2204 2631 -71 -593 -1537
2562a537K022K661n902J890K341n61r97l024N486q60m106K256L36K724m360q76
$$ -1537 485 3146 -2756 -866 1475 914 -83 -3107 2379 1519 -2587 -331 5 2729 -1631 -2507
2578b507N525k649j091j082K541K499o496K120K845o23j553k867O031p34n070
$$ -2507 3018 369 -722 -1804 737 3236 -3260 -1140 1705 1082 -471 -3338 2693 1959 -3111
2593c111K278J504K081m518j409O792k761k230m30K666K758p010J688M210j577
$$ -3111 -833 671 2752 -1766 -3175 3617 856 -1374 -1804 862 3620 -3390 -1702 2508 931
2608I31j554l204O593k68n921K840J561J827m561j644P164k661k782j83L036K826
$$ 931 -623 -3827 2766 2498 -3423 -583 978 2805 -1756 -3400 3764 1103 -1679 -1862 1174 4000
2624D000p791J921M839j988j893k803O402K90o471K822J811J824m591k015P913
$$ 4000 -3791 -1870 2969 981 -912 -3715 2687 2977 -3494 -672 1139 2963 -1628 -3643 4270
2639D270l043l346K94K828K809p262J419N004k052j649k522N929M52o825L014
$$ 4270 1227 -2119 -1825 1003 3812 -3450 -2031 2973 921 -728 -3250 2679 3131 -3694 -680
2654f80K014J168m072j840O936k321l098O57K174K808o861J303M909k347j833
$$ -680 1334 2502 -1570 -3410 3526 1205 -1893 -1236 938 3746 -3115 -1812 3097 750 -1083
2669a083j889N324K69o082K815J811Q63l348j989O676j966l205P61J605K394n666
$$ -1083 -2972 2352 2621 -3461 -646 1165 2028 -1320 -3309 3367 1401 -1804 -1043 562 2956 -2710
2685b710Q38M629k086j456j301L902Q72n607K294J658M17k417j723N288j444l113
$$ -2710 -1872 2757 671 -785 -2086 1816 2688 -2919 -625 1033 1450 -967 -2690 2598 1154 -1959
2701a959J363J317J486m172J02M480k308q83j031K345J508m655K055J502m41j020
$$ -1959 -596 721 2207 -1965 -1863 2617 309 -574 -1605 740 2248 -2407 -352 1150 709 -311
2717c11j584M091j321k760J852L35J246k779k73L469k113j26o17J284J327l686
$$ -311 -1895 2196 875 -1885 -33 302 1548 -1231 -1504 1965 -148 -274 -891 393 1720 -1966
2733a966J893J275j280J28j666L088r76k101K272p43J217j696q44L024j996p6
$$ -1966 -73 1202 -78 50 -1616 1472 496 -1605 667 -76 1141 -555 -1399 1625 -371 -447
2749d47J16N54Q88k666J775P37j070L61j227J998p39j507J802q71J182j345k82
$$ -447 -331 223 1111 -1555 220 957 -113 248 -979 1019 280 -1227 575 -296 886 -459 -741
2766g41J998j750M08o9k0J071j703J021K03o89M57o61J058m52j138J299n03N39
$$ -741 1257 -493 -85 -154 -174 897 -806 215 418 -271 186 -475 583 131 -1007 292 -211 328
2784C28p46L6J262j301M84J30l41O48r19N78K35n58M85o82L75J48p38R05k77J62
$$ 328 -418 -382 880 -421 63 193 -148 500 -419 159 394 -164 321 -361 14 162 -576 329 52 214
2804B14J03n73P62n87j4J22j15M33o29J66M59o91O17l06o5K17n02L90m7J40Ll20
$$ 214 317 -256 506 -81 -95 27 -88 345 -284 -118 341 -350 267 -39 -104 113 -389 1 -46 94 97 -223
2826b23N63k60q0J31m82M43l25L71K9m17O09k69m4j4l37L00N8Q4j28l38N50k78
$$ -223 340 80 0 131 -351 92 -233 138 167 -250 359 90 46 32 -305 -5 53 137 9 -329 221 -57
2848e7p1M33k70K59k02n2K22k82K7K3K1O0k14j59J43N2J60k73J20K47k69K04m35
$$ -57 -128 305 35 294 92 40 262 -20 7 30 51 111 -103 -262 -119 -67 93 -180 -60 187 -82 122 -313
2871c13L68Kj28J22j32M1J50k16K02j50J44J7k6j0k46J87P5k59L03k05J67m3j12
$$ -313 55 57 -71 51 -81 -40 110 -106 96 -54 90 107 81 71 -175 12 87 -172 131 -74 93 50 -62
2894f2J44k95L91k56n8L42m16J23R2k50K24m10M18k20J32J29j91K61k37J62K75
$$ -62 82 -213 178 -78 -136 206 -210 -87 5 -245 -21 -431 -13 -233 -101 28 -163 98 -139 23 298
2915B98m63K88k20J82k1l02J63J16j22O6n0K42l11J28L56m13J31j01k31Q15r10
$$ 298 -165 123 -97 85 64 -238 -75 41 -81 -15 -65 177 -134 -6 350 -63 68 -33 -264 551 -359
2936c59P13j18k61N68q85M87q6k98N29q04P97l39n15J124j067Q49l85l58J186
$$ -359 354 236 -25 543 -342 145 59 -239 290 -514 283 -56 -571 553 -514 335 -50 -408 778
2955G78j391Q33l58j65Q20j116P65q6m18Q15j119J323n14o38J305j339J028n80
$$ 778 -613 220 -138 -303 517 -599 166 80 -338 477 -642 681 167 -471 834 -505 523 -57
2973e7n20J701j436K23n8r5J388k172J344M34j081R57j895J793M6j729K008j310
$$ -57 -577 1124 -312 -89 -147 -242 1146 -1026 318 752 -329 628 -1267 526 572 -1157 851 -459
2991d59J179r51r03K633k189Q05k72m14K369l308J396Q72j300J287k338K476J09
$$ -459 720 -231 -1134 1499 -690 115 -157 -571 1798 -1510 -114 758 -542 745 -1593 883 992
3008I92k692K686j405J382j033j559L826k830N22o6m29K521l608J676J326j824
$$ 992 -1700 986 -419 963 -70 -1629 2197 -633 -111 -177 -606 1915 -1693 -17 1309 -515
3024e15J658k894K962k6l410L350j733J566j240j872M633l393K46P23n81K994
$$ -515 1143 -1751 1211 1185 -2225 1125 -608 958 -282 -2154 2479 -914 -668 55 -526 2468
3040B468m439J239K423k663J579k605L359M72m657L761j009J266j360k087N132
$$ 2468 -1971 -732 1691 -972 607 -1998 1361 1833 -2824 937 -72 1194 -166 -2253 2879
3055B879l219o70J133n14L076m950J471L190l241J519k635L427L87n087M062p48
$$ 2879 -340 -1010 123 -391 2685 -2265 -794 2396 -845 674 -1961 1466 1853 -3234 828 80
3071H0P54j145k122N812l928q71J743p77L221n438J566M115m287J361k020L455
$$ 80 834 -311 -2433 3379 -549 -1420 323 -454 2767 -2671 -1105 3010 -1277 84 -1936 1519
3087A519O01n704M511k78j70q32k566O562l708j939K368q83L394n454J376M369
$$ 1519 2120 -3584 927 649 479 -353 -2919 3643 -65 -2004 364 -519 2875 -2579 -1203 3166
3103C166m558J212j467K860J448o389M647j23j96n21l288O564l118k398K621j163
$$ 3166 -1392 -180 -1647 1213 2661 -3728 919 796 600 79 -3209 3355 237 -2161 460 -703
3119g03L436m972Q29M574m196J495k257K663J800n964M055Rl98k05l378O426k729
$$ -703 2733 -2239 -1410 3164 -1032 463 -1794 869 2669 -3295 760 769 371 166 -3212 3214 485
3136D85k687K871j342L255m513M11M842m518J460j731K137K137o185L813N96o10
$$ 485 -2202 669 -673 2582 -1931 -1520 3322 -1196 264 -1467 670 2807 -3378 435 1031 421
3152D21j38l280N641j934k943L334j708K898l764m61M928l921J316j734J387K671
$$ 421 283 -2997 2644 710 -2233 1101 -607 2291 -1473 -1934 2994 -927 389 -1345 42 2713
3168B713n695L432L53j025R61l576N098j460k837K795j534K947l158q53M700l890
$$ 2713 -2982 450 803 -222 739 -2837 2261 801 -2036 759 -775 2172 -986 -1839 2861 -1029
3184a029J232r48M19K814n311L072O84j121J017l308M370j111k630K985j801K007
$$ -1029 203 -745 -326 2488 -2823 249 933 -188 829 -2479 1891 780 -1850 1135 -666 1341
3200A341j935j035M160l466R71l23q1K406m188K368P23j427J586k803K900n18
$$ 1341 -594 -1629 2531 -935 36 -287 -368 2038 -2150 218 941 -486 1100 -1703 1197 679
3216F79k048K334j692J937j589j264L804k935O04Q6m02K301l518J679P67j555
$$ 679 -1369 965 -727 1210 -379 -1643 2161 -774 -170 -84 -486 1815 -1703 -24 743 -812
3232h12J730k411K201M8k096K124j180J097q58j133K650k148N92M36j048K177
$$ -812 918 -1493 708 756 -1340 784 -396 701 -157 -1290 1360 -788 -196 240 -808 1369
3248A369k688J552L88j307J485j657J391J0j856K282j604P02L41j413K175j495
$$ 1369 -1319 233 621 -686 799 -858 533 543 -1313 969 -635 67 408 -1005 1170 -325
3264c25J98N56r81J591j765P68N53j749J570j151Q00M50j475J714j262O70K07
$$ -325 -127 429 -552 1039 -726 42 595 -1154 416 -735 65 515 -960 754 -508 162 369
3281C69j224J569j107N10L20j155J563j258M77L80j056J316j364O11L74q69J354
$$ 369 -855 714 -393 117 437 -718 845 -413 64 444 -612 704 -660 -49 325 -544 810
3298H10j124K93M65r78J192r87L46M34j049R71n62J74L86r03J162n73n9K78q30
$$ 810 -314 -21 444 -534 658 -329 17 451 -598 373 -189 -15 371 -532 630 57 -2 276 -554
3317e54P45l69J27J41l17L93l47L20N1n17O84l61r4L01m76N42l95Q7K90j47M2
$$ -554 191 -178 -51 90 -227 166 -181 139 190 -327 357 -4 -98 203 -273 269 -126 -39 251 104 146
3338A46j53q3K68k56J6N2m5K83l15K18J44l13K56k38K93k29j03K88r7p9q5l20
$$ 146 -7 -90 178 -78 -62 -10 -55 228 -87 131 275 -38 218 -20 273 44 -59 229 132 53 -32 -352
3360c52N89n44L49J35k55L43n80M67l36L16n9k41L23o8k69N65m71L19J09o73N14
$$ -352 237 -307 42 177 -78 265 -315 152 -184 132 73 -168 155 87 -182 383 -88 231 340 -333 181
3381A81n89M99j0j26J22op4R9m04M08j96L37r3j16K67m50K44J71m01K78k79PL00
$$ 181 -408 91 81 -45 77 71 -3 96 -308 100 -96 241 148 32 299 -151 93 264 -137 141 -138 -131 169
3404A69m00L73j46m1O0K1M8k48N5J49k45K75k02Q0N9r9j16K07R8k6l94N46j92
$$ 169 -231 142 -4 -45 15 36 84 -164 -109 40 -205 70 -132 -52 7 -92 -208 -1 97 71 -323 223 31
3427C1N2l6j72N57m18J72k63o2L11m54N60k05k2L59n96M66p8p00J133q41L42r2
$$ 31 83 47 -125 432 14 186 -77 -139 172 -282 278 73 51 410 -186 280 202 -498 635 -206 136 44
3449D4n41J105r72N03j17m02O26p04O73L0n78P63j000Q84m8r65J389j148O96k83
$$ 44 -497 608 -364 139 22 -380 246 -458 215 245 -333 430 -570 314 266 -699 690 -458 238 -45
3469d5m46J344j170M66R4p05J104j345R18L99j195J081j215J146K11j798J790
$$ -45 -491 853 -317 149 243 -462 642 -703 215 614 -581 500 -715 431 642 -1156 634
3486F34j063O46j96q62K015j548L91L11o76J305k141J298M90j303J614j938J972
$$ 634 -429 217 21 -841 1174 -374 17 328 -348 957 -1184 114 604 -699 915 -1023 949
3503I49l63j800J990j461J215n01j248K597j785L7O95r26K146k777J193J247k007
$$ 949 586 -1214 776 -685 530 29 -1219 1378 -407 -370 325 -601 1545 -1232 -39 1208 -799
3520g99J566j949J901J13k567K582r01O41m53j569L252k473J08J003j068K234
$$ -799 767 -1182 719 832 -1735 847 -54 587 134 -1435 1817 -656 -548 455 -613 1621
3536A621l326J771J585k419J371j725K088J78l132K963j004J59O3j873L979k863
$$ 1621 -1705 66 1651 -768 603 -1122 966 1144 -1988 975 -29 130 193 -1680 2299 -564
3552e64m29J592j347K733l671J077K471l104K003k091K124Q30m147L777j085l1
$$ -564 -993 599 -748 1985 -1686 -609 1862 -1242 761 -1330 794 1624 -2523 1254 169 138
3568A38J61k584M705k877n87K075j891K868l876J166K979l839K213j838J809J181
$$ 138 299 -2285 2420 -457 -1044 1031 -860 2008 -1868 -702 2277 -1562 651 -1187 622 1803
3584A803m762M274j100j72N58l162N224k907j077K684k538L167l918R02L728m504
$$ 1803 -2959 1315 215 43 601 -2561 2663 -244 -1321 1363 -1175 1992 -1926 -1024 2704 -1800
3600a800K628j890J290J762m761L931p24p82Q45k572M502k517j601K918k701L576
$$ -1800 828 -1062 228 1990 -2771 1160 436 -346 499 -2073 2429 -88 -1689 1229 -1472 2104
3616B104l435K95L567m220K357j336N01K411n163M330r06j351J651l162M648k260
$$ 2104 -1331 -1036 2531 -1689 668 -668 -167 2244 -2919 1411 505 -846 805 -2357 2291 31
3632C1j975L661k946K919k690k04L608m153K455j255L54K106m672L695n59j206
$$ 31 -1944 1717 -1229 1690 -1000 -1204 2404 -1749 706 -549 -195 1911 -2761 934 375 -831
3648h31J957l513M412k106j687L480l070K751k136k78L650m399K339p01m03K525
$$ -831 1126 -2387 2025 -81 -1768 1712 -1358 1393 -743 -1021 2629 -1770 569 -132 -535 1990
3664A990m345L470m58j583K123l220L822j769j662L507l225K328j483p07L571
$$ 1990 -2355 1115 657 -926 1197 -2023 1799 30 -1632 1875 -1350 978 -505 -1212 2359
3679B359m034K280l70j037K642l951K985j90j946K747l217K872q15j991L555k945
$$ 2359 -1675 605 235 -802 1840 -2111 874 684 -1262 1485 -1732 1140 325 -1666 1889 -1056
3695a056J674o60j407L705l778J850k4j527K713l323K465j7j859K602k898K378
$$ -1056 618 -42 -1449 2256 -1522 328 304 -1223 1490 -1833 632 615 -1244 1358 -1540 838
3711H38n74j814L097k544J540N3j851L063k732J171J47j628K840k682J281N37
$$ 838 264 -1550 1547 -997 543 596 -1255 1808 -924 247 394 -1234 1606 -1076 205 742
3727G42j867K477k300J332K33j556K415k327J239J28j777K528k208J077K46j452
$$ 742 -1125 1352 -948 384 617 -939 1476 -851 388 516 -1261 1267 -941 136 382 -1070
3743a070K369k163Q59L33j430K271j785N32O86j669K114j828Q26M58j495K007
$$ -1070 1299 -864 -5 328 -1102 1169 -616 -84 602 -1067 1047 -781 45 503 -992 1015
3759A015j548P29M50j555K118k013N94O26j170J760j502N81L72j206J772j752
$$ 1015 -533 196 646 -909 1209 -804 -210 416 -754 1006 -496 85 457 -749 1023 -729
3775g29N47N83j143J362j267P18K30j145J590q80J09M39j169J389j027K23Q45
$$ -729 -182 401 -742 620 -647 71 301 -844 746 -134 -25 414 -755 634 -393 -170 675
3792F75j498J126m24k03R04j379J201o44K24N61j151J204q78j58O59p57R48q20
$$ 675 -823 303 -121 -324 580 -799 402 -242 -18 543 -608 596 -282 -440 219 -538 410 -410
3810d10K41O38j017P71l99P7N05p95L40j06J18L04o40Q21m40l79O92m27N32m43
$$ -410 -169 469 -548 223 -176 -99 406 -389 -49 -155 -37 267 -373 448 8 -371 321 -106 426 -17
3830a7m03P78p44Q05l02l02N18o01K20K41k27k2j24L88k75k00K41j15N32k99k50
$$ -17 -420 358 -386 419 117 -185 333 -268 -48 193 -34 -56 -180 208 -67 -267 -26 -141 391 92 -158
3851a58L33m22N28k90K3J45k87j41K18l15N62m96L93j52l30N09k93K59n4j79J66
$$ -158 175 -247 281 -9 14 159 -128 -269 -51 -366 196 -300 93 -59 -389 120 -173 86 32 -147 19
3872A9k76L51p9p5J8l17J72K41m21M28l78L27p7j13J56o2P5O9l25N43n24K58q
$$ 19 -257 94 15 -60 -42 -359 -187 54 -367 61 -317 10 -67 -180 -24 -86 -11 58 -267 276 -248 10 2
3895BNM8j18m6K03j49k9o9P8K40l89M85m35J19J90p6O4o2j82K51k06J06m7m0k
$$ 2 7 55 -63 -109 94 -55 -84 -153 -75 165 -224 261 -174 -55 135 59 123 61 -121 130 -76 30 -17 -57 -59
3920e9k4J80k46L01k11n9K54m12L18J53l12K78k36Q7K50l09K06l71M18l7m30L32
$$ -59 -83 97 -149 152 -59 -118 136 -276 42 195 -117 161 -75 12 262 -47 159 -212 206 169 -261 71
3942G1o6j75m5J60K28k07J07J06l29J91k11J41K16l55L90m14J45k0m5J87l98M98
$$ 71 5 -170 -215 -55 173 -34 73 179 -150 41 -170 -29 187 -168 222 -192 -47 -67 -112 75 -323 175
3964A75j80l50M53k24J14J90k58K57n62L03M82n82N06p99O56L7n98Q65o41L72
$$ 175 -5 -355 98 -126 -12 178 -80 177 -385 -82 400 -182 324 -475 181 218 -380 485 -156 216
3984B16k89m29J125q63J93J69n10P96j090P21M91r70O83m87M25K26q33J008q27
$$ 216 -73 -502 623 -240 -47 122 -388 408 -682 39 530 -440 243 -244 181 407 -426 582 -245
4003b45P9N1l81J236q72j70L58k83P40r06N55L09j038R24p88O64L7j214J415n18
$$ -245 -166 -115 -496 740 -132 -302 56 -227 513 -393 162 471 -567 357 -431 233 270 -944 471 -47
4023d7m6j19n41J405j047Q5N44n10J134j417N33N60j256R61p67N67N31j447J500
$$ -47 -93 -212 -753 652 -395 -310 234 -276 858 -559 -26 534 -722 239 -528 39 570 -877 623
4042F23q44J71K48r98J460j133n6J021j070J301j301N06R18j672J312j140J082
$$ 623 -221 -50 198 -800 660 -473 -529 492 -578 723 -578 -72 846 -826 486 -654 428
4059D28L33j952K075q97j16K78j123K239j574m54J426j119J308j570L99J484k061
$$ 428 761 -1191 884 -13 -129 149 -974 1265 -309 -763 663 -456 852 -718 -319 1165 -896
4076h96J348p82K05P11j994K327p84r7M98j672K352j271o06J426j593J758j573
$$ -896 452 -330 -125 586 -1408 919 135 38 536 -1136 1216 -55 -661 765 -828 930 -643
4093f43J70J783k483J658q34M17Q85k241K152o71n33Q69j474J983j210o54J704
$$ -643 -473 1310 -1173 485 -349 68 953 -1288 864 193 -340 529 -945 1038 -172 -826 878
4110H78j750J834j503J17J912k898J764l49k51J357k686K539q23q55J685k098
$$ 878 -872 962 -541 -424 1488 -1410 354 5 -246 1111 -1575 964 141 -714 971 -1127
4126a127K397j425o26J844j947J717j063l09J861k201J459n30m12J487k268K040
$$ -1127 1270 -155 -781 1063 -884 833 -230 -539 1322 -879 580 50 -362 1125 -1143 897
4142H97q19r39J847k223J977o14j070J922j848J412n21p20K228k673J611m43n82
$$ 897 78 -861 986 -1237 740 126 -944 978 -870 542 21 -699 1529 -1144 467 24 -558
4159e58J735k176J599q7j211J661k108J645j33j038J524k089J779n37j019K299
$$ -558 1177 -999 600 513 -698 963 -1145 500 367 -671 853 -1236 543 6 -1013 1286
4175A286k507J869m99j114K252k447J535n1j152K033k010J092j13q74J880j983
$$ 1286 -1221 648 149 -965 1287 -1160 375 324 -828 1205 -805 287 174 -700 1180 -803
4191h03J217j3j255J700j649J198L0j490K307j953J021L3j314K114j860Q17K74
$$ -803 414 401 -854 846 -803 395 425 -1065 1242 -711 310 343 -971 1143 -717 100 374
4208C74j124K000k251J293L07j379J697j491Q73j37j463K378j552M48K97j139
$$ 374 -750 1250 -1001 292 599 -780 917 -574 299 162 -1301 1077 -475 -27 270 -869
4224h69K193j884M67O05j115J589j857J097L84j404J576j477R63m6j184J790j167
$$ -869 1324 -560 -93 512 -603 986 -871 226 610 -794 782 -695 268 222 -962 828 -339
4241c39K55K99j085J961j618N30O35j268J545j617N60J078j800J406q39L94M07
$$ -339 -84 215 -870 1091 -527 3 638 -630 915 -702 -142 936 -864 542 -297 97 504
4258E04j386J672r92J02L86j079J727j027k5O82q97R37j021M50O80j337J153o45
$$ 504 -882 790 -202 -100 286 -793 934 -93 -118 564 -333 604 -417 33 713 -624 529 -116
4276a16L09L36j430J393n76l18N42r09J488q54j23R63j479J544j077L52M71j043
$$ -116 193 529 -901 492 -84 -402 140 -769 719 -135 -258 705 -774 770 -307 45 516 -527
4294e27J065n64P5L02q84J044n07j75L27n24Q55o08m3M45n82Q07p08j9Q61j096
$$ -527 538 -26 49 351 -533 511 4 -171 156 -368 487 -121 -164 281 -301 506 -202 -221 640 -456
4314d56P45k69J79m4n07Q18m06m37O83o24Q40o98J42K39o90O34m01j1M85o46L99
$$ -456 289 20 199 155 -352 466 60 -377 306 -318 522 -176 -34 205 -485 149 -252 -263 222 -424 -25
4335b5j27pM81q89O78J36m00L66m43P30m20l69M28m53M49n8k71N56n66J92L68
$$ -25 -152 -159 322 -567 111 247 -153 213 -230 500 80 -289 139 -314 135 77 -194 362 -204 -12 356
4356C56m86K72l62J65R2k43N89o58M76j1l31K65r4p0Q7j02Q3j62J31J37k23K9
$$ 356 -130 142 -220 -55 37 -206 383 -275 201 190 -141 124 30 -40 47 -55 28 -134 -3 134 -89 -60
4378f0J32r4K00j58Pj65L52k00l09M61l09J70l39K07M07m58J23o8R0R5k70J07
$$ -60 72 -22 178 20 27 -138 214 14 -295 166 -143 27 -312 -105 302 -156 -33 -101 -11 84 -186 -79
4400g9R3K12j72l15L79r4m2J54k53q2K38Ro3kk3j1r0L08r9j48J02j15L56l94R5
$$ -79 14 226 54 -261 118 24 -18 136 -117 -199 39 48 -15 -17 -40 -51 -141 167 68 -80 22 -93 263 -131 -36
4425c6J4q9L21k07l5P0L9j51J4K07n3mr8K14k73P2j27J30p6m3J84l4K14j63j93
$$ -36 -22 -111 210 3 -32 38 77 -74 -60 147 94 90 -8 206 -67 5 -122 8 -68 -111 73 39 253 90 -103
4450a03J35j4J37j34J13Q2l54L99m41L16p3k45L86j75k12J72k1L57n05M3M47m57
$$ -103 32 18 155 21 134 216 -138 261 -180 136 63 -182 204 29 -183 -11 -32 325 -180 -137 310 -147
4472a47K62n39O24k72p1M88n16K78q8NJ50l00K85j9k22K95n28J94K89m13N08j93
$$ -147 115 -424 200 -72 -143 345 -171 107 19 24 174 -126 159 140 -82 213 -315 -121 168 -245 263 70
4494G0n7K99p46O22j71k99N00o29Q33p87L19J19l37N11l78J65K1m84N66j91K08
$$ 70 13 312 -434 188 17 -282 218 -411 422 -365 -46 73 -264 247 -131 34 55 -429 137 -54 154
4515A54l2o49Q63m59j44N38n16M64m48K5M87r67J106p72K82L96p49P75o27N41
$$ 154 122 -527 336 -123 -267 271 -245 219 -229 -204 283 -684 422 -350 -68 328 -421 354 -273 268
4535B68j08o71J176q16K99P1o78Q78o10N2P37j001P47n63K70L61r94Q99l32N0
$$ 268 160 -511 665 -151 148 219 -459 419 -191 -139 598 -403 344 -219 51 412 -582 317 -15 35
4555C5L08j089J083l32j40O27j180J302p60j94Q61r93J174j101L06P09j459J415
$$ 35 343 -746 337 5 -135 492 -688 614 -146 -340 521 -472 702 -399 -93 616 -843 572
4573E72q08M5O50j371J502n33l00P80j449J453o86j12P59j079J109o15j15P46
$$ 572 -236 -191 459 -912 590 57 -243 537 -912 541 -145 -257 502 -577 532 -83 -198 548
4591E48j270J144p61J95Q56j554J573p60m7O75j529J430o07j43J063j458J322
$$ 548 -722 422 -339 -144 712 -842 731 -29 -76 599 -930 500 -107 -250 813 -645 677
4608F77p61m46J127j358J431p54l45Q89j001J059n91l55R63j251J248m74r5N24
$$ 677 -84 -530 597 -761 670 -84 -429 460 -541 518 -73 -428 535 -716 532 58 -37 487
4626D87j241J017k93m42R40j158J203m99n56J247j117P94n48p9J059j613J184
$$ 487 -754 263 -30 -472 468 -690 513 14 -542 705 -412 382 -166 -245 814 -799 385
4643C85m20l00R22j511J458n08m27Q87j238J330o44n72J282j090R39n59l84J397
$$ 385 -35 -335 587 -924 534 26 -401 486 -752 578 -66 -638 644 -446 493 -66 -450 947
4661I47j797J185l38r4O99j555J410q1q81R38j061J189l19p94J454j223Q65n27
$$ 947 -850 335 -3 -97 602 -953 457 376 -505 433 -628 561 242 -552 902 -321 544 17
4679A7m65J756j836M19L64p12J041j338J273k21r39J034j031J424o95q13J369
$$ 17 -448 1308 -528 -109 255 -457 584 -754 519 298 -641 393 -638 786 91 -722 647
4696F47r43L10k2m63J595j712N96L20n42P01j154P44N34j330R63p25R51l26j133
$$ 647 -296 14 -8 -471 1124 -588 8 328 -214 487 -667 77 611 -719 244 -481 470 144 -989
4715i89J644o74P8p2n56J372j412N50M02m94Q06j388J043K14j237R47m65N05k27
$$ -989 655 -19 59 -13 -569 803 -609 -59 343 -151 655 -733 310 524 -713 234 -231 274 47
4734D7q12J394p73J59o5l52J066r86J83L87p23R03r85O02M57j176P74n20O42K34
$$ 47 -765 629 -144 15 -50 -402 664 -322 -139 248 -475 428 -557 45 502 -674 100 -420 222 456
4754D56j138J331o72j20J98m89J080q62j54P92o67L94o40M80O45j272O71k90L98
$$ 456 -682 649 -23 -143 55 -434 646 -216 -370 422 -245 149 -491 -11 634 -638 33 -257 141
4773A41J21p47J029n10l25L72m20R42q82n2P71o53M30n64L41M34r18O25m88N10
$$ 141 262 -485 544 34 -291 81 -339 603 -279 -331 440 -213 217 -347 -6 428 -490 135 -353 157
4793A57n3p05J142o99l6K10k59P45p95QO14p75N06j65K74Jl69M02l4J05l5n91
$$ 157 104 -601 541 -158 -194 16 -243 502 -293 -285 329 -446 60 -105 169 170 -199 203 169 274 239 -352
4815c52M07K28m00M50m81K91j19k10M47m02L09m83L23K35m81L66k75J93L68n96
$$ -352 55 283 -117 333 -148 143 24 -186 261 -141 168 -315 8 243 -238 128 -147 46 414 -182
4835a82L83j05j88J60k59K02j15j32M36m39J30m0Q8K44l74J81K26k11l5k35M00
$$ -182 201 96 -92 68 -191 11 -104 -236 200 -239 -109 -149 -61 183 -191 -10 216 5 -30 -265 135
4856A35k67q3J83j8L24k82m8J56R6j42k5p0K33l72K24oj21N7k21N50n39K04J70
$$ 135 -132 -215 -32 -50 274 -8 -56 100 196 54 29 -41 192 -180 44 38 -83 -26 -247 303 -236 -32 138
4879A38oJ6P0m07P9l7J77j36l9L37k37O6j05N2J70k66K60j69k62M68j89k8p1J13
$$ 138 132 148 218 -189 -110 -147 30 -106 -145 192 -45 21 -84 -32 138 -128 132 -37 -299 169 -20 -48 -119 -6
4903fK5mk50K95J07Ll77J55q7l3J5Q0Q9Q8O2lj18M9O3k84R8j83K13j06j27J68
$$ -6 19 15 -235 60 167 170 -207 -52 -139 -172 -157 -77 12 100 162 159 41 90 153 -131 -33 -216 -3 -109 -236 -68
4929f8J38m40J63Q1j00L17n1j5j76J8K03j56o8r4L15J54k94J64j89P0p6J59k00
$$ -68 70 -370 -207 -126 -226 91 40 25 -151 -133 70 -86 -154 -248 67 221 -73 91 -98 -28 -104 55 -145
4952a45J26J37j40O1m6m9J19j13k26K07K83k03j97P9o0R7m6N7L5r2k3J76p5R9
$$ -145 -19 118 -22 39 -7 -56 63 -50 -276 -69 214 11 -186 -107 -167 -70 -116 -59 -24 -116 -139 37 -38 61
4976F1r1J32J92m60J42J15k10L18l95L09%o0J32l93J08N4n0M29n86J64j57l0O06
$$ 61 -30 102 294 -166 -24 91 -119 199 -196 113 113 53 185 -208 -100 -46 -96 333 -253 -89 -246 -276 330
4999C30k57k22M73m83L70l62K39J10k53K29l81K04Pl21L92q1j79J20j80N65l81
$$ 330 73 -149 324 -159 211 -151 88 198 -55 174 -207 -3 4 -317 75 -6 -185 -65 -245 320 -61
5020f1R6k4m34M80k76R1L24n53N27r3k85L84l33M81l77P4M0o33P10j63K9J80m99
$$ -61 35 11 -423 57 -219 -128 196 -357 170 77 -208 176 -157 324 -53 21 61 -572 138 -25 4 184 -315
5043c15O37n18K52K00l76K89l60K6K68l25L45j29Q5P9m92P23l75j10L46l70M11
$$ -315 322 -196 56 256 -120 169 -191 -165 103 -222 123 -6 79 158 -334 389 14 -96 250 -120 291
5064B91k64m8K31k98L13l27k52N95n90N89l86K55L21n89M51o02K33L31n45O46
$$ 291 27 -21 210 -88 225 -102 -354 241 -349 240 -146 109 430 -159 292 -310 -77 254 -291 355
5084C55m17O4J74n63O18m54MN45n19M56l56j47P34q81N52k11J28K81q91Q53k59
$$ 355 -62 2 176 -387 231 -223 -219 326 -193 263 -93 -240 494 -387 165 -46 82 363 -528 325 66
5105F6k29L44n20P74p08j2P34q64N96l13J2N20p83N42j11k68Q14j221J091m45
$$ 66 -163 181 -339 435 -273 -285 449 -415 181 -132 -120 400 -383 159 48 -220 594 -627 464 19
5125A9j17L02m83P47o64k78Q64m21k7O0P4M33r42N67J16j71J28p58R16l03l85
$$ 19 -98 204 -279 468 -196 -474 390 -31 -58 2 76 509 -433 134 250 79 207 -551 365 62 -323
5146c23N49n41N28k80j67P11o54nJ19j06Q10j089L10O8R1J54p99R17K72j145O83
$$ -323 226 -315 213 -67 -234 477 -177 -182 -63 -169 641 -448 -138 -70 21 175 -624 293 565 -580 103
5167A03l24Q24p83n58J188p23K68k92J03P91r68K81L29j52K88j086R07q5n41N96
$$ 103 -221 603 -180 -738 450 -273 -5 -297 -194 597 -371 -90 239 87 375 -711 196 111 -430 166
5187A66n53P26l13n25R57l97J19l74l3O89p93L54J60j83J39p73Q33K43r78O18
$$ 166 -387 339 26 -499 458 61 180 -194 -227 462 -331 23 183 0 139 -634 199 442 -536 82
5207H2k83K84l15l06Q68m27Q6J39m40P48r04M98J77n75L11k86O61K13q71K62J94
$$ 82 -201 83 -232 -538 330 -97 -11 128 -312 436 -468 30 207 -368 -57 -343 318 531 -340 -78 116
5228A16r6j10m17Q97l29l01K32j0N86j030K35N74l81K14j49J03J11m52L43o0J68
$$ 116 20 -90 -507 390 61 -240 -8 -18 568 -462 -227 347 -34 180 31 134 245 -207 136 76 244
5249B44k89o92J352o77J37J44j80L05m28j63P62o43K33k29o3K90m61K60j14L89
$$ 244 -45 -737 615 -62 75 219 39 344 -84 -247 515 -128 105 -124 -187 103 -358 -98 -212 177
5269A77r7o34Q78l42j43L86n26O90n03j65N56k94J97k27P9m4j39M45k30J8L48
$$ 177 80 -554 324 -18 -161 225 -301 389 -114 -279 277 -17 180 -47 32 -12 -151 294 64 82 430
5290D30m81M65n78J22OpK39k51j14N41l00j89J11j1L54o04R8L56j68q0k69M37
$$ 430 -51 414 -164 -42 -36 -43 196 -55 -169 372 72 -117 -6 -17 337 -267 -169 187 19 -61 -330 107
5312A07k36l36O98j17J90l74m8K84l26K26j90O8J59j29J18j1k87K00o4L13K0n30
$$ 107 -129 -465 233 116 306 -68 -116 168 -158 68 -122 -54 105 -24 94 83 -204 -4 -68 245 265 -265
5334b65M01m37L33j23j90M52l09K42o4o7P2j83Q3J05j66J67N5j2j46j26K50q2
$$ -265 136 -301 32 -91 -281 171 -138 104 40 -27 45 -138 -55 50 -116 51 106 94 -52 -178 72 -10
5356a0J79k19J10J69m73L68k8n0J95k67J37j33Q9K7j90m0K41k84P0n2J65j96p3
$$ -10 169 -50 60 229 -244 124 96 46 241 -26 111 -22 67 94 -96 -136 105 -179 -109 -161 4 -192 -265
5379b65Q9K74P3j78QJ37k22J83n5l01L41p9k3Q8j52K89j43J19o9k75P8K32Mk42
$$ -265 -176 98 171 -7 1 138 -84 99 44 -257 84 5 -18 70 -82 207 64 183 114 -161 -83 149 153 -89
5403h9j35J08R1N0n9O5j0K0m58N93m15J07L3K91j75N1j02J38j00j10J34M1l47
$$ -89 -224 -116 -25 25 -34 31 21 41 -417 176 -239 -132 -99 192 17 68 -34 104 4 -106 28 69 -278
5426b78M54l47j1K41N1n8k07k3K03pJ32N4l32M4J27j88M0pK98l70K46J3N8j36
$$ -278 176 -171 -182 59 110 52 -155 -178 25 18 150 204 -128 -84 43 -145 -105 -112 186 -184 62 75 133 -3
5450cj20K18k20J99l9J49l33K33j25L22k87q4J23l5j3N1l9N5k15L92l01LJ26k8
$$ -3 -123 95 -125 74 35 184 -149 84 -41 281 -6 -90 33 -2 -15 36 -3 52 -163 229 -72 -69 57 29
5474B9p2l9qL17n01K50K88n36J73l8J93j76%J87l90L15K26j01J57m78M44q8j60
$$ 29 -43 -82 -90 227 -274 -24 264 -272 -99 -137 56 -120 -120 67 -323 -8 218 117 274 -204 240 152 -8
5497hp7J44O6j70L7l0r6J73q7m4O7m9N0M9j27K83m36J38J54m1j45J12K41k21m6
$$ -8 -85 59 125 -45 -8 -38 -134 39 -48 -92 -25 -74 -24 25 -102 181 -255 -117 37 -4 -149 -37 204 -17 -63
5522f3k0M3J71j70K0pOr5r7J25j87K94r0p3K56j17OJ66m8l42J88m8R4p0K37q0
$$ -63 -83 -40 131 -39 -19 -26 -20 -115 -212 -87 -274 20 -70 -143 113 -4 2 168 120 -222 -34 -82 12 -58 179 99
5548I9k38K12o4J1K20j93l0j28O0K9k58M22l7j22P8j60J53j82O0M45l34j34k76
$$ 99 -139 73 9 20 240 47 17 -111 -51 -22 -280 142 105 -17 61 -99 54 -128 -68 377 43 -91 -367
5571c67L86K05p50M55J90k80J07l41M43j42o5KJ56j5k02O7M13m23L61l65J59K75
$$ -367 19 224 -526 -71 119 -161 -54 -395 48 -94 -159 -157 -1 -16 -218 -151 262 -161 200 -165 -6 269
5593B69o68K20L28j11m7j96L76j10k15J25L8j05m3j94P65o25L51k93K35J33n73
$$ 269 -399 -179 149 38 -9 -205 171 61 -154 -29 9 -96 -139 -333 432 -193 158 -135 100 233 -340
5614c40L57K89k98J4l79N94j15o67Q37n38M97l96j96O15k18j34J02P3K44p24K92
$$ -340 17 306 8 22 -357 237 122 -545 292 -246 251 -145 -341 274 56 -78 24 97 341 -383 -91
5635i1J51k10K63k78O20k38n86L87M2J02k03M4L37n23rJ69j13L05n23L77J26o3
$$ -91 60 -150 113 -165 455 217 -369 18 60 162 -41 3 340 -183 -192 -23 -136 169 -354 23 149 86
5657H6r6m56P97j2n10L80j26L09o18j4O01l84Q9m9K92l2p05M55J45r0j64l14N19
$$ 86 -10 -466 331 319 -191 189 63 372 -246 -260 341 -43 46 -3 289 257 -448 7 152 62 -102 -416 103
5680A03n3l73L73k4K2j21j39O91m12k55J62O9K29l97j12K14J78k9l78M71k48l64
$$ 103 50 -323 50 26 48 -73 -212 479 67 -188 -26 43 272 -125 -237 -23 155 126 -252 219 -29 -393
5702c93N01mQ0l62j83N07j18k07O4J60J10n12K97J13k6K36n83N84k25m37M90M8
$$ -393 108 104 184 -178 -361 146 28 -179 -115 45 155 -357 -60 53 27 263 -320 264 39 -398 92 140
5724A40K99n47l06O81k72k33L95l02L48k77J39J76k99J29m26N78q2n86N01K63
$$ 140 439 -108 -414 267 -5 -238 157 -145 203 -74 65 241 -58 71 -355 223 141 -445 56 319
5744C19O6m38j11N33k67k05J44r2R9m37P5O55n23N3l5L22q0n73L02L09K11m82
$$ 319 385 -53 -164 369 102 -103 41 -51 48 -389 -314 341 -182 -129 -164 158 78 -495 -193 116 327 -155
5766a55j30N18l50J43O4N1R0k30n3J51j82K79k97J40K57o83N28m04K72K2k25M53
$$ -155 -285 233 -117 26 90 141 231 1 -52 99 -83 196 -101 39 296 -387 141 -263 9 31 -194 259
5788B59l04r1K62l12K31o9q2L32j66k65N5J16O0k62J64j50K28N8j87L46j04k69
$$ 259 -45 -136 126 -186 45 -24 -106 226 60 -205 -150 -34 26 -236 -72 -222 6 64 -123 223 119 -150
5810a50R0K20j22j42P3K8n7K02j39L2Q7j80J80o4r0Rj32J80J27m08J42K71O5k49
$$ -150 -60 160 38 -104 -31 -3 -60 142 3 35 122 -58 122 58 -32 -23 -155 25 152 -256 -114 157 222 -27
5834b7k3L0k65L34j6j94J62l0k13N14k48R5k39Q5R8p8J2j39L66m15J22K06k70
$$ -27 -50 -20 -285 49 33 -161 1 -29 -242 272 24 119 -120 -35 63 -15 -3 -142 224 -191 -69 137 -133
5857a33J90j13R8J52l65K45n4j66K21nn4l8k00J62K77k14P2N8k16Q4p6J39o1O0
$$ -133 57 -56 42 194 -171 74 20 -146 75 70 16 -22 -222 -60 217 3 75 133 -83 1 -75 64 3 63
5881F3J63k88L29k60p6K39j39oj24L88j79j27Kj98O2J5K58j04J9M3O1k20K42J
$$ 63 226 -62 267 7 -69 170 31 25 -99 289 110 -17 -15 -213 -151 -136 122 18 37 80 141 -79 163 164
5905A64k00J44q2J5Q7j33pJ67j66J23j08L2K85j67o2j03l4k36L57l93K75R9j98
$$ 164 -36 108 26 41 128 -5 -12 155 -11 112 4 36 321 154 92 -11 -45 -281 76 -317 -42 57 -141
5928a41J00O9J48Om09J91k48K35O3m34L54nO0l00M88l7m22L18P1k41lJ27j57J93
$$ -141 -41 28 176 182 -227 -36 -284 -49 14 -420 -66 -71 -11 -311 177 140 -282 36 107 -134 -137 -10 -167 26
5952B6J33j54J9o4o8J39J04j98L7P9O9l24M42j18j77M0N6j46k4K0K30j66J99r6
$$ 26 159 5 24 -40 -108 31 135 -63 -26 53 122 -202 240 122 -55 -15 41 -105 -129 -109 121 -45 154 58
5976E8k27J83q0L4l01J88J18q4O9k3j1R6O8k86K72j03Jj26P6J12K1o8R2j10L39
$$ 58 -169 14 -66 -32 -333 -145 -27 -111 -42 -65 -76 20 88 -198 74 -29 -28 -154 -78 34 55 -13 79 -31 308
6001C08k45J76J37l98m2J36Op2o6r9Q7J25r4k36J33J94l06L46j24J81l10J38K7
$$ 308 63 239 376 -22 -64 72 78 6 -60 -159 -72 53 -41 -277 -144 50 -256 90 -34 147 -163 -25 2
6024BJ0q8q3j00J91J54j02J59j24j07J40q1L0K87k41k0o5oJ12R5j01k42L9K39
$$ 2 12 -76 -159 -259 -68 86 -16 143 19 -88 52 -29 1 288 47 27 -38 -44 68 163 62 -180 -141 98
6048I8j40j88p2K36L99l31r0K56k62P5P1L0n7j39L45j36o7q6lK79k00r3m3K91
$$ 98 -42 -230 -302 -66 333 2 -88 168 -94 -19 52 82 25 -114 231 95 28 -58 -61 218 18 -75 -118 173
6072A73j65L3n4N2j89J52L5P5j57Q9j20J68j15n0m8J58P9l17M8K74k1k64K88j80
$$ 173 8 41 -13 39 -150 2 37 112 -45 44 -76 92 -23 -73 -121 37 116 -201 -153 121 100 -164 124 -56
6096e6J48l97K65P9N1j38j40J96n4o5o3L00q2j18l2M0L08m67Q0J15j0m4LQ8K04
$$ -56 92 -305 -40 39 90 -48 -188 8 -46 -111 -174 126 44 -74 -106 -66 242 -225 -145 -30 -40 -84 -81 7 211
6121B11n88K04K16n0J89j60K34m17L8K27J23k28j25K15R3j94j96J27M9L59n19
$$ 211 -377 -173 43 -7 182 22 256 -161 -123 104 227 -1 -126 89 182 -12 -208 -81 -32 327 -192
6142a92l5L24q6j76J40K63o0k43o3L62l20J89k72L87j56J08l89J69N3j07n0K99
$$ -192 -227 97 11 -165 -25 238 178 -65 -128 234 -86 103 -169 218 62 170 -219 -50 3 -104 -154 145
6164A45j11m47M85O5j08l68L77m4R6j24l4J68M4m49J20L15J93o28N8L91j74n5
$$ 145 34 -413 72 137 29 -339 38 -6 90 -34 -68 100 144 -305 -185 130 323 -305 -247 144 -30 -85
6186h5N8J08P6k73O2O3P1n2N4R1j54Q1N3J8q3k43P8J35l11K08K1q8J39Q4k03K95
$$ -85 -27 81 157 -116 -54 9 80 28 82 173 19 100 153 171 88 -155 -77 58 -253 -45 -24 -112 27 111 -92 203
6212B03J7j75jM0K2k39L22ok7j60kK66q5l01J15J23j05j97K20J66n5l15N3J01
$$ 203 220 45 44 84 106 -133 189 183 156 -4 -6 260 175 -126 -11 112 7 -190 30 196 141 -174 -121 -20
6236b0m4j6N5J36j64j11j0K19k24j3K27j88J31Q5j05m1J2K08l63L06K18l96P3
$$ -20 -64 -80 -25 111 -53 -164 -174 45 -179 -192 35 -153 -22 63 -42 -83 -71 137 -226 80 298 -98 -25
6259b5K5m2K38l87L80m34NM14k33j99K77k5M8p8j04k78L63O4q5RK14j59k8P9o
$$ -25 0 -42 196 -191 189 -245 -240 174 -59 -258 19 -6 42 -36 -140 -418 -55 9 -76 -67 147 -12 -40 39 33
6284C3q1J21J89j5l21Q7K30j42j53nK25k00j06K00J9j67M5J10k78K68j1RM1kk98
$$ 33 -48 73 262 247 -74 13 243 101 -52 -57 168 -32 -138 62 81 -86 -41 69 -209 59 48 57 98 96 -202
6309b02J34k0Q0k41J44j12K37Ro0j63L9J57j53J54p3m7K15P7k56J25m3NJ29p5
$$ -202 -68 -88 -8 -249 -105 -217 20 29 -31 -194 -155 2 -151 3 -70 -117 98 175 -81 44 1 6 135 60
6333F0m8R5l0m6J31L3l40J93R6j54J1K4J17j37p1j63K03j57K27J06r4k03K98j46
$$ 60 12 107 77 31 162 195 -145 48 144 -10 1 25 142 5 -66 -229 -26 -183 44 150 56 -147 151 5
6357El8J43j78R5m5N1Q9l39L45j23K6Q4j00M6j47K00k3k11P4M1O0K2k63K16o3
$$ 5 -33 110 -68 27 -18 33 122 -217 128 5 31 115 15 61 -86 114 91 -120 -46 -5 55 77 -186 30 -33
6382c3N0R6j21O0j06%jJ46k9n3K72k90R4j97J82K3k06N0K66m25J65Jj34J83j79
$$ -33 17 113 -8 52 -54 -54 -55 91 62 9 281 -9 85 -112 70 93 -113 -63 203 -222 -57 -56 -190 -7 -186
6407a86J85p5k14L25l7J15m4M1J18j97r0l2L13R9l55l8k4J20r6K76k29j13K35
$$ -186 -1 -76 -290 35 -2 113 69 110 228 31 -59 -91 222 321 -34 -72 -96 24 -72 204 -25 -138 97
6430I7J49k24K18l23L2K5j39L69j89P0j09k4K9J57j56O5k28J15j61K76k9J43n5
$$ 97 246 22 240 -83 -51 -26 -165 204 15 85 -24 -48 -19 138 -18 47 -181 -66 -227 49 20 163 108
6453A08n6J7L3l5j06m3J54q3j39J53J97m36J08M87k88J14Oj52k4J62j65J21m3
$$ 108 52 69 102 67 -39 -82 72 -11 -150 3 200 -236 -128 359 71 185 191 39 15 177 12 133 90
6476I0j67J48m6o1R0k58J58J01p0j91M17j56j7nj62m5Q0J52j33J05K36j83o6r1
$$ 90 -77 71 25 -36 54 -204 -46 55 -15 -206 211 55 38 33 -129 -174 -94 58 -75 30 266 83 17 -74
6500g4M6J01L5j10j09P2O1k47n0L24l10K93j32J05j05K76j71k0K44j37J49k38
$$ -74 -28 73 108 -2 -111 -39 22 -225 -275 49 -261 32 -100 5 -100 176 5 -15 229 92 241 3
6522Cj03K3J23j51J32k03L03r5n2N7K12m11k6M19k52J23n7p2o5J07p2K50j77J1
$$ 3 -100 -77 46 -105 27 -176 127 32 -20 37 249 -162 -188 231 -21 102 45 -27 -92 15 -57 193 16 27
6546B7l18L86l4k64L83k96L02k63j09J73k39K4K1L06Ok32k5K01k03L67j14M2J40
$$ 27 -291 95 61 -203 180 -116 186 -77 -186 -13 -252 -228 -207 99 105 -127 -152 49 -154 213 99 141 281
6569B81n96L04j35L41l23K00j49K28l89J71K9J29N0k46K36j85O3o1N7l0k8K60
$$ 281 -315 -11 -146 195 -128 72 -77 151 -238 -67 -38 91 141 -105 131 -54 9 -52 5 -25 -53 207
6591B07n1k11J5j54K53j46O6K01j81J24k06J3K94q6RO9l30J50M1k2J61M6m13l20
$$ 207 156 -55 -40 -194 59 -87 -21 180 -1 123 -83 -70 224 138 147 216 -114 36 77 55 216 262 -151 -471
6615d71O21q0k18J5J11K34m0q0l6j16q0k8J68K17m14J79K60j7j95p8N9J60q9J77
$$ -471 150 70 -148 -133 -22 212 172 92 56 -60 -140 -168 0 217 -197 -18 242 225 30 -48 11 171 82 259
6639B59L5l62N3K27l7l13q3J31K07o8j77J10Qp5R7O2p1Nm8M7J63n9k25Q9J40L5
$$ 259 294 -68 -15 212 175 -138 -221 -90 117 49 -128 -18 -10 -85 12 74 3 8 -40 7 170 111 -114 -25 115 150
6665A50j42p2K2J48k51K27j12q9L00j76R7J61l11lp0J39J48k22K36j34J42j79
$$ 150 8 -64 -42 106 -145 82 -30 -119 181 5 102 263 -48 -51 -121 18 166 -56 180 46 188 9
6687Ij3L4j16J9P7j78K53J12k28P4j63L24j92j16J16j92J01L78k28l13R6J74k14
$$ 9 -4 30 -86 -67 10 -168 85 197 -31 43 -120 204 12 -104 12 -180 -79 299 71 -242 -146 28 -186
6710a86J2K67K8N7n41M09o0j28J35j05K08k20r2L77k49J75K22m42K34l39N9K57
$$ -186 -174 93 121 178 -363 46 -14 -142 -7 -112 96 -124 -216 161 -88 87 309 -133 101 -238 -179 78
6732G8p0O5k43L05m33K45J74k25n8J28O1J28k72M71n25Q7L40k17j33J82l23L62
$$ 78 8 73 -170 135 -298 -53 121 -104 -162 -34 27 155 -117 354 -171 -84 256 39 -94 88 -235 127
6754A27j36J21j1k82M13m84L13j71L0J76j83J12j64K07l09K51k56J53n9L09j56
$$ 127 -9 112 101 -181 232 -252 61 -110 -80 96 -87 25 -139 68 -241 10 -246 -93 -152 157 1
6775Aj79J92M7l7l4k1J15j5o1R6j50O6j90M12k23K09k05Jm0p9J35l03L06J50R8
$$ 1 -178 14 61 24 -10 -31 84 69 8 104 -46 20 -170 242 19 228 23 24 -16 -95 40 -263 43 193 291
6800B91m56M18n11M48k52J77L3l17K9k5J72p0k3K70q4l97L44R3k9l62J05J29K3
$$ 291 -165 253 -258 190 -62 115 148 -169 -140 -165 7 -63 -86 184 100 -297 47 140 111 -251 -146 -17 6
6823Fj52J60l8M5j29K97m8m7j00L9R3j34O8K0j23nkJ52Kk50K07j35J19j04P4j35
$$ 6 -146 14 -24 21 -108 189 141 94 -6 33 126 -8 60 80 -43 -48 -50 102 104 -146 61 -74 45 -59 15 -120
6849a20K21j71M7m5R5J18j70K29k87J37J58k24j0J47j66J3m1l1J13l80O04l3k16
$$ -120 101 -70 -23 -68 27 145 -25 204 -83 54 212 -12 -22 125 -41 -28 -69 -100 13 -367 237 204 -12
6872a2J51r4K7P4j02l47K54J49l72K52K97j30l17L13m0j15P7k10J81q1n0L15k24
$$ -12 139 45 72 146 44 -303 -49 100 -272 -20 277 147 -170 143 103 -12 65 -145 36 -45 -95 220 -4
6895dj11K80j21j25j85M6J63N5J54j38k04L7J9K08J56j64n4J5l5J99m11J68k13
$$ -4 -115 165 44 -81 -266 -220 -57 -2 152 14 -190 -153 -134 74 230 66 12 27 -8 191 -220 -52 -265
6918b65J18K45k16j04L62k29J94L7nM9r2J7j83l5J81k56K15J77k34j41L28k07
$$ -265 -147 98 -118 -222 140 -89 105 142 137 186 94 111 -72 -107 74 -182 33 210 -24 -165 163 -44
6940d4K74Q2j66O9l07n3K47o0J9j37lk4J09K05m54J72p6J39k98K47L8j15J60n4
$$ -44 230 312 146 215 -92 -145 102 42 61 -76 -79 -103 6 211 -243 -71 -147 -8 -306 -59 -21 -136 24 -30
6964c0j56M4K49J8m03M13k60J04J58j68M6j88J48J21j35J5l39L69n7J41k10Q9
$$ -30 -186 -142 107 125 -278 135 -125 -21 137 -31 15 -173 -25 96 -39 -24 -363 6 -51 90 -120 -31
6986c1K88k21j72K96q2j60J84m59M44l6J4J7k16P9K8k4K15J11o8k68j03J67J50
$$ -31 257 36 -136 160 78 -82 102 -357 87 51 65 82 -134 -55 -27 -51 164 275 207 -61 -164 3 153
7009A53l39K96r0K2l59J30J38L60m50l6L96k65J23j88L7R1Q0k98K93l09K04j4
$$ 153 -186 110 20 42 -317 -187 -49 311 -139 -175 221 -44 79 -109 -72 19 99 -199 94 -215 -11 -25
7031b5o9K73l04J92r1pk7rK61k53J36k57N5K09j1o9K60j51L6j21j0Q3N7Q6k59
$$ -25 -94 179 -125 67 -24 -31 -58 -67 194 -59 77 -180 -125 84 73 4 264 113 149 28 18 101 158 244 -15
7056a5J70m34j18L61j1q6k5M3J42L3j38P3j28J34j4p8K04m3p0j13M63m12N2J30
$$ -15 155 -279 -397 -36 -47 -133 -158 -115 27 60 -78 -5 -133 1 -13 -91 113 70 0 -113 350 -62 -10 120
7080A20l6m9MJ56j40k10J19N5j47J70LK43j66q5j46J88k29L12k15K04j04J55l82
$$ 120 84 35 39 195 55 -155 -36 19 -128 42 45 288 122 37 -109 79 -150 162 -53 151 47 202 -180
7103a80p2K58j98K19K15m31K65j66N8K01k41J9K8J13k18k67M75j13m2J51j69o
$$ -180 -252 6 -192 27 242 -189 76 -90 -32 169 -72 -53 -25 88 -130 -397 78 -35 -77 74 -95 -101
7125a01N3p9J38O0k35J71k12K20o6J20q8NoJ83P0q9K5j58K00j79n8J37j49l9K7
$$ -101 -48 -127 11 71 -164 7 -205 15 -51 69 -19 -14 -20 163 233 144 169 11 211 32 -26 111 -38 -77 -50
7150e0j05M05j35o7J9pN4l09Q2K42k32N9j11K28J60m03J89j32ML30o8q8J97m63
$$ -50 -155 250 115 48 67 60 114 -195 -113 129 -103 -44 -155 73 233 -170 19 -113 -109 221 153 65 262 -201
7174b01J92j01J56k25K2J82m5j08K7q7M21k59p3L34r4p0j85J78o0k33J00j33J28
$$ -201 -9 -110 46 -179 -157 25 -20 -128 -101 -188 233 -26 -99 235 141 71 -114 64 4 -229 -129 -262 -134
7197a34j27K12N4j26J34q6R2r9k02K93K49l97K47k75J95m1j29K91l17J9L58l52
$$ -134 -261 -49 5 -121 13 -73 19 -80 -282 11 260 -137 110 -165 30 -11 -140 151 -166 -147 211 -141
7219a41L34n62K31N3kL56j26l29M49k07K4J03l07J00o8M51l76k00%K22J40n9M8
$$ -141 193 -369 -138 -85 -87 269 143 -186 263 56 80 183 -124 -24 -92 359 -17 -217 -217 5 145 86 134
7242A34k10j84L95l04K34k95k01Q17l61j81K91JR0j95J3j73J77Q2k01O2O2j57
$$ 134 -76 -260 135 -169 65 -230 -431 386 25 -156 135 136 226 31 44 -129 48 130 -71 -9 53 -104
7264a04J45o1L8K2j43J96j76j23J93j55K64l9M5n6p1M3Q6j26k11L01J33p9l2J64
$$ -104 41 -20 18 40 -103 93 -83 -206 -13 -168 96 57 102 46 -25 18 104 -22 -233 68 201 122 90 254
7288B54m62K23J62J20o8j16J02k60j71N44m44J22O1j18J33ll30J36Q2J95l21m0
$$ 254 -208 15 177 297 229 113 215 -45 -216 328 -116 6 67 -51 82 79 -251 -115 -33 162 -159 -199
7310a99J48j62K62RJ49j59j50L97l35M6J41k99L0P1J45o1k33M48q9j02l2K14r1
$$ -199 -51 -213 49 58 207 48 -102 295 -40 6 147 -152 -122 -51 94 33 -200 248 159 57 25 239 148
7333A48j76J20j7k57L19m06L55r3J10l9m8K13l74K31l10L3K05P2l66L86j36Q9
$$ 148 -28 92 75 -182 137 -269 86 -7 103 64 16 229 -145 86 -224 -191 14 86 -280 106 -30 59
7355E9k73J93J81k84j10rJ33j3P9QK1JJ58k9kk86J9rJ46J37J07l18q1R1j1O5k30
$$ 59 -214 -21 160 -124 -234 -243 -110 -123 -44 -36 -15 -14 144 115 113 -173 -154 -163 -17 120 227 -91 -172 -81 -92 -27 -257
7382b57K96j9Q2Q5j55p2k25J59J43m3K91k15k56L31k23P9J52k85R8M4L5k13J31
$$ -257 39 20 102 187 32 -40 -265 -106 37 -6 285 70 -186 145 -78 1 153 -132 -34 10 45 -168 -37
7405c7M02l68M9M1k00K71k33K3K05j24m3P8l19L75l38J34J91Nj03o2J40P9j34
$$ -37 365 -3 46 87 -113 158 -75 -52 153 29 -14 64 -255 120 -218 -84 107 112 9 -53 87 166 32
7428C2J21l99L29j62K9J5J24O6k75J33K49m12m3K05k4j01N7j01OO6Q3j61K01K4
$$ 32 153 -246 83 -79 -50 -35 89 155 -120 13 262 -150 -193 12 -12 -113 -56 -157 -151 -85 -2 -163 38 62
7452F2j7j55K05k6L9k55K61q2j66K54k21K63k89J31K2R6r5J23J5l3m4j36L12k24
$$ 62 45 -110 95 69 108 -147 114 32 -134 120 -101 162 -127 4 26 122 27 150 165 132 88 -48 264 40
7476D0qk0R2n6ml4l2K44j53kr3o4K69k52J3J95o0k1k8k8J91l35L46m56J22K48
$$ 40 32 12 104 48 44 10 -22 222 69 67 -26 -90 179 -73 -60 135 75 54 26 -2 189 -146 200 -256 -134 114
7502A14M1k04M2o9lm8m0K38j43J28k47J68J20l33J13K30j3n7K47k77p7K48k90
$$ 114 155 -49 -7 -76 -79 -127 -167 71 -72 56 -191 -23 97 -236 -123 107 94 37 284 7 -70 178 -112
7525a12K52k2k36J91r7J7nnr3N1j31QK43k81J23J41j57K39n4k06L77k35J08l5
$$ -112 140 118 -118 73 -24 -7 -12 -17 -110 -59 -190 -182 61 -220 -97 44 -113 126 72 -134 243 8 116 81
7549H1k57K56r7m3j55L81k07J85j82K09j52J0j37k8K83k92L30l21J73j49L4j27
$$ 81 -176 80 -17 -60 -215 166 -41 144 -38 171 19 29 -108 -136 147 -145 185 -136 37 -112 -78 -205
7571b05J14Q2K07k23J34o5j47J45j2m1l7j20r4J84M8o3J58J9j37J01l3L7p8k15
$$ -205 -91 -9 198 -25 109 44 -103 42 30 -11 -48 -168 -262 -78 -30 -93 65 84 -53 48 15 52 -26 -241
7595b41M52m05J89O6p2J50k90K48R9j96J70j15j01Q4l4j15J02nl3m7J23kL99m93
$$ -241 211 -194 -5 61 -11 139 -151 97 196 0 170 55 -46 38 4 -111 -9 -14 -47 -94 29 27 426 -67
7619f7N5J05l9k9J0j03K3l9J75j02M1rK08j95r7j0K45j28r6R6J82n9j97K7J83
$$ -67 -12 93 54 25 35 -68 -45 -84 91 -11 30 21 229 34 -63 -73 172 44 -52 44 226 167 -30 -3 180
7644A80m57M22k68K65k2l07M47l71K98j73Q4j66n3J73K55m07J76j33Lk8p7M7n7
$$ 180 -277 145 -123 142 120 -187 260 -111 187 14 98 -68 -121 52 307 -100 76 -57 -54 -82 -159 -112 -169
7667a69j9K13l47O24m77R0j3o0J48K9R7j01j88J07j4J66l3r0J11k36P0J45L7J47
$$ -169 -188 25 -322 302 -175 -85 -98 -158 -10 19 116 15 -173 -66 -80 86 53 -37 74 -162 -92 53 90 237
7691B37k89p0J50M1J09q8J28J7l57J85P3j68J48k95J05r2m0J27j97J84j60L83
$$ 237 -52 -122 28 69 178 90 218 235 -122 63 136 -32 116 -179 -74 -166 -206 -79 -276 -92 -252 131
7713A31M1k27N0LL61m87j86M92l25K03j31j91K70P6k71L30j90K1R8j79N46p50
$$ 131 172 -55 -5 -2 359 -128 -314 178 -147 56 -75 -266 4 80 -191 139 -51 -30 68 -111 435 -315
7735c15L11q1O0O8j91K09K%J5J12r6l88K38L40m52K73k3l0k4J13j31m21P4L83
$$ -315 -4 -85 -25 43 -148 61 63 63 78 190 94 -294 -56 284 -168 105 82 52 28 141 10 -411 -337 46
7759D6k82L45q6j33K8Q2nj8r9K92j47MJ7N2p2n6L2J58j60K24n09M63n25J09M8
$$ 46 -236 109 23 -110 -82 0 -5 -23 -122 170 23 27 44 96 24 -32 0 158 -2 222 -287 176 -349 -240 -192
7784a92J40J19j18OK04j14R4j57j31K83l14K40k99K29P6n7j02K31l28J53Q8m1
$$ -192 -52 67 -51 -45 159 45 139 -18 -149 134 -180 60 -239 -10 66 9 -93 138 -190 -37 51 10
7806A0j5k18M38l9k4l40J91J79o0j96K31k61K42l22K24kj76K00l68K98k23J32
$$ 10 -5 -223 215 176 152 -188 3 182 122 -74 157 -104 138 -184 40 38 -138 62 -306 -8 -231 -99
7828i9P6k75M28l29K19N0l22M44l24J86rK02k03q2k52J96K07k01m2k5J25K14J64
$$ -99 -23 -298 130 -199 20 70 -252 192 -132 54 45 247 44 -38 -290 -94 113 -88 -130 -155 -30 184 348
7851C48l47N2J57r7j12q6p3J30k36mM05k22J34q9j08L58l45L19n6j64J54j79K87
$$ 348 1 53 210 113 1 -85 -158 -28 -264 -268 137 -85 49 -40 -148 210 -135 184 128 -36 118 -61 226
7874B26l0j89j8RJ99l34J16J51q4J5j82RJ08j70L27j79J24K6l54K84p1j56K97
$$ 226 196 7 -11 -2 197 -137 -21 130 46 61 -121 -112 -4 -174 153 -26 98 124 -230 54 -17 -173 124
7897A24l63Q6K58J8O2l22J74k6R5Kj07p3l2R5J68k66K34j75o6J42k76Q6K3J26
$$ 124 -239 -153 105 123 185 -137 37 11 106 108 1 -72 -104 -9 159 -107 127 -48 -114 28 -248 -162 -139 -13
7921a3oN4p6J79k09P8l5R4P5k06K75k94j64J51Q6Q2k60K41p1J14Q7k41k4K52l46
$$ -13 -19 35 -41 138 -71 7 -28 66 141 -65 210 -84 -248 -97 -11 71 -189 52 -19 95 182 -59 -83 169 -177
7946a77L64n50M97L3n0p9k29J2J57J66p4o7K8L0Mj13pJ44M8j93J51K7k34K17k30
$$ -177 187 -363 134 167 117 38 -191 -179 -22 144 70 3 31 61 65 -48 -55 89 137 -56 95 122 -112 105 -125
7971a25J24J7N5j20r8L44r7nk33l0J51l9P8r4O7j40J47m5Q2j78K0j93L89k0k59
$$ -125 -1 16 71 -49 -147 197 100 95 -138 -168 -17 -56 22 -72 -5 -145 2 -43 39 -139 -119 -312 77 57 -202
7996b02J35L42j05k19k09K75K19l49R5k11J89K32j62K07k90J98n1j03K14l20L2
$$ -202 -67 275 170 -49 -258 17 236 -113 -18 -229 -40 192 30 237 -53 145 94 -9 205 -115 -83
8017h3P2J84L9m01J32j22J33J87m42L57j32r7L61j18j3q1l1J22j07nJ36N2M6j63
$$ -83 -11 173 212 -189 -57 -179 -46 141 -301 56 -76 -173 188 70 57 -24 -55 67 -40 -45 91 143 189 26
8041B6Lr6O3L27k10j3k78K93J33m24J63r5R1o0L3M8J69n7k46q4J65JJ16K01O2
$$ 26 29 -67 -4 323 113 100 -178 115 248 -176 -13 -108 -17 -77 -44 4 173 116 -130 -214 -49 -48 68 269 331
8066C31k01o4Q1J9k21J6J9o2l4M8J41j3J3l73L26K6M1k23J99p8K5j37J19j25J15
$$ 331 130 66 147 166 -55 -39 -20 -82 -116 -68 73 60 73 -300 26 52 93 -130 69 -9 16 -121 -2 -127 -12
8091a2j94K90J87l24J20MQ8l10M7K39j58p9L1J26R7K5m8o3L4J21k72PL25k73m6
$$ -12 -206 84 271 -53 67 71 159 -151 -104 135 -23 -102 -71 55 152 177 129 66 100 221 -51 -44 281 8 -38
8116c8pP6j59K37r0k11J84j16L92j57q6L6k49P5j63J57K1J05%r2j74M21k89K23
$$ -38 -45 31 -128 109 19 -192 -8 -124 268 111 25 61 -188 -113 -276 -119 -98 7 7 -85 -259 162 -127 96
8140I6n4p1J45N9K50n22L69o3k35J18k65R7J57j39m8Q9J43k44l3K7q0J67J12p5
$$ 96 42 -29 116 175 425 -97 272 209 -26 92 -173 -76 81 -58 -106 -17 126 -118 -151 -124 -204 -37 75 0
8164@J28j41K40l46j3M3j17K50k3L9k5j92K51N2O7m40L50p3j2j0K9o1K13l87L12
$$ 0 128 -13 227 -119 -132 -89 -206 44 21 60 35 -157 94 146 213 -227 123 50 38 28 57 -4 209 -178 134
8189A34J18k33
$$ 134 252 19
8191A9
$$ Imaginary data points
##PAGE= N=2
##DATA TABLE= (X++(I..I)), XYDATA
0@%%%%%%%%%qJ6j6J6j6K4l2L2m0N6o4P2q8J04j20J36j58J87k14K42k78L15l55
$$ 0 0 0 0 0 0 0 0 0 0 -8 8 -8 8 -8 16 -16 16 -24 32 -32 40 -48 56 -64 72 -86 101 -113 129 -149 166 -189
32a89M01m48N03n66O31p03P82q68R61j061J172j293J424j567J725j900K089k296
$$ -189 212 -236 267 -299 332 -371 411 -457 504 -557 615 -678 746 -821 904 -996 1093 -1203
50a203K526k780L064l385L748m162M642n199N858o652P623q841J0413j2513J5450
$$ -1203 1323 -1457 1607 -1778 1970 -2192 2450 -2749 3109 -3543 4080 -4761 5652 -6861 8589
65H589j9806K6822l9674O9618k36998j28697O05271m10389K55513l52913J58358
$$ 8589 -11217 15605 -24069 45549 -191449 -320146 285125 -125264 130249 -222664 -64306
76f4306M61988o79006L48606o8595N3343J44261o03206O17059j33465k43133K28812
$$ -64306 397682 -281324 67282 -1313 52030 196291 -406915 210144 76679 -166454 62358
87F2358k64241N05356l83472j38133M86350l60323K22022k75395P1604L85677
$$ 62358 -201883 303473 -79999 -218132 268218 -92105 129917 -145478 -73874 311803
97C11803n65040K59463q787K1382J35407m76213N02570p3468k42641K17351k41063
$$ 311803 -253237 6226 -2561 18821 154228 -321985 180585 107117 -135524 81827 -159236
108a59236L79831k61455j63858L99880k87698J89755j91750J4363L43244m58872
$$ -159236 220595 -40860 -204718 195162 -92536 97219 -94531 -80168 263076 -195796
118a95796K25958n088o0022J74669l74844L54121n1598j96746K35043k35952K77158
$$ -195796 30162 25074 -34948 139721 -235123 118998 67400 -129346 105697 -130255 146903
129A46903j47498j60780L33428k58932J41833r4573n1258K90250l46742J64988
$$ 146903 -595 -161375 172053 -86879 54954 -39619 -90877 199373 -147369 17619
139A7619K2516r3748J85205k96945K28876N277j78158J98347j95436J93146o3531
$$ 17619 40135 -53613 131592 -165353 63523 68800 -109358 88989 -106447 86699 23168
150B3168j53184K66978k07724J05534k8014r2477K27408k47821J13828K9913j02379
$$ 23168 -130016 136962 -70762 34772 6758 -85719 141689 -106132 7696 37609 -64770
161f4770J68424k20301J60168K3662j60592J73880j49848J21501k7139j31568
$$ -64770 103654 -116647 43521 67183 -93409 80471 -69377 52124 24985 -106583
171a06583K08290j60109P5922k960r2542J92120j83281O7859M4578r5062J29306
$$ -106583 101707 -58402 17520 14560 -77982 114138 -69143 -1284 43294 -51768 77538
182G7538j56839J05033K1524j27989J47163j18234P2754J0677j09420J50166j05664
$$ 77538 -79301 25732 47256 -80733 66430 -51804 20950 31627 -77793 72373 -33291
193c3291M0617R199p0052J34519j33162M6488M6447q7596R6329r4512N4328K4435
$$ -33291 7326 16525 -53527 80992 -52170 -5682 40765 -46831 49498 -45014 9314 33749
205C3749q6024R6955p8841M7747J2964q3886J08388o8651J3447K0787n0430Q0444
$$ 33749 -52275 44680 -34161 13586 26550 -57336 51052 -17599 -4152 16635 -33795 46649
217D6649q0365L1240L0035o4872P3373o0138K3142K8500n9716N8498m3938K2676
$$ 46649 -33716 -2476 27559 -37313 36060 -24078 -936 27564 -32152 26346 -17592 5084
229E084J0612n2305O9244m6390O201K5807m0855M8223l9127J2282J9385m1292
$$ 5084 15696 -36609 32635 -13755 -7554 18253 -22602 25621 -13506 -1224 18161 -23131
241b3131M5366l6241O780K5129m0527L4992j8484N682J3052k8772L5651k5871
$$ -23131 22235 -14006 -7226 17903 -22624 12368 -6116 -434 12618 -16154 19497 -6374
253f374K152J8742l1709K5676j2886j281J1844j7235K2681j7719O091J3668k6614
$$ -6374 -4222 14520 -17189 8487 -4399 -5680 6164 -11071 11610 -6109 -18 13650 -12964
266a2964K2617r071o888J2146j3512J1352q096L534P207j5345J6385n978n871
$$ -12964 9653 582 -6306 5840 -7672 3680 -4416 -882 6325 -9020 7365 1387 -4484
279d484R697q467N238l592J255K629p489J1172p044k184Q959q998K732R26l144
$$ -4484 5213 -3254 1984 -1608 -353 2276 -5213 5959 -1085 -3269 5690 -3308 -576 350 -2794
294b794M005k101K050j241J064L356o500K885M06l980L778k303j588K778J621
$$ -2794 1211 -890 1160 -81 983 4339 -2161 724 1130 -2850 928 -1375 -2963 -185 1436
309A436k67k018L523o47k289K238m454j36L578k703l62J301K579l46m26J562l559
$$ 1436 1169 -849 2674 2027 -262 1976 -2478 -2614 964 -1739 -2101 -800 1779 1433 1007 2569 -990
326i90K223L90n082P85J836P75j719J978J596k051N034k797m235M026j619j513
$$ -990 1233 1623 -3459 -2674 -838 -63 -1782 196 1792 -259 4775 1978 -2257 1769 150 -1363
342a363k345K142J098j719N408l793l13O139m534r96n66J785m38m437N869m539
$$ -1363 -3708 -1566 -468 -2187 3221 -572 -885 5254 720 -276 -842 943 505 -3932 1937 -2602
358b602K31P046p034J830J541K70o23l626N977m953J146O136j0614O384L371p180
$$ -2602 -2371 4675 -2359 -529 1012 1282 659 -2967 3010 -1943 -797 5339 -5275 1109 4480 -2700
374b700J409k82M418n703k33P184q561P850N03r398J1099m699k033P37j112M723
$$ -2700 -1291 -1573 2845 -2858 -3091 4093 -4468 3382 3885 -5513 5586 887 -1146 -409 -1521 3202
390C202j1553J1520J308j3673J5040n495P24J895q987J1852q074L878l639o259
$$ 3202 -8351 3169 4477 -9196 5844 349 1073 2968 -6019 5833 -2241 1637 -2002 -8261
404h261K3407k1835N94J5287j2111Q029j3678J1160M197j7648J7300j3775J2073
$$ -8261 15146 -6689 -6095 9192 -2919 5110 -8568 2592 6789 -10859 6441 -7334 4739
417D739J715k2475K9000j1757l746L621o986K2085k8973P548J6745j9428J5925
$$ 4739 6454 -16021 12979 1222 -2524 1097 -5889 16196 -12777 -5229 11516 -7912 8013
430H013k0676J4887J3745l1623J8629m319Q981m550k4036L9226j6232r664J0125
$$ 8013 -12663 2224 15969 -15654 2975 -1344 7637 3087 -20949 18277 2045 -7619 2506
443B506j0650K7118k9837j843K7273j9007R675k0657J9191J8925m3560K3647J638
$$ 2506 -8144 18974 -10863 -12706 14567 -4440 5235 -15422 3769 22694 -20866 2781 4419
456D419Q43k68l0398M2773j2101j8469J4003j0888L5529l5931q240M3153k8613
$$ 4419 5262 4994 -25404 17369 5268 -13201 802 -10086 25443 -10488 -18728 24425 -4188
469d188R513k1038J5670K7619n5229K8669J086K728P409m7399N8442r545l0456
$$ -4188 5325 -15713 -43 27576 -27653 1016 2102 4830 12239 -35160 23282 13737 -16719
482a6719J9419j8027M8216m5522j7338N8765l5621J6951k9305J3800M7938p1270
$$ -16719 2700 -15327 32889 -12633 -29971 28794 -6827 10124 -19181 -5381 42557 -28713
494b8713K6650M697M327J0304o6142P1792l940m2055K7445k2457N6668m5807k8143
$$ -28713 -2063 2634 6961 17265 -48877 22915 18975 -23080 4365 -18092 38576 -7231 -35374
507c5374O8989l7733J5494l6482J4210O3645q7845K3877J7340N087Q881p6081
$$ -35374 33615 -4118 11376 -25106 -10896 52749 -35096 -11219 6121 11208 20089 -55992
519e5992Q1940J144n0224K4982k6286P1547n1136m3895Q1572l2492J2575m5837
$$ -55992 25948 27092 -23132 1850 -24436 47111 -4025 -47920 33652 1160 13735 -32102
531c2102J9257P3883r9420K7774J7531K639J5340q4449Q5000M182n4938K6611
$$ -32102 -12845 61038 -38382 -10608 6923 9562 24902 -59547 25453 29635 -25303 1308
543A308k6343P5949n7682m5795R2375m0105J1448m1763J6176P8751j01026K3070
$$ 1308 -25035 50914 -6768 -52563 39812 -293 11155 -30608 -14432 64319 -36707 -13637
555a3637J9801N475J7081r3508Q7306J2474o1172K7473k6870P4631n1633m8937
$$ -13637 6164 11639 28720 -64788 22518 34992 -26180 1293 -25577 49054 -2579 -51516
567e1516Q9408m0708J5060l7949P103Q0157r7089K3109K1546l339K2918q6004
$$ -51516 37892 -2816 12244 -25705 -18602 61555 -35534 -12425 9121 5782 28700 -57304
579e7304P8808J1252o0817L4629l3343O7358l8173n4729Q7962l8865J4924k8514
$$ -57304 21504 32756 -28061 6568 -26775 40583 2410 -52319 35643 -3222 11702 -16812
591a6812o638Q3283q9310J7284K2421j4303L7824q5081O1996K2772o2103M1439
$$ -16812 -23450 59833 -29477 -12193 10228 -4075 33749 -51332 10664 33436 -28667 12772
603A2772l9546N7846j9112o2518Q5630m0684J2576j5751j9055Q2868q3417J7609
$$ 12772 -26774 31072 11960 -50558 35072 -5612 6964 -8787 -27842 55026 -28391 -10782
615a0782K6907k6071M4279p9310N3184K2422o1960M7232m4246N3597j0682o1333
$$ -10782 16125 -9946 34333 -44977 8207 30629 -31331 15901 -28345 25252 14570 -46763
627d6763Q3005m4749J7024r733k8118P8247p6386K0135J9848k9087N0602p4116
$$ -46763 36242 -8507 8517 -1216 -29334 48913 -27473 -7338 12510 -16577 34025 -40091
639d0091M8708K0538n9437N1273m2918M1785r216n3453P7794m8243J5829J399
$$ -40091 8617 29155 -30282 20991 -21927 19858 10642 -42811 34983 -13260 2569 3968
651C968l0058P0555o7259J7124K3700l4900M3474n9709L8942J7140n5303N3069
$$ 3968 -26090 44465 -22794 -5670 18030 -16870 26604 -33105 5837 22977 -32326 20743
663B0743l6825K7578K591m7161O4909m2345J0494P044l2135N8298n5469J6018
$$ 20743 -16082 11496 14087 -33074 31835 -10510 -16 7028 -25107 33191 -22278 -6260
675f260K4752l9178M4354m3341K5022J5043m7551M8348l4515J7222O915m0059
$$ -6260 18492 -20686 23668 -19673 5349 20392 -27159 21189 -13326 3896 10811 -29248
687b9248N6196l8315Q364J5171l1526M5455m2585J4245J8272l7683M1427l4495
$$ -29248 26948 -11367 -3003 12168 -19358 26097 -16488 -2243 16029 -21654 19773 -14722
699a4722J4687J5302l7490M1822k9126R501J2454l2670M0282l0919P189J6131
$$ -14722 -35 15267 -22223 19599 -9527 -26 12428 -20242 20040 -10879 -3690 12441
711A2441l1015L4945k6389R121J3933l0627L4388k4649O138J3176k8561L1595
$$ 12441 -18574 16371 -10018 -897 13036 -17591 16797 -7852 -1714 11462 -17099 14496
723A4496k1143L327J3268k4171K8187k1828N305J5073k7290K4987j4318J802J0523
$$ 14496 -6647 -3320 9948 -14223 13964 -7864 -2559 12514 -14776 10211 -4107 -2305 8218
736H218k1126K4940j6284J519J1771k0578K2893j5030j825J4107j8052J5918j1723
$$ 8218 -12908 12032 -4252 -2733 9038 -11540 11353 -3677 -5502 8605 -9447 6471 -5252
749e252L051J0944j9599J9162r678j659J2049j7429J4509o827k778P908j2333
$$ -5252 -2201 8743 -10856 8306 -1372 -3031 9018 -8411 6098 -729 -3507 4401 -7932
762g932J5064j1273q72J3713j5398J0423l050k694P681j0377Q671o061L25P359
$$ -7932 7132 -4141 -5013 8700 -6698 3725 675 -2019 5662 -4715 3956 -2105 -1780 5579
776E579j3190J0815k567m258P526p218O376m135l36N034q458P443l079k310O699
$$ 5579 -7611 3204 637 -3621 3905 -3313 3063 -1072 -1408 3626 -4832 2611 -468 -2778 3921
791C921p079M701j55j612K295m947N585l873j231M196n103M107j21k140K431p96
$$ 3921 -3158 1543 1388 -224 2071 -2876 2709 -1164 -2395 1801 -3302 805 684 -1456 975 179
807A79K496l225P31K180m091K670j338j690K459r61N08r43J232J072j832J694
$$ 179 2675 -550 181 2361 -1730 940 -398 -2088 371 -590 -82 -1025 207 1279 -553 1141
823A141q76k59Q85o53j012N07J218j426m40J231j350J305K60k072J038J774q68
$$ 1141 265 6 891 238 -774 -267 951 -475 -915 316 -1034 271 531 -1541 -503 1271 403
840D03j068J237L31j043J153n73k043K006Q88l045N21K169j037j171J875m74j401
$$ 403 -665 572 903 -140 1013 440 -1603 403 1291 -1754 -1233 936 -101 -1272 603 129 -1272
857a272L120j018k918L172o2j640L77R46k41k059L128k156j877N117l521o10K515
$$ -1272 1848 830 -2088 1084 1022 -618 -241 705 464 -1595 1533 -623 -2500 2617 -904 -1514 1001
874A001k017J817j029J474k273K32N705q076K618L338m969L327l175K240K12j813
$$ 1001 -1016 801 -228 1246 -1027 -795 4910 -3166 -548 2790 -2179 1148 -2027 213 425 -1388
890a388M053p650P520O61q913J0263n211P97R26l133P166j0441O122J499p919
$$ -1388 2665 -4985 2535 3196 -5717 4546 -665 132 1058 -2075 5091 -5350 772 2271 -5648
905e648J0350j0252N878M663j0021Q705o570P878k699j0988J7327j0895J339K173
$$ -5648 4702 -5550 328 4991 -5030 3675 -2895 4983 2284 -8704 8623 -2272 -933 1240
919A240p981J5353j3743K669O310q127J1917j5572Q807P814j7414J3522q366O567
$$ 1240 -6741 8612 -5131 -2462 3848 -4279 7638 -7934 873 8687 -8727 4795 -3571 2996
933B996R08j6115K1929j0802j126M410j0609K1516j9189l75J4630j3354J2682
$$ 2996 3904 -12211 9718 -1084 -2210 2200 -8409 13107 -6082 -6457 8173 -5181 7501
946G501j7454R891J4107k6665J7168o574N091M199k5351K9915j0774o483Q567
$$ 7501 -9953 -62 14045 -12620 4548 -2026 3065 7264 -18087 11828 1054 -5429 3138
959C138j4760K9251k4556l867K5032k0562J5757k0473R728K0983l6461K1205o585
$$ 3138 -11622 17629 -6927 -10794 14238 -6324 9433 -11040 -1312 19671 -16790 4415 -2170
972b170N301O017l3941L9218j0506j2532J2500j6090L3869k8867o353L0778k3660
$$ -2170 3131 9148 -24793 14425 3919 -8613 3887 -12203 21666 -7201 -13554 17224 -6436
985f436J5917k2757R950K6530m3325K1194n71K902N534l4819M3380j0354j9499
$$ -6436 9481 -13276 -3326 23204 -20121 1073 502 3404 8938 -25881 17499 7145 -12354
998a2354J7979j7305L2841k6941j2997L8490k4963J1516j9296R256L1061n0739
$$ -12354 5625 -11680 21161 -5780 -18777 19713 -5250 6266 -13030 -3774 27287 -23452
1010b3452K2955O239o754J2260l7336M1541m450k6861K4081j9789L2100k4325
$$ -23452 -497 5742 -1012 11248 -26088 15453 11003 -15858 8223 -11566 20534 -3791
1022c791k0103M8364l1557Q467q885R66L4408n2144K4127R780j4938J9136l9966
$$ -3791 -23894 24470 -7087 1380 -7505 -6539 27869 -24275 -148 9632 -5306 13830 -26136
1035b6136L9832K57l3971K9668k0580K8553j9252k2709N0445l4780R040l474p343
$$ -26136 13696 13953 -20018 9650 -10930 17623 -1629 -24338 26107 -8673 367 -3107 -10450
1048a0450L7324m8571K1256J0895j8074K4534m0580L4975L562l5544L2629k3489
$$ -10450 26874 -21697 -441 10454 -7620 16914 -23666 11309 14871 -20673 11956 -11533
1060a1533K3979j1890k4611M7930l3687J1488l7j4882M0271m3917J5439J1757
$$ -11533 12446 556 -24055 23875 -9812 1676 1639 -13243 27028 -16889 -1450 10307
1072A0307j9787K6730l9553K9293P756l5638L4494k5316J9889q68k9411M2323
$$ 10307 -9480 17250 -22303 6990 14746 -20892 13602 -11714 8175 7307 -22104 20219
1084B0219k8646J0849J613k1572M2704l8115Q602J5513k3295K9415l4347J9007
$$ 20219 -8427 2422 4035 -17537 25167 -12948 -4346 11167 -12128 17287 -17060 1947
1096A947J2744l3421L2526k5629J6203O797l3831M0341k2740M821O934k3508L8397
$$ 1947 14691 -18730 13796 -11833 4370 11167 -22664 17677 -5063 -242 6692 -16816 21581
1109B1581l2040M912J7004k5681L0389k9076J0373J7775l1824K8395k0471J0439
$$ 21581 -10459 -5547 11457 -14224 16165 -12911 -2538 15237 -16587 11808 -8663 1776
1121A776J0607l2238L5382k0060K033J2327k6808L3431k3511J573J6774k5799
$$ 1776 12383 -19855 15527 -4533 -2500 9827 -16981 16450 -7061 -5488 11286 -14513
1133a4513K8373k2566N328J7073l0059K8798j7108K090J5077k8801K9727j7856
$$ -14513 13860 -8706 -3378 13695 -16364 12434 -4674 -2584 12493 -16308 13419 -4437
1145d437l19J5880k6702K8742j8640o66J8890k7445K5704j4741k41J5622k5915
$$ -4437 -4756 11124 -15578 13164 -5476 -6142 12748 -14697 11007 -3734 -3975 11647 -14268
1158a4268K7231j6458l026J8813k5176K2459j4379r41J8009k5339K1557j2071
$$ -14268 12963 -3495 -6521 12292 -12884 9575 -4804 -5745 12264 -13075 8482 -3589
1170c589J58J6025k7615K3593q026n837J3358j9742K2557j3524m580J8529k1437
$$ -3589 -3431 12594 -15021 8572 546 -5291 8067 -11675 10882 -2642 -7222 11307 -10130
1183a0130J7702j0571k713J7409k2073J4700n563o26J0714k2200K2047n626j0178
$$ -10130 7572 -2999 -5712 11697 -10376 4324 -1239 -1865 8849 -13351 8696 3070 -7108
1196g108J3814j3853J5223j0375n621J6972j5729J1595q353j534J7114k1100J0362
$$ -7108 6706 -7147 8076 -2299 -7920 9052 -6677 4918 -3435 -4969 12145 -8955 1407
1209A407J037l909P354j5256J5985m858q231J2112j2151J2024n793p262J5352
$$ 1407 2444 -1465 5889 -9367 6618 1760 -6471 5641 -6510 5514 -279 -7541 7811
1222G811j1349N454l926m2J1492j7795R280K682o124O769j1136J0490j072q052
$$ 7811 -3538 1916 -2010 -2052 9440 -8355 925 3607 -2517 4252 -6884 3606 2534 -5518
1236e518Q367o659Q687m948o059J2918r421L616j405j948Q672j1818O071J783
$$ -5518 2849 -3810 4877 -71 -6130 6788 -2633 983 -422 -2370 6302 -5516 555 2338
1250B338m408N100q265P814k36o690P106m896M710k582l871Q397o159K237q93
$$ 2338 -2070 3030 -5235 2579 2343 -4347 2759 -2137 2573 -9 -3880 4517 -1642 595 -298
1265b98j340O020p908L298J638k606K850m634M264L3l810M026k893L027j134k712
$$ -298 -1638 4382 -3526 -228 1410 -1196 1654 -2980 1284 1317 -2493 1533 -1360 1667 533 -2179
1281b179M939l439M93L92j123K553l510J741P48j655K159k409J068J245j790J467
$$ -2179 2760 -679 -186 206 -917 1636 -1874 -133 615 -1040 1119 -1290 -222 1023 -767 700
1297G00j118J319m15j605K479j817n09J276o00N85r99R08M95j451J732j170J92
$$ 700 -418 901 486 -1119 1360 -457 -966 310 -290 295 -704 204 699 -752 980 -190 2
1314BR51j349L20r9O26n46r04J595p96k76R25q25M96J32K20n90j01P80o08K03
$$ 2 953 -396 -76 -175 451 -95 -999 596 -200 -476 449 -376 120 252 472 -118 -219 561 -47 156
1334A56K90o69M77J47p76j07Q65j75p52P29q5l10O07j46q84O02O12q95PQ35m18
$$ 156 446 -223 254 401 -375 -482 383 208 -544 185 100 -210 397 251 -633 -31 581 -314 -307 528 110
1355A10m01M16O9p53P18J69q66K71P25m90n39P46J54j28K91l35J9k14M2R2j151
$$ 110 -291 125 194 -559 159 328 -538 -267 458 -32 -571 175 329 201 492 157 176 -38 4 96 -1055
1376a055J271n68j65O16l57R11n83L58M23j754K210j872N2R52j953K028q84Q8
$$ -1055 216 -352 -517 99 -258 653 70 428 851 -903 1307 -565 -513 439 -1514 514 -370 -282
1394b82N63r12K468k574K11K140k363J473j713P89J047j921K021j980J764L28
$$ -282 281 -631 1837 -737 -526 1614 -749 724 -989 -200 847 -1074 947 -1033 731 1059
1410A059l260L638j934L30M36j505L526l906J346J796k909L169l509K172J808
$$ 1059 -2201 1437 -497 -167 269 -1236 2290 -1616 -270 1526 -1383 1786 -1723 449 2257
1425B257m838L656k305K723n32m577O589k959l34O96k609O165n892N04L843l774
$$ 2257 -2581 1075 -1230 1493 961 -3616 2973 14 -320 376 -2233 3932 -1960 -1456 2387 -1387
1441a387L530n058L286L178p282M797j985K085O31p161Q828k971j845J514k303
$$ -1387 2143 -2915 371 3549 -3733 1064 -921 1164 1795 -5366 3462 491 -1354 160 -2143
1456b143P430p504o41O066m834M184o598L791N503r559N042j575L403n78q425
$$ -2143 5287 -2217 -2858 3208 -1626 2558 -4040 -249 5254 -4305 737 -838 2565 1987 -6438
1471f438J1394m070k911K251l237R034q864j079Q119n542L964p690N655O590j3119
$$ -6438 4956 886 -2025 226 -3011 6023 -2841 -3920 4199 -1343 2621 -5069 586 7176 -5943
1486e943O793q90J909k3j0221J3654m285m095M178m810J1239j0338j895J0852
$$ -5943 850 -40 1869 1846 -8375 5279 994 -3101 1077 -3733 7506 -2832 -4727 6125
1500F125q294M805o988L749Q137j4939Q806j122N29K504j1939J4812m923m835
$$ 6125 -2169 2636 -4352 -603 7534 -7405 1401 279 808 3312 -8627 6185 1262 -3573
1514c573O223p368J1804j0010j974J1824j0343O666p300L587Q265j6407J1407
$$ -3573 2650 -4718 7086 -2924 -4898 6926 -3417 3249 -4051 -464 7801 -8606 2801
1527B801k689m70M381j2244J4728o338l604P107r021J2688j0632p11J1297j2440
$$ 2801 112 -358 4023 -8221 6507 169 -3435 3672 -5349 7339 -3293 -4004 7293 -5147
1541e147R037o904J568Q155j4267J1191m221n70N727j2436J3860o002l754Q233
$$ -5147 3890 -3014 -1446 6709 -7558 3633 -588 -1158 4569 -7867 5993 -9 -3763 4470
1555D470r056J0073p893r89R642j1480Q336n353L97Q054j3112R921k565k459O416
$$ 4470 -4586 5487 -2406 -3395 6247 -5233 3103 -2250 -1853 6201 -6911 3010 445 -2014 4402
1570D402j0103R891m163l392Q354r914Q717m406l448R738j0400O971k259k797
$$ 4402 -5701 4190 27 -3365 4989 -4925 3792 -614 -4062 5676 -4724 2247 -12 -2809
1584b809Q157j0804Q370k172m545R280j0543P646j284n371Q991r344O850j880
$$ -2809 5348 -5456 2914 742 -3803 5477 -5066 2580 1296 -4075 4916 -4428 2422 542
1598E42m537R747j0950P316k62o510R641r032O463j531n389J0321r775N403p46
$$ 542 -3995 5752 -5198 2118 1856 -4654 4987 -4045 2418 887 -4502 5819 -3956 1447 701
1613G01m985J1039j1255M430K556n277P365j0190P680J115q409R133p096N713
$$ 701 -4284 6755 -4500 -70 2486 -2791 4574 -5616 2064 3179 -5230 3903 -3193 2520
1627B520p74p452J1644p740J536K82l412J0027j1855L582N628o238M921p551P561
$$ 2520 1746 -5706 5938 -1802 -266 16 -3396 6631 -5224 -1642 3986 -2252 2669 -4882 2679
1642B679J924j0098P444k899L794k687p697J3474n816k474J422q27R144j1493
$$ 2679 4603 -5495 1949 -950 2844 157 -7540 5934 118 -2356 -934 -1761 7383 -4110
1656d110J479P005m940K607p340O702M022j1397O213j13K916l277o510J3107n091
$$ -4110 -2631 4374 -566 2041 -5299 1403 5425 -5972 241 128 3044 -233 -6743 6364 1273
1671A273m370K631lO532j0263K58Q665m262j73m754O734L621j1713M847K650O89
$$ 1273 -3097 -466 -469 6063 -4200 -3942 4723 461 288 -4466 2268 5889 -5824 -977 1673 2362
1687B362l198m970R945j891n141K035M32N458p304j932Q363l268j852j987M218
$$ 2362 -836 -5806 4139 2248 -2893 -858 -426 5032 -2272 -4204 4159 891 -961 -2948 1270
1702A270K967q679L157L038k04j384m830P646K98o557J961J658L440n596k072
$$ 1270 4237 -4442 -1285 1753 1549 165 -4665 2981 3279 -3278 -1317 341 3781 -1815 -3887
1717c887P420k560k105j162K217M199o848O10L973o85p18m176N729R27n556K427
$$ -3887 3533 973 -1132 -2294 -77 4122 -2726 -2116 1857 1172 454 -3722 2007 2934 -2622 -195
1733a95K89J947k567k821N605j642j471m66Q84L746n218J06L876j314n41k726
$$ -195 94 2041 -526 -3347 2258 616 -855 -1321 -437 3309 -1909 -1803 2073 759 218 -2508
1749b508L096J941m544J490N53J662j335l215M714j111j271o6P9K955l487J9K496
$$ -2508 588 2529 -2015 -525 28 1690 355 -2860 1854 743 -528 -594 -515 2440 -1047 -1028 1468
1766A468j344K94k056J857J409k984J307J11L17j46k623L078n5j397N81R4J659
$$ 1468 124 418 -1638 219 1628 -1356 -49 62 379 233 -2390 688 633 -764 -183 -89 1570
1783A570k122k73J843j177K60r31P55Q89j709P33O3M07q4j041J838n20r36Q02
$$ 1570 -552 -825 1018 -159 101 -830 -75 814 -895 -162 -99 308 224 -817 1021 501 -435 367
1801C67n79N23m86j07M17l53M55p64J72J051j317N44M84m84J29O5J93J17n90O80
$$ 367 -212 311 -175 -282 135 -218 237 -527 -355 696 -621 -77 407 -77 52 117 310 427 -163 517
1821E17m18L23k18o48O31j15m63K02J9J6K37m0K86m97M16j50n40P65m87l5K77
$$ 517 99 422 204 -444 187 72 -391 -189 -170 -154 83 43 329 -168 248 98 -442 323 -164 -199 78
1842G8m17O4J8N88n06o7O97m59r0j67K77O8k20L95n27J57O75j067L32P6Q1j45
$$ 78 -339 -275 -257 331 -175 -242 455 -4 -94 -261 16 84 -136 259 -268 -111 564 -503 -171 -95 -14 -159
1864a59q0N54n45K12J61k99L35k28L98l24m9L51q54O42k19k76O35o78M33M4J89
$$ -159 -239 315 -230 -18 143 -156 179 -49 349 25 -24 327 -527 115 -104 -380 255 -423 10 54 243
1885B43J85o91O35l57l76P91o12J12J78l18K46j10K24l92K95O37j387N84L23j61
$$ 243 428 -263 372 15 -361 430 -182 -70 108 -210 36 -74 150 -242 53 690 -697 -113 210 49
1905D9j84n4N09n6l21M61n70L71O5r94Q69k45j49K33l09J048j013L17Q50j395
$$ 49 -135 -189 320 264 -57 404 -166 205 270 -724 145 -100 -249 -16 -325 723 -290 27 877 -518
1925e18Q31r19M75P99j641J251j60J35k40j186K216j502Q8P27j277K024j378k23
$$ -518 313 -606 -131 668 -973 278 118 253 13 -1173 1043 -459 -371 356 -921 1103 -275 -498
1943d98J540j392J099j615J219M56k433K232r40K67L27j745K795j580L38M77j019
$$ -498 1042 -350 749 -866 353 809 -1624 608 -332 -65 262 -1483 1312 -268 70 547 -472
1960d72K490l220P12J450k100K088k249J474O39k277K606k043J447N33k816L418
$$ -472 2018 -1202 -490 960 -1140 948 -1301 173 812 -1465 1141 -902 545 1078 -1738 1680
1976A680j926J4R95k075K615k572Q80J596k944K908k023Q32J093k766L029k228
$$ 1680 -246 -232 763 -1312 1303 -1269 -389 1207 -1737 1171 -852 -20 1073 -1693 1336 -892
1992h92J141N93k446L391k431J81J835k704K603k110Q62P19k496L695k846M45
$$ -892 249 842 -1604 1787 -644 -463 1372 -1332 1271 -839 23 742 -1754 1941 -905 -460
2008d60J566k452K972k323R68M87j999K959l157J461J505l526L109j506N97M96
$$ -460 1106 -1346 1626 -697 271 758 -1241 1718 -1439 22 1527 -1999 1110 -396 201 697
2024F97k708L861k424P52P03k473L838l041J80J958k034J610k569J779J357l905
$$ 697 -2011 1850 -574 178 881 -1592 2246 -795 -615 1343 -691 919 -1650 129 1486 -2419
2040b419L293j276Q18N48l289M443j811q68Q60j340L482l915J27L218k757J691
$$ -2419 874 -402 416 964 -2325 2118 307 -561 299 -1041 2441 -1474 -1347 1871 -886 805
2056H05k530K099J734m497K939q30J075l32l278N350k157j096N10o41L936m693
$$ 805 -1725 374 2108 -2389 550 -280 795 463 -2815 2535 378 -718 -208 -849 3087 -1606
2072a606j05L665k102N92l345M227J464n773L409m8J187j781k819O312k617j816
$$ -1606 -1711 1954 -148 444 -2901 1326 2790 -2983 426 378 1565 -216 -3035 3277 660 -1156
2088a156J92L72M342p014R41M894k173m01l372N463J149o653K872J209K453m111
$$ -1156 -964 -592 3750 -3264 -2323 2571 398 -3 -3375 2088 3237 -3416 -544 665 3118 -993
2104i93l476Q151k471l013o71L398L710q624J530N361j293k211l763P742kp582
$$ -993 -4469 3682 1211 -1802 -2473 925 4635 -3989 -2459 2902 1609 -602 -4365 3377 3375 -4207
2120d207K869K689K669o766j791R182l032m109j018N464L439j0122K171N843q26
$$ -4207 -1338 1351 4020 -2746 -4537 4645 1613 -2496 -3514 1950 5389 -4733 -2562 3281 2455
2135B455m104l419R373q49p597K203L376L084q125j108R624k444m988j365O510
$$ 2455 -1649 -5068 4305 3456 -4141 -1938 1438 4522 -3603 -4711 4913 2469 -2519 -3884 2626
2150B626K459j0047K562N862n15m790l256R459j146p148J616L940L091q366m47
$$ 2626 5085 -4962 -2400 3462 2947 -1843 -5099 4360 3214 -3934 -2318 1622 4713 -3653 -4100
2165d100Q730k734l736j834O530J840r022K462M317J30m105l077Q569j456n826
$$ -4100 4630 1896 -1840 -3674 2856 4696 -4326 -1864 2453 2583 -1522 -4599 3970 2514 -3312
2180c312J375L261K877p401j55P089k049l039j769N413J443p266J835L418M15
$$ -3312 -1937 1324 4201 -3200 -3355 3734 1685 -1354 -3123 2290 3733 -3533 -1698 1720 2135
2195B135l267k931P163o15m974J120K359K261n117q91N762j851j889j497L332
$$ 2135 -1132 -4063 3100 2485 -2489 -1369 990 3251 -1866 -2757 3005 1154 -735 -2232 1100
2210A100J763n576J147K414R19k503k303N472p72l428J420J004J756l662o50L885
$$ 1100 2863 -2713 -1566 848 1767 -736 -3039 2433 1661 -1767 -347 657 2413 -1249 -1899 1986
2226A986j718q51j421K274K229m836J465J794p1j005k075L727m58k379J049J03
$$ 1986 268 -583 -2004 270 2499 -2337 -872 922 851 -154 -2229 1498 1040 -1339 -290 -187
2242a87K350l018q73L262j372l49j278J647J859l920J879M39J45l30k153L354
$$ -187 2163 -855 -1728 1534 162 -187 -1465 182 2041 -1879 0 439 584 254 -1899 1455
2258A455q57j408J037m37J594k233j48K106j645N96j078J413Q15k542J572L36
$$ 1455 598 -810 227 -210 1384 -849 -997 1109 -536 60 -1018 395 1210 -1332 240 576
2274E76p6j45j411K240j173o90O21m82J658k019K81J342o85L27p07Q04K78j806
$$ 576 500 355 -1056 1184 11 -679 -58 -540 1118 -901 -620 722 37 364 -343 461 739 -1067
2292a067J430j61q2Lq64J204l96l41J90j00Q33j237L72Q71o84K15m05K86M6l96
$$ -1067 363 202 120 123 -741 463 67 -274 -84 -184 649 -588 -216 655 -29 186 -219 67 113 -283
2312b83O07n17J72K53p52R55o75P1J82j96M84m83K6N55n89K33K8M1k15j12L14
$$ -283 324 -193 -21 232 -520 435 -240 -169 13 -183 301 -182 -156 399 -190 43 71 112 -103 -215 99
2333I9k88J44n3m3j38L76k72L68k71K37k18o1M15n07M22k22p7J59l50K13l0j1
$$ 99 -189 -45 -98 -141 -279 97 -175 193 -78 159 -59 -120 295 -212 210 -12 -89 70 -280 -67 -97 -108
2355a08L16l58J30O5j5L48j95j4k16K69j18n52N06j51q9L34m47L23k02N9M24l99
$$ -108 208 -150 -20 45 30 378 183 169 -47 222 104 -448 58 -93 -182 152 -295 28 -174 -115 309 -90
2377i0J72m9l02M23l32L23k53N8J31o04L99J41k08J71k65K95j91L50P1m50O09
$$ -90 82 33 -269 154 -178 145 -108 -50 81 -523 -124 17 -191 -20 -285 10 -181 169 240 -210 399
2398C99m92Q9L9j73K12j67k4j25n0O50q90M63J75L2r8m6J83Lj41M38p02N82j14
$$ 399 -93 -4 35 -138 74 -93 -117 -242 -292 358 -532 -69 106 138 40 -6 177 180 39 477 -225 357 243
2421B43p72N63J23l32J61l42N58n57N75Q3q27Q96n13Q2J59m00M88m49K09J82l17
$$ 243 -529 34 157 -175 -14 -356 202 -355 220 303 -524 372 -141 -59 100 -300 188 -261 -52 130 -187
2442a87N48p28L36M20n80N38l80M3K25n42M53m80K12N79j212J464q91R9K49j004
$$ -187 361 -367 -31 389 -191 347 -33 10 235 -307 146 -334 -122 457 -755 709 -182 -83 166 -838
2462h38J689j289K09Q23j186J189j210N39P64j540J525j090O00Q8j345J887j161
$$ -838 851 -438 -229 594 -592 597 -613 -74 690 -850 675 -415 185 273 -1072 815 -346
2479c46K11N02j087J815j807P23P58j241J107j375J021O58k281J836q61O30k69
$$ -346 -135 367 -720 1095 -712 11 769 -472 635 -740 281 939 -1342 494 -367 263 -6
2496fj420K822j550k89P29p53J872k240L74J628j586Q54j467J447O75k535J729
$$ -6 -1426 1396 -154 -443 286 -467 1405 -835 -461 1167 -419 435 -1032 415 1090 -1445 284
2513B84l23K41l72j530L432j763q96J142m09J947k947J02K524k085O08j075J455
$$ 284 -39 202 -170 -1700 1732 -31 -927 215 -194 1753 -1194 -1092 1432 -653 -45 -1120 335
2530C35J334l617K140n3N67m93k630M315j382j902J247j98K589l607L51K753k187
$$ 335 1669 -1948 192 139 706 213 -2417 1898 516 -1386 -139 -337 2252 -1355 -1004 1749 -438
2547d38R10k189K527J304m663K538O11M73j374k289N462k132k435J512k5K599
$$ -438 472 -1717 810 2114 -2549 -11 600 1073 -301 -2590 2872 740 -1695 -183 -208 2391
2563B391m337J61M170k263l28j926K995J896n719K818J246K20j909k707O102j542
$$ 2391 -1946 -1785 2385 122 -206 -2132 863 2759 -2960 -142 1104 1324 -585 -3292 2810 1268
2579A268l313J309P50K784n088j03N517k650j467j352L611J867o628K437K620
$$ 1268 -2045 -736 14 2798 -2290 -2393 3124 474 -993 -2345 1266 3133 -3495 -1058 1562
2594A562j85k127k926O796j408m601K132J231K608n088j032O513k659j992j474
$$ 1562 1377 -750 -3676 3120 1712 -2889 -757 474 3082 -2006 -3038 3475 816 -1176 -2650
2609b650M214K067p104K376L090m40k392k932O658n99n458K265J572K687n869
$$ -2650 1564 3631 -3473 -1097 1993 1553 -839 -3771 2887 2288 -3170 -905 667 3354 -2515
2624b515n63P012l254k212o97L436K723p862K408M300j446k399k880P501j223
$$ -2515 -3078 3934 680 -1532 -2229 1207 3930 -3932 -1524 2776 1330 -1069 -3949 3552 2329
2639B329n896K683J898K112n150r49O817k966k470o44L541K681p879K071M538
$$ 2329 -3567 -884 1014 3126 -2024 -2973 3844 878 -1592 -2236 1305 3986 -3893 -1822 2716
2654B716j247k465k361O321k96n840K294K130J528m716j265O662k475k793K24
$$ 2716 1469 -996 -3357 2964 2668 -3172 -878 1252 2780 -1936 -3201 3461 986 -1807 -1583
2669a583K821K083o422J641M020j326j787k491N390r3n392K530J583J190l685
$$ -1583 1238 3321 -3101 -1460 2560 1234 -553 -3044 2346 2253 -3139 -609 974 2164 -1521
2684a521j567O245k260k746N63J915K432n392O81M040j795q87k004M020M93m947
$$ -1521 -3088 3157 897 -1849 -1286 629 3061 -2331 -1650 2390 595 -292 -2296 1724 2217 -2730
2700b730K391J349N33k305j534M878j898k416J179Q58J754l770L60L361j752p50
$$ -2730 -339 1010 1543 -762 -2296 2582 684 -1732 -553 305 2059 -1711 -1351 2010 258 -492
2716d92r74K515Q00m027K361O50k97p47j858M270j694j731J127R4J820l214J33
$$ -492 -1466 1049 1849 -2178 183 833 536 -211 -2069 2201 507 -1224 -97 -3 1817 -1397 -1264
2733a264L381k359r4p20J670Q00l199K105J48n18o2j555L259j183j557J447m46
$$ -1264 2117 -242 -336 -1056 614 1414 -1785 320 468 -50 -112 -1667 1592 409 -1148 299 -147
2750a47J228j952K2K099j825N95o41O81J062k482J730J64n74Jj045K258j430n54
$$ -147 1081 -871 -849 1250 -575 20 -621 60 1122 -1360 370 534 -40 -39 -1084 1174 -256 -810
2768h10J315p74Q36r94k26J590j401P28l54O3O10j482J220K9n89N11j018J397
$$ -810 505 -269 567 -427 -653 937 -464 264 -90 -27 583 -899 321 350 -239 272 -746 651
2786F51o23o14R42p76R26o56l59J062o93L97l0m95O27q35O01N6k59L96o25N52
$$ 651 28 -586 356 -420 506 -150 -509 553 -140 257 227 -268 359 -476 125 181 -78 318 -307 245
2806B45j9p75Q53l13J52k19j36Q63r89M29L7n06P59n81J09K72j28L06n84J34M52
$$ 245 226 -549 304 -9 143 -76 -212 651 -338 91 128 -378 381 -200 -91 181 53 359 -225 -91 361
2827C61p48K23j12L54m3l03O00m16K1J00k35L37n08J05L23k17L20k72K54M6m30
$$ 361 -387 -164 -276 78 35 -268 332 -84 -63 37 -198 139 -369 -264 59 -158 162 -110 144 190 -240
2848b40N11m27K58j55j4J16j69k1k5Q0K93k89j27M41j02j35j96J05J52j33j06
$$ -240 271 -156 102 -53 -67 49 -120 -141 -166 -86 207 -82 -209 232 130 -5 -201 -96 56 -77 -183
2869a83J00n1K62l51J75L2m8J76l75L6J72j91J12n6M86l25O3M2j34R9M6l51L28
$$ -183 -83 -134 128 -223 -48 -16 -64 112 -263 -227 -55 -246 -134 -190 296 -29 34 76 -58 41 87 -264 64
2892F4k68J10J76l34L57l27M32k66J10L6j79J78o7j70K02j16J74k29J26K99n70
$$ 64 -204 -94 82 -252 105 -222 210 -56 54 90 -89 89 22 -148 54 -62 112 -117 9 308 -262
2913b62N61m45J43J18m07N25l04P0O3l07L00r8r7J44o53Q81j71L3J87m24M53l33
$$ -262 299 -146 -3 115 -292 233 -71 -1 62 -245 55 -43 -140 4 -649 232 61 94 281 -143 310 -23
2935b3r5N64p20N34n67m0P20p81Q30q07M44L02p95Q32m30k1M45j282J422n53m18
$$ -23 -118 446 -274 260 -307 -347 373 -408 422 -385 59 361 -434 398 -32 -53 392 -890 532 -21 -439
2956d39O35n02P44q09K63O89j206J187r27L33Q10j851J507l65k48P14j580J724
$$ -439 196 -306 438 -371 -108 581 -625 562 -365 -32 778 -1073 434 69 -179 535 -1045 679
2974F79m82q59J474j266R83j151r0K035k084J177p95J15J612k737J588p0m23Q33
$$ 679 197 -662 812 -454 529 -622 -712 1323 -761 416 -379 -264 1348 -1389 199 129 -294 539
2992E39j815K452q33j183J492j382J630j523n29K521k151J164q34L26J818l471
$$ 539 -1276 1176 343 -840 652 -730 900 -623 -1152 1369 -782 382 -452 -126 1692 -1779
3008a779J993K91q59R18k659L734j194k057K530j686K048j788r49L577k817P81
$$ -1779 214 505 -354 564 -2095 1639 445 -1612 918 -768 1280 -508 -1457 2120 -697 84
3024H4m54K02K318m501K622P79j461J099k706L863j043k881L215j791J968k109
$$ 84 -370 -168 2150 -2351 271 1050 -411 688 -2018 1845 802 -2079 1136 -655 1313 -796
3040g96j043M570l716Q78l38P33K299n561L039J555k201J202k952M400q06l927
$$ -796 -1839 2731 -985 -107 -445 288 2587 -2974 65 1620 -581 621 -2331 2069 1263 -2664
3056b664M007j416J779k540j160N240m171L13L98J97K550n648L005K008k468J397
$$ -2664 1343 -73 1706 -834 -1994 3246 -925 -612 -214 -17 2533 -3115 -110 1898 -570 827
3072H27l017M358n94m674M197j292J447k094j662O071m310m92J192j19K960o214
$$ 827 -2190 2168 1574 -3100 1097 -195 1252 -842 -2504 3567 -743 -1235 -43 -162 2798 -3416
3088c416K972K764l281J383k997M686m13n075M594j399J502k058k167O439m219
$$ -3416 -444 2320 -961 422 -2575 2111 1698 -3377 1217 -182 1320 -738 -2905 3534 -685
3103f85p64J653l44L189n888K078L408l473J320k822M179Q7n753M935q22O34j243
$$ -685 -1449 204 -140 3049 -2839 -761 2647 -826 494 -2328 1851 1938 -3815 1120 298 932 -311
3120c11k761O713m096j252J930p92L617n935J851L765l910J510k476L902P97o234
$$ -311 -3072 3641 -455 -1707 223 -569 3048 -2887 -1036 2729 -1181 329 -2147 1755 2552 -3682
3136c682M527m51N73j216k671O266l341j394J608r45L612n327J356L687l631J682
$$ -3682 845 394 967 -249 -2920 3346 5 -1389 219 -726 2886 -2441 -1085 2602 -1029 653
3152F53k388K949J158n631L992k08l2j79l264N907k673j959K276j409L338m366
$$ 653 -1735 1214 2372 -3259 733 525 493 314 -2950 2957 284 -1675 601 -808 2530 -1836
3168a836P33L670l685J761k246J904K084n253L540k81K14q1l343N655k618j735
$$ -1836 -1103 2567 -1118 643 -1603 301 2385 -2868 672 391 605 524 -2819 2836 218 -1517
3184a517K225j598L311l968L41L486l100J102j543J486K054m769L227n62%N51
$$ -1517 708 -890 2421 -1547 -1206 2280 -820 282 -1261 225 2279 -2490 737 175 175 726
3200G26l064M168j734j196J980j823K949l222n6L377l295J804j367O61J852l596
$$ 726 -2338 1830 96 -1100 880 -943 2006 -1216 -1272 2105 -1190 614 -753 -92 1760 -1836
3216a836K493m02n01R60k219L096j339j507K166j513J512j852J4K783k818J347
$$ -1836 657 255 -246 714 -1505 1591 252 -1255 911 -602 910 -942 -928 1855 -963 384
3232C84n23J4J783l103J893j01q68J200k194K571r11j274K036j642J637r54r62
$$ 384 -139 -125 1658 -1445 448 347 -521 679 -1515 1056 145 -1129 907 -735 902 -52 -1014
3249a014K488k278J169n24l04J638k511J718K59j287J545j980J668R7j808J923
$$ -1014 1474 -804 365 -159 -463 1175 -1336 382 641 -646 899 -1081 587 684 -1124 799
3265G99j552J565q02n73J903j957O13J58m46J129k007J408J07r41J255j798J633
$$ 799 -753 812 10 -563 1340 -617 -4 154 -292 837 -1170 238 345 -596 659 -1139 494
3282D94k62r92J667j517R48j36p88J320j106N82j15p58J276j241O83L50r10R60
$$ 494 232 -760 907 -610 338 202 -586 734 -372 210 95 -663 613 -628 55 405 -505 455
3300D55j002J018l1q48J062j112P00k23l14R32r94O23j83n81J033j059N74J46
$$ 455 -547 471 440 -408 654 -458 242 19 -295 637 -357 266 83 -498 535 -524 50 196
3318A96n82M75j18K04Qn04M55l11K70J70p25P50l56O8L43o54M47m42L20J14m08
$$ 196 -386 89 -29 175 183 -321 134 -177 93 263 -462 288 -68 0 343 -311 136 -306 14 128 -280
3339b80M43j96k43N10o52P33k64k56M24k06L12j46j63J66m30K26J68j8J33m28
$$ -280 163 -33 -276 234 -418 315 51 -205 219 13 325 179 16 182 -248 -22 146 128 261 -167
3359a67M44j59j69J94kp8k05n2K26j46J08J23l31J90p7J65q5j94K26j63L44j55
$$ -167 277 118 -51 143 141 63 -142 -194 32 -114 -6 117 -214 -24 -101 64 -21 -215 11 -152 192 37
3381C7k76J66j93O45l98rQ7l20M98l07O6K78l31J90j88j27l4L04k21Q9O3L30n37
$$ 37 -239 -73 -266 379 -19 -28 59 -261 237 -70 -4 274 -57 133 -55 -182 -216 88 -133 -44 19 349 -188
3404a88M14k10j9J39j82K50n8j77J54l33K49k05j7M35k65R2l45M24p8r3l9K2j03
$$ -188 226 16 -3 136 -46 204 146 -31 123 -210 39 -166 -183 252 -13 79 -266 158 80 -13 -52 -30 -133
3427a33L53n09M11k06J28N0l80N76o84J86O90p05M89j94j85M14o29M92J5k95M94
$$ -133 220 -289 122 -84 44 94 -286 290 -394 -208 482 -223 266 72 -113 301 -328 164 179 -116 378
3448C78q32P22j53l47P85j021N59l22M1N52n92L43j35l38Q99j359J306l35m13
$$ 378 -454 268 115 -232 553 -468 91 -231 -190 362 -230 113 -22 -360 539 -820 486 151 -262
3467b62M59p25J062l68n94R64j068J106o64j06J111j370O33k30m6P21j421R65
$$ -262 197 -528 534 166 -428 536 -532 574 -90 -196 915 -455 178 -52 -98 623 -798 167
3485A67j06l59Q92j281J354m52j101J439q25Q07p26m13J844k065J157k84l63J400
$$ 167 61 -298 594 -687 667 215 -886 553 -272 535 -191 -604 1240 -825 332 48 -315 1085
3503A085k305J718J87j396J485j921K253o74j759K265j450J257r43j018L027k551
$$ 1085 -1220 498 685 -711 774 -1147 1106 432 -1327 938 -512 745 -198 -1216 1811 -740
3519g40Q62k56k60J890l215J951M77j548J625k356K696n51k426L097j897J490
$$ -740 122 -134 -394 1496 -1719 232 709 -839 786 -1570 1126 575 -1851 1246 -651 839
3535H39j173r13L305k904J009j8o72K336l978K360J058k191J756k472K871k16
$$ 839 -334 -1247 2058 -846 163 145 -527 1809 -2169 191 1249 -942 814 -1658 1213 997
3551I97l030L177j336J163j112j521M127l533M70P95p60K529m183K020J739k658
$$ 997 -2033 1144 -192 971 -141 -1662 2465 -1068 -598 197 -563 1966 -2217 -197 1542 -1116
3567a116K227k764K854p6l813M050j733J017q53j799N010l780J38J107j424L157
$$ -1116 1111 -1653 1201 1125 -2688 1362 -371 646 -207 -2006 3004 -776 -638 469 -955 2202
3583B202m452K074K194l333K193k547K857L00m552M638j606M44l45k422N161l681
$$ 2202 -2250 -176 2018 -1315 878 -1669 1188 1488 -3064 1574 -32 412 67 -2355 2806 -875
3599h75j29J915j906L430m437J701K373l541K564k835K591O62m520M609j831O60
$$ -875 -1004 911 -995 2435 -2002 -301 2072 -1469 1095 -1740 851 1513 -3007 1602 -229 431
3615D31J01l166N353l426l01K187k099L159m257J573K674l972K699k040J766J299
$$ 431 532 -2634 2719 -707 -1008 1179 -920 2239 -2018 -445 2229 -1743 956 -1084 682 1981
3631A981n025M575j681LN47k719N076l469n12K388k496L403l830J172K900l867
$$ 1981 -3044 1531 -150 -147 400 -2319 2757 -712 -1224 1164 -1332 2071 -1759 -587 2313 -1554
3647a554K633k114J296J307m240M332j834k29J334k888M103k419j098K667k841
$$ -1554 1079 -1035 261 1568 -2672 1660 -174 -403 931 -1957 2146 -273 -1371 1296 -1545
3662a545L342l051N05L107m379L065j784M99J750l836L604j003r32J584k904L841
$$ -1545 1797 -1254 -749 2358 -2021 1044 -740 -241 1509 -2327 1277 274 -658 926 -1978 1863
3678A863k096j036K793k724K571j995M7K659l927K728j077j20J991l885L424j146
$$ 1863 -233 -1269 1524 -1200 1371 -624 -577 2082 -1845 883 -194 -314 1677 -2208 1216 70
3694G0r22K106k973L063j474q94K676l014K431j357p07K936l477K347j027o91
$$ 70 -852 1254 -1719 1344 -130 -1024 1652 -1362 1069 -288 -995 1941 -1536 811 -216 -907
3710i07K330l202K574o47r80J930k722K557j198p91K355k481K036r31q71K468
$$ -907 1423 -1779 795 148 -832 1098 -1624 933 -265 -1056 1299 -1182 854 -77 -948 1520
3726A520l080K294o67j008K153k494J848m59j083K286k751K100j60j394K076k404
$$ 1520 -1560 734 67 -941 1212 -1282 566 107 -976 1310 -1441 659 499 -895 1181 -1223
3742a223J815m99r33J975k243J865p37r28J924j896J309j80j075J754j930J569
$$ -1223 592 93 -840 1135 -1108 757 20 -908 1016 -880 429 249 -826 928 -1002 567
3758E67l69j113J787j806J140j65p57J491j609J162k07q45J701j681J243n56m50
$$ 567 198 -915 872 -934 206 41 -716 775 -834 328 121 -724 977 -704 539 -17 -467
3775d67J086j288Q31Q8q63J337j377R06j00j023J602j149P58j8j006J436j113
$$ -467 619 -669 162 250 -613 724 -653 253 153 -870 732 -417 341 323 -683 753 -360
3792c60M87M3p98J234j159L28O68q41J030j252N51N82j323J244q72P54j01p37
$$ -360 127 170 -628 606 -553 -225 443 -398 632 -620 -69 513 -810 434 -438 316 215 -522
3810e22R32p03L38L81p83R81q83j0M29m17P14o82K02M17r91R62n39J94J57p38
$$ -522 410 -293 45 426 -357 624 -259 -269 160 -257 457 -225 -23 394 -597 365 -174 20 177 -561
3830e61J006m13R5k13k96P89n26O0L72l58L13m64k6O08n44K75j37p9J44l27L60
$$ -561 445 32 127 -86 -382 407 -119 -59 313 -45 268 -196 -222 386 -158 117 -20 -99 45 -282 78
3851G8m0J01N7k95J48p7r4K43l03J07J85j54J97l16J04J23k09M26k71J47k79M1
$$ 78 38 139 196 -99 49 -28 -122 121 -182 -75 110 -44 153 -163 -59 64 -145 281 10 157 -122 -81
3873h1p7J26K78k86k36L62j43J08l9j91J32l7L75l14M6j16N3J48j72J28J63m35
$$ -81 -158 -32 246 -40 -276 86 -57 51 12 -179 -47 -84 291 -23 23 -93 -40 108 -64 64 227 -208
3895b08J65m7J92N7k41K63j62J73j14k87L7P2j96J55J96l1q1M0l5j06J43O7j47
$$ -208 -43 -90 102 159 -82 181 19 192 78 -209 -172 -100 -296 -141 55 24 -57 -17 -52 -158 -15 52 -95
3918i5r4J92J12M5k01K86n74M73j72r4M58m93J43j32r2J48j99M78j68J36Kj88
$$ -95 -189 3 115 160 -41 245 -329 144 -28 -122 336 -157 -14 -146 -238 -90 -289 189 21 157 159 -29
3940b9J7R8r1Pp7N6j14j64L03j4L6L8j47L72o20J10J38Q9J38m24K71J85j49O0
$$ -29 -12 86 -5 2 -75 -19 -133 -297 6 -8 28 66 -81 291 -329 -219 -81 8 146 -278 -7 178 29 89
3964H9l60P59k58n40P63o78K85k97J72M41o38K68K45l23M25j106R37j70l69M94
$$ 89 -271 488 230 -310 453 -225 60 -237 -65 376 -262 6 251 -72 353 -753 184 14 -355 139
3984A39m33N32k61l90O64l99L83l15l08R55r11M03l6k62Q13r90M81L8m10O59n47
$$ 139 -294 238 -23 -413 251 -148 235 -80 -388 567 -344 59 23 -239 574 -416 65 103 -307 352 -195
4005a95L94k56m67J304j141P77o91j16J140r98J12j3j60J040j442Q95J04q13R20
$$ -195 199 -57 -524 780 -361 416 -275 -391 749 -249 -137 -150 -310 730 -712 183 287 -526 394
4024C94q64J039k40j127J306p75L87j63o69J878j880P75K31p72R45j347R74L72
$$ 394 -470 569 329 -798 508 -267 120 -43 -712 1166 -714 61 292 -480 465 -882 92 464
4042D64j042R34j192J431m53j200J902j258P79l85q60J912j700L49O45j014J557
$$ 464 -578 356 -836 595 142 -1058 844 -414 365 -20 -880 1032 -668 -319 326 -688 869
4059H69j868J108M89j555J535j168J000K56j894K327j363K80K18j139K256j930
$$ 869 -999 109 598 -957 578 -590 410 666 -1228 1099 -264 16 234 -905 1351 -579
4075e79M0J011j047J574k078J073R88j853J361j252J171J34j916K141r65K77N5
$$ -579 -539 472 -575 999 -1079 -6 982 -871 490 -762 409 543 -1373 768 -197 80 135
4092A35j323K526j661L3Q23j068J748k001P67J140k269J803j319R43K97j907K306
$$ 135 -1188 1338 -323 -290 533 -535 1213 -788 -21 1119 -1150 653 -666 277 574 -1333 973
4109I73j119j63Q40j570K440k030J7J333j625J892j956P12J360k020J449r75L66
$$ 973 -146 -309 531 -1039 1401 -629 -612 721 -904 988 -968 -256 1104 -916 533 -442 -76
4126g6J121k389K525j465l3J115j805K230j797J21J348j824J844j532L61J540
$$ -76 1045 -1344 1181 -284 -317 798 -1007 1223 -574 -453 895 -929 915 -617 -256 1284
4142A284k434J736r42K6J339k398K300j023k9J085k289K440j487j48J600k202
$$ 1284 -1150 586 -356 -330 1009 -1389 911 -112 -141 944 -1345 1095 -392 -540 1060 -1142
4158a142K124j351MJ565k483K178j150l38J649k248K003j147j78J432k051J904
$$ -1142 982 -369 -365 1200 -1283 895 -255 -593 1056 -1192 811 -336 -514 918 -1133 771
4174G71j055l43J719k417K087p82o27J509k334K344j153m78J793k070J937p79
$$ 771 -284 -627 1092 -1325 762 -20 -647 862 -1472 872 -281 -759 1034 -1036 901 122
4190A22p88J978k586J957q72l16J609k107J964j052o22J704k141J960q14r79J976
$$ 122 -666 1312 -1274 683 -189 -505 1104 -1003 961 -91 -713 991 -1150 810 -4 -983 993
4207I93j909J352n58n33J814k280J490m23m14J546k266J731l91o53J426j833J671
$$ 993 -916 436 -122 -655 1159 -1121 369 -54 -468 1078 -1188 543 152 -501 925 -908 763
4224G63o14j115J827j448Q35k65n82J536j541R94j84o77J546j989J199m3r15J406
$$ 763 149 -966 861 -587 248 -17 -599 937 -604 390 206 -471 1075 -914 285 242 -673 733
4242G33j308J203n50j231J738j331J073j47p30J701j801O88K44o69J193j593Q47
$$ 733 -575 628 78 -1153 585 -746 327 180 -550 1151 -650 38 282 -387 806 -787 60
4259F0K26j066J160j003R00l2j139J646r96L99q5o37J580j436L65L33p38J065
$$ 60 286 -780 380 -623 277 245 -894 752 -244 155 70 -567 1013 -423 -58 275 -463 602
4277F02j239N42Q45j463Q83n34P16k97q26J108q27L49L67p19J075j130O40K03
$$ 602 -637 -95 750 -713 170 -364 352 55 -771 337 -490 -141 226 -493 582 -548 92 295
4295B95n41P84o87K87K18r61Q30m96N15O7r05J152o98J55N35q75O93p97M16L41
$$ 295 -246 538 -149 138 356 -605 225 -271 244 311 -594 558 -140 15 550 -325 368 -429 -13 328
4315C28n29N77m88J45K61o77P55n66J85O9o33P79j19l64M64l00K26m34p9P56n68
$$ 328 -201 376 -112 33 294 -383 372 -194 -9 60 -573 206 87 -277 187 -113 113 -321 -400 356 -212
4336b12O32p44J39L79k82L19m02L1L04m72L65K2n1Qk15L92l32Q0L55m88K13O6
$$ -212 420 -324 -185 194 -88 231 -171 -140 164 -308 57 79 28 36 -179 213 -119 -39 316 -172 41 107
4358A07j98M88o79M39j71n7L70m47L99m97n7M40m10Q8L11l48M34m70N26l51k28
$$ 107 -91 397 -282 157 -14 -71 299 -148 251 -246 -303 137 -273 -185 126 -222 212 -258 268 -83 -311
4379c11L19k24K78j58Q4K63l62O4J00k48M94l70J12J48j07J92l93K37j41O2P1
$$ -311 8 -216 62 -96 -12 251 -111 -47 53 -195 299 -71 41 189 82 274 -119 118 -23 39 110
4400A10j80K37K9j83Q9j58O8P9n17L87q9M9J66j53K10l19K51K36o44M09o5N7K
$$ 110 -70 167 196 13 102 -56 12 91 -426 -39 -128 -79 87 -66 144 -175 76 312 -332 77 12 69 71
4423G1J5N9k04K50j86k85J32J47P1J28k75K09q8J85m5m21L62j25j04J56j22K07
$$ 71 86 145 -59 191 5 -280 -148 -1 70 198 -77 132 44 229 184 -237 125 0 -104 52 -70 137
4445A37Jk33M48m29K03q5r9k1q6L14j91J8P3k02J03RJ23J99n63N42l48J32J7k59
$$ 137 138 -95 353 -76 127 42 -57 -78 -164 150 -41 -23 50 -152 -49 -40 83 282 -281 261 -87 45 62 -197
4469a97L90k67J58L3k01L31o61N63J22p08P67n05K36k10J09M29n36J71L2k09M04
$$ -197 193 -74 84 117 -84 247 -414 149 271 -437 330 -175 61 -149 -40 389 -147 24 56 -153 251
4490B51n16J32J11M8J57m82J63M10l33K82m47M70k31l23O77o01K25j30k02J095
$$ 251 -265 -133 -22 26 183 -299 -136 274 -59 223 -224 246 15 -308 369 -232 -7 -137 -339 756
4510G56r39J37K99n65O08o19N04Po52O29o11P15k67o56J136p37L76N1l53N85q02
$$ 756 -183 -46 253 -312 296 -323 181 188 -464 165 -446 269 2 -654 482 -255 121 172 -181 404 -398
4531c98J77L47m44P07q62L43N27p21Q95r14L72L47p98J046j077N68J24p65J286
$$ -398 -221 126 -318 389 -473 -130 397 -324 571 -343 29 376 -422 624 -453 115 239 -526 760
4550G60j167M01M46r40P71p71O73j26m52O64o59O16J68j117J222r87L61N14q66
$$ 760 -407 -6 440 -500 271 -500 173 47 -405 259 -400 216 384 -733 489 -498 -137 377 -489
4569d89J052j021N66R6p02R74r52P02K55j280J301j078N62O43j216J384j218M04
$$ -489 563 -458 108 204 -498 476 -476 226 481 -799 502 -576 -14 629 -587 797 -421 -17
4587a7N56j327J614j427N15O69j083J201j014K68K22p20J196j154N14L27q46Q79
$$ -17 539 -788 826 -601 -86 583 -500 701 -313 -45 177 -543 653 -501 13 340 -506 373
4605C73p75K77M69j004J307r74J41O06r87J065q37K27N40j053J531j104J76N25
$$ 373 -402 -125 344 -660 647 -327 -186 420 -567 498 -339 -112 428 -625 906 -198 -22 503
4623E03j114J489j418L44P42j295J149m09M6M42j499J924j190Q6O43j369J747
$$ 503 -611 878 -540 -196 546 -749 400 -9 37 479 -1020 904 -286 -200 443 -926 821
4640H21r32k96R70j294J080o99J90Q42j443J544j118K93N82j219J271q53O0O88
$$ 821 -111 -407 563 -731 349 -350 -160 682 -761 783 -335 -42 540 -679 592 -261 -201 487
4658D87j259J405q28l80J266j290J062p61k23J294j613J391n14j03Q00j684J150
$$ 487 -772 633 -195 -575 691 -599 463 -298 -521 773 -840 551 37 -66 734 -950 200
4675B00k64k75N68r14J542r89p59J558j151R87r11j95J601j727P40k83K36O41
$$ 200 -64 -339 229 -685 857 -132 -891 667 -484 503 -408 -603 998 -729 11 -272 -36 605
4693F05j516J708p46n72Q66q88J126o97o25J444j018N97n30q6J214j706R24K18
$$ 605 -911 797 51 -521 345 -543 583 -114 -739 705 -313 284 -246 -332 882 -824 100 318
4711C18o80J001j649J461R6j029Q27p48J069m47q32J282r45O43l65n06J123j154
$$ 318 -362 639 -1010 451 547 -482 345 -403 666 219 -613 669 -276 367 2 -504 619 -535
4729e35N52K35l71P83j264R73K3r16R61j040J049o45l85J119p49L88m12j43J388
$$ -535 17 252 -119 664 -600 373 396 -520 441 -599 450 -195 -580 539 -210 178 -234 -377 1011
4748A011j415K21N93n49M44r59Q10L93j066O37l12N95l46o45J145p31K15j58j63
$$ 1011 -404 -183 410 -139 305 -654 156 549 -517 120 -192 403 57 -588 557 -174 41 -117 -280
4767b80Q11q53K35J39k44N50p37M95J37o22O12m12J82j78n08R57k59Q4l01Q6O18
$$ -280 531 -322 -87 52 -192 358 -379 116 253 -369 243 -169 13 -165 -673 284 25 109 -192 -106 512
4788E12r77K41O13o50O40q73L20O05q59Q22o20L47m1m66P25l62m3J90l05O27o01
$$ 512 -465 -224 389 -261 379 -494 -174 431 -428 394 -226 121 80 -386 339 -23 -66 124 -181 446 -155
4809a55J91J06k70L90o85L25N48m06%j93K16J25l37N99n42R8j1j51M37o13M02
$$ -155 36 142 -128 262 -423 -98 450 44 44 -149 67 192 -145 454 -88 10 -1 -152 285 -328 74
4830G4j4k40L44j66l3J41k77L92l17J23M5j44L22k54J05K4k98K48n6m3J59r6K6
$$ 74 60 -180 164 -2 -35 106 -171 221 -96 27 72 -72 250 -4 101 125 -173 75 19 -24 135 39 65
4853F5k74K75P4m68L87M7j65J22l03N22l68J04J69r9n6j75M2K47n51M40j78l4
$$ 65 -209 66 140 -328 59 106 -59 63 -240 282 -86 18 187 88 32 -143 -101 146 -405 35 -143 -177
4875a77M05l99J95j05K04j08j80R3pJ95L4k27J60p4k15L01k78K50k2j96R1J60
$$ -177 228 -171 24 -81 123 15 -165 -72 -79 116 150 -77 83 9 -206 95 -183 67 45 -151 -60 100
$$ [...]
8191i7
##END NTUPLES=NMR FID
##END=
