##TITLE=1H_LR-746-R2-H-CHL
 CDCl3
 8 sc, 
 16.03.2022
##JCAMPDX= 6.0         $$ Bruker NMR JCAMP-DX V2.0
##DATA TYPE= NMR FID
##DATA CLASS= NTUPLES
##ORIGIN= UXNMR, Bruker Analytische Messtechnik GmbH
##OWNER= root
$$ XWIN-NMR		Version 3.5
$$ Wed Mar 16 12:39:38 2022 Russian Standard Time (UT+4h)  she@DPX200
##.OBSERVE FREQUENCY= 200.131346
##.OBSERVE NUCLEUS= ^1H
##.DELAY= (6, 6)
##.ACQUISITION MODE= SIMULTANEOUS
##.ACQUISITION SCHEME= undefined
##.AVERAGES= 8
##.DIGITISER RES= 18
##SPECTROMETER/DATA SYSTEM= spect
##.PULSE SEQUENCE= zg30
##.SOLVENT NAME= Acetone
##.SHIFT REFERENCE= (INTERNAL, Acetone, 0, 15.7039)
##AUDIT TRAIL= $$ (NUMBER, WHEN, WHO, WHERE, WHAT)
$$ ##TITLE= Audit trail, XWIN-NMR		Version 3.5
$$ ##JCAMPDX= 5.01
$$ ##ORIGIN= Bruker BioSpin GmbH
$$ ##OWNER= she
$$ F:/spectra/data/she/nmr/H-F/1/audita.txt
$$ ##AUDIT TRAIL=  $$ (NUMBER, WHEN, WHO, WHERE, WHAT)
(   1,<2022-03-16 12:38:39.81 +0400>,<she>,<DPX200>,
      <created by zg, POWCHK disabled, PULCHK disabled
       configuration hash MD5:
       00 E9 B6 7A A2 85 ED C7 34 08 36 98 17 FE 4E 26
       data hash MD5: 16K
       D8 8A 10 46 29 53 2A A9 0B E2 47 F1 1E B1 DB 39>)
$$ ##END=
$$ 
$$ hash MD5
$$ 07 A9 23 E8 DA 6A 15 E8 D3 90 99 DE 6F C6 69 AA
##$RELAX= 
##$RELAX= 
##$RELAX= 
##$RELAX= 
##$RELAX= 
##$RELAX= 
$$ Bruker specific parameters
$$ --------------------------
##$DU= <F:/spectra>
##$EXPNO= 1
##$NAME= <H-F>
##$PROCNO= 1
##$TYPE= <nmr>
##$USER= <she>
##$AMP= (0..31)
100 100 100 100 100 100 100 100 100 100 100 100 100 100 100 100 100 100 
100 100 100 100 100 100 100 100 100 100 100 100 100 100 
##$AQSEQ= 0
##$AQ_mod= 1
##$AUNM= <au_zg>
##$AUTOPOS= <>
##$BF1= 200.13
##$BF2= 200.13
##$BF3= 200.13
##$BF4= 200.13
##$BF5= 200.13
##$BF6= 200.13
##$BF7= 200.13
##$BF8= 200.13
##$BYTORDA= 1
##$CFDGTYP= 0
##$CFRGTYP= 5
##$CHEMSTR= <none>
##$CNST= (0..31)
1 1 145 1 1 1 1 1 1 1 1 1 1 1 1 1 1 1 1 1 1 1 1 1 1 1 1 1 1 1 1 1 
##$CPDPRG= <>
##$CPDPRG1= <>
##$CPDPRG2= <>
##$CPDPRG3= <>
##$CPDPRG4= <mlev>
##$CPDPRG5= <mlev>
##$CPDPRG6= <mlev>
##$CPDPRG7= <mlev>
##$CPDPRG8= <mlev>
##$CPDPRGB= <>
##$CPDPRGT= <>
##$D= (0..31)
0 1.2 0 0 0 0 0 0 0 0.06 0 0.03 0 0 0 0 0.0002 0 0 0 0 0 0 0 0 0 0 0 0 
0 0 0 
##$DATE= 1647419919
##$DBL= (0..7)
120 120 120 120 120 120 120 120 
##$DBP= (0..7)
150 150 150 150 150 150 150 150 
##$DBP07= 0
##$DBPNAM0= <>
##$DBPNAM1= <>
##$DBPNAM2= <>
##$DBPNAM3= <>
##$DBPNAM4= <>
##$DBPNAM5= <>
##$DBPNAM6= <>
##$DBPNAM7= <>
##$DBPOAL= (0..7)
0.5 0.5 0.5 0.5 0.5 0.5 0.5 0.5 
##$DBPOFFS= (0..7)
0 0 0 0 0 0 0 0 
##$DE= 6
##$DECBNUC= <off>
##$DECIM= 32
##$DECNUC= <off>
##$DECSTAT= 4
##$DIGMOD= 1
##$DIGTYP= 9
##$DL= (0..7)
0 120 120 120 120 120 120 120 
##$DP= (0..7)
150 150 150 150 150 150 150 150 
##$DP07= 0
##$DPNAME0= <>
##$DPNAME1= <>
##$DPNAME2= <>
##$DPNAME3= <>
##$DPNAME4= <>
##$DPNAME5= <>
##$DPNAME6= <>
##$DPNAME7= <>
##$DPOAL= (0..7)
0.5 0.5 0.5 0.5 0.5 0.5 0.5 0.5 
##$DPOFFS= (0..7)
0 0 0 0 0 0 0 0 
##$DQDMODE= 0
##$DR= 18
##$DS= 0
$$ [...]
##$SUBNAM2= <"">
##$SUBNAM3= <"">
##$SUBNAM4= <"">
##$SUBNAM5= <"">
##$SUBNAM6= <"">
##$SUBNAM7= <"">
##$SUBNAM8= <"">
##$SUBNAM9= <"">
##$SW= 18.0517287032376
##$SWIBOX= (0..15)
0 0 2 0 0 0 0 0 0 0 0 0 0 0 0 0 
##$SW_h= 3612.71676300578
##$TD= 16384
##$TD0= 1
##$TE= 0
##$TE2= 300
##$TE3= 300
##$TEG= 300
##$TL= (0..7)
0 120 120 120 120 120 120 120 
##$TP= (0..7)
150 150 150 150 150 150 150 150 
##$TP07= 0
##$TPNAME0= <>
##$TPNAME1= <>
##$TPNAME2= <>
##$TPNAME3= <>
##$TPNAME4= <>
##$TPNAME5= <>
##$TPNAME6= <>
##$TPNAME7= <>
##$TPOAL= (0..7)
0.5 0.5 0.5 0.5 0.5 0.5 0.5 0.5 
##$TPOFFS= (0..7)
0 0 0 0 0 0 0 0 
##$TUNHIN= 0
##$TUNHOUT= 0
##$TUNXOUT= 0
##$USERA1= <user>
##$USERA2= <user>
##$USERA3= <user>
##$USERA4= <user>
##$USERA5= <user>
##$V9= 5
##$VALIST= <valist>
##$VCLIST= <CCCCCCCCCCCCCCC>
##$VD= 0
##$VDLIST= <DDDDDDDDDDDDDDD>
##$VPLIST= <PPPPPPPPPPPPPPP>
##$VTLIST= <TTTTTTTTTTTTTTT>
##$WBST= 1024
##$WBSW= 4
##$XGAIN= (0..3)
0 0 0 0 
##$XL= 0
##$YL= 0
##$YMAX_a= 515735
##$YMIN_a= -585672
##$ZGOPTNS= <>
##$ZL1= 120
##$ZL2= 120
##$ZL3= 120
##$ZL4= 120
##$ABSF1= 10
##$ABSF2= 0
##$ABSG= 5
##$ABSL= 3
##$ALPHA= 0
##$AQORDER= 0
##$ASSFAC= 0
##$ASSFACI= 0
##$ASSFACX= 0
##$ASSWID= 0
##$AUNMP= <proc_1d>
##$AZFE= 0.1
##$AZFW= 0.1
##$BCFW= 1
##$BC_mod= 2
##$BYTORDP= 1
##$COROFFS= 0
##$CY= 11.3945322036743
##$DATMOD= 1
##$DC= 2
##$DFILT= <>
##$DTYPP= 0
##$F1P= 2.36226072786647
##$F2P= -0.459571619588291
##$FCOR= 0.5
##$FTSIZE= 0
##$FT_mod= 4
##$GAMMA= 1
##$GB= 0.15
##$INTBC= 1
##$INTSCL= 1
##$ISEN= 128
##$LB= 0.24
##$LEV0= 0
##$LPBIN= 0
##$MAXI= 10000
##$MC2= 0
##$MEAN= 0
##$ME_mod= 0
##$MI= 1.114404
##$NCOEF= 0
##$NC_proc= 0
##$NLEV= 6
##$NOISF1= 3.799351
##$NOISF2= 2.8
##$NSP= 1
##$NTH_PI= 0
##$NZP= 0
##$OFFSET= 15.70392
##$PC= 1
##$PHC0= -16947.36
##$PHC1= 7.800779
##$PH_mod= 1
##$PKNL= yes
##$PPARMOD= 0
##$PSCAL= 0
##$PSIGN= 0
##$REVERSE= no
##$SF= 200.130013532006
##$SI= 16384
##$SIGF1= 3
##$SIGF2= 2
##$SINO= 400
##$SIOLD= 16384
##$SREGLST= <1H.CDCl3>
##$SSB= 0
##$STSI= 0
##$STSR= 0
##$SW_p= 3612.71676300578
##$SYMM= 0
##$S_DEV= 0
##$TDeff= 0
##$TDoff= 0
##$TI= <>
##$TILT= no
##$TM1= 0
##$TM2= 0
##$TOPLEV= 0
##$USERP1= <user>
##$USERP2= <user>
##$USERP3= <user>
##$USERP4= <user>
##$USERP5= <user>
##$WDW= 1
##$XDIM= 8192
##$YMAX_p= 0
##$YMIN_p= 0
$$ End of Bruker specific parameters
$$ ---------------------------------
##NTUPLES= NMR FID
##VAR_NAME=  TIME,          FID/REAL,        FID/IMAG
##SYMBOL=    X,             R,               I
##VAR_TYPE=  INDEPENDENT,   DEPENDENT,       DEPENDENT
##VAR_FORM=  AFFN,          ASDF,            ASDF
##VAR_DIM=   8192,          8192,            8192
##UNITS=     SECONDS,       ARBITRARY UNITS, ARBITRARY UNITS
##FACTOR=    0.0002768,     1,               1
##FIRST=     0,             0,               0
##LAST=      2.2672688,     0,               0
##MIN=       0,             -585672,         0
##MAX=       2.2672688,     515735,          0
$$ Real data points
##PAGE= N=1
##DATA TABLE= (X++(R..R)), XYDATA
$$ [...]
$$ plain form
2183 -3792 -320 2165 -1054 384 1424 -3133 -2103 4857 1984 -3922 -995 2133 144 892 1694
2198 1694 -2525 -1707 4016 1608 -4049 -964 2956 294 -206 176 -3310 -1484 4169 2240 -4204 -2037
2214 -2037 1745 -8 -263 554 -1760 -1304 3286 1191 -3776 -914 3563 1367 -695 -317 -1778 -475
2230 -475 3664 1632 -3390 -1575 2634 786 -1106 41 -1116 -1050 2241 844 -3584 -1335 2493 773
2246 773 -1280 -277 -541 -536 1986 751 -2577 -797 2542 871 -1707 -462 137 207 2304 781 -2100
2263 -2100 -1054 2017 890 -849 171 -58 -814 258 100 -1629 -520 1699 -109 -1782 -673 110
2279 110 30 656 311 -1411 -514 1106 697 -301 269 406 -505 438 957 -75 -272 723 -95 -373 683
2298 683 305 -903 -277 738 -64 -269 -48 -250 -519 490 -4 -920 -101 819 304 -706 -824 117 564
$$ packed form
2183c792L472K485l219J438J040m557J030O960k873n906K927L128j989P48Q02
2198A694m219Q18N723k408n657L085L920k662n00L82l486J826N653j929o444K167
2214b037L782j753k55Q17k314M56M590k095m967K862M477k196k062L78j461J303
2230d75M139k032n022J815M209j848j892J147j157O6L291j397m428K249L828j720
2246G73k053J003k64NK522j235l328J780L339j671k578J245N99P0K097j523k881
2263b100J046L071j127j739J020k29p56J072j58j729J109K219j808j673J109P83
2279A10q0O26l45j722Q97J620m09r98N70J37r11R43N19j032j97R95q18k78J056
2298F83l78j208O26J015q02k05K21k02k69J009m94r16Q19R20n15j010j18R41M47
$$ plain form
2317 564 1202 -239 -1420 -301 1468 1531 -339 -997 -383 768 1111 6 -1488 -250 894 668 -981
2334 -981 -1153 232 847 614 -1022 -1733 49 1841 673 -1396 -1740 89 1898 1026 -938 -1747 267
2351 267 2023 1257 -1128 -1333 619 1576 487 -1188 -1499 401 1832 248 -1618 -1466 655 1856
2367 1856 286 -1810 -1844 590 1754 620 -1966 -1588 669 1712 847 -1246 -1217 767 1714 339 -1317
2384 -1317 -659 1303 1774 57 -1606 -725 1324 1559 -148 -1932 -1159 1200 1482 -415 -1903 -1383 605
2401 605 1587 -90 -1692 -1025 849 1011 -343 -945 -402 817 1212 -293 -1505 -7 1479 1216 -672
2418 -672 -1075 -596 934 1270 -285 -1715 -402 1135 654 -428 -817 -316 111 586 -125 -1095 -197 836
2436 836 -379 -723 155 148 239 491 -417 -776 134 1189 453 -372 234 -12 -93 748 387 -496 -448 390 -539
$$ packed form
2317E64O38j441j181J119J769O3j870o58O14J151L43j105j494J238J144k26j649
2334i81j72J385O15k33j636p11J782J792j168k069l44J829J809q72j964q09K014
2351B67J756p66k385k05J952R57j089j675l11J900J431j584j866J52K121J201
2367A856j570k096l4K434J164j134k586L78K257J043q65k093K9J984R47j375j656
2384a317O58J962M71j717j663Q81K049K35j707j784P73K359K82j897j488N20J988
2401F05R82j677j602O67J874J62j354o02N43J219L95j505j212J498J486k63j888
2418f72m03M79J530L36j555j430J313J537m81j082l89N01M27M75p11r70Q98J033
2436H36j215l44Q78pR1K52r08l59R10J055p36q25O06k46q1Q41l61q83M8Q38r29
$$ plain form
2457 -539 -455 824 280 -1013 -225 298 -690 -265 329 -611 -566 705 134 -1080 248 1041 -223 -320 519
2476 519 -106 -143 678 39 -1379 675 1872 -128 -909 -118 -570 109 1394 138 -1970 -612 1297
2493 1297 -335 -901 393 117 -440 616 -438 -1803 379 2493 42 -1745 -163 482 132 1740
2509 1740 242 -1996 -26 2305 16 -1552 591 766 27 966 -416 -2241 -51 2038 -212 -2319
2525 -2319 4 498 -743 318 -90 -1634 678 2711 -334 -2842 151 1862 683 1010 202 -2217
2541 -2217 -93 2490 170 -2017 828 1576 -696 -439 101 -1244 460 2729 -609 -3071 330 1656
2557 1656 -306 -40 96 -1801 -404 2135 -503 -2315 572 2115 -291 -424 342 -1218 -311 2326
2573 2326 246 -1995 913 1616 -1295 -626 1035 -451 -292 1893 -444 -2948 272 1806 -406 -787
$$ packed form
2457e39Q4J279n44j293P88N23r88M25N94r40M5J271n71j214J328P93j264r7Q39
2476E19o25l7Q21o39j418K054J197k000p81P91m52O79J285j256k108J358J909
2493A297j632n66J294k76n57J056j054j365K182K114k451j787J582O45l50J608
2509A740j498k238J970K331k289j568K143J75p39R39j382j825K190K089k250k107
2525b319K323M94j241J061m08j544K312K033l045k508K993J711j179L27q08k419
2541b217K124K583k320k187K845P48k272K57N40j345J704K269l338k462L401J326
2557A656j962K66J36j897J397K539k638j812K887J543k406j33P66j560R07K637
2573B326k080k241K908P03k911O69J661j486J59K185k337k504L220J534k212l81
$$ plain form
2589 -787 849 -1095 -1277 1423 556 -1822 914 1618 -1137 -1249 1116 -11 -450 1469 563 -1927 108
2606 108 1770 -920 -684 1573 -147 -1580 754 339 -1858 58 1721 -939 -1246 872 -450 -1728
2622 -1728 876 1530 -1183 -239 1071 -1126 -1022 1708 605 -1146 810 806 -1476 -387 1790 -15
2638 -15 -458 1595 -97 -2081 312 1677 -637 -653 629 -883 -1336 771 197 -1821 308 1607 -1119
2655 -1119 -1123 687 -346 -445 1622 429 -1630 160 1559 -654 -547 1407 306 -464 885 40 -1795
2672 -1795 409 2366 -99 -1295 258 -457 -995 794 322 -1539 82 1090 -1258 -1782 786 574
2688 574 -225 529 108 -1595 -28 2060 -266 -881 940 584 -547 436 192 -840 635 1770 -723
2705 -723 -1731 262 617 -501 670 636 -1115 -624 692 -544 -1131 922 862 -379 -440 -41 -733 322
$$ packed form
2589g87J636j944j82K700q67k378K736P04k755j12K365j127m39J919r06k490K035
2606A08J662k690K36K257j720j433K334m15k197J916J663k660l07K118j322j278
2622a728K604O54k713R44J310k197J04K730j103j751J956mk282J089K177j805
2638a5m43K053j692j984K393J365k314j6J282j512m53K107n74k018K129J299k726
2655a119mJ810j033r9K067j193k059J790J399k213J07J954j101p70J349q45j835
2672a795K204J957k465j196J553p15n38J789m72j861J621J008k348n24K568k12
2688E74p99P54m21j703J567K088k326o15J821l56j131R83k44j032J475J135k493
2705g23j008J993L55j118J171l4j751M91J316j236n87K053o0j241o1L99o92J055
$$ plain form
2723 322 1800 -5 -973 110 508 -446 464 783 -398 150 664 -385 -1077 604 987 -628 -428 -157
2741 -157 -639 -141 935 -202 -944 329 236 -513 -340 453 20 66 585 -342 -747 236 418 -13 314 767
2761 767 -241 -388 382 461 -184 383 446 -675 -494 207 -88 -255 57 -74 -752 -124 55 -244 30 317
2781 317 -285 -628 385 51 -377 321 349 -237 47 492 187 172 478 498 -107 -43 85 -139 -182 281 66
2802 66 -376 52 11 -156 -303 -2 -217 -137 -141 -73 -253 -27 299 254 212 70 218 -45 399 232 -152 -55 385
2825 385 36 -12 144 12 -142 -47 48 -108 -83 -167 -279 -200 204 -77 -201 92 15 -284 91 137 -9 -117 52
2848 52 -22 -12 294 136 95 -66 490 216 451 211 -115 -199 271 11 -223 -101 -178 35 100 -396 -138 -218 145
2871 145 214 -191 -262 -202 196 207 9 53 -54 173 108 196 275 312 248 263 287 -70 72 297 107 -359 -160 -281
$$ packed form
2723C22J478j805r68J083L98r54R10L19j181N48N14j049o92J681L83j615K00K71
2741a57m82M98J076j137p42J273r3p49J73P93m33M6N19r27m05R83J82m31L27M53
2761G67j008j47P70P9o45N67O3j121J81P01k95j67L12j31o78O28J79k99K74K87
2781C17o02l43J013l34m28O98K8n86K84M45l05j5L06K0o05O4J28k24m3M63k15
2802F6m42M28m1j67j47L01k15Q0mO8j80K26L26m5m2j42J48k63M44j67l84R7M40
2825C85l49m8J56j32j54R5R5j56K5q4j12P9M04k81j24K93p7k99L75M6j46j08J69
2848E2p4J0L06j58m1j61N56k74K35k40l26q4M70k60k34J22p7K13O5m96K58q0L63
2871A45O9m05p1O0L98J1j98M4j07K27o5Q8P9L7o4J5K4l57J42K25j90m66J99j21
$$ plain form
2895 -281 110 117 -320 -342 -145 -20 262 -264 -78 -24 -62 -9 -182 -162 53 452 312 107 201 165 348 259 28
2918 28 -149 107 107 250 -156 -187 -63 31 -155 -123 -149 -492 -85 -28 -443 -331 -76 -82 -328 -345 244 74 121 328
2942 328 13 -72 97 321 68 168 -64 -107 149 236 52 -51 184 -99 -513 -118 19 -118 -176 -12 -241
2963 -241 -199 -176 -311 -353 137 278 -209 -193 -39 22 53 346 50 -128 152 405 -60 139 351 284 -123 31
2985 31 -426 -314 328 824 -444 -564 -297 -144 -287 -162 120 -199 27 96 -714 -638 494 455 -45 -3 -148
3006 -148 -332 416 469 -221 -122 383 622 -86 -624 -36 113 672 589 -483 -1090 147 409 52 -188 18
3026 18 -320 -145 -41 -726 -338 886 793 -203 -484 -141 16 693 896 -211 -588 419 413 -474 3 248
3046 248 482 98 -272 -815 -603 800 891 -94 -719 -439 -167 -205 330 -216 -165 682 415 -803 -980 119
$$ packed form
2895b81L91Pm37k2J97J25K82n26J86N4l8N3j73K0K15L99j40k05R4l6J83q9k31
2918B8j77K56%J43m06l1J24R4j86L2k6l43M07N7m15J12K55ok46j7N89j70M7K07
2942C28l15q5J69K24k53J00k32m3K56Q7j84j03K35k83m14L95J37j37n8J64k29
2963b41M2K3j35m2M90J41m87J6J54O1L1K93k96j78K80K53m65J99K12o7m07J54
2985C1m57J12O42M96j268j20K67J53j43J25K82l19K26O9q10P6J132l9n00M2j45
3006a48j84P48N3o90R9N05K39p08n38N88J49N59q3j072o07J237K62l57k40K06
3026A8l38J75J04o85L88J224r3r96k81L43J57O77K03j107l77J007oq87M77K45
3046B48K34l84l70n43K12J403R1r85o25K80K72l8N35n46N1Q47k67j218j77J099
$$ plain form
3066 119 846 679 619 -481 -972 206 768 166 -10 447 119 -215 -151 45 2 650 749 -674 -1088 -238
3086 -238 75 116 347 -344 -620 -150 79 -346 -85 491 505 -209 -26 -263 -77 402 1007 235 -308 -106 -172
3107 -172 -606 229 765 77 39 -110 -671 -628 291 596 -69 -229 -428 -943 -336 732 643 168 -91 -579 -736
3128 -736 -6 956 263 31 19 -150 -328 50 582 14 663 377 -765 -884 196 332 0 101 -172 -770
3148 -770 -177 177 -396 -426 441 487 -215 -471 -334 -255 713 1054 -277 -845 -336 240 -90 226 530 158 281
3169 281 193 -871 -554 645 898 -47 -785 -889 -170 419 554 -598 -724 335 375 -561 -413 -442 214 530
3189 530 310 -634 -982 546 986 234 -360 -55 326 600 212 -586 -521 942 1132 -355 -1188 -325 246
3208 246 827 345 -267 -956 -88 289 -452 -588 44 312 89 -413 -720 -158 970 811 -400 -975 -11
$$ packed form
3066A19P27j67o0j100m91J178N62o02j76M57l28l34O4J96m3O48R9j423m14Q50
3086b38L13M1K31o91k76M70K29m25K61N76J4p14J83k37J86M79O05p72n43K02o6
3107a72m34Q35N36o88l8j49n61M3R19L05o65j60j99n15O07J068q9m75k59m88j57
3128g36P30R62o93k32j2j69j78L78N32n68O49k86j142j19J080J36l32J01k73n98
3148g70N93L54n73l0Q67M6p02k56J37P9R68L41j331n68N09N76l30L16L04l72J23
3169B81q8j064L17J199K53r45p38j04P19N89J35j152j26J059M0r36J48k9O56L16
3189E30k20r44l48J528M40p52n94L05L81K74l88p98O5J463J90j487q33Q63N71
3208B46N81m82o12o89Q68L77p41j36O32K68k23n02l07N62J128j59j211n75R64
$$ plain form
3227 -11 646 855 209 -455 -390 400 797 -202 -638 14 329 157 -290 -492 -298 301 274 -166 -733 498 405
3248 405 -78 -455 -411 155 631 479 -361 -882 97 668 473 206 -120 -286 -42 371 -33 -115 286 236 -642
3269 -642 -416 99 76 -24 -61 -416 -310 93 227 1 -157 -15 -351 27 576 190 -149 -126 15 150 235
3290 235 301 -58 -156 -165 271 270 251 -229 -330 343 176 -90 -220 -276 133 -343 -232 12 74 317 21 -512 -735
3313 -735 387 1050 153 -335 -665 -142 724 519 -315 -411 -2 565 282 -84 -269 -56 335 5 -557 -482
3333 -482 274 426 -176 -705 -620 396 603 213 -872 -782 207 830 310 -570 -623 155 757 416 -333 -468
3353 -468 196 818 40 -522 110 396 698 -164 -739 -354 605 783 -94 -992 -552 437 767 -119 -1037 -741
3373 -741 280 549 61 -361 -39 411 279 -45 -363 -70 655 573 -217 -426 345 827 627 -460 -768 -261
$$ packed form
3227a1O57K09o46o64O5P90L97r99m36O52L15j72m47k02J94N99k7m40n67J231r3
3248D05m83l77M4N66M76j52q40n21R79N71j95k67l26j66K44M13m04q2M01n0q78
3269f42K26N15k3j00l7l55J06M03J34k26j58J42l36L78N49l86l39K3J41J35Q5
3290B35O6l59r8rM36jj9m80j01O73j67k66j30n6M09m76J11K44O2K43k96n33k23
3313g35J122O63q97m88l30N23Q66k05q34r6M09N67k83l66j85K13L91l30n62P5
3333d82P56J52o02n29Q5J016K07l90j085R0R89O23n20q80n3P78O02l41p49j35
3353d68O64O22p78n62O32K86L02q62n75L85R59J78q77q98M40R89L30q86r18K96
3373g41J021K69m88m22L22M50j32l24l18K93P25q2p90k09P71M82k00j087l08N07
$$ plain form
3393 -261 378 678 -205 -933 -275 177 532 -300 -389 -456 294 193 -283 -379 257 574 107 -173 -202 193 742
3414 742 308 -514 -538 52 849 497 -342 -493 -12 299 288 -383 -127 -28 55 16 11 -69 -63 -255 -143 -332 -176
3437 -176 203 358 -37 -41 -117 179 471 104 66 -243 189 172 234 113 138 19 -197 103 263 333 -296 -36 -403
3460 -403 34 189 262 -298 -403 -170 197 130 144 -16 73 -31 -339 -233 298 512 258 -289 -346 160 600 343
3482 343 -181 -603 353 445 137 -324 -260 -47 273 327 -587 -599 -56 358 -179 -147 -75 219 197 121 -602 -138 737
3505 737 800 -2 -635 -102 500 930 612 -498 -758 -2 519 324 -277 -167 54 -145 -245 -582 -202 524
3525 524 441 -449 -764 -207 562 686 101 -206 -461 168 609 -171 -533 -22 641 388 8 -339 -239 358
3545 358 719 -109 -381 -218 520 3 -141 -219 73 582 297 -609 -1036 -191 673 394 -49 -578 -303 22
$$ packed form
3393b61O39L00q83p28O58M52L55q32q9o7P50j01m76r6O36L17m67k80k9L95N49
3414G42m34q22k4N90P97l52q39j51M81L11j1o71K56R9Q3l9nq0Oj92J12j89J56
3437a76L79J55l95mp6K96K92l67l8l09M32j7O2j21K5j19k16L00J60P0o29K60l67
3460d03M37J55P3n60j05K33L67o7J4j60Q9j04l08J06N31K14k54n47n7N06M40k57
3482C43n24m22R56R2l08m61O4K13L20N4r14j2N43M14n37L2P2K94k2p6p23M64Q75
3505G37O3q02o33N33O02M30l18j110k60P56N21j95o01J10K21j99j00l37L80P26
3525E24q3q90l15N57P69J24n85l07k55O29M41p80l62N11O63k53l80l47J00N97
3545C58L61q28k72J63P38n17j44p8K92N09k85r06m27Q45Q64k79m43n29K75L25
$$ plain form
3565 22 250 67 5 455 349 1 -429 31 218 752 109 -218 -588 129 464 81 -196 -104 -184 -81 -61 -357
3587 -357 -451 0 580 51 -127 -451 -244 146 296 171 59 131 -35 -287 -110 615 745 141 91 -192 -459
3608 -459 267 410 -76 -108 -227 -572 -411 297 324 -3 -97 -596 -581 -15 293 -154 62 307 6 -357 26
3629 26 63 105 443 404 0 -395 160 276 319 21 242 -41 52 -85 -355 -158 458 296 -114 -581 -375 -78
3651 -78 336 364 -348 -357 -279 -130 177 -39 267 335 183 -225 -509 149 229 821 12 -414 -458 -43 475 137 -361
3674 -361 -480 173 302 -271 -572 -292 293 355 140 -472 -410 150 366 -80 -236 -13 465 8 -93 -271 -91
3695 -91 401 501 -143 -427 17 321 466 154 -260 -272 -169 193 -317 -489 -281 69 9 -216 -300 -122 420
3716 420 331 -173 -311 101 245 80 -90 -344 145 358 325 22 -286 83 238 203 -10 200 -173 -27 147
$$ packed form
3565B2K28j83o2M50j06l48m30M60J87N34o43l27l70P17L35l83k77R2q0J03K0k96
3587c57r4M51N80n29j78l24K07L90J50j25j12P2j66k52J77P25J30o04n0k83k67
3608d59P26J43m86l2j19l45J61P08K7l27r4m99J5N66L08m47K16K45l01l63L83
3629B6L7M2L38l9m04l95N55J16M3k98K21k83R3j37k70J97O16j62m10m67K06K97
3651g8M14K8p12rP8J49L07k16L06O8j52m08k84O58Q0N92q09m26m4M15N18l38m98
3674c61j19O53J29n73l01K80N85O2k15o12O2N60K16m46j56K23M78m57j01j78J80
3695i1M92J00o44k84M44L04J45l12m14j2J03L62n10j72K08L50o0k25q4J78N42
3716D20q9n04j38M12J44j65j70k54M89K13l3l03l08L69J55l5k13K10l73J46J74
$$ plain form
3737 147 -204 33 -118 316 101 -161 -413 112 23 -36 -226 -319 -32 212 81 -83 -282 11 41 269 50
3758 50 -54 58 99 78 50 152 -53 89 106 -55 -208 14 -156 -408 -207 -209 -163 132 122 -85 -282 -152 18
3781 18 -157 137 107 -63 -81 100 228 126 265 -166 -15 164 -82 111 120 167 80 -54 -428 -45 -59 -301 -145
3804 -145 -33 -248 18 -57 -68 -77 -142 85 299 109 -23 -100 234 149 165 345 -39 132 184 47 28 193 48
3827 48 -30 -77 -352 21 154 -42 -84 -307 -300 -105 36 80 -76 -105 -18 -38 49 -223 10 320 415 161 -156 107
3851 107 131 306 -62 -162 75 126 -13 137 -68 -27 183 139 -134 -224 45 32 143 -105 -395 -190 -12 165
3873 165 1 -189 -145 28 292 143 132 139 97 194 17 -23 199 235 377 -133 -129 137 -103 -9 103 -67 -100 3
3897 3 109 -113 27 -132 63 -55 -3 -194 105 -3 5 -272 -247 39 195 182 17 -69 102 186 162 -82 -163 -124
$$ packed form
3737A47l51K37j51M34k15k62k52N25q9n9j90r3K87K44j31j64j99K93L0K28k19
3758E0j04J12M1k1k8J02k05J42J7j61j53K22j70k52K01kM6K95j0k07j97J30J70
3781A8j75K94l0j70j8J81J28j02J39m31J51J79k46J93RM7q7j34l74L83j4k42J56
3804a45J12k15K66p5j1ro5K27K14j90j32p7L34q5J6J80l84J71N2j37j9J65j45
3827D8p8m7k75L73J33j96m2k23PJ95J41M4j56k9Q7k0Q7k72K33L10R5k54l17K63
3851A07K4J75l68j00K37N1j39J50k05M1K10m4k73r0K69j3J11k48k90K05J78J77
3873A65j64j90M4J73K64j49j1Pm2R7j77m0K22L6J42n10MK66k40R4J12j70l3J03
3897CJ06k22J40j59J95j18N2j91K99j08Qk77K5K86J56j3j65q6J71Q4k4k44q1L9
$$ plain form
3921 -124 -260 -33 -132 86 -230 34 113 -49 -55 -101 -56 -93 264 -163 -120 -140 -65 58 38 149 180 19 158 59
3945 59 188 202 -54 224 81 -69 149 -41 109 -323 -279 35 254 -66 -267 131 10 185 -67 41 -209
3966 -209 174 -4 -59 54 137 26 80 -78 -92 285 88 153 55 -1 65 40 274 -37 -357 103 -169 -222 178
3989 178 130 -30 162 -122 -127 -118 31 -140 -333 -259 -221 -104 -30 -155 -48 -112 -7 158 -116 -364 49 202 -35
4012 -35 -107 -12 -28 -45 66 -76 103 206 -54 -251 -156 -112 30 327 219 -319 -307 -172 -25 -298 -78 127 -84
4035 -84 177 144 -50 57 446 288 -196 -145 -123 234 251 346 220 -280 67 17 -177 -199 276 25 -76 74 -171
4058 -171 -326 65 295 -61 -266 -210 -95 151 117 33 4 172 32 -294 -72 235 -16 -89 352 -134 -99 -30
4080 -30 198 -262 -182 130 -27 -385 43 225 -254 100 -16 -104 -241 -55 214 4 -5 72 -199 0 67 320
$$ packed form
3921a24j36K27r9K18l16K64P9j62om6M5l7L57m27M3k0P5J23k0J11L1j61J39r9
3945E9J29J4k56K78j43j50K18j90J50m32M4L14K19l20k01L98j21J75k52J08k50
3966b09L83j78n5J13Q3j11N4j58j4L77j97O5r8n6O6k5K34l11l20M60k72n3M00
3989A78m8j60J92k84nRJ49j71j93P4L8J17P4j25J07o4J05J65k74k48M13J53k37
4012c5p2R5j6j7J11j42J79J03k60j97R5M4J42K97j08n38J2J35J47k73K20K05k11
4035h4K61l3j94J07L89j58m84N1K2L57J7R5j26n00L47n0j94k2M75k51j01J50k45
4058a71j55L91K30l56k05N6J15K46l4q4k9J68j40l26K22L07k51p3M41m86L5O9
4080c0K28m60Q0L12j57l58M28J82m79L54j16q8j37J86K69k10rP7k71J99O7K53
$$ plain form
4102 320 -61 192 -237 -131 -54 347 -52 63 232 84 13 133 -41 -195 -5 -65 -454 -136 87 -124 -398
4123 -398 148 -15 -243 96 25 8 -82 163 -40 49 85 278 -211 86 355 -71 7 0 -26 -121 173 -90 -265
4146 -265 79 346 -127 -184 50 -27 -323 -92 63 -297 224 114 -390 -585 346 334 176 185 148 -314 133 195
4168 195 97 -17 259 46 -270 -307 -220 -118 308 691 -218 -800 49 135 -49 72 -86 3 298 128 -33 -273
4190 -273 284 460 -206 37 36 251 253 526 -199 -319 191 299 -291 -150 320 150 -15 229 -403 -606 122
4211 122 432 30 -427 -42 -415 65 306 54 -171 57 92 -262 -174 207 245 177 179 -211 -568 183 342 -7
4233 -7 90 345 -227 57 169 -277 -403 198 44 -341 -476 -49 -163 -27 -14 -35 -29 118 70 -400 -183 264 134
4256 134 -100 248 -203 -306 135 465 173 109 -162 -170 -290 352 368 -153 -108 -164 -414 -124 255 37 9 -38 -62
$$ packed form
4102C20l81K53m29J06P7M01l99J15J69j48p1J20j74j54J90o0l89L18K23k11k74
4123c98N46j63k28L39p1j7r0K45k03Q9L6J93m89K97K69m26P8pk6r5K94k63j75
4146b65L44K67m73n7K34p7k96K31J55l60N21j10n04j95R31j2j58Rl7m62M47O2
4168A95r8j14K76k13l16l7Q7J02M26L83r09n82Q49Q6j84J21j58Q9K95j70j61k40
4190b73N57J76o66K43jK15KK73p25j20N10J08n90J41M70j70j65K44o32k03P28
4211A22L10m02m57L85l73M80K41k52k25K28L5l54Q8L81L8o8Kl90l57P51J59l49
4233gR7K55n72K84J12m46j26O01j54l85j35M27j14J36J3k1OJ47m8m70K17M47j30
4256A34k34L48m51j03M41L30k92o4k71qj20O42J6n21M5n6k50K90L79k18k8m7k4
$$ plain form
4279 -62 -64 -23 200 89 96 306 -143 -221 115 325 -133 -186 262 267 17 -60 -165 53 235 282 -258 -383 -54 -198
4303 -198 -8 122 -172 -363 103 296 -232 -121 97 412 -28 -31 -177 -123 407 357 -145 -341 24 393 287
4324 287 161 -267 -338 286 132 -63 -201 50 327 46 -125 -188 -196 164 122 -134 -359 141 332 44 -238 -428
4346 -428 -32 332 349 -169 -313 191 285 -53 -130 -256 136 217 121 -203 -126 50 125 -181 -354 -51 314 173
4368 173 125 -283 -306 68 470 225 -178 -369 -30 357 -14 0 -59 -105 127 43 -8 31 157 542 11 -111 41
4391 41 217 497 -259 -349 -23 19 178 -67 -209 -398 49 19 90 -273 -265 -171 73 -135 220 185 201 92 -338
4414 -338 237 198 188 -61 -193 -267 20 189 203 -157 -71 -318 154 150 109 -60 -167 -250 71 -116 -1 100 -20
4437 -20 76 -97 145 36 231 -198 -23 -191 66 -12 143 145 131 -108 108 339 255 -18 -14 -402 -97 294 -100
$$ packed form
4279f2kM1K23j11PK10m49p8L36K10m58n3M48Nk50p7j05K18J82M7n40j25L29j44
4303a98J90J30k94j91M66J93n28J11K18L15m40lj46N4N30n0n02j96L65L69j06
4324B87j26m28p1O24j54j95j38K51K77k81j71o3qL60m2k56k25N00J91k88k82j90
4346d28L96L64J7n18j44N04R4l38p7j26L92Q1r6l24P7J76P5l06j73L03L65j41
4368A73m8m08k3L74M02k45m03j91L39L87l71J4n9m6K32q4n1L9J26L85n31j22J52
4391D1J76K80p56r0L26M2J59k45j42j89M47l0P1l63QR4K44k08L55l5J6j09m30
4414c38N75l9j0k49j32p4K87J69J4l60Q6k47M72mm1j69j07q3L21j87J15J01j20
4437b0R6j73K42j09J95m29J75j68K57p8J55Kj4k39K16K31q4k73Ml88L05L91l94
$$ plain form
4460 -100 -122 -231 -83 269 379 146 -405 -91 3 2 15 -9 -99 5 34 -121 -68 296 308 329 -95 -263 327 190
4484 190 288 -156 -334 -48 171 449 57 -309 -154 11 -1 -33 -234 -80 185 229 -201 -249 166 54 -139 -112
4506 -112 -133 84 668 129 -190 -461 133 275 296 -229 -51 -146 211 231 -377 -151 4 131 -290 -259 -347 -254
4528 -254 174 212 -351 -481 363 333 212 -69 -140 -39 537 465 -306 -458 443 405 -6 -87 41 -11 133 124 -570
4551 -570 -122 81 28 -445 -187 -123 0 270 181 -404 -610 358 341 32 37 21 -62 174 110 -187 -221 318 322 -169
4575 -169 -132 145 76 11 318 -361 -298 211 410 -194 -232 -5 -28 -134 258 6 -448 284 415 -353 -56 299
4597 299 -354 -228 412 186 -368 256 92 -357 221 403 -239 -361 142 59 -445 96 132 -31 -220 -143 -199
4618 -199 -148 484 234 -483 -323 45 -511 -26 323 -174 -132 188 108 -77 26 230 159 235 273 -241 -156 212
$$ packed form
4460a00k2j09J48L52J10k33n51L14R4jJ3k4r0J04K9j55N3L64J2K1m24j68N90j37
4484A90R8m44j78K86K19K78l92l66J55J65j2l2k01J54K65M4m30m8M15j12j93K7
4506a12k1K17N84n39l19k71N94J42K1n25J78r5L57K0o08K26J55J27m21L1q8R3
4528b54M28L8n63j30Q44l0j21k81p1J01N76p2p71j52R01l8m11q1J28n2J44ro94
4551e70M48K03n3m73K58O4J23K70q9n85k06R68j7l09Nj6q3K36o4k97l4N39Mm91
4575a69L7K77o9o5L07o79O3N09J99o04l8K27k3j06L92k52m54P32J31p68K97L55
4597B99o53J26O40k26n54O24j64m49N78J82o42j22N03q3n04N41L6j63j89P7n6
4618a99N1O32k50p17J60L68n56M85L49m97M2L20q0j85J03K04p1P6L8n14Q5L68
$$ plain form
4640 212 352 -171 55 538 -536 -293 85 -363 -430 720 423 -423 -377 133 181 134 442 -47 -486 -239 216
4661 216 -548 2 479 435 82 93 -233 -260 855 483 -264 -390 343 -151 -210 271 -137 -233 347 101 -740
4682 -740 -365 318 335 48 -61 -321 -641 334 507 -266 -164 594 -16 -476 -53 278 125 628 160 -764
4702 -764 -396 220 467 243 102 -49 -432 25 305 -391 -151 412 -6 -778 -318 -57 105 295 343 -581
4722 -581 -567 128 317 -175 210 247 -472 -5 148 -189 122 757 332 -133 -98 -190 -447 32 400 43 -303
4743 -303 7 -189 -331 -6 371 -29 -10 182 -362 -251 214 517 -224 8 1 -455 -197 220 240 68 272
4764 272 -202 -244 -119 83 38 49 67 5 -268 -246 63 -349 142 239 -292 -301 269 144 -174 -50 232 -70 -166
4787 -166 209 100 -22 131 307 -198 -247 -3 -128 385 100 -93 -211 33 299 -93 -46 23 51 -136 -40 -243
$$ packed form
4640B12J40n23K26M83j074K43L78m48o7J150k97q46M6N10M8m7L08m89m39K47M55
4661B16p64N50M77m4l53J1l26k7J115l72p47j26P33m94n9M81m08r6N80k46q41
4682g40L75O83J7k87j09k60l20R75J73p73J02P58o10m60M23L31j53N03m68r24
4702g64L68O16K47k24j41j51l83M57K80o96K40N63m18p72M60K61J62J90M8r24
4722e81J4O95J89m92L85L7p19M67J53l37L11O35m25m65L5r2k57M79L68l57l46
4743c03L10j96j42L25L77m00J9J92n44J11M65L03p41K32pm56K58M17K0j72K04
4764B72m74m2J25K02m5J1J8o2k73K2L09m12M91R7n31rN70j25l18J24K82l02r6
4787a66L75j09j22J53J76n05m9K44j25N13k85j93j18K44K66l92M7O9K8j87R6k03
$$ plain form
4809 -243 -37 269 44 -162 -374 93 173 202 214 -1 -100 90 274 -14 1 566 388 195 -306 -223 125 286
4831 286 54 -243 -421 269 -29 -138 -329 -120 -53 314 146 -546 -83 303 94 -9 -80 -238 97 196 61
4852 61 -245 35 98 -16 68 -173 -11 54 135 -28 -143 -267 -4 39 -75 -326 -200 122 -127 -148 -174 -34 -67
4875 -67 -78 28 -202 -97 -36 196 101 48 -103 234 145 138 0 150 175 185 -157 -189 -171 -192 2 -189 -86 -334
4899 -334 -98 198 -81 -117 164 85 -256 -16 -292 -217 -17 223 162 -53 41 -63 286 -34 38 -87 -175 23
4921 23 35 97 65 -36 -91 -66 -77 -148 -68 -8 37 -25 -22 12 -49 -115 -51 65 -55 -162 136 -193 192 25 138 -144
4947 -144 278 -1 -90 65 20 110 1 95 18 76 56 90 -117 -196 -50 24 31 81 166 -4 -262 14 -121 -149 175
4972 175 137 -32 -163 -10 98 135 -135 9 23 117 215 -264 150 198 129 -75 39 -197 -165 8 262 -69 -70
$$ packed form
4809b43K06L06k25k06k12M67Q0K9J2k15r9J90J84k88J5N65j78j93n01Q3L48J61
4831B86k32k97j78O90k98j09j91K09O7L67j68o92M63L86k09j03p1j58L35R9j35
4852F1l06K80O3j14Q4k41J62O5Q1j63j15j24K63M3j14k51J26L22k49k1k6J40l3
4875f7j1J06k30J05O1K32r5n3j51L37q9pj38J50K5J0l42l2J8k1J94j91J03k48
4899c34K36K96k79l6K81p9l41K40k76P5K00K40o1k15R4j04L49l20P2j25q8J98
4921B3J2O2l2j01n5K5j1p1Q0O0M5o2LL4o1o6O4J16j20j07K98l29L85j67J13k82
4947a44M22k79q9J55m5R0j09R4p7N8k0L4k07p9J46P4PN0Q5j70k58K76j35k8L24
4972A75l8j69j31J53J08L7k70J44J4R4R8m79M14M8o9k04J14k36L2J73K54l31j
$$ plain form
4995 -70 169 -201 116 41 47 -26 -6 100 -199 33 57 -76 35 -26 -32 -97 92 198 158 -95 113 -127 -293 -42
5019 -42 3 -70 -82 234 96 -316 96 -287 55 112 -16 -44 115 143 -385 60 47 230 115 133 -8 -192 57
5042 57 117 -160 -106 117 1 -313 53 124 -254 64 78 -329 -234 177 -78 -114 108 77 -239 -213 186 63 -77
5065 -77 -62 156 -57 -117 24 -11 254 387 -179 -52 75 -218 98 106 204 -149 2 290 -195 -225 318 123 -241
5088 -241 -75 -46 -197 -66 385 197 -405 284 67 -318 34 347 121 27 437 93 -248 200 274 -6 93
5109 93 174 -315 -79 215 82 -86 245 135 -329 -1 118 -241 -338 420 -6 -465 104 49 -315 -112 348
5130 348 -89 -357 255 30 -183 308 376 -187 -248 379 78 -285 169 -37 -124 -213 -157 -219 -294 414 166 -541
5152 -541 -329 127 -381 222 182 -77 -335 166 18 -192 320 254 271 -133 40 -344 -170 615 280 51 -180
$$ packed form
4995g0K39l70L17p5Op3K0J06k99K32K4j33J11o1oo5J89J06m0k53K08k40j66K51
5019d2M5p3j2L16j38m12M12l83L42N7j28k8J59K8n28M45j3J83j15J8j41j84K49
5042E7O0k77N4K23j16l14L66P1l78L18J4m07R5M11k55l6K22l1l16K6L99j23j40
5065g7J5K18k13o0J41l5K65J33n66J27J27k93L16QR8l53J51K88m85l0N43j95l64
5088b41J66K9j51J31M51j88o02O89k17l85L52L13k26r4M10l44l41M48P4k80R9
5109I3Q1m89K36K94j33j68L31j10m64L28J19l59r7P58m26m59N69n5l64K03M60
5130C48m37k68O12k25k13M91O8n63o1O27l01l63M54k06q7q9N6o2p5P08k48p07
5152e41K12M56n08O03m0k59k58N01j48k10N12o6J7m04J73l84J74P85l35k29k31
$$ plain form
5173 -180 50 -202 -82 317 4 -301 409 -33 -364 164 199 -23 -124 197 -422 -61 293 270 -200 247 137
5194 137 -243 17 236 -1 168 389 -156 -577 -105 455 196 288 242 -112 -632 143 43 -306 -5 484 -187
5215 -187 -299 21 -32 -408 105 302 -249 -19 -193 -142 102 554 188 -251 106 102 -367 -25 371 393 -48 262
5237 262 -57 -322 167 64 -394 70 5 -88 -325 354 32 32 -52 97 -226 -268 122 -37 93 171 389 -345
5259 -345 25 644 -72 -90 295 -12 -330 -64 141 -154 172 54 -221 33 -76 364 -97 166 -71 -416
5279 -416 -447 26 160 221 193 40 -18 65 -53 -113 278 260 -1 -176 -233 108 -30 -77 278 -295 -61 -3 -108
5302 -108 -101 -44 -31 -129 -69 136 -341 -119 164 -44 -333 18 -39 55 -59 -25 -110 -127 204 95 -40 18 78 -138
5326 -138 144 -259 -334 -200 162 86 -208 -197 35 -113 130 -60 -170 7 125 34 -258 -203 -90 34 203 -48
$$ packed form
5173a80K30k52J20L99l13l05P10m42l31N28L5k22j01L21o19L61L54k3m70M47j10
5194A37l80K60K19k37J69K21n45m21M72N60k59R2m6l54n20P75j00l49L01M89o71
5215a87j12L20n3l76N13J97n51K30j74N1K44M52l66m39L57mm69L42L96K2m41L10
5237B62l19k65M89j03m58M64o5r3k37O79l22%q4J49l23m2L90j59J30P8K18p34
5259c45L70O19p16j8L85l07l18K66K05k95L26j18k75K54j09M40m61K63k37l45
5279d16l1M73J34O1k8j53n8Q3j18o0L91j8k61j75n7L41j38m7L55n73K34N8j05
5302a08PN7J3r8O0K05m77K22K83k08k89L51n7R4j14L4q5j7L31j09j35N8O0k16
5326a38K82m03p5J34L62p6k94J1K32j48K43j90j10J77J18r1k92N5J13J24J69k51
$$ plain form
5348 -48 -141 -278 146 100 20 -105 109 162 161 120 90 -92 139 131 -59 -380 39 89 -51 -52 -179 71 -39 171 -34
5373 -34 -255 -188 140 95 -89 -73 -29 88 -59 -128 -90 261 95 40 -179 70 238 58 289 -110 -106 -170 154 -97
5397 -97 -286 -213 -113 -142 -135 -71 -113 100 46 341 83 -168 -115 233 -174 25 164 140 216 -15 -67 149 47 55 -110
5422 -110 -110 -158 37 -173 -68 -102 -44 -157 -114 20 -97 -124 154 1 -145 154 138 -172 -121 197 -58 22 51 137
5446 137 196 152 20 65 -213 -22 -13 211 -110 -19 -154 134 103 -144 -34 -77 197 229 -170 -86 7 45 98 -81
5470 -81 -259 186 99 13 -123 139 84 201 -4 -61 52 136 -61 -86 4 -144 15 176 -282 -169 139 128 -140
5493 -140 137 -275 -31 144 -112 253 52 82 146 189 -2 44 114 138 259 98 -5 105 238 161 -224 -260 59
5516 59 151 -68 -198 -221 -187 280 344 -258 -101 67 32 -42 70 -343 -3 -119 29 -245 -31 323 181 -69
$$ packed form
5348d8r3j37M24m6q0j25K14N3jm1l0j82K31qj90l21M19N0j40jj27K50j10K10k05
5373c4k21O7L28m5j84J6M4J17j47o9L8L51j66n5k19K49J68j80K31l99Mo4L24k51
5397i7j89P3J00k9PO4m2K13n4K95k58k51N3L48m07J99J39k4P6k31n2K16j02Qj65
5422a10%m8J95k10J05l4N8j13M3J34j17k7K78j53j46K99j6l10N1L18k55Q0K9Q6
5446A37N9m4j32M5k78J91RK24l21R1j35K88l1k47J10m3K74L2l99Q4R3L8N3j79
5470h1j78M45q7q6j36K62n5J17k05n7J13Q4j97k5R0j48J59J61m58J13L08j1k68
5493a40K77m12K44J75k56L65k01L0O4M3j91M6P0K4J21j61j03J10J33p7l85l6L19
5516E9R2k19j30k3L4M67O4o02J57J68l5p4J12m13L40j16J48k74K14L54j42k50
$$ plain form
5538 -69 56 -181 -104 57 56 -146 94 110 -189 -87 73 -3 9 0 108 -375 -153 -109 122 -149 -144 163 64 274
5562 274 4 -241 32 122 46 -100 195 -167 65 121 -15 -200 -235 367 -16 -91 112 155 100 -26 113 -168
5584 -168 -123 165 -40 -55 138 -3 -274 9 -86 242 142 128 -206 -175 101 170 144 205 165 -183 28 458 -142
5607 -142 -207 207 -86 -206 77 28 -228 -39 46 -46 -119 167 171 -185 -162 172 56 -195 -7 6 -32 265 197 -246
5631 -246 -236 167 -7 -1 138 -58 206 85 8 -188 -115 268 -33 -203 -72 -304 -112 130 180 -531 70 -61
5653 -61 0 -104 -71 19 -102 98 -144 -109 22 429 169 -307 156 -107 -228 168 167 -203 -81 23 44 -392 -38
5676 -38 323 -74 188 -73 -224 -70 140 49 -176 54 180 137 225 110 -95 -171 224 25 -56 -154 39 -109
5698 -109 15 -46 -200 -194 205 -106 -220 -184 -18 -62 75 301 -141 -157 -51 -52 -34 -121 154 -138 -24 215 -96
$$ packed form
5538f9J25k37P7J61jk02K40J6k99J02J60p6J2rJ08m83K22M4K31k71NL07r9K10
5562B74k70k45K73R0p6j46K95l62K32N6j36j85l5O02l83p5K03M3n5j26J39k81
5584a68M5K88k05j5J93j41k71K83r5L28j00j4l34L1K76O9k6O1m0l48K11M30o00
5607a42o5M14k93j20K83m9k56J89Q5r2p3K86Ml56K3L34j16k51J88J3l8K97o8m43
5631b46J0M03j74OJ39j96K64j21p7j96P3L83l01j70J31k32J92K42N0p11O01j31
5653f1O1j04L3R0j21K00k42L5J31M07k60m76M63k63j21L96jl70J22J04K1m36L54
5676c8L61l97K62k61j51J54K10r1k25K30J26m3Q8j15k05p6L95j99q1r8J93j48
5698a09J24o1j54OL99l11j14L6J66m4J37K26m42j6J06jJ8q7K75k92J14K39l11
$$ plain form
5721 -96 110 107 88 -232 -158 309 -181 -411 -105 -21 159 101 109 -196 8 263 86 -136 168 -31 -106 -64 16 -398
5745 -398 -12 -5 96 -109 66 9 -96 365 -74 -27 -51 -86 -134 98 68 67 101 182 263 -66 -40 -130 4 -73 -10 -187
5771 -187 -162 45 147 92 -114 31 -129 129 35 32 -309 -16 14 21 -93 -143 18 347 217 201 80 47 357 -142
5795 -142 1 -88 -415 -68 -7 -54 -184 212 103 -131 -269 -44 24 53 248 35 -395 -31 154 -3 -104 -49
5817 -49 -108 87 -117 62 -285 9 195 -32 -319 37 47 279 138 -209 182 44 142 -210 -8 -101 3 45
5839 45 18 -83 -210 -76 0 141 -10 -37 -53 64 90 -13 -71 338 73 187 -91 60 118 101 185 7 -145
5862 -145 -21 110 -116 -61 -164 -65 -11 39 -201 -183 -97 89 146 195 -100 -264 -163 32 -34 -151 104 -59 6
5885 6 -23 206 45 164 41 -145 72 -46 -266 -50 -49 19 134 175 -34 -202 134 -25 -154 -7 -97 -108 222
$$ packed form
5721i6K06lj9l20P4M67m90k30L06Q4J80n8Ql05K04K55j77k22L04j99p5M2Q0m14
5745c98L86PJ01k05J75n7j05M61m39M7k4l5m8K32l0jL4Q1Q1l29K6r0J34p7O3j77
5771a87K5K07J02n5k06J45j60K58r4ll41K93L0Pj14n0J61L29j30j6j21l3L10m99
5795a42J43q9l27L47O1m7j30L96j09k34j38K25O8K9J95k13m30L64J85j57j01N5
5817d9n9J95k04J79l47K94J86k27k87L56J0K32j41l47L91j38R8l52K02r3J04M2
5839D5k7j01j27J34P6J41j51k7j6J17K6j03n8M09k65J14k78J51N8j7Q4j78j52
5862a45J24J31k26N5j03R9N4N0k40J8Q6J86N7M9k95j64J01J95o6j17K55j63O5
5885Fk9K29j61J19j23j86K17j18k20K16JO8J15M1k09j68L36j59j29J47r0j1L30
$$ plain form
5908 222 -106 -159 31 192 161 121 153 -171 -41 53 170 250 -244 184 41 79 -81 -89 151 30 -126 -207 -60
5931 -60 109 22 21 -22 -12 -68 186 115 -146 122 201 76 -73 50 27 -214 185 -80 147 -144 58 -42 133
5954 133 -114 141 88 -128 11 62 258 -38 88 160 -48 -23 59 -45 121 36 97 60 129 11 -109 197 -189
5977 -189 61 1 93 -22 34 -50 -208 157 -24 -267 -29 -208 117 -4 -175 -15 -4 154 20 102 -118 19
5999 19 169 -53 -183 8 113 -68 44 12 -39 45 115 21 -4 -13 -34 -115 106 -170 26 110 -73 51 122 -127
6023 -127 -17 17 88 -6 -306 -2 77 46 167 129 -67 -140 -74 122 -64 204 -23 135 -257 159 -67 -93 88
6046 88 -52 71 104 63 51 123 -39 -128 -116 -118 -262 181 -1 8 -168 -149 -123 9 -143 -158 177 -58 19 176 84
6071 84 70 -82 2 -13 -82 -69 -42 58 78 115 -241 121 -153 17 136 -30 15 -3 301 17 -15 50 17 -197 44
$$ packed form
5908B22l28n3J90J61l1m0L2l24J30R4J17Q0m94M28j43L8j60qK40j21j56q1J47
5931f0J69q7jm3J0n6K54p1k61K68P9j25j49J23k3k41L99k65K27k91K02j00J75
5954A33k47K55n3k16J39N1J96k96J26P2k08K5Q2j04J66q5O1l7O9j18j20L06l86
5977a89K50o0R2j15N6q4j58L65j81k43K38j79L25j21j71J60J1J58j34Q2k20J37
5999A9J50k22j30J91J05j81J12l2n1Q4P0r4k5rk1q1K21k76J96Q4j83J24P1k49
6023a27J10L4P1r4l00L04P9l1J21l8j96p3O6J96j86K68k27J58l92M16k26k6J81
6046H8j40J23L3m1j2P2j62q9J2kj44M43j82Rj76J9K6J32j52j5L35k35P7J57r2
6071H4j4j52Q4j5o9J3K7J00K0L7l56L62k74J70J19j66M5j8L04k84l2O5l3k14K41
$$ plain form
6096 44 102 -149 12 303 98 -160 10 263 -26 103 24 35 8 -17 69 171 -119 -7 -13 -27 100 -101 -171 -20
6120 -20 36 19 -27 -131 -27 90 91 116 88 33 -147 83 -154 -75 -156 -40 91 151 -3 269 111 9 87 120 52
6145 52 81 -51 30 -24 63 -25 -23 -157 29 -118 -417 11 -261 -82 -62 113 -306 -106 222 -57 74 30 256
6168 256 -153 -166 154 -29 108 -55 31 12 -104 -91 124 -57 -71 161 -44 75 -240 133 -91 -135 -192 -154 27
6191 27 209 -55 81 9 -115 71 64 -50 -252 -34 105 48 110 -144 -64 -145 60 105 -140 226 -207 -82 68
6214 68 -78 66 -81 120 -123 -106 239 88 -87 -30 13 33 -279 29 192 -272 32 -60 -242 9 198 -55
6236 -55 -110 47 -90 -92 114 -55 -147 -46 311 188 91 227 -2 -67 -133 46 86 -34 328 -10 2 25 116 26
6260 26 -180 26 -36 254 33 -91 -36 140 59 -90 124 185 -346 -289 -31 -119 -139 44 -117 -67 -27 81 99 164
$$ packed form
6096D4N8k51J61K91k05k58J70K53k89J29p9J1k7k5Q6J02k90J12oj4J27k01p0J51
6120b0N6j7m6j04J04J17JK5k8n5j80K30k37P9q1J16J31O0j54K72j58j02P8L3o8
6145E2K9j32Q1n4Q7q8Kj34J86j47k99M28k72J79K0J75m19K00L28k79J31m4K26
6168B56m09j3L20j83J37j63Q6j9j16J3K15j81j4K32k05J19l15L73k24m4n7L8J81
6191B7J82k64J36p2j24J86pj14k02K18J39n7O2k54Q0q1K05M5k45L66m33J25J50
6214F8j46J44j47K01k43J7L45j51j75N7M3K0l12L08J63m64L04r2j82K51J89k53
6236e5n5J57j37kK06j69r2J01L57j23r7J36k29o5o6J79M0j20L62l38J2K3R1r0
6260B6k06K06o2K90k21j24N5J76q1j49K14O1n31N7K58q8k0J83j61N0M0J08J8O5
$$ plain form
6284 164 127 -42 76 211 136 -61 139 268 306 23 -65 163 -86 91 -203 -211 92 -116 -190 102 232 137 1
6307 1 27 45 -133 -46 -178 -113 105 199 277 -196 48 -63 -105 183 239 79 -39 164 87 0 46 -154 -97 -158 198
6332 198 -6 -147 -42 133 204 20 86 -116 -54 -54 -9 69 189 -88 -170 161 124 -93 -261 -205 206 -121 -84 159
6356 159 -49 101 -1 265 -37 38 -23 -115 30 -66 -194 6 100 22 -93 -217 56 5 125 -12 19 176 33
6379 33 -9 -54 150 -143 181 -61 -8 41 -15 128 67 -346 217 56 -35 -4 84 -164 179 -131 -33 148 -238 -64
6403 -64 -109 -113 -45 0 -129 63 -3 27 131 -35 -63 -46 -180 143 -5 157 -23 41 -163 -16 -41 -311 -77 16
6427 16 277 -41 188 31 146 -146 202 33 -12 212 -98 181 -9 84 -127 157 13 2 -122 -42 26 -123
6449 -123 169 214 45 30 -18 39 -168 -137 79 -215 59 48 -5 -63 11 86 67 -128 -212 -106 60 -166 -150 -16
$$ packed form
6284A64l7j69J18J35p5j97K00J29L8k83q8K28k49J77k94qL03k08p4K92J30r5j36
6307AK6J8j78Q7j32O5K18R4P8m73K44j11m2K88N6j60j18K03p7q7M6k00N7o1L56
6332A98k04j41J05J75P1j84O6k02O2%M5P8J20k77q2L31l7k17j68N6M11l27L7K43
6356A59k08J50j02K66l02P5o1r2J45r6j28K00R4p8j15j24K73n1J20j37L1J57j43
6379C3m2m5K04k93L24k42N3M9n6J43o1m13N63j61r1L1Q8k48L43l10R8J81l86J74
6403f4m5mO8M5j29J92o6L0J04j66k8J7j34L23j48J62j80O4k04J47k5k70K34R3
6427A6K61l18K29j57J15k92L48j69m5K24l10K79j90R3k11K84j44j1j24Q0O8j49
6449a23K92M5j69j5m8N7k07L1K16k94K74j1n3n8P4P5j9j95q4J06J66k26J6J34
$$ plain form
6473 -16 -161 101 42 -179 -102 -12 184 -36 137 -76 -100 49 226 -123 -172 157 20 -54 293 -9 -87 -20 -44
6496 -44 145 -180 -4 -131 -39 16 -59 116 153 126 -128 -103 240 39 136 21 146 -26 155 113 -96 -191 184
6519 184 87 -146 -211 13 16 50 -134 -225 -170 241 275 -208 -36 -74 -159 -350 -58 51 -135 54 125 23 -25 -215
6543 -215 205 43 -65 270 -159 102 19 -116 -152 157 -97 -254 45 -82 -97 14 19 26 -112 166 189 61 -18
6566 -18 87 -451 89 78 -94 94 -50 5 -102 103 197 -84 -39 225 -5 56 -71 39 -132 27 61 -115
6588 -115 -131 248 -126 -97 -113 -42 -103 220 386 -137 26 20 45 25 13 89 -279 -172 -33 152 -134 299 -18 -270
6612 -270 -221 104 -104 92 257 -104 -168 130 212 43 218 -8 58 7 113 94 -212 96 68 -184 132 250
6634 250 -249 -20 173 97 -60 379 -122 -204 16 193 -10 -274 -1 -127 -211 114 18 -244 244 190 -222 -132
$$ packed form
6473a6j45K62n9k21P7R0J96k20J73k13k4J49J77l49m9L29j37p4L47l02p8O7k4
6496d4J89l25J76j27R2N5p5J75L7k7k54K5L43k01R7j15J25j72J81m2k09r5L75
6519A84r7k33o5K24LL4j84r1N5M11L4m83J72l8q5j91K92J09j86J89P1j02m8j90
6543b15M20j62j08L35m29K61q3j35l6L09k54j57K99j27j5J11NPj38K78K3j28p9
6566a8J05n38N40j1j72J88j44N5j07K05R4k81M5K64k30O1j27J10j71J59L4j76
6588a15j6L79l74K9j6P1o1L23J66n23J63oK5k0j2P6l68J07J39J85k86M33l17k52
6612b70M9L25k08J96J65l61o4K98Q2j69J75k26O6n1J06j9l06L08k8k52L16J18
6634B50m99K29J93p6j57M39n01q2K20J77k03k64K73j26q4L25r6k62M88n4m12R0
$$ plain form
6656 -132 -99 -22 -264 45 45 -316 38 -74 29 -111 140 124 -281 -196 159 -208 -12 138 14 30 207 -119
6678 -119 -369 34 178 -273 -60 103 -53 -159 -311 113 -298 153 282 -442 -220 181 -87 -174 345 136
6698 136 -273 211 48 -102 -165 134 -141 -6 364 -26 -267 158 -42 -270 -201 210 20 -304 0 -158 -368
6719 -368 22 548 -207 -39 -20 185 -153 28 261 -170 77 117 -68 -96 359 155 -268 148 300 -286 -95
6740 -95 134 -214 -245 396 -36 -401 111 399 -383 131 175 89 -164 239 -22 -56 112 -8 -188 -85 212 -1
6762 -1 35 66 388 -209 35 255 14 -105 282 -383 -268 279 273 -160 -26 411 -73 -107 -22 -15 -80 -54 261 -165
6786 -165 158 -78 -186 -71 125 -18 -420 23 102 -262 232 197 -258 -110 201 -110 -282 -66 272 -173 48
6807 48 101 -83 -258 269 128 -145 -56 -107 -88 82 266 -75 -209 213 188 -252 314 188 31 -170 77 46
$$ packed form
6656a32L3P7k42L09%l61L54j12J03j40K51j6m05Q5L55l67J96J50j24J6J77l26
6678a19k50M03J44m51K13J63j56j06j52M24m11M51J29p24K22M01k68q7N19k09
6698A36m09M84j63j50o3K99k75J35L70l90k41M25k00k28O9M11j90l24L04j58k10
6719c68L90N26p55J68J9K05l38J81K33m31K47M0j85k8M55k04m23M16J52n86J91
6740i5K29l48l1O41m32l65N12K88p82N14M4q6k53M03k61l4J68j20j80J03K97k13
6762aL6L1L22n97K44K20k41j19L87o65J15N47om33J34M37m84l4Q5Po5K6L15m26
6786a65L23k36j08J15J96j43m02M43P9l64M94l5m55J48L11l11j72K16L38m45K21
6807D8N3j84j75N27j41k73Q9n1J9J70J84l41j34M22k5m40N66j26j57k01K47l1
$$ plain form
6829 46 -415 235 23 -69 -132 521 -9 -8 291 -269 -336 -96 95 -211 -94 281 -192 -46 304 -56 -207 -38
6851 -38 113 -231 -78 178 -201 -157 363 -130 62 183 -96 -155 -59 34 -47 -123 -81 -38 -60 44 -66 -33 138 -14
6875 -14 -57 -362 91 114 -99 170 273 4 273 330 -106 -160 -86 133 -81 100 239 152 -321 -94 99 -366
6897 -366 -54 184 -166 125 56 -236 8 199 43 -402 -7 261 -192 235 192 -266 78 5 -136 -29 -148
6918 -148 -99 124 -53 75 210 -154 187 46 67 35 14 -100 -43 -268 131 -122 44 138 -107 159 -234 -3
6940 -3 240 -79 231 50 -75 -38 -150 -183 154 8 -234 -133 113 -16 80 47 -8 -125 134 70 171 90 -88
6963 -88 -50 -7 228 27 -57 -150 -113 173 -38 109 13 -45 -218 -286 22 125 -24 -71 12 -146 120 -46 143 -88
6987 -88 1 47 53 70 168 -21 -394 48 -53 -68 94 -259 196 -150 106 -5 -284 99 -231 -157 -87 65 62 83
$$ packed form
6829D6m61O50k12r2o3O53n30JK99n60o7K40J91l06J17L75m73J46L50l60j51J69
6851c8J51l44J53K56l79M4N20m93J92J21k79n9R6R3q1p6M2M3k2J04j10L3J71j52
6875a4m3l05M53K3k13K69J03k69K69N7m36n4P4K19k14J81J39q7m73K27J93m65
6897c66L12K38l50K91o9k92K44J91j56m45L95K68m53M27m3m58L44p3j41J07j19
6918a48M9K23j77J28J35l64L41j41K1l2k1j14N7k25L99k53J66R4k45K66l93K31
6940cK43l19L10j81j25L7j12l3L37j46k42J01K46j29R6l3n5j17K59o4J01q1j78
6963h8L8M3K35k01q4r3L7K86k11J47r6n8j73o8L08J03j49m7Q3j58K66j66J89k31
6987h8Q9M6OJ7R8j89l73M42j01j5J62l53M55l46K56j11k79L83l30P4P0J52lK1
$$ plain form
7011 83 96 -271 -164 97 162 129 -129 -147 -217 57 305 197 3 -316 71 45 -115 -103 140 -163 1 -95 -95 99
7035 99 173 -135 71 143 174 25 -91 198 66 161 141 -97 -243 77 103 42 14 -18 -119 -109 264 -92 -110 395
7059 395 -82 -137 -65 193 -240 -15 218 221 -108 40 -157 -71 -34 273 -198 156 -11 160 -54 154 178 146 43
7082 43 83 -243 -379 -106 -246 -132 70 23 -235 105 89 -260 -51 189 -6 -197 23 95 -18 301 -11 -166
7104 -166 -568 179 57 33 282 275 -126 -129 125 -103 19 372 -9 44 37 150 -126 -217 81 -246 54 245 127
7127 127 -307 -31 99 -316 6 288 -43 -91 267 431 57 153 -165 -31 -156 263 93 -95 280 0 -326
7148 -326 -164 250 -163 -22 61 -80 -323 117 385 -194 53 127 -203 -360 153 3 -55 167 244 -268 -73
7169 -73 12 -131 -120 463 124 -315 74 156 -121 121 167 27 -155 74 5 -426 151 340 -180 -179 211 -229 -146
$$ packed form
7011H3J3l67J07K61O5l3k58j8p0K74K48j08j94l19L87k6j60J2K43l03J64r6%J94
7035I9P4l08K06P2L1j49j16K89j32R5k0k38j46L20K6o1k8l2j01J0L73l56j8N05
7059C95m77n5P2K58m33K25K33Ll29J48j97Q6L7L07m71L54j67J71k14K08K4l2j03
7082D3M0l26j36K73j40J14K02m7k58L40j6l49K09K40j95j91K20P2j13L19l12j55
7104a66m02P47j22k4K49pm01lK54k28J22L53l81N3pJ13k76r1K98l27L00J91j18
7127A27m34K76J30m15L22K82l31m8L58J64l74R6l18J34j25M19j70j88L75k80l26
7148c26J62M14m13J41Q3j41k43M40K68n79K47P4l30j57N13j50n8K22P7n12J95
7169g3Q5j43J1N83l39m39L89Q2k77K42M6j40j82K29o9m31N77J89n20JL90m40Q3
$$ plain form
7192 -146 475 85 -129 -34 -213 -173 -210 454 -57 -436 -17 -150 -401 62 263 -211 -50 58 -126 -212 204
7213 204 288 -91 -118 139 -275 -318 282 -26 -271 390 246 -164 -70 364 -166 -71 199 254 -447 60 391 -200
7235 -200 146 239 51 -389 157 121 -18 82 98 -332 -251 355 51 -329 269 -18 -256 -31 143 -211 0
7256 0 325 -1 -317 480 204 -282 157 141 -250 -262 302 -161 -69 171 -16 -374 81 108 -173 -183 416 -76
7278 -76 -117 242 80 56 53 252 82 -85 159 1 -561 257 218 -131 -144 460 -29 -98 220 9 -86 20 270
7301 270 -117 -410 -8 -122 -211 169 207 -216 28 199 -26 -252 165 -175 111 13 -26 -89 -238 182 55 -178
7323 -178 22 87 7 294 -3 -243 70 85 -261 -472 -58 -109 -123 267 -12 5 44 201 -300 -54 236 68
7345 68 -405 113 133 -103 -55 149 0 -241 223 -123 -269 -55 89 -197 -159 -145 -79 -123 6 5 18 -28 76 -228
$$ packed form
7192a46O21l90k14R5j79M0l7O64n11l79M19j33k51M63K01m74J61J08j84q6M16
7213B04Q4l79k7K57m14m3O00l08k45O61j44m10R4M34n30R5K70N5p01N07L31n91
7235b00L46R3j88m40N46l6j39J00J6m30Q1O06l04l80N98k87k38K25J74l54K11
7256@L25l26l16P97k76m86M39j6l91j2N64m63R2K40j87l58M55K7k81j0N99m92
7278g6m1L59j62k4lJ99j70j67K44j58n62Q18l9l49j3O04m89o9L18k11r5J06K50
7301B70l87k93M02j14q9L80L8m23K44J71k25k26M17l40K86r8l9o3j49M20j27k33
7323a78K00O5q0K87k97k40L13J5l46k11M14n1j4L90k79J7L9J57n01K46K90j68
7345F8m73N18K0k36M8K04j49k41M64l46j46K14J44k86L8J4O6m4J29jJ3m6J04l04
$$ plain form
7369 -228 -96 200 -23 -184 -187 203 -20 -16 164 46 241 14 -21 57 25 197 102 15 184 -60 -229 -118 153
7392 153 -57 233 91 -122 99 41 -118 51 56 34 -109 101 76 314 113 68 44 -95 -22 -30 -340 155 -152
7415 -152 -98 129 -136 13 -153 81 198 -73 -233 -85 -77 -184 2 97 -32 152 -75 -233 -20 234 -58
7436 -58 67 12 -110 -292 65 108 -113 123 43 161 -20 -62 -209 -89 -47 151 -53 -418 56 -175 -69 -34
7458 -34 -65 -237 -13 126 -41 8 286 -85 43 187 78 -254 91 93 156 -42 -67 -26 136 -184 133 -219 -53
7481 -53 201 -35 -123 -70 -21 52 -72 9 -67 -289 189 31 -66 243 129 129 -30 36 -246 -251 24 -93 -90 -175 44
7506 44 -27 -12 109 -130 5 141 -47 -305 98 -4 -97 4 141 -125 -43 140 -302 -260 -64 338 -16 9
7528 9 83 -92 59 252 115 136 -131 -32 -144 208 3 -109 216 89 -62 -11 350 35 -144 78 11 -30 111
$$ packed form
7369b28J32K96k23j61lL90k23MJ80j18J95k27l5P8l2J72r5q7J69k44j69J11K71
7392A53k10K90j42k13K21n8j59J69Nk2j43K10k5K38k01m5k4j39P3ql10M95l07
7415a52N4K27k65J49j66K34J17k71j60J48Qj07J86R5j29J84k27j58K13K54k92
7436e8J25n5j22j82L57M3k21K36q0J18j81m2j47J20M2J98k04l65M74k31J06L5
7458c4l1j72K24J39j67M9K78l71J28J44j09l32L45KO3j98k5M1J62l20L17l52J66
7481e3K54k36q8N3M9P3j24Q1p6k22M78j58r7L09j14%j59O6k82nK75j17Lq5K19
7506D4p1J5J21k39J35J36j88k58M03j02r3J01J37k66Q2J83m42M2J96M02l54K5
7528IP4j75J51J93j37K1k67R9j12L52k05j12L25j27j51N1L61l15j79K22o7m1J41
$$ plain form
7551 111 195 179 -232 -166 10 11 -98 105 -20 -102 -5 -306 -100 -9 51 -151 -45 183 -79 -30 64 -32 -209 139
7575 139 -8 -177 -83 -30 -112 35 59 -145 -124 191 235 -32 276 130 -91 -176 -161 -141 -151 242 87 -196 -119 95
7599 95 -191 -248 146 195 -295 -67 278 -10 -68 254 124 -168 -7 75 -212 -7 187 -244 -87 68 -86 -258
7621 -258 217 166 -196 -46 141 -157 31 104 -32 4 310 -45 -115 -107 199 -34 -240 315 -208 -393 102 249
7643 249 14 -105 39 -223 -109 333 -73 -201 425 109 -202 -188 285 -140 -164 203 21 -201 446 29 -190
7664 -190 -204 178 82 -110 292 -35 -304 141 304 -180 -63 272 -126 -629 164 131 -101 -27 177 -344 -319 257
7686 257 191 -94 87 -18 -470 28 395 -135 -187 383 -75 -445 193 75 -96 25 219 -477 -482 332 41
7707 41 -276 78 -26 7 -95 393 -276 -411 264 173 -170 66 107 -383 -240 145 -42 -176 70 195 -409
$$ packed form
7551A11Q4j6m11O6J76Jj09K03j25q2R7l01K06R1O0k02J06K28k62M9R4r6j77L48
7575A39j47j69R4N3q2J47K4k04K1L15M4k67L08j46k21q5J5K0j0L93j55k83P7K14
7599I5k86n7L94M9m90K28L45k88n8L22j30k92J61Q2k87K05J94m31J57J55j54j72
7621b58M75n1l62J50J87k98J88P3j36L6L06l55p0QL06k33k06N55n23j85M95J47
7643B49k35j19J44k62J14M42m06j28O26l16l11J4M73m25k4L67j82k22O47m17k19
7664a90j4L82r6j92M02l27k69M45J63m84J17L35l98n03P93l3k32P4K04n21K5N76
7686B57o6k85J81j05m52M98L67n30n2N70m58l70O38j18j71J21J94o96nQ14k91
7707D1l17L54j04L3j02M88o69j35O75r1l43K36M1m90J43L85j87j34K46J25o04
$$ plain form
7728 -409 134 421 -297 161 22 198 -295 19 96 -298 -16 378 -331 -76 306 207 -265 18 37 -351 -92
7749 -92 606 -194 -113 399 -118 76 131 244 -268 18 470 -151 -233 164 -71 -566 216 111 -212 -164 89 -165
7771 -165 -107 367 270 -346 -88 43 -384 6 348 -81 -475 71 -177 -309 240 339 36 -21 249 46 -157
7792 -157 228 37 -303 -32 243 173 -41 328 -82 -427 463 315 -217 -121 41 -205 37 119 -222 -264 189
7813 189 145 -234 -87 444 160 -357 190 -141 -74 410 105 -377 -284 166 -1 -110 165 -100 -359 -7 281
7834 281 -126 -101 311 -224 -142 144 -31 -125 125 198 -261 2 297 19 -13 214 -33 -197 206 45 -129 -80
7856 -80 252 331 -28 199 84 -152 -322 304 55 -64 17 116 -173 23 122 101 239 107 -258 -218 52 31 38
7879 38 -98 3 -50 14 168 -125 46 219 -44 17 -92 -42 -83 -64 64 -225 -107 12 197 22 97 -7 -21
$$ packed form
7728d09N43K87p18M58j39J76m93L14P7l94K82L94p09K55L82r9m72K83J9l88K59
7749i2O98q00Q1N12n17J94N5J13n12K86M52o21q2L97k35m95P82j05l23M8K53k54
7771a65N8M74r7o16K58J31m27L90L42m29l94N46k48j32N49R9l03n7K70k03k03
7792a57L85j91l40K71K75p0k14L69m10l45Q90j48n32R6J62k46K42Q2l41m2M53
7813A89m4l79J47N31k84n17N47l31O7M84l05m82R3M50j67j09K75k65k59L52K88
7834B81m07K5M12n35Q2K86j75r4K50P3m59K63K95k78l2K27k47j64M03j61j74M9
7856h0L32P9l59K27j15k36j70O26k49j19Q1R9k89J96R9k1J38j32l65M0K70k1P
7879C8j36J01n3O4J54k93J71J73k63O1j09N0m1J9J28k89J18J19J85j75P5j04j4
$$ plain form
7902 -21 -44 85 161 -33 209 -3 316 14 180 -159 93 127 204 137 47 -199 4 -9 91 -120 -320 26 120
7925 120 -239 -95 164 67 -129 -102 -164 10 108 -17 -86 -70 -283 -136 -62 126 -92 -50 137 -1 -80 13 171
7948 171 -42 44 45 -62 48 120 155 -129 -86 332 122 113 -78 24 -131 38 145 -139 -320 104 74 106 71 -190
7972 -190 -94 340 290 -134 102 190 73 -29 242 -51 -55 244 6 -125 -231 272 227 -55 -264 -275 19 56 391
7995 391 -99 -96 33 12 -99 -303 -117 -67 -34 -2 -94 -202 209 77 -163 -295 130 133 181 92 -81 -94 -1 101
8019 101 -19 -15 164 -4 -197 -131 82 184 54 156 208 5 141 76 -79 -58 -252 -139 214 221 -342 -188 -78
8042 -78 58 97 -30 219 -15 -89 11 -314 136 248 -111 -100 -99 114 -70 -109 -29 -439 -45 135 -281 48 27
8065 27 50 8 417 -65 -21 -125 82 -154 -90 146 -95 45 203 -192 -22 56 336 -365 -132 187 -29 -189
$$ packed form
7902b1k3J29P6j94K42k12L19l02J66l39K52L4P7o7r0k46K03j3J00k11k00L46R4
7925A20l59J44K59r7j96K7o2J74R8j25o9J6k13J47P4J88k18M2J87j38p9R3J58
7948A71k13Q6Jj07J10P2L5k84M3M18k10rj91J02j55J69J07k84j81M24l0L2l5k61
7972a90R6M34n0m24K36Q8j17j02K71k93mK99k38j31j06N03m5k82k09j1K94L7L35
7995C91m90LJ29k1j11k04J86N0L3L2r2j08M11j32k40j32M25LM8q9j73j3R3J02
8019A01j20MJ79j68j93O6K13J02j30J02N2k03J36o5j55K1j94J13L53Pn63J54J10
8042g8J36L9j27K49k34p4J00l25M50J12l59J1JK13j84l9Q0m10L94J80m16L29k1
8065B7K3m2M09m82M4j04K07k36O4K36k41J40J58l95J70P8K80p01K33L19k16j60
$$ plain form
8087 -189 22 -87 -377 64 164 -326 -45 350 -149 -8 74 -69 40 154 334 -105 74 243 -8 -322
8107 -322 -19 -106 -289 114 20 -221 -79 234 -69 15 93 100 -322 111 95 14 -12 133 -63 -271 -13 117 -30
8130 -30 22 225 -186 -166 195 147 -246 23 179 -257 17 -162 216 -320 347 -73 -518 -25 23 -94 -202 -31
8152 -31 -234 -144 327 -52 -199 -12 99 -211 -94 41 -194 -134 213 67 84 -120 30 -365 95 385 -24
8173 -24 -127 337 62 -535 178 299 -24 -135 464 -353 -228 432 184 -191 145 391 -212 -161
$$ packed form
8087a89K11j09k90M41J00m90K81L95m99J41Q2j43J09J14J80m39J79J69k51l14
8107c22L03q7j83M03r4k41J42L13l03Q4P8Pm22M33j6q1k6J45j96k08K58J30j47
8130c0N2K03m11K0L61m8l93K69J56m36K74j79L78n36O67m20m45M93M8j17j08J71
8152c1k03R0M71l79j47J87J11l10J17J35k35O0L47j46J7k04J50l95M60K90m09
8173b4j03M64k75n97P13J21l23j11N99q17J25O60k48l75L36K46o03N1
8191a61
$$ Imaginary data points
##PAGE= N=2
##DATA TABLE= (X++(I..I)), XYDATA
$$ plain form
0 0 0 0 0 0 0 0 0 0 0 0 0 -8 8 -8 8 -11 16 -16 22 -24 32 -37 45 -50 58 -69 82 -92 105 -119 138 -159 176 -199
34 -199 225 -251 283 -316 351 -391 436 -483 534 -590 650 -719 794 -874 963 -1058 1167 -1289
52 -1289 1418 -1568 1736 -1926 2145 -2399 2697 -3056 3495 -4045 4755 -5712 7070 -9148 12671
67 12671 -19738 39196 -199737 -585672 84571 182818 -119541 224649 298661 -318852 -217753
78 -217753 226999 -109399 -221103 385870 282385 -287602 -111217 49975 -281551 24677
88 24677 515735 40524 -362831 36997 30251 -298596 89502 385584 -49850 -124218 119734
99 119734 -216291 -329034 284972 370351 -119916 -84527 25767 -282114 -99539 384679
109 384679 126442 -208866 76535 60519 -299078 -44310 290090 13316 -67363 161338
$$ packed form
0@%%%%%%%%%%%qJ6j6J6j9K7l2L8m6N6o9Q2r5J08j27J51j74J97k24K57k97L35l75
34a99M24m76N34n99O67p42Q27r19J017j124J240j369J513j668J837k021K225k456
52a289K707k986L304l662M071m544N096n753O551p540Q800j0467J2782j6218K1819
67A2671l2409N8934k38933l85935O70243R8247l02359L44190P4012o17513J01099
78b17753M44752l36398j11704O06973j03485n69987J76385J61192l31526L06228
88B4677M91058m75211m03355L99828o746l28847L88098K96082m35434p4368K43952
99A19734l36025j12743O14006Q5379m90267L5389J10294l07881J82575M84218
109C84679k58237l35308K85401j6016l59597K54768L34400k76774q0679K28701
$$ plain form
119 161338 -97612 -313655 100602 238658 -95222 -19055 153546 -144191 -186593 154576
129 154576 56871 -143944 135025 175590 -202810 -146659 126842 -21127 -54273 212858 64435
140 64435 -234935 -40684 104372 -87627 18904 229871 -27030 -204858 27716 37062
150 37062 -104787 104076 186107 -120824 -144379 78404 -22441 -89767 147758 106221 -156016
161 -156016 -55487 83174 -71971 -32057 162838 3108 -151141 49813 81773 -107013
171 -107013 -9337 119035 -43560 -53659 111804 -13592 -144014 54348 107327 -76270
181 -76270 -20486 91096 -55343 -77430 83330 7657 -94739 74197 98728 -110406 -85022
192 -85022 65062 8233 -3742 91731 -23969 -140385 25372 105835 -36435 -28330 62421
$$ packed form
119A61338k58950k16043M14257J38056l33880P6167J72601k97737m2402L41169
129A54576r7705k00815K78969M0565l78400N6151K73501j47969l3146K67131j48423
140F4435k99370J94251J45056j91999J06531K10967k56901j77828K32574R346
150C7062j41849K08863Q2031l06931k3555K22783j00845o7326K37525m1537k62237
161a56016J00529J38661j55145L9914J94895j59730j54249K00954L1960j88786
171a07013R7676J28372j62595j0099J65463j25396j30422J98362N2979j83597
181g6270N5784J11582j46439k2087J60760p5673j02396J68936K4531k09134K5384
192h5022J50084n6829j1975R5473j15700j16416J65757Q0463j42270Q105R0751
$$ plain form
203 62421 -24375 -53109 56160 9879 -68997 50815 81638 -76310 -74097 53857 30036
214 30036 -9838 32672 -26752 -80560 42277 87661 -46951 -66820 28700 15779 -7202 36188
226 36188 -11650 -68787 23716 69133 -32937 -47112 38681 25175 -20255 1592 -7345 -21802
238 -21802 44367 49759 -54249 -64552 29262 45917 7973 -955 -30697 -44727 27181 59209
250 59209 -18596 -48846 7856 21314 -6657 -3191 -1717 -9018 16024 16280 -32089 -29031 31145
263 31145 37352 -6469 -22734 -16793 -272 35460 33165 -25897 -44793 6060 33544 10041 -9718
276 -9718 -13553 -10810 5868 12428 -7043 -11865 8391 8536 -11901 -13158 1638 11263 13692 -533
290 -533 -24360 -17771 18012 28734 1513 -19629 -13465 4268 15773 12378 -2101 -10047 -5060
$$ packed form
203F2421q6796k8734J09269m6281p8876J19812L0823j57948K213J27954k3821
214C0036l9874M2510n9424n3808J22837M5384j34612j9869R5520j2921k2981M3390
226C6188m7838n7137R2503M5417j02070j4175Q5793j3506m5430K1847q937j4457
238b1802O6169N392j04008j0303R3814J6655l7944q928k9742j4030P1908L2028
250E9209p7805l0250N6702J3458k7971L466J474p301K5042K56m8369L058O0176
263C1145O207m3821j6265N941J6521L5732k295n9062j8896N0853K7484k3503j9759
276i718l835K743J6678O560j9471m822K0256J45k0437j257J4796R625K429j4225
290e33k3827O589L5783J0722k7221k1142O164J7733J1505l395j4479p946M987
$$ plain form
303 -5060 1672 4357 5882 3197 -3883 -7690 -5436 -859 5555 7905 -595 -11326 -10299 1389 8872
318 8872 5635 -2348 -6370 -5314 -1744 4097 9901 6931 -5037 -12224 -4479 10756 16187 4654
332 4654 -10556 -13173 226 13965 10747 -5245 -13795 -4705 6455 5239 -2893 -4840 90 2709
346 2709 -3901 -11405 -3682 13598 11816 -8823 -18498 -4516 14423 19518 2850 -20926 -16784 14255
360 14255 24871 2455 -14624 -9218 3091 11979 7204 -11575 -12403 10920 13941 -10589 -15254
373 -15254 3812 10520 5392 -4613 -19759 -11536 22499 21739 -17665 -26513 2221 16382 13612
386 13612 4864 -18599 -21727 16028 28632 -6852 -16777 7539 6699 -4288 1836 -4278 -7513 19663
400 19663 18602 -28598 -29236 18107 22690 -590 -1960 -13958 -24583 13294 30637 -15178 -25010
$$ packed form
303e060O732K685J525k685p080l807K254M577O414K350q500j0731J027J1688P483
318H872l237p983m022J056L570N841N804k970j1968p187P745J5235N431j1533
332D654j5210k617J3399J3739l218j5992q550R090J1160j216q132j947M930K619
346B709o610p504P723J7280j782k0639r675J3982J8939N095j6668k3776M142L1039
360A4255J0616k2416j7079N406J2309Q888m775j8779q28K3323L021k4530m665
373a5254J9066O708n128j0005j5146Q223L4035p60l9404q848K8734J4161k770
386A3612q748k3463l128L7755J2604l5484r925K4316q40j0987O124o114l235K7176
400A9663j061m7200o38M7343M583k3280j370j1998j0625L7877J7343m5815r832
$$ plain form
413 -25010 17437 13127 -15483 -1704 1734 -13607 15979 31590 -19677 -31654 19208 16476 -15405
426 -15405 7573 15442 -17565 -1991 20334 -22854 -27346 36583 30209 -26116 -14613 855 -24231
439 -24231 6524 46335 -5861 -38383 11369 7311 -33675 9597 41603 -9846 -13806 20288
451 20288 -22655 -38136 39229 43719 -23692 -7796 16281 -34864 -20401 47867 12770 -29590
463 -29590 20853 12433 -55412 -12115 47465 -2471 -12622 37116 -12371 -62623 11290 39452
475 39452 -19317 7908 45533 -32914 -54864 26332 18947 -22252 38055 40663 -53652 -37660
487 -37660 33190 -6564 -14368 62500 23770 -66463 -19163 22901 -27754 8376 74478 -7012
499 -7012 -67394 5659 7931 -42056 30815 72048 -27106 -44612 19346 -25673 -43894 65129
$$ packed form
413b5010M2447m310k8610J3779L438j5341K9586J5611n1267j1977N0862k732l1881
426a5405K2978P869l3007J5574K2325m3188m492O3929o374n6325J1503J5468k5086
439b4231L0755L9811n2196l2522M9752m058m0986M3272L2006n1449l960L4094
451B0288m2943j5481P7365M490o7411J5896K4077n1145J4463O8268l5097m2360
463b9590N0443q420o7845M3297N9580m9936j0151M9738m9487n0252P3913K8162
475C9452n8769K7225L7625p8447k1950Q1196p385m1199O0307K608r4315J5992
487c7660P0850l9754p804P6868l8730r0233M7300M2064n0655L6130O6102q1490
499g012o0382P3053K272m9987P2871M1233r9154j7506O3958m5019j8221J09023
$$ plain form
511 65129 64198 -44448 -24459 18048 -47570 -21659 81613 28459 -48307 14763 11272 -73915
523 -73915 -7075 81452 6241 -25272 34638 -28284 -86944 28155 74821 -19196 -4630 40834
535 40834 -53507 -71188 47965 40288 -25051 40248 37139 -86917 -53964 60891 19150 -9113
547 -9113 62296 2683 -98466 -11150 57879 -17018 5755 77032 -22157 -88627 11127 23234
559 23234 -33910 46977 75949 -59458 -71700 30781 -3703 -30572 71782 47840 -72945
570 -72945 -27759 32340 -42923 -15380 94470 23861 -68535 1705 8140 -61606 22536 96363
582 96363 -13813 -53272 24984 -19121 -63674 49463 73216 -35745 -19471 28939 -53928
593 -53928 -49443 72737 44446 -43024 9449 16058 -72474 -19009 76539 9153 -31209 38025
$$ packed form
511F5129r31j08646J9989M2507o5618K5911J03272n3154p6766O3070l491q5187
523g3915O6840Q8527p5211l1513N9910o2922n8660J15099M6666r4017J4566M5464
535D0834r4341j7681J19153p677o5339O5299l109j24056L2953J14855m1741k8263
547i113P1409n9613j01149Q7316O9029p4897K2773P1277r9189o6470R9754J2107
559B3234n7144Q0887K8972j35407j2242J02481l4484k6869J02354k3942j20785
570g2945M5186O0099p5263K7543J09850p0609r2396P0240O435o9746Q4142P3827
582I6363j10176l9459P8256m4105m4553J13137K3753j08961J6274M8410q2867
593e3928M485J22180k8291q7470N2473O609q8532N3465R5548o7386m0362O9234
$$ plain form
605 38025 -3788 -78356 8911 63932 -14353 -3536 49823 -33817 -70225 34136 39814 -28185
617 -28185 23221 43318 -58501 -48865 46237 9472 -27227 46215 22965 -70617 -18435 44178
629 44178 -18165 -11458 60005 -3516 -65510 12491 28667 -36366 13038 60206 -27364 -46191
641 -46191 32441 4059 -39998 36392 44951 -43273 -20146 34750 -23161 -29086 51194 19043
653 19043 -47431 6183 23383 -42226 -7425 55391 -6779 -37629 25841 4575 -46015 17381
665 17381 45200 -27151 -18237 34953 -13807 -34871 34153 22152 -34390 8501 30788 -33131
677 -33131 -18851 41290 260 -30211 23763 12408 -40185 3417 34645 -22191 -18651 33051
689 33051 -2543 -33604 16547 16615 -27640 5239 29612 -23405 -21861 29751 5143 -24840 14711
$$ packed form
605C8025m1813p4568Q7267N5021p8285J0817N3359q3640l6408J04361N678o7999
617b8185N1406K0097j01819R636R5102l6765l6699P3442k3250r3582N2182O2613
629D4178o2343O707P1463o3521o1994P8001J6176o5033M9404M7168q7570j8827
641d6191P8632k8382m4057P6390Q559q8224K3127N4896n7911n925Q0280l2151
653A9043o6474N3614J7200o5609L4801O2816o2170l0850O3470k1266n0590O3396
665A7381K7819p2351Q914N3190m8760k1064O9024j2001n6542M2891K2287o3919
677c3131J4280O0141m1030l0471N3974j1355n2593M3602L1228n6836L540N1702
689C3051l5594l1061N0151O8m4255L2879K4373n3017J544N1612k4608k9983L9551
$$ plain form
702 14711 14705 -26166 1174 28004 -14922 -18775 25433 6835 -23890 7404 14460 -18098 -941
715 -941 20012 -15396 -18798 21728 9057 -21653 1226 10686 -13978 -152 19210 -10440 -18128
728 -18128 17011 11249 -16554 223 12484 -7332 -1543 13677 -7951 -13942 15509 11615 -14509
741 -14509 -3136 10378 -5069 -3145 9688 -6659 -12210 12078 10145 -14746 -7889 7931 -813
754 -813 -1666 6979 -5683 -11598 8305 9964 -8617 -4069 8496 329 -3615 3986 -1384 -4890 8975
769 8975 8302 -9411 -7219 6687 3375 -1399 1992 -3289 -6616 4327 6215 -6082 -5799 3752 1045
784 1045 -3204 413 -620 -3094 2819 3237 -4500 -2689 5160 2416 -1838 248 241 -696 4042 3778 -3128
801 -3128 -3599 2065 2280 -165 398 -52 -2324 -1123 711 446 7 -732 -3137 -2515 1486 2235 -555
$$ packed form
702A4711om0871K7340K6830m2926l853M4208j8598l0725L1294P056l2558J7157
715i41K0953l5408l402M0526j2671l0710K2879R460k4664J3826J9362k9650p688
728a8128L5139n762k7803J6777J2261j9816N789J5220k1628n991K9451l894k6124
741a4509J1373J3514j5447J924J2833j6347n551K4288j933k4891O857J5820q744
754h13q53Q645j2662n915J9903J659j8581M548J2565q167l944P601n370l506J3865
769H975o73j7713K192J3906l312m774L391n281l327J0943J888j2297K83R551k707
784A045m249L617j033k474N913M18p737J811P849k744m254K086pr37M738k64o906
801c128m71N664K15k445N63m50k272J201J834k65m39p39k405O22M001P49k790
$$ plain form
818 -555 -1467 -924 -511 -56 773 514 212 1293 1137 -748 -708 2033 3801 1232 -3987 -4049 2038 6559
836 6559 2313 -4413 -5473 257 4482 2208 -3690 -5394 -1267 3632 2527 -2701 -4119 742 4028
851 4028 140 -5296 -3761 4594 8180 565 -8133 -4291 7029 8988 281 -7077 -5728 2799 9465
866 9465 4164 -7271 -7554 3042 7350 34 -6500 -5230 1565 6368 24 -9291 -3600 9281 6075
881 6075 -7073 -9007 -1198 6402 9835 1412 -12361 -8087 10863 12199 -2040 -7732 -3306 2532
895 2532 7381 3631 -8797 -4991 11105 6062 -10627 -7812 3393 4296 4011 445 -11958 -7555
909 -7555 13291 9827 -11324 -8827 4426 4273 4055 2047 -11711 -8013 15907 12249 -11062 -7541
923 -7541 5177 -619 706 8472 -3388 -7692 10147 4356 -17361 -4710 16172 4814 -4696
$$ packed form
818e55r12N43M13M55Q29k59l02J081j56j885M0K741J768k569n219o2O087M521
836F559m246o726j060N730M225k274n898j704M127M899j105n228j418M861L286
851D028l888n436J535Q355L586p615q698L842J1320J959q707p358J349Q527O666
866I465n301j1435k83J0596M308p316o534J270O795M803o344r315N691J2881l206
881F075j3148j934P809P600L433q423j3773M274J8950J336j4239n692M426N838
895B532M849l750j2428L806J6096n043j6689K815J1205R03k85l566j2403M403
909g555K0846l464k1151K497J3253j53k18k008j3758L698K3920l658k3311L521
923g541J2718n796J325P766j1860m304J7839n791k1717J2651K0882j1358r510
$$ plain form
936 -4696 -880 -12451 -11252 17392 16402 -13228 -9519 6287 -5535 -5488 13538 3253 -9912 7933
950 7933 5481 -18490 -4088 20584 2992 -8149 7083 -3494 -15962 9488 14549 -12221 -3747
963 -3747 16017 -6423 -16316 8388 3920 -11576 10527 14615 -18256 -13200 12135 -2800 -7204
976 -7204 21089 8841 -24053 -6704 10485 -7281 3704 25865 -3558 -24921 4117 7126
988 7126 -12356 10761 24783 -11638 -19445 5815 -4895 -9263 25671 17807 -26965 -15562 12043
1001 12043 -5468 -5288 21314 2036 -20695 7337 9351 -24374 -4421 30009 3647 -14658
1013 -14658 6812 -6075 -20824 18193 26160 -17762 -10382 21209 -6966 -24864 11792 13360
1025 13360 -8260 14931 12416 -37462 -22419 31946 15505 -12472 7686 -3152 -29764 6815
$$ packed form
936d696L816j1571J199K8644r90k9630L709J5806j1822M7J9026j0285j3165J7845
950G933k452k3971J4402K4672j7592j1141J5232j0577j2468K5450N061k6770Q474
963c747J9764k2440r893K4704m468j5496K2103M088l2871N056K5335j4935m404
976g204K8293j2248l2894J7349J7189j7766J0985K2161k9423k1363K9038L009
988G126j9482K3117J4022l6421p807K5260j0710m368L4934p864m4772J1403K7605
1001A2043j7511J80K6602j9278k2731K8032K014l3725J9953L4430k6362j8305
1013a4658K1470j2887j4749L9017P967m3922P380L1591k8175j7898L6656J568
1025A3360k1620K3191k515m9878J5043N4365j6441k7977K0158j0838k6612L6579
$$ plain form
1037 6815 27033 -14838 -9221 30781 -2560 -36732 3185 18725 -5015 15383 19765 -33837
1049 -33837 -27363 31727 16077 -19908 7975 10932 -22733 342 21326 -20324 -15477 36717
1061 36717 9702 -36440 -3017 15826 -13242 5707 25508 -20396 -23953 27498 8636 -32176
1073 -32176 5440 26200 -10572 -2879 16036 -23758 -20145 38630 20140 -31195 -3641 16725
1085 16725 -17652 -3111 27932 -9044 -21037 23168 6197 -35693 2169 30252 -8484 -9804
1097 -9804 14215 -16215 -21170 30191 18305 -30245 -4562 22094 -11779 -9280 22784 -4660
1109 -4660 -21753 19279 14892 -26053 -1000 25051 -11062 -14803 19154 -597 -19695 15589
1121 15589 12783 -26961 -3880 26441 -7670 -16931 14938 -416 -21215 13850 18319 -20702
$$ packed form
1037F815K0218m1871N617M0002l3341l4172L9917J5540k3740K0398M382n3602
1049c3837O474N9090j5650l5985K7883K957l3665K3075K0984m1650M847N2194
1061C6717k7015m6142L3423J8843k9068J8949J9801m5904l557N1451j8862m0812
1073c2176L7616K0760l6772P693J8915l9794L613N8775j8490n1335K7554K0366
1085A6725l4377J4541L1043l6976j1993M4205j6971m1890L7862K8083l8736j320
1097i804K4019l0430m955N1361j1886m8550K5683K6656l3873K499L2064k7444
1109d660j7093M1032m387m0945K5053K6051l6113l741L3957j9751j9098L5284
1121A5589k806l9744K3081L0321l4111r261L1869j5354k0799L5065M469l9021
$$ plain form
1133 -20702 -7367 20549 -7701 -14381 20527 5884 -23257 5476 17097 -14368 -2995 21605
1145 21605 -8829 -20009 16717 10170 -18819 4656 15838 -17346 -10076 19035 -2351 -14203
1157 -14203 15565 5145 -25882 -499 22544 -4753 -8529 11387 -8327 -16575 18460 14784
1169 14784 -19440 -3856 16938 -6988 -9306 13995 -551 -12908 13796 9286 -22190 -4399
1181 -4399 21149 -2173 -12060 7364 -1581 -11126 12807 8127 -22012 -5302 21977 1064 -13588
1194 -13588 2839 -1977 -8242 15159 11802 -19407 -8312 17706 903 -11236 6776 4937 -5765
1207 -5765 6948 3508 -18855 -3140 23533 4648 -16000 -3876 -252 -3102 11496 7944 -17199
1220 -17199 -8656 15304 3400 -12503 913 5498 -2272 4172 2447 -13464 -2956 18097 4218
$$ packed form
1133b0702J3335K7916k8250o680L4908j4643k9141K8733J1621l1465J1373K4600
1145B1605l0434j1180L6726o547k8989K3475J1182l3184P270K9111k1386j1852
1157a4203K9768j0420l1027K5383K3043k7297l776J9916j9714q248L5035l676
1169A4784l4224J5584K0794k3926k318K3301j4546j2357K6704m510l1476J7791
1181d399K5548k3322r887J9424q945r545K3933m680l0139J6710K7279k0913j4652
1194a3588J6427m816o265K3401l357l1209J1095K6018j6803j2139J8012j839j0702
1207e765J2713l440k2363J5715K6673j8885k0648J2124L624k850J4598l552k5143
1220a7199Q543K3960j1904j5903J3416M585p770O444j725j5911J0508K1053j3879
$$ plain form
1233 4218 -13566 -2257 6156 670 4285 1829 -11700 -2525 16274 4014 -13968 -4533 5586
1246 5586 2056 3426 1407 -10293 -4494 10178 2587 -9638 -407 6403 -746 -2175 -784 -5131
1260 -5131 1438 12022 1861 -12261 -4016 7396 4206 1666 -278 -6368 -2397 7565 3446 -5814
1274 -5814 -1369 3936 -982 -2118 361 -1583 -648 4060 -836 -6889 -788 5279 1043 -3012 -1404
1289 -1404 -1215 649 4294 1773 -3957 -1620 2962 1308 542 1713 -382 -1933 881 1930 199
1304 199 635 586 -2286 -1997 1488 1542 -743 -916 -477 -1004 -254 508 -285 -35 889 -1153 -2329 289 2985
1323 2985 2417 -629 -2761 -1842 2389 4627 1092 -3637 -2648 2160 4123 856 -2461 -2502 1197 2718
1339 2718 -364 -3461 -1669 2489 2033 -2113 -4645 -1286 4134 3596 -2534 -5919 -1346 5156 5220 -1526
$$ packed form
1233D218j7784J1309Q413n486L615k456j3529R175J8799j2260j7982R435J0119
1246E586l530J370k019j1700N799J4672p591j2225R231O810p149j429J391m347
1260e131O569J0584j0161j4122Q245J1412l190k540j944o090L971R962m119r260
1274e814M445N305m918j136K479j944R35M708m896o053O101O067m236m055J608
1289a404J89J864L645k521n730K337M582j654p66J171k095j551K814J049j731
1304A99M36m9k872K89L485N4k285j73M39n27P50P62p93K50R24k042j176K618K696
1323B985n68l046k132R19M231K238l535m729R89M808J963l267l317m1L699J521
1339B718l082l097J792M158m56m146k532L359N420n38o130l385M573O502O4o746
$$ plain form
1355 -1526 -5749 -1991 4719 5437 -664 -4951 -1625 4443 3732 -1630 -4227 -500 4223 3375 -3385 -5618
1371 -5618 305 5703 2532 -4766 -6110 4 5455 3963 -3663 -7174 -649 6747 3665 -3454 -4559
1386 -4559 -41 4179 3476 -1638 -4801 1116 6668 1491 -4900 -2798 2396 4260 2110 -3335 -6262
1401 -6262 984 7524 963 -6506 -3432 1849 2919 1983 -2420 -6043 584 7077 777 -5758 -1387
1416 -1387 2741 796 1097 -10 -3643 1133 6797 -806 -6653 710 5028 1195 312 -972 -5540
1431 -5540 -352 7320 674 -6678 0 2561 -2675 -269 2526 -2858 -1268 5139 -1438 -7398 1918
1446 1918 5436 -2237 -734 3004 -3579 -2527 6550 1196 -5763 2586 5357 -4389 -2238 4821 -1666
1461 -1666 -2906 5832 1189 -7747 931 4234 -4688 -891 7314 -2553 -7208 3347 1778 -5396 3367
$$ packed form
1355a526m223L758O710P18o101m287L326O068p11n362k597L727M723q48o760k233
1371e618N923N398l171p298j344O114N451j492p626l511O525P396l082p119j105
1386d559M518M220p03n114l163N917N552n177o391K102N194J864k150n445k927
1401f262P246O540o561p469L074N281J070r36m403l623O627O493o300o535M371
1416a387M128j945L01j107l633M776N664p603n847P363M318l833q83j284m568
1431e540N188P672o646p352O678K561n236K406K795n384J590O407o577n960R316
1446A918L518p673J503L738o583J052R077n354o959Q349K771r746K151P059o487
1461a666j240Q738m643q936Q678L303q922L797Q205r867m655J0555j569p174Q763
$$ plain form
1476 3367 6571 -5960 -4138 6173 -1542 -5267 6925 5367 -6873 -451 4321 -5513 -1040 11145
1490 11145 -173 -9712 2668 3905 -6206 1229 7573 -5335 -4623 7476 -1650 -10421 4929
1503 4929 8350 -5991 -2542 4716 -6120 -3889 10969 1740 -10563 3245 7766 -7278 -2860
1516 -2860 8361 -2413 -3624 9766 -96 -13124 3557 11804 -5202 -3784 6548 -4931 -6766
1529 -6766 9635 2696 -11777 3214 9929 -8737 -6816 8530 -947 -5020 9791 963 -15000
1542 -15000 2486 13335 -5003 -5479 8589 -2603 -8285 9268 4487 -11671 2878 12031 -8129
1555 -8129 -8630 9106 933 -7234 7772 3299 -14068 566 12679 -5812 -8132 9193 430
1568 430 -9514 5722 4946 -10848 1435 13581 -6293 -10326 8258 3247 -7279 6736 6248 -11529
$$ packed form
1476C367L204j2531J822J0311p715l725J2192j558j2240O422M772r834M473J2185
1490A1145j1318r539J2380J237j0111P435O344j2908P12J2099r126q771J5350
1503D929L421j4341L449P258j0836K231J4858r229j2303J3808M521j5044M418
1516b860J1221j0774j211J3390r862j3028J6681Q247j7006J418J0332j1479j835
1529f766J6401o939j4473J4991O715j8666J921J5346r477m073J4811q828j5963
1542a5000J7486J0849j8338m76J4068j1192n682J7553m781j6158J4549R153k0160
1555h129n01J7736q173q167J5006m473j7367J4634J2113j8491k320J7325q763
1568D30r944J5236p76j5794J2283J2146j9874m033J8584n011j0526J4015m88j7777
$$ plain form
1582 -11529 -1656 12118 -4242 -8079 9837 3032 -10967 2330 6053 -9169 -477 12708 -5127
1595 -5127 -11927 6804 3856 -8560 4430 7935 -9576 -4231 10106 -2586 -8087 9472 5520
1608 5520 -10320 613 7486 -6695 -2199 12194 -1158 -10559 4912 4145 -8895 1963 9905
1621 9905 -5940 -6380 7479 -1776 -9269 7148 7352 -8936 -1905 6861 -6281 -5759 10357 2654
1635 2654 -8926 3424 4907 -8930 -361 10943 -2259 -6332 7067 596 -9130 4280 8124
1648 8124 -6310 -1876 7942 -5118 -8708 7526 4179 -7124 2451 5176 -9103 -3933 9404
1661 9404 -883 -6258 6418 1919 -9611 1164 7494 -3982 -1473 8604 -2819 -9104 5470
1674 5470 5427 -5249 2267 6620 -6223 -4660 6771 -293 -5562 5462 4127 -7990 -1869 5301
$$ packed form
1582a1529R873J3774j6360l837J7916o805j3999J3297L723j5222Q692J3185j7835
1595e127o800J8731k948j2416J2990L505j7511N345J4337j2692n501J7559l952
1608E520j5840J0933O873j4181M496J4393j3352r401J5471p67j3040J0858P942
1621I905j5845m40J3859r255p493J6417K04j6288P031Q766j3142N22J6116p703
1635B654j1580J2350J483j3837Q569J1304j3202m073J3399o471r726J3410L844
1648H124j4434M434R818j3060l590J6234l347j1303R575K725j4279N170J3337
1661I404j0287n375J2676m499j1530J0775O330j1476K509J0077j1423o285J4574
1674E470m3j0676P516M353j2843J563J1431p064n269J1024j335j2117O121P170
$$ plain form
1688 5301 -3808 -2134 7494 -921 -8098 2577 3712 -5379 858 7096 -3057 -4294 4508 -297
1702 -297 -5238 4764 5493 -4880 -1761 4137 -3056 -2638 6367 1519 -5527 1230 2467 -5198 -765
1717 -765 5368 -1201 -3878 2731 -336 -5257 1731 4372 -2856 -1440 3350 -2047 -3365 3660 2842
1732 2842 -2935 1021 2745 -3258 -1519 3989 482 -2222 2437 951 -3972 -163 3212 -1288 -952
1747 -952 2762 -1497 -3530 1393 1603 -1946 -15 2302 -2110 -2120 1875 306 -1722 1980 1750 -2193
1763 -2193 -534 2223 -418 -300 2500 218 -2106 660 1616 -847 8 1950 -367 -1475 598 -89
1779 -89 -2032 518 1246 -1842 -1274 717 -378 -887 1149 441 -1516 -183 958 -906 -169 1878 554
1796 554 -536 826 584 -783 456 1086 -167 -142 611 -519 -880 832 596 -807 -722 286 -790
$$ packed form
1688E301r109J674R628q415p177J0675J135r091O237O238j0153j237Q802m805
1702b97m941J0002P29j0373L119N898p193M18R005m848p046O757J237p665M433
1717g65O133o569k677O609l067m921O988K641p228J416M790n397j318P025q18
1732B842n777L956J724o003J739N508l507k704M659j486m923L809L375m500L36
1747i52L714m259k033M923K10l549J931K317m412j0L995j569k028L702k30l943
1763b193J659K757k641J18K800k282k324K766R56k463Q55J942k317j108K073o87
1779h9j943K550P28l088N68J991j095n09K036p08j957J333J141j864P37K047j324
1796E54j090J362k42j367J239O30j253K5P53j130l61J712k36j403Q5J008j076
$$ plain form
1813 -790 -512 293 -188 -792 92 321 -528 -299 107 97 277 310 -9 -211 818 1089 -117 -384 75 280
1833 280 522 302 -428 -415 521 513 -353 -1029 -664 414 315 -444 -1031 -654 542 739 -657 -916 -159 604
1853 604 1005 -45 -833 41 1123 1161 -222 -959 -171 1389 1145 -282 -1241 -206 1110 995 -1033 -1257
1871 -1257 -59 1152 471 -1095 -1419 -281 1195 401 -1165 -1651 233 1322 718 -693 -1241 285
1887 285 1557 905 -1161 -1231 852 1700 479 -959 -782 -18 1460 750 -1474 -1562 992 1390 -52 -1383
1905 -1383 -935 -41 674 328 -1772 -1581 1141 1464 -519 -1048 -264 115 1304 809 -1130 -1101 1448 1668
1923 1668 -591 -706 289 135 776 917 -1284 -1502 1308 1282 -1465 -815 462 -553 -50 757 -1038 -1755
1941 -1755 951 1144 -1613 -730 961 -324 -447 1242 -453 -1209 1569 1499 -1289 -54 1607 -568
$$ packed form
1813g90K78Q05m81o04Q84K29q49K29M06j0J80L3l19k02J029K71j206k67M59K05
1833B80K42k20p30J3R36qq66o76L65J078r9p59n87L77J196J97j396k59P57P63
1853F04M01j050p88Q74J082L8j383p37P88J560k44j427r59J035J316j15k028k24
1871a257J198J211o81j566l24J138J476p94j566m86J884J089o04j411n48J526
1887B85J272o52k066p0K083Q48j221j438J77P64J478p10k224q8K554L98j442j331
1905a383M48Q94P15l46k100J91K722L23j983n29P84L79J189m95j939K9K549K20
1923A668k259j15R95j54O41J41k201k18K810k6k747O50J277j015N03Q07j795p17
1941a755K706J93k757Q83J691j285j23J689j695p56K778p0k788J235J661k175
$$ plain form
1957 -568 -874 1812 78 -1672 781 1211 -1995 -460 1749 -1230 -1663 1167 61 -2194 522 1297
1973 1297 -1507 -409 1770 -1178 -2270 2358 1466 -2030 349 1441 -1162 165 2609 -1029 -1994
1988 -1994 2606 1827 -2628 -633 2021 -790 -486 2097 -1697 -3015 2448 2036 -3376 -1120 1966 -835
2004 -835 -712 1779 -1815 -2978 3151 2873 -3722 -1889 2704 275 -243 2480 -962 -3128 2896 2920
2020 2920 -3561 -1755 3641 397 -1690 1152 -1443 -3017 3638 3524 -4547 -3197 3210 661 -2040
2035 -2040 1446 -699 -3079 2653 3180 -4409 -2484 4511 1744 -2130 746 -575 -2669 3280 4160
2050 4160 -3991 -3098 4434 1037 -3112 1069 790 -2361 2453 3332 -5228 -3725 4787 2157 -3135 520
2066 520 155 -3646 1418 4237 -3485 -3159 5077 1352 -4506 317 2443 -1528 1873 3806 -3984 -3919
$$ packed form
1957e68l06K686j734j750K453M30l206J535K209k979m33K830j106k255K716P75
1973A297k804J098K179k948j092M628q92l496K379J092k603J327K444l638r65
1988a994M600p79m455J995K654k811L04K583l794j318N463m12n412K256L086k801
2004h35J23K491l594j163O129k78o595J833M593k429n18K723l442k166O024K4
2020B920o481J806N396l244k087K842k595j574O655j14q071J350O407k549k701
2035b040L486k145k380N732N27p589J925O995k767l874K876j321k094N949Q80
2050D160q151Q93P532l397m149M181k79l151M814Q79q560J503Q512k630n292L655
2066E20l65l801N064K819p722L26Q236l725n858M823K126l971L401J933p790O5
$$ plain form
2082 -3919 4741 2696 -3276 551 1944 -2811 -71 3191 -2924 -2879 4855 1791 -5344 -787 2539
2097 2539 -2167 251 3875 -2702 -4347 3635 1811 -3894 651 3661 -2184 -1107 3304 -1650 -2814
2112 -2814 4569 2994 -4310 -413 2761 -2538 -1131 4300 -672 -3921 2031 1187 -4090 545 4061
2127 4061 -2253 -2562 2880 -948 -3675 2857 2979 -3151 -97 2915 -2826 -2011 4652 1508 -3656 888
2143 888 1752 -3011 858 4349 -2057 -2851 3544 260 -4210 645 2845 -1820 -237 2315 -3426 -3261
2159 -3261 3848 2224 -4123 -370 1983 -1976 -333 2760 -2209 -2064 4422 1768 -4651 -814 3292
2174 3292 6 270 2134 -2855 -3151 3769 2421 -3776 -1038 2866 -843 -1779 1195 -1835 -1608 4196
2190 4196 1532 -5151 -2201 3352 1100 -462 962 -2197 -2117 3699 2613 -3540 -1100 3673 625
$$ packed form
2082c919Q660k045n972L827J393m755K740L262o115M5P734l064p135M557L326
2097B539m706K418L624o577j645P982j824n705M545L010n845J077M411m954j164
2112b814P383j575p304L897L174n299J407N431m972l249N952q44n277M635L516
2127D061o314l09N442l828k727O532J22o130L054L012n741Q15O663l144n164M544
2143H88Q64m763L869L491o406p94O395l284m470M855K200m665J583K552n741J65
2159c261P109j624o347L753K353l959J643L093m969J45O486k654o419L837M106
2174C292l286K64J864m989k96O920j348o197K738L904l709r36K974l030K27N804
2190D196k664o683K950N553k252j562J424l159Q0N816j086o153K440M773l048
$$ plain form
2205 625 -1466 175 -878 -795 3856 1521 -4496 -2057 3316 872 -1541 -288 -862 -907 2611 1039
2221 1039 -3953 -1588 3540 1337 -1855 -742 -981 -494 2875 1508 -3114 -1414 3244 1065 -1775
2236 -1775 131 891 46 1712 690 -3374 -1087 3473 1527 -2224 -1077 -6 -412 1292 858 -2590
2252 -2590 -1455 2021 392 -2052 -349 916 20 576 437 -1837 -341 2490 1114 -1694 -275 814
2268 814 68 674 541 -1457 -576 1722 496 -1615 -171 474 -287 318 367 -844 -867 645 -137 -934
2286 -934 124 888 -918 -549 97 -339 -150 1006 396 -966 144 429 -245 262 1171 143 -654 -224
2304 -224 181 234 635 172 -1346 -617 702 323 -922 -708 -81 243 170 -330 -1084 -354 973 216 -809
2323 -809 -459 316 1066 488 -519 -1045 591 2035 935 -988 -1051 551 1573 767 -1009 -1651 -178
$$ packed form
2205F25k091J641j053Q3M651k335o017K439N373k444k413J253n74m5L518j572
2221A039m992K365N128k203l192J113k39M87L369j367m622J700M658k179k840
2236a775J906P60q45J666j022m064K287M560j946l751J147J071m06J704m34l448
2252b590J135L476j629k444J703J265q96N56j39k274J496K831j376k808J419J089
2268H14p46O06j33j998Q81K298j226k111J444O45p61O05M9j211k3J512p82p97
2286i34J058P64j806L69O46m36J89J156o10j362J110K85o74N07R09j028p97M30
2304b24M05N3M01m63j518P29J319l79j245K14O27L24p3n00p54P30J327p57j025
2323h09L50P75P50n78j007n26J636J444j100j923o3J602J022q06j776o42J473
$$ plain form
2340 -178 1194 620 -1306 -1442 373 1058 108 -1599 -1527 729 1674 -66 -1590 -1011 1158 2018 527
2357 527 -1808 -1093 1214 2203 607 -1514 -1106 1144 2086 210 -1416 -1066 1082 1516 -407 -1822 -695
2374 -695 1097 1347 -674 -2088 -720 1414 1684 -641 -2193 -1012 1605 1976 -391 -1749 -544 1283
2390 1283 1557 -226 -1456 -280 1625 1065 -564 -1077 -167 1361 1072 -944 -2126 -104 1458 681
2406 681 -1069 -1678 -390 1120 1002 -493 -1653 -254 1396 725 -400 -1020 331 836 665 -246 -839
2423 -839 571 1354 145 -896 -332 743 974 620 -465 -1343 -80 1037 76 -1082 -500 -165 147
2440 147 167 73 -1142 -401 595 -66 -695 93 372 -221 192 266 -185 82 775 -102 -790 712 568 14
2460 14 258 231 -702 -693 768 -75 -409 554 -299 -1576 -28 1290 20 -1007 -425 -418 -440 994 619 -1081
$$ packed form
2340a78J372n74j926j36J815O85r50j707P2K256R45j740j524N79K169Q60j491
2357E27k335P15K307R89j596k121M08K250R42j876j626L50K148M34j923j415J127
2374f95J792K50k021j414J368K134K70k325j552J181K617L71k367j358J205J827
2390A283K74j783j230J176J905n60j629n13R10J528k89k016j182K022J562p77
2406F81j750o09J288J510j18j495j160J399J650o71j125o20J351N05j71r11n93
2423h39J410P83j209j041N64J075K31l54j085q78J263J117r61j158N82L35L12
2440A47K0r4j215P41R96o61o29P88K79n93M13P4m51K67O93q77o88J502j44n54
2460A4K44k7r33RJ461q43l34R63q53j277J548J318j270j027N82Pk2J434l75j700
$$ plain form
2480 -1081 10 1431 -449 -928 509 619 36 630 2 -1066 354 1721 -110 -1605 -9 615
2496 615 -145 273 -132 -1813 59 2169 -257 -1953 -413 472 -191 624 412 -1646 -176 2210 18
2513 18 -1956 844 1957 76 -66 -275 -1696 900 3074 319 -2594 -428 1268 -364 244 264 -1128
2530 -1128 -243 1988 -615 -3012 252 2232 -46 -450 -206 -953 -81 2462 71 -2175 480 2396
2546 2396 -462 -971 428 -454 125 2515 -112 -3004 52 2099 -104 -558 523 -1195 -686 1388
2562 1388 -427 -2481 683 2280 -1176 -1909 403 -576 -280 2131 87 -2710 -55 1923 -640 -903
2578 -903 1453 190 -864 1475 326 -2100 663 2519 -520 -1527 744 -347 -1230 1172 351 -1914
2594 -1914 174 1718 -1427 -1974 879 483 -920 1171 382 -2152 -676 1981 -203 -797 1644 503
$$ packed form
2480a081J091J421j880m79J437J10n83N94o28j068J420J367j831j495J596O24
2496F15p60M18m05j681J872K110k426j696J540Q85o63Q15k12k058J470K386k192
2513A8j974K800J113j881j42k09j421K596K174k755k913K166J696j632O08K0j392
2530a128Q85K231k603k397L264J980k278m04K44p47Q72K543k391k246K655J916
2546B396k858n09J399q82N79K390k627k892L056K047k203m54J081j718N09K074
2562A388j815k054L164J597l456p33K312r79K96K411k044k797K655J978k563k63
2578i03K356j263j054K339j149k426K763J856l039j007K271j091q83K402q21k265
2594a914K088J544l145n47K853l96j403K091p89k534J476K657k184n94K441j141
$$ plain form
2610 503 -1628 476 1152 -752 243 1844 -765 -1650 847 354 -1379 714 1249 -1620 -806 1234 -588
2627 -588 -1579 1207 697 -1994 42 986 -1137 -838 1363 36 -884 937 481 -1835 243 2175 -457
2644 -457 -707 1332 -152 -1450 789 863 -1448 267 1378 -1123 -1656 856 454 -769 741 144 -2061
2661 -2061 -324 1666 -686 -1034 1185 528 -1123 615 615 -1231 403 2309 -342 -1577 816 739 -428
2678 -428 574 820 -1318 5 1503 -688 -1814 1143 1084 -546 -157 -52 -1589 -411 1766 -49
2694 -49 -1283 303 453 -1148 -20 934 -146 321 1608 -396 -1851 840 1283 -195 183 308 -965
2711 -965 -338 1282 122 -1345 517 801 -1164 -906 208 -632 255 1122 -174 -1949 195 763 -242
2728 -242 -57 823 64 -226 469 -116 -818 914 1420 -469 -509 131 -353 -115 1120 338 -804 -150 366
$$ packed form
2610E03k131K104O76j904R95J601k609q85K497m93j733K093N35k869Q14K040j822
2627e88r91K786n10k691K036R44k123K99K201j327r20J821m56k316K078J932k632
2644d57k50K039j484j298K239P4k311J715J111k501n33K512m02j223J510n97k205
2661b061J737J990k352l48K219o57j651J738%j846J634J906k651j235K393p7j167
2678d28J002K46k138J323J498k191j126K957n9j630L89J05j537J178K177j815
2694d9j234J586J50j601J128R54j080M67J287k004j455K691M43j478L78J25j273
2711i65O27J620j160j467J862K84j965K58J114q40Q87Q67j296j775K144N68j005
2728b42J85Q80p59k90O95n85p02J732N06j889m0O40m84K38J235p82j142O54N16
$$ plain form
2747 366 -972 -599 588 -201 -585 157 -163 -850 99 846 -158 -462 238 36 -464 404 311 -76 102
2766 102 521 -180 -519 544 510 -108 221 275 -317 -282 143 -231 -131 307 -53 -619 89 93 -301 -6 224
2787 224 -500 -543 24 3 -22 515 363 -109 -310 133 -8 173 404 214 -28 -67 356 61 62 265 -97 -360
2809 -360 -104 -40 -383 42 326 -195 -192 -257 -66 100 45 18 8 66 100 -58 158 68 -60 268 335 71 58 188
2833 188 158 38 -236 -26 199 -153 -133 -144 -23 -219 53 -305 -359 -8 13 -177 240 254 -56 -138 123 79 277
2856 277 -91 138 112 469 113 101 48 220 186 -49 241 -128 -276 -195 92 -212 -305 -27 -11 -19 -443 -125 -271
2879 -271 -101 -6 -263 -88 -128 214 -41 7 -150 208 143 322 304 82 230 140 501 280 -38 121 100 -9
2901 -9 -228 -269 -50 -16 -318 -257 -286 -221 -77 113 -463 -382 -20 73 235 -80 -22 113 210 267 -153 -185 379 259
$$ packed form
2747C66j338L73J187p89l84P42l20o87R49P47j004l04P00k02n00Q68r3l87J78
2766A02M19p01l39J063l4o18L29N4n92L5M25l74J00M38l60n66P08Ml94K95K30
2787B24p24m3N67k1k5N37j52m72k01M43j41J81K31j90k42l9M23k95JK03l62k63
2809c60K56O4l43M25K84n21Lo5J91J66n5k7j0N8L4j58K16r0j28L28O7k64j3J30
2833A88l0j20k74K10K25l52K0j1J21j96K72l58n4L51K1j90M17J4l10q2K61m4J98
2856B77l68K29k6L57l56j2n3J72l4k35K90l69j48Q1K87l04r3K78J6qm24L18j46
2879b71J70R5k57J75m0L42k55M8j57L58o5J79j8k22J48r0L61k21l18J59k1j09
2901ik19m1K19L4l02O1k9O5J44J90n76Q1L62R3J62l15N8J35R7N7m20l2N64j20
$$ plain form
2925 259 203 178 189 -13 255 190 -220 -349 104 -87 -252 -226 29 -228 1 46 -292 -711 -149 161 9 18 227
2948 227 76 -66 163 189 217 235 248 -80 261 373 68 -36 30 84 -339 109 42 43 187 155 -466 -683 104
2971 104 83 -23 54 3 -628 114 133 -159 -182 667 238 45 -267 254 23 124 729 117 -309 93 74 -300
2993 -300 -51 35 -69 258 -174 -609 -686 484 487 -131 -504 -390 -131 218 532 -219 -485 103 401 -364 -311
3014 -311 387 601 697 482 -666 -836 546 787 183 -290 -119 -74 -41 29 -723 -279 560 576 -800 -897 -323
3035 -323 343 287 366 -335 -944 202 414 -206 -161 492 644 89 3 -557 -249 1131 1181 -102 -845 -425 33
3056 33 87 304 -117 -420 40 118 -865 -752 604 667 -221 -332 -671 -490 494 846 -2 -348 167 -84 -453
3077 -453 60 303 306 703 580 -882 -1100 22 647 348 276 -201 -870 -199 115 -287 -126 649 194 -1128
$$ packed form
2925B59n6k5J1k02K68o5m10j29M53j91j65K6K55k57K29M5l38m19N62L10j52RK09
2948B27j51j42K29K6K8J8J3l28L41J12l05j04O6N4m23M48o7JJ44l2o21k17P87
2971A04k1j06P7n1o31P42J9k92k3Q49m29j93l12N21k31J01O05o12m26M02j9l74
2993c00K49Q6j04L27m32m35p7J170Lo18l73J14K59L49L14p51k66N88K98p65N3
3014c11O98K14R6k15j148j70J382K41o04m73J71M5L3P0p52M44Q39J6j376r7N74
3035c23O66n6P9p01o09J146K12o20M5O53J52n55q6n60L08J380N0j283p43M20M58
3056C3N4K17m21l03M60P8r83J13J356O3q88j11l39J81R84L52q48l46N15k51l69
3077d53N13K43LL97j23j462k18J122O25k99p2m77o69O71L14m02J61P75m55j322
$$ plain form
3097 -1128 -585 4 128 644 524 -416 -1002 -252 243 229 594 447 -199 -385 79 90 137 778 429 -338 -325
3118 -325 -32 -254 88 636 249 -275 -400 -514 -767 39 570 354 -482 -10 -375 -693 102 590 357 380
3138 380 353 -709 -822 568 1067 613 99 -226 -918 -71 570 277 11 245 346 -618 -876 40 141 443
3158 443 513 -770 -944 -12 516 15 -312 67 149 381 351 -705 -223 698 1096 102 -1060 -89 202 530
3178 530 560 -548 -501 262 562 -454 -751 365 658 315 -140 -1158 -922 621 1231 -133 -1017 -555 230
3197 230 421 255 -282 -476 707 733 -425 -789 313 911 508 -660 -532 -350 674 633 -526 -931 64
3216 64 656 66 -426 -842 -379 490 1025 -256 -1091 -17 186 34 -114 -248 66 360 48 -478 -249 610
3236 610 1054 247 -465 -658 -184 702 787 -399 -858 -285 354 -71 -306 -544 -223 7 77 -512 -406 -18
$$ packed form
3097a128N43N89J24N16j20r40n86P50M95j4L65j47o46j86M64J1M7O41l49p67J3
3118c25K93k22L42N48l87n24j25j14k53Q06N31k16q36M72l65l18P95M88k33K3
3138C80k7j062j13J390M99m54n14l25o92Q47O41k93k66K34J01r64k58R16J01L02
3158D43P0j283j74R32N28n01l27L79Q2K32l0j056M82R21L98r94j162R71K91L28
3178E30L0j108M7P63L00j016k97J116K93l43m55j018K36J543O10j364q84M62P85
3197B30J91j66n37j94J183K6j158l64J102N98m03j168J28J82J024m1j159m05R95
3216F4N92n90m92m16M63Q69N35j281q35J074K03j52j48j34L14K94l12n26K29Q59
3236F10M44q07p12j93M74Q86Q5j186m59N73O39m25k35k38L21K30P0n89J06L88
$$ plain form
3256 -18 284 -144 -137 -205 19 215 307 -85 -122 228 713 -141 -361 -138 -57 428 525 84 -313 -295 -261 -10 117
3279 117 232 -291 -487 -119 -260 79 23 14 -361 -13 93 164 263 372 128 -301 155 -35 207 112 2 -286
3301 -286 -331 437 480 243 -460 -352 -108 282 166 -360 -547 -95 293 25 -173 -381 -111 48 -210 -565 -23
3322 -23 369 535 -25 -727 -366 688 760 29 -605 -538 376 800 367 -625 -568 14 476 -65 -488 -342 252
3343 252 202 -466 -604 -316 506 422 -303 -843 -300 627 882 -108 -1053 -274 691 728 92 -588 -57 510 741
3364 741 18 -504 41 553 336 -277 -767 103 573 490 -681 -837 -133 553 250 -682 -885 -216 701 901
3384 901 -469 -634 -100 481 536 10 -180 179 518 107 -230 -505 272 750 167 -802 -235 89 666 145
3404 145 -449 -731 -91 521 194 -387 -456 -331 303 128 2 -529 -113 65 -41 -358 -7 154 281 174
$$ packed form
3256a8L02m28Po8K24J96R2l92l7L50M85q54k20K23Q1M85R7m41l97J8L4K51J27
3279A17J15n23j96L68j41L39n6rl75L48J06P1R9J09k44m29M56j90K42r5j10k88
3301b86m5P68M3k37p03J08K44L90j16n26j87M52L88k68j98k08K70J59k58l55N42
3322b3L92J66n60p02L61J054P2p31o34O7R14M24m33r92N7N82M62n41m23J46N94
3343B52n0o68j38K88Q22q4p25n40N43R27K55r90r45P79R65L7o36o80N31N67K31
3364G41p23n22N45N12k17o13m90Q70M70q3j171j56P04O86l03r32k03O69R17K00
3384I01j370j65N34N81N5n26j90L59L39m11l37k75P77M78n83r69N67L24N77n21
3404A45n94k82O40O12l27n81o9J25O34j75j26n31M16J78j06l17L51J61J27j07
$$ plain form
3424 174 -444 62 366 369 133 -296 -214 221 280 367 -404 -318 -245 165 -27 -139 -148 -347 -185 148 293 278 -16
3447 -16 -150 -94 -78 306 182 152 28 76 96 129 113 120 164 47 -77 -325 233 364 -141 -254 -203 54 397 68
3471 68 -401 -391 25 331 -140 -357 -216 -99 75 315 -335 -19 340 280 -144 -708 102 499 468 -196 -622
3492 -622 -511 510 852 60 -539 -508 -140 211 -55 -369 -504 86 344 -72 -839 -37 456 296 -376 -728
3512 -728 -150 628 815 7 -482 128 563 343 168 -691 -143 626 843 -218 -974 -316 467 464 -115 -523
3532 -523 -453 114 47 -499 -305 265 667 48 -435 -410 -29 973 867 -409 -770 -256 639 372 -108 -75 100
3553 100 369 50 -483 -291 47 431 28 -204 -455 -18 374 358 -461 -778 76 400 -141 -525 134 414
3573 414 719 294 -239 -652 -258 613 387 80 131 -23 -192 -95 -119 99 352 191 -441 -770 -209 288 335
$$ packed form
3424A74o18N06L04Lk36m29Q2M35N9Q7p71Q6P3M10j92j12rj99J62L33J45j5k94
3447a6j34N6J6L84j24l0j24M8K0L3j6PM4j17j24k48N58J31n05j13N1K57L43l29
3471F8m69J0M16L06m71k17J41J17J74K40o50L16L59o0m24n64Q10L97l1o64m26
3492f22J11J021L42p92n99L1L68L51k66l14j35N90K58m16p67Q02M93j60o72l52
3512g28N78P78J87q08m89O10M35k20j75q59N48P69K17j061p56O58P83ln79m08
3532e23P0N67o7n46J94N70M02o19m83K5L81J002j06j276l61N14Q95k67m80L3J75
3553A00K69l19n33J92L38L84m03k32k51M37L92j6q19l17Q54L24n41l84O59K80
3573D14L05m25n33m13L94Q71k26l07N1j54j69R7k4K18K53j61o32l29N61M97M7
$$ plain form
3594 335 642 -67 -451 -55 -69 126 105 89 67 -273 30 -105 8 151 358 304 -89 53 -185 -175 186 180 116
3617 116 -218 -212 -440 -234 139 113 -239 -58 -164 -635 -456 -74 370 112 -150 -476 -703 -7 334 298 -70
3638 -70 -152 -215 81 88 262 211 189 153 -6 -319 -104 156 404 442 -475 -298 74 155 -213 -534 -27 213 86
3661 86 -33 -400 -228 277 621 25 -468 -273 142 164 128 48 -32 123 260 -414 -92 307 562 318 -172 -760
3683 -760 -354 363 681 -291 -491 -425 20 248 54 -290 -55 445 204 -356 -507 88 380 176 3 -185
3703 -185 20 457 432 -210 -137 -12 387 -106 -279 -317 -31 106 210 18 -582 -86 383 41 -219 -115 -73
3724 -73 303 76 -236 -205 104 162 32 -261 -154 81 308 215 -258 60 40 161 47 -173 -14 -198 141 224
3746 224 -105 -176 -6 -40 -101 -158 12 114 -144 -262 -233 -13 100 212 -38 198 -14 82 500 97 440 -104
$$ packed form
3594C35L07p09l84L96j4J95k1j6k2l40L03j35J13J43K07n4l93J42k38J0L61oo4
3617A16l34Ok28K06L73k6l52J81j06m71J79L82M44k58k62l26k27O96L41l6l68
3638g0q2o3K96PJ74n1k2l6j59l13K15K60K48L8r17J77L72Q1l68l21N07K40j27
3661H6j19l67J72N05L44n96m93J95M15K2l6q0q0J55J37o74L22L99K55k44m90n88
3683g60M06P17L18r72k00O6M45K28j94l44K35N00k41n60j51N95K92k04j73j88
3703a85K05M37k5o42P3J25L99m93j73l8K86J37J04j92o00M96M69l42k60J04M2
3724g3L76k27l12L1L09N8j30k93J07K35K27r3m73L18k0J21j14k20J59j84L39Q3
3746B24l29p1J70l4o1n7J70J02k58j18K9K20J13J12k50K36k12R6M18m03L43n44
$$ plain form
3768 -104 213 7 104 236 126 95 30 -25 -125 -31 70 -8 14 -45 -27 -185 -226 -180 -38 -4 -24 -101 204 -87 -79
3793 -79 -131 14 109 188 74 12 282 -32 156 154 62 -76 -79 219 71 -212 25 -123 43 -128 -202 -4 83 -52
3817 -52 118 -190 -112 171 116 102 -177 320 217 227 140 -288 -19 -43 300 145 -285 5 56 135 3 -129 -133 336
3841 336 48 -212 -231 32 77 -157 -171 -237 -56 -46 12 2 -66 -22 137 310 188 -190 90 -72 172 -133 -144
3864 -144 -12 23 -11 -5 -12 17 126 230 -207 4 -61 125 -238 -235 -229 -215 -201 240 -103 -190 -75 81 46 -39 115 -26
3890 -26 -94 211 49 27 130 295 -165 -104 85 -55 203 -211 109 -281 -221 -328 58 -161 -192 -243 -85 -227
3912 -227 -34 218 74 -76 44 -81 -43 231 267 85 165 89 54 88 307 172 41 31 111 -3 141 -115 -34
3935 -34 34 -4 -47 -246 86 -139 -59 87 -239 -75 33 -37 69 -21 -32 70 297 222 141 -42 272 -105 -58 250
$$ packed form
3768a04L17k06R7J32j10l1o5n5j00R4J01p8K2n9J8j58m1M6J42L4k0p7L05k91Q
3793g9n2J45R5P9j14o2K70l14J88kr2j38lK98j48k83K37j48J66j71p4J98Q7j35
3817e2J70l08P8K83n5j4k79M97j03J0q7m28K69k4L43j55m30K90N1P9j32j32mM69
3841C36k88k60j9K63M5k34j4o6J81J0N8j0o8M4J59J73j22l78K80j62K44l05j1
3864a44J32L5l4OpK9J09J04m37K11o5J86l63LOJ4J4M41l43q7J15J56l5q5J54j41
3890b6o8L05j62k2J03J65m60O1J89j40K58m14L20l90O0j07L86k19l1n1J58j42
3912b27J93K52j44j50J20j25L8K74L6j82Q0p6l5L4K19j35j31j0Q0j14J44k56Q1
3935c4O8l8m3j99L32k25Q0J46l26J64J08p0J06r0j1J02K27p5q1j83L14l77M7L08
$$ plain form
3959 250 6 17 137 -57 -147 -42 -5 69 70 -127 -122 123 -119 35 42 -11 136 -166 -214 -71 -163 210 23 -92
3983 -92 -20 -186 174 -134 -114 144 81 -264 -126 6 -11 184 -49 -142 7 -88 -124 -174 1 92 -92 -205 9
4006 9 -37 72 100 108 81 71 -121 72 53 329 204 -16 85 -11 -197 151 64 88 100 145 -94 -412 -110 -18 -217
4031 -217 -26 -25 -8 -224 -153 -106 42 282 -71 -245 -6 111 157 265 -52 -127 -229 -82 257 -9 -217 245
4053 245 76 -25 -130 90 -390 193 70 -292 -350 4 -161 44 -71 -9 161 -136 39 -250 -197 372 109
4074 109 186 167 -146 63 21 281 -47 -17 31 154 81 62 233 -231 -113 273 -27 -77 -55 -83 60 100 181 -173
4098 -173 -186 142 -68 149 164 -15 -50 227 256 -119 214 317 176 169 319 -37 -119 -9 130 -98 -205 32
4120 32 -161 -92 -30 -89 -291 87 327 -428 -268 75 -155 -104 9 -112 142 147 82 -237 -11 375 300 128 88
$$ packed form
3959B50k44J1J20j94r0J05L7P4Jj97NK45k42J54Pn3J47l02m8J43r2L73j87j15
3983i2P2j66L60l08K0K58o3l45J38J32j7J95k33r3J49r5l6n0J75R1j84j13K14
4006Im6J09K8Qk7j0j92J93j9K76j25k20J01r6j86L48q7K4J2M5k39l18L02R2j99
4031b17J91JJ7k16P1M7J48K40l53j74K39J17M6J08l17p5j02J47L39k66k08M62
4053B45j69j01j05K20m80N83j23l62n8L54j65K05j15O2J70k97J75k89N3N69k63
4074A09P7j9l13K09m2K60l28L0M8J23p3j9J71m64J18L86l00n0K2k8J43M0Q1l54
4098a73j3L28k10K17J5j79l5K77K9l75L33J03j41pJ50l56q2J10J39k28j07K37
4120C2j93O9O2n9k02L78K40p55J60L43k30N1J13j21K54No5l19K26L86p5j72m0
$$ plain form
4143 88 -191 -101 235 565 -89 -264 41 -100 119 -222 98 -138 95 48 -364 -240 39 283 -240 -302 -236 -314
4165 -314 53 106 -285 -184 27 88 181 -221 55 21 205 473 -448 -373 252 370 -68 205 18 77 -56 -100
4187 -100 -474 -510 300 636 -427 -488 -248 -35 306 455 -216 -384 225 196 -47 76 77 -31 231 -20 -53 -132
4209 -132 452 548 62 -393 -93 -22 -130 305 -183 -464 109 214 -375 -444 41 234 16 -77 -265 -332 184 220
4231 220 38 -43 179 -143 -302 84 -99 -14 426 185 -329 -281 -30 175 170 473 -180 -304 70 180 138 330
4253 330 226 -139 -459 -212 150 46 302 224 59 -430 246 -17 50 388 364 53 46 359 193 -186 175 239
4275 239 -334 297 -71 -544 -262 -4 58 -63 -261 -491 -551 -90 392 -7 -134 -34 -32 -184 288 16 -52 136
4297 136 160 -309 -548 183 214 146 -144 -52 -295 70 243 -402 -214 158 52 19 -248 -215 -293 -6 210 -62
$$ packed form
4143H8k79R0L36L30o54j75L05j41K19l41L20k36K33m7m12J24K79K44n23o2O6p8
4165c14L67N3l91J01K11O1R3m02K76l4J84K68r21P5O25J18m38K73j87N9j33m4
4187a00l74l6Q10L36j063o1K40K13L41J49o71j68O09k9k43J23Jj08K62k51l3p9
4209a32N84R6m86m55L00P1j08M35m88k81N73J05n89o9M85J93k18r3j88o7N16L6
4231B20j82q1K22l22j59L86j83Q5M40k41n14M8K51K05nL03o53j24L74J10m2J92
4253C30j04l65l20K47L62j04K56p8j65m89O76k63O7L38k4l11pL13j66l79L61O4
4275B39n73O31l68m73K82K58O2j21j98k30o0M61M82l99j27J00Kj52M72k72o8J88
4297A36K4m69k39P31L1o8k90R2k43L65J73o45J88L72j06l3k67L3p8K87K16k72
$$ plain form
4319 -62 -310 57 176 239 -24 -98 127 333 86 -471 160 341 497 127 -125 -536 -8 320 328 -338 -474 -24
4341 -24 296 131 -297 -259 51 89 107 -404 -253 330 287 -100 -417 -73 434 513 26 -425 -534 166 390 39
4363 39 -240 -67 321 218 30 -236 -230 216 69 -78 -112 -85 33 216 -315 -132 -238 273 96 -302 -391 -292
4385 -292 549 292 -78 -230 -38 14 237 82 -238 163 245 194 118 66 143 267 181 -349 -71 -1 265 5 -453
4408 -453 -204 -282 67 342 79 -155 -185 168 191 16 -22 38 -117 -11 177 172 167 89 -11 -106 224 47 143 -23
4432 -23 -15 -170 182 -125 127 13 -11 -294 78 28 45 199 -151 -241 -155 147 316 116 -28 -75 199 235 14
4455 14 102 -179 195 156 -98 178 -59 134 -238 -272 -195 297 590 -26 -630 -398 52 428 32 -264 -308 -182
4477 -182 28 206 -150 -410 145 170 177 -33 -199 169 292 186 -402 -230 307 264 168 -238 -186 22 180 557
$$ packed form
4319f2k48L67J19O3k63p4K25K06k47n57O31J81J56l70k52m11N28L28Qo66j36M50
4341b4L20j65m28L8L10L8J8n11J51N83m3l87l17L44N07P9m87m51j09P00K24l51
4363C9k79J73L88j03j88k66OM46j47j47l4K7J18J83n31J83j06N11j77l98q9R9
4385b92Q41k57l70j52J92N2K23j55l20M01Q2n1p6n2P7J24q6n30K78P0K66k60m58
4408d53K49p8L49K75k63k34l0L53K3j75l8O0j55J06J88nnp8j00r5L30j77R6j66
4432b3Qj55L52l07K52j14k4k83L72n0J7J54l50r0Q6L02J69k00j44m7K74L6k21
4455A4Q8k81L74l9k54K76k37J93l72l4P7M92K93o16o04K32M50L76l96k96m4J26
4477a82K10J78l56k60N55K5Pk10j66L68J23j06n88J72N37m3r6m06N2K08J58L77
$$ plain form
4499 557 -116 -594 -156 205 17 -207 -152 -77 278 58 -214 -235 2 275 -299 -274 -298 223 458 10 -373 -302
4521 -302 486 330 -131 -243 46 -110 384 300 -360 -243 95 283 -253 -159 -165 75 34 182 -300 -81 430 198
4543 198 -388 -289 366 286 327 155 -338 -399 110 497 -377 -267 68 254 -68 93 -86 -201 5 185 -403
4564 -403 153 212 17 -117 50 -238 -219 393 333 -239 -326 347 120 -48 359 -170 -486 306 315 -147 -23 139
4586 139 -146 -300 81 47 -386 -76 166 -427 -43 213 -213 -414 159 75 -242 238 98 -199 20 374 26
4607 26 -98 410 191 -472 2 493 -180 36 299 -278 -458 315 401 -315 -77 -77 -412 -378 283 1 -159 210
4629 210 -47 -743 -404 421 332 49 203 -377 -215 530 954 -203 -107 329 -42 -211 574 -11 97 498
4649 498 411 -614 -383 512 128 63 4 3 -422 38 209 -390 -113 480 86 -411 -350 -278 -244 470 707 -542
$$ packed form
4499E57o73m78M38L61j88k24N5P5L55k20k72k1K37K73n74K5k4N21K35m48l83P1
4521c02P88j56m61j12K89j56M94q4o60J17L38J88n36R4oK40m1J48m82K19N11k32
4543A98n86R9O55q0M1j72m93o1N09L87q74J10L35J86l22J61j79j15K06J80n88
4564d03N56N9j95j34J67k88J9O12o0n72q7O73k27j68M07n29l16P92Rm62J24J62
4586A39k85j54L81l4m33L10K42n93L84K56m26k01N73q4l17M80j40k97K19L54l48
4607B6j24N08k19o63M74M91o73K16K63n77j80P73Q6p16K38%l35L4O61k82j60L69
4629B10k57o96L39Q25q9k83J54n80J62P45M24j157R6M36l71j69P85n85J08M01
4649D98q7j025K31Q95l84o5n9jm25M60J71n99K77N93l94m97O1P2L4P14K37j249
$$ plain form
4671 -542 -488 286 172 -58 295 260 40 67 -113 -429 -53 898 321 -353 -241 -210 -175 355 660 -99 -424 154
4693 154 15 -320 -10 470 200 124 115 -617 -477 538 556 -287 -155 211 -265 130 230 -92 -112 545 -15
4714 -15 -687 -348 279 283 232 -17 -457 -723 378 294 -106 126 4 -22 -490 170 -170 -70 612 260 -654 -318
4736 -318 200 183 228 398 -83 -256 121 67 -3 121 476 -158 -418 -158 -7 -328 238 307 -338 -191 48 -208
4758 -208 -91 322 454 28 139 -13 -373 -47 583 379 -242 155 -27 -187 47 413 -108 -35 128 -473
4778 -473 -256 99 288 -10 -408 138 -237 -38 374 -86 -203 19 -164 -440 -345 351 158 48 155 4
4798 4 -343 119 260 -87 -61 252 -58 -304 -22 -195 -255 264 253 -206 -280 -56 46 96 261 -113 -243 -13
4820 -13 86 -226 -130 204 221 -24 -180 4 38 373 411 -39 -291 111 7 -77 115 128 -7 -3 42 -360 -110 4
$$ packed form
4671e42N4P74j14k30L53l5k20K7j80l16L76R51n77o74J12L1L5N30L05p59l25N78
4693A54j39l35L10M80k70p6rp32J40J015J8q43J32L66m76L95J00l22k0O57n60
4714a5o72L39O27Mn1k49m40k66J101q4m00K32j22k6m68O60l40J00O82l52r14L36
4736c18N18j7M5J70m81j73L77n4p0J24L55o34k60K60J51l21N66O9o45J47K39k56
4758b08J17M13J32m26J11j52l60L26O30k04o21L97j82j60K34L66n21P3J63o01
4778d73K17L55J89k98l98N46l75J99M12m60j17K22j83k76R5O96j93j10J07j51
4798Dl47M62J41l47K6L13l10k46K82j73o0N19j1m59p4K24J02N0J65l74j30K30
4820a3R9l12R6L34J7k45j56J84L4L35L8m50k52M02j04q4J92J3j35MM5m02K50J14
$$ plain form
4844 4 159 -331 -281 -304 -31 206 -7 -238 -357 161 303 -122 -150 21 102 179 134 -113 149 194 277 70 -172
4867 -172 -64 -222 94 -307 -21 -169 307 86 16 -256 -30 125 6 -210 -2 -272 7 -27 14 -85 156
4888 156 94 -116 -67 -174 -154 72 110 -54 -23 -16 230 -29 216 -30 -251 -39 246 -8 -282 -23 54 -159 64
4911 64 82 -99 196 144 76 104 7 55 170 7 -122 3 74 -109 112 22 120 -75 -17 -83 101 190 -29 -78 -116
4936 -116 19 48 -65 64 134 63 -272 -172 -56 -9 65 101 142 79 35 48 -36 246 -91 -4 104 55 -76 68
4960 68 -12 177 -141 48 33 -212 7 81 64 -125 85 23 -197 -234 -167 88 50 126 23 205 168 13 121 95
4984 95 223 -90 109 -249 150 262 76 223 -164 -128 22 -94 61 -100 -208 77 -25 6 -133 247 314
5005 314 173 -103 -95 81 74 42 -103 154 81 279 -42 -316 -15 154 -93 161 238 -142 -218 185 60 95 123
$$ packed form
4844DJ55m90N0k3K73K37k13k31j19N18J42m25k8J71Q1P7m5k47K62M5Q3k07k42
4867a72J08j58L16m01K86j48M76k21p0k72K26J55j19k16K08k70K79l4M1r9K41
4888A56o2k10M9j07K0K26L8j64L1PK46k59K45k46k21K12K85k54k74K59P7k13K23
4911F4J8j81K95n2o8K8r7M8J15j63j29J25P1j83K21r0R8j95N8o6J84Q9k19m9l8
4936a16J35K9j13J29P0p1l35J00J16M7P4L6M1o3m4J3q4K82l37Q7J08m9j31J44
4960F8q0J89l18J89j5k45K19P4j7j89K10o2k20l7O7K55l8P6j03J82l7j55J08k6
4984I5J28l13J99l58L99J12j86J47l87L6J50j16J55j61j08K85j02L1j39L80O7
5005C14j41k76QJ76pl2j45K57p3J98l21k74L01J69k47K54P7l80p6M03j25L5K8
$$ [...]
8191B47
##END NTUPLES=NMR FID
##END=
