##TITLE=1H_LR-746-R2-H-BzL
 CDCl3
 8 sc, 
 16.03.2022
##JCAMPDX= 6.0         $$ Bruker NMR JCAMP-DX V2.0
##DATA TYPE= NMR FID
##DATA CLASS= NTUPLES
##ORIGIN= UXNMR, Bruker Analytische Messtechnik GmbH
##OWNER= root
$$ XWIN-NMR		Version 3.5
$$ Wed Mar 16 12:32:43 2022 Russian Standard Time (UT+4h)  she@DPX200
##.OBSERVE FREQUENCY= 200.131346
##.OBSERVE NUCLEUS= ^1H
##.DELAY= (6, 6)
##.ACQUISITION MODE= SIMULTANEOUS
##.ACQUISITION SCHEME= undefined
##.AVERAGES= 8
##.DIGITISER RES= 18
##SPECTROMETER/DATA SYSTEM= spect
##.PULSE SEQUENCE= zg30
##.SOLVENT NAME= Acetone
##.SHIFT REFERENCE= (INTERNAL, Acetone, 0, 15.7039)
##AUDIT TRAIL= $$ (NUMBER, WHEN, WHO, WHERE, WHAT)
$$ ##TITLE= Audit trail, XWIN-NMR		Version 3.5
$$ ##JCAMPDX= 5.01
$$ ##ORIGIN= Bruker BioSpin GmbH
$$ ##OWNER= she
$$ F:/spectra/data/she/nmr/H-F/1/audita.txt
$$ ##AUDIT TRAIL=  $$ (NUMBER, WHEN, WHO, WHERE, WHAT)
(   1,<2022-03-16 12:31:24.79 +0400>,<she>,<DPX200>,
      <created by zg, POWCHK disabled, PULCHK disabled
       configuration hash MD5:
       00 E9 B6 7A A2 85 ED C7 34 08 36 98 17 FE 4E 26
       data hash MD5: 16K
       91 6A 0C 2E E9 91 9B A7 5C 8F DA B2 DD AD ED 23>)
$$ ##END=
$$ 
$$ hash MD5
$$ 5A 0B 34 8D 2E 75 F0 6D F1 6C 8C 46 C6 6F 81 61
##$RELAX= 
##$RELAX= 
##$RELAX= 
##$RELAX= 
##$RELAX= 
##$RELAX= 
$$ Bruker specific parameters
$$ --------------------------
##$DU= <F:/spectra>
##$EXPNO= 1
##$NAME= <H-F>
##$PROCNO= 1
##$TYPE= <nmr>
##$USER= <she>
##$AMP= (0..31)
100 100 100 100 100 100 100 100 100 100 100 100 100 100 100 100 100 100 
100 100 100 100 100 100 100 100 100 100 100 100 100 100 
##$AQSEQ= 0
##$AQ_mod= 1
##$AUNM= <au_zg>
##$AUTOPOS= <>
##$BF1= 200.13
##$BF2= 200.13
##$BF3= 200.13
##$BF4= 200.13
##$BF5= 200.13
##$BF6= 200.13
##$BF7= 200.13
##$BF8= 200.13
##$BYTORDA= 1
##$CFDGTYP= 0
##$CFRGTYP= 5
##$CHEMSTR= <none>
##$CNST= (0..31)
1 1 145 1 1 1 1 1 1 1 1 1 1 1 1 1 1 1 1 1 1 1 1 1 1 1 1 1 1 1 1 1 
##$CPDPRG= <>
##$CPDPRG1= <>
##$CPDPRG2= <>
##$CPDPRG3= <>
##$CPDPRG4= <mlev>
##$CPDPRG5= <mlev>
##$CPDPRG6= <mlev>
##$CPDPRG7= <mlev>
##$CPDPRG8= <mlev>
##$CPDPRGB= <>
##$CPDPRGT= <>
##$D= (0..31)
0 1.2 0 0 0 0 0 0 0 0.06 0 0.03 0 0 0 0 0.0002 0 0 0 0 0 0 0 0 0 0 0 0 
0 0 0 
##$DATE= 1647419484
##$DBL= (0..7)
120 120 120 120 120 120 120 120 
##$DBP= (0..7)
150 150 150 150 150 150 150 150 
##$DBP07= 0
##$DBPNAM0= <>
##$DBPNAM1= <>
##$DBPNAM2= <>
##$DBPNAM3= <>
##$DBPNAM4= <>
##$DBPNAM5= <>
##$DBPNAM6= <>
##$DBPNAM7= <>
##$DBPOAL= (0..7)
0.5 0.5 0.5 0.5 0.5 0.5 0.5 0.5 
##$DBPOFFS= (0..7)
0 0 0 0 0 0 0 0 
##$DE= 6
##$DECBNUC= <off>
##$DECIM= 32
##$DECNUC= <off>
##$DECSTAT= 4
##$DIGMOD= 1
##$DIGTYP= 9
##$DL= (0..7)
0 120 120 120 120 120 120 120 
##$DP= (0..7)
150 150 150 150 150 150 150 150 
##$DP07= 0
##$DPNAME0= <>
##$DPNAME1= <>
##$DPNAME2= <>
##$DPNAME3= <>
##$DPNAME4= <>
##$DPNAME5= <>
##$DPNAME6= <>
##$DPNAME7= <>
##$DPOAL= (0..7)
0.5 0.5 0.5 0.5 0.5 0.5 0.5 0.5 
##$DPOFFS= (0..7)
0 0 0 0 0 0 0 0 
##$DQDMODE= 0
##$DR= 18
##$DS= 0
$$ [...]
##$SUBNAM2= <"">
##$SUBNAM3= <"">
##$SUBNAM4= <"">
##$SUBNAM5= <"">
##$SUBNAM6= <"">
##$SUBNAM7= <"">
##$SUBNAM8= <"">
##$SUBNAM9= <"">
##$SW= 18.0517287032376
##$SWIBOX= (0..15)
0 0 2 0 0 0 0 0 0 0 0 0 0 0 0 0 
##$SW_h= 3612.71676300578
##$TD= 16384
##$TD0= 1
##$TE= 0
##$TE2= 300
##$TE3= 300
##$TEG= 300
##$TL= (0..7)
0 120 120 120 120 120 120 120 
##$TP= (0..7)
150 150 150 150 150 150 150 150 
##$TP07= 0
##$TPNAME0= <>
##$TPNAME1= <>
##$TPNAME2= <>
##$TPNAME3= <>
##$TPNAME4= <>
##$TPNAME5= <>
##$TPNAME6= <>
##$TPNAME7= <>
##$TPOAL= (0..7)
0.5 0.5 0.5 0.5 0.5 0.5 0.5 0.5 
##$TPOFFS= (0..7)
0 0 0 0 0 0 0 0 
##$TUNHIN= 0
##$TUNHOUT= 0
##$TUNXOUT= 0
##$USERA1= <user>
##$USERA2= <user>
##$USERA3= <user>
##$USERA4= <user>
##$USERA5= <user>
##$V9= 5
##$VALIST= <valist>
##$VCLIST= <CCCCCCCCCCCCCCC>
##$VD= 0
##$VDLIST= <DDDDDDDDDDDDDDD>
##$VPLIST= <PPPPPPPPPPPPPPP>
##$VTLIST= <TTTTTTTTTTTTTTT>
##$WBST= 1024
##$WBSW= 4
##$XGAIN= (0..3)
0 0 0 0 
##$XL= 0
##$YL= 0
##$YMAX_a= 365048
##$YMIN_a= -420659
##$ZGOPTNS= <>
##$ZL1= 120
##$ZL2= 120
##$ZL3= 120
##$ZL4= 120
##$ABSF1= 10
##$ABSF2= 0
##$ABSG= 5
##$ABSL= 3
##$ALPHA= 0
##$AQORDER= 0
##$ASSFAC= 0
##$ASSFACI= 0
##$ASSFACX= 0
##$ASSWID= 0
##$AUNMP= <proc_1d>
##$AZFE= 0.1
##$AZFW= 0.1
##$BCFW= 1
##$BC_mod= 2
##$BYTORDP= 1
##$COROFFS= 0
##$CY= 11.3945322036743
##$DATMOD= 1
##$DC= 2
##$DFILT= <>
##$DTYPP= 0
##$F1P= 2.36226072786647
##$F2P= -0.459571619588291
##$FCOR= 0.5
##$FTSIZE= 0
##$FT_mod= 4
##$GAMMA= 1
##$GB= 0.15
##$INTBC= 1
##$INTSCL= 1
##$ISEN= 128
##$LB= 0.24
##$LEV0= 0
##$LPBIN= 0
##$MAXI= 10000
##$MC2= 0
##$MEAN= 0
##$ME_mod= 0
##$MI= 1.114404
##$NCOEF= 0
##$NC_proc= 0
##$NLEV= 6
##$NOISF1= 3.799351
##$NOISF2= 2.8
##$NSP= 1
##$NTH_PI= 0
##$NZP= 0
##$OFFSET= 15.70392
##$PC= 1
##$PHC0= -16950.41
##$PHC1= 12.20078
##$PH_mod= 1
##$PKNL= yes
##$PPARMOD= 0
##$PSCAL= 0
##$PSIGN= 0
##$REVERSE= no
##$SF= 200.130013532006
##$SI= 16384
##$SIGF1= 3
##$SIGF2= 2
##$SINO= 400
##$SIOLD= 16384
##$SREGLST= <1H.CDCl3>
##$SSB= 0
##$STSI= 0
##$STSR= 0
##$SW_p= 3612.71676300578
##$SYMM= 0
##$S_DEV= 0
##$TDeff= 0
##$TDoff= 0
##$TI= <>
##$TILT= no
##$TM1= 0
##$TM2= 0
##$TOPLEV= 0
##$USERP1= <user>
##$USERP2= <user>
##$USERP3= <user>
##$USERP4= <user>
##$USERP5= <user>
##$WDW= 1
##$XDIM= 8192
##$YMAX_p= 0
##$YMIN_p= 0
$$ End of Bruker specific parameters
$$ ---------------------------------
##NTUPLES= NMR FID
##VAR_NAME=  TIME,          FID/REAL,        FID/IMAG
##SYMBOL=    X,             R,               I
##VAR_TYPE=  INDEPENDENT,   DEPENDENT,       DEPENDENT
##VAR_FORM=  AFFN,          ASDF,            ASDF
##VAR_DIM=   8192,          8192,            8192
##UNITS=     SECONDS,       ARBITRARY UNITS, ARBITRARY UNITS
##FACTOR=    0.0002768,     1,               1
##FIRST=     0,             0,               0
##LAST=      2.2672688,     0,               0
##MIN=       0,             -420659,         0
##MAX=       2.2672688,     365048,          0
$$ Real data points
##PAGE= N=1
##DATA TABLE= (X++(R..R)), XYDATA
$$ [...]
2518B208m473K493L665n007k678M930j043k704M845J589p024L64N256l275j164
2533b018N549j397n940L645K675n079J077O435m018m533M929k66m733M535L845
2548D706o712j176O084k787l803N620J401p026K760M513o169j227P609j905n814
2563c926M980J981o851K519O043n543k849P007j469o619N453L330p021J391O116
2578D542n018l985P509l50p469M409M769o886m22P185m622m864P735J263p944
2593d148L740M859p282j347Q635k702n921O744J112q405K934O941n989k311P885
2608D745l502p380O511L926p026J720O647p248m589Q776k92o543N789L812r699
2623d353j69Q341l884l274Q132j222r390M083N706o423R53Q128n573p114O970
$$ y = [2208, -2265, 228, 3893, -1114, -3792, 1138, 95, -2609, 2236, 3825, -3199, -2835, 2421, -854, -2018, 3531, 2134, -3806, -161, 2514, -2565, -1488, 4947, 929, -3604, 1325, 1059, -3674, 861, 4706, -2006, -3182, 2902, 115, -3688, 1932, 3333, -3693, -933, 3580, -2589, -3816, 3793, 1888, -3926, 1054, 3035, -3816, -1297, 4746, -797, -3646, 3361, 1892, -4727, 726, 4056, -2965, -1574, 4542, -476, -4461, 3048, 2698, -4771, -362, 4407, -2479, -2901, 4284, -338, -5202, 2533, 3796, -4148, -408, 4451, -2831, -4178, 4457, 1755, -4166, 2578, 3690, -4715, -1781, 5160, -829, -3140, 4745, 1243, -6137, 374, 4300, -2726, -1006, 5641, -1607, -6196, 2580, 2288, -4255, 1534, 5346, -4353, -4522, 3819, -65, -3339, 4793, 3571, -5819, -1736, 3970, -2453, -1500, 6628, 1055, -6059, 911]
2638I11J536o412M515N712q270k910P552k568m655Q144K012r318P22N871n718
2653b876n29R209k239q283M387K550o628L347P876n645n025N318j212n660O889
2668A479N418p819j684M931m651k489Q385J213p348K018K758o438N10Q682j963
2683C002n614L721j87o629M328O877m596k806M510l213m937O455M043n740L68
2698d18L576n575k729P432J312m699K509Q15o576N20P085j478l262M321j401o653
2714e221K974N437k911n61L889l846n049N225K825l770K118K513n792k183N485
2729A133K93k661L757M30o360M30M693j856j101M599j504n783K356L068k866J050
2745c22M051l625l597L472Q02k829L167K516m605j647L661j387j007L996Q7m559
$$ y = [911, 2447, -3965, 550, 6262, -2008, -4918, 2634, 66, -4589, 3555, 5567, -3751, -3029, 2842, -2876, -3405, 5804, 3565, -4718, -331, 2219, -4409, -1062, 6814, 1169, -3856, 1462, 250, -5410, 1479, 6897, -922, -2606, 2325, -2326, -4815, 3570, 4783, -2565, -547, 2211, -4227, -3717, 4965, 3002, -2612, 1109, 922, -5707, -1379, 5498, 902, -1904, 2606, -607, -5544, 911, 4954, -786, -418, 3158, -2417, -5146, 2286, 3598, -1101, 1408, 2223, -4353, -3833, 3252, 1774, -1488, 2833, 1432, -5221, -2247, 3190, 279, -282, 3607, -239, -5288, -63, 2762, -1008, 1110, 3623, -2169, -4352, 1133, 1426, -1235, 2522, 2952, -3408, -2978, 1715, -141, -1242, 3357, 1853, -3930, -1574, 1494, -1372, -322, 3729, 104, -3493, -21, 781, -2048, 1119, 3635, -970, -2617, 1044, -343, -1350, 2646, 2733, -1826]
2761a826M28K611k301J02L948j795l543K079P67k685J744L194k854j810K339n17
2777a19k383L417J505l182j50K095k210o64L443j15k499P54J069k258M19K654
2793A776j163j681J653l67j847J362J916j898m68J375j168q13J585Q20j413L83
2809E2K50j010j87J799k57j124Q97K18j198K77J027m70p03J088m21j013Q21O65
2827G11q34k47R00o88l99N26K4k12m5M84o28l7O35l7o03M12M30o38J07M58m32
2848a13J0M56Q5n24J34K19j83o4L44n77n5L15J52j84j84J89j84k26L58O6n12L39
2870a39J78j80K91P2l72J78k9K34k03J01R5k27J03L65m92m50O70J87n21L13k31
2891e7R2l2o8J10m66N68n7l66l1O14n25J70R1M3m76O48L6n84J83O22q12K64P63
$$ y = [-1826, -1398, 1213, -1088, -986, 2962, 1167, -2376, -297, 470, -2215, -471, 2723, -131, -1941, 398, -119, -2502, 915, 2420, -762, -912, 1183, -1027, -1691, 1752, 1637, -862, -108, 961, -1297, -878, 1776, 613, -1068, 585, 218, -1629, -267, 1649, -249, -717, 658, -510, -1323, 262, 1082, -331, 52, 302, -708, -895, 904, 647, -477, 420, 638, -560, -283, 744, 274, -429, 659, 238, -775, 46, 711, -123, -370, 530, -158, -557, -31, -7, -219, -264, 220, -408, -445, 190, 153, -450, -38, 392, -246, -139, 319, -113, -103, 353, 438, -86, 48, 267, 84, 20, 364, -213, -268, 47, 199, 15, -169, 20, -164, -390, -32, 34, -478, -139, 39, -141, 150, 222, -150, 28, -1, 233, 30, 131, 226, -1, 102, 467, -25, -475, 195, 382, -139, 174, -57, 35, 3, -65, 45, -421, 147, 90, -276, -307, 307, -218, -48, 43, 86, -390, 258, 294, -290, -107, 515, -297, -33, 730]
2914G30p09j61M09K5o16K52O97n36l64Q28m47o90Q54J72j053N16P81j191k04J152
2934D45j49j180J198L67j497M14J287j065k76J391o93j112J093O90j460K01J656
2951A310j713q30K000n10j322J580L39j877K04J775j468n72J959k69k221J391
2967b24J265j913K91K136j569j540K015N95k457J618J648k470n59K694j406k137
2983b013L186L87k999Q05K033k442l78L302j023l008K667R02l523J104L307k208
2999I9j883L569j071l273K911K261l588l27L217k163j912L982k32l696K293K393
3015B580m405NL964j815k488L688M9m646K403L729m140j031M655k293l213M121
3031A163J062n006J928M164l968j983M887o91m486L791K274n883J279N019l790
$$ y = [730, 21, -140, 269, 294, -322, -70, 627, 91, -273, 555, 108, -582, 272, 444, -609, -93, 688, -503, -707, 445, 296, -884, 314, 681, -816, -402, 885, -180, -456, 935, 242, -870, 223, 913, -547, -346, 1310, -403, -1233, 767, 257, -1065, 515, 854, -1023, -819, 956, -512, -1084, 875, 606, -1615, -224, 1041, -872, -581, 1555, -14, -1554, 461, 1056, -1401, 217, 1865, -605, -1164, 1530, 124, -2013, 1173, 1560, -1439, -634, 1399, -1043, -1421, 1881, 858, -2150, 517, 1419, -2104, -1000, 2307, 99, -1784, 1785, 714, -2559, 352, 2613, -975, -1302, 1915, -248, -2160, 1822, 1590, -2106, 187, 2580, -1825, -1820, 2144, 329, -2159, 1529, 1578, -3068, -665, 3064, -1076, -2107, 2548, 255, -2958, 1163, 2225, -2781, -853, 3311, -657, -2640, 2247, 1556, -2930, 861, 3135, -2748, -1469, 3550, -240]
3046b40k894N415m14n069L614K845n920K80N576l225l456N426M20n770K658L949
3062C195n084l75O265l143m874N120J725n817K897M480n727k217O094j912m465
3077c838N671K121o891Q89N092m745j546P284j638o662M128K923n961J171O925
3092D923m546m045N631p77n858N259M630o454q04N105m109l701P598J514p006
3107b640K275L251o440n32Q417j837n396M542L18p243L164O970m339k541N642
3122C611l674o347O591M403n675J023M292o741l242P785R78m905M103J979q535
3137d354p6P661k570k529O091j817q331L372N848m137K55N835n373o153O032K440
3153B194m926L932M477p343l595O577q40l111O647J263r322L43N869l255p84P461
$$ y = [-240, -3134, 2281, 1867, -3202, 412, 3257, -2663, -2383, 3193, -32, -3488, 1938, 2358, -3412, -754, 3195, -1889, -2264, 4001, 858, -4016, 1104, 2829, -2988, -91, 4389, -1338, -3555, 2539, 627, -3838, 1833, 3954, -2937, -2048, 3044, -1701, -3247, 4037, 2399, -4263, -135, 2788, -3173, -2002, 4923, 377, -3668, 1963, 1186, -4672, 587, 5217, -1237, -2041, 3064, -1045, -4746, 2852, 4366, -2640, -365, 2886, -3554, -4086, 4331, 2494, -2902, 1640, 1958, -5285, -2121, 4849, 510, -2031, 3611, -63, -6410, 181, 4584, -1091, -68, 4224, -2517, -5759, 2026, 3004, -1901, 2202, 4181, -4354, -4430, 3231, 661, -1868, 4223, 2406, -5925, -2553, 3295, -842, -587, 5248, -125, -6278, -246, 2194, -2732, 1200, 5677, -1666, -5261, 1316, 476, -2635, 4012, 5275, -4047, -3704, 2165, -1090, -1874, 5587]
3169E587k443p826L316K694m512K865O580n224n339M141k8l923O343L765p327
3184a331k053M892l042k367P379Q65o542J113K734n282R66P737k172n298K816
3199D15K89n274L986N756m503k845M027k408m406N826L338m655k08K752m900j618
3215d428O853R41m672J880J090n365J168O027k071k760L560j492m981L356M042
3230C148k627q23K852l558l384N045J952l585J197K237m783r22M931o14k535K957
3246A488N28m938P62M015j938q66L570j720l830K319K322k488Q10K824l075k608
3262b825L117P66k387K324J674m154p69L171j131r32K870j30l644P70K413k132
3278i99L21K695j391k561J577J103j695J126J895k272j250K071k08j959K139J095
$$ y = [5587, 3144, -4682, -1366, 1328, -3184, -319, 6261, 1037, -4302, -161, -189, -4112, 2231, 5996, -1331, -3384, 1508, -1534, -3901, 3478, 4343, -2199, -1086, 1648, -3634, -2668, 5069, 2897, -2401, 415, 704, -4570, -584, 5172, 669, -2176, 1851, -557, -4963, 863, 4201, -454, -662, 2090, -2810, -4428, 2425, 3366, -1306, 574, 1664, -3701, -2533, 3494, 1423, -1337, 2223, 731, -4250, -894, 3148, 521, -302, 2550, -1008, -4392, 653, 2605, -980, 217, 2454, -2329, -3251, 1680, 1066, -1469, 1488, 2016, -2922, -2160, 1855, -83, -949, 2621, 901, -2929, -610, 1712, -776, 34, 2858, -217, -2825, 292, 1058, -1329, 995, 2669, -1485, -2254, 917, -214, -1146, 1724, 1594, -2050, -1280, 1133, -999, -678, 2017, 626, -1935, -358, 745, -950, 176, 2071, -201, -1451, 620, 412, -1547, 592, 1687]
3294A687k596q8J658j213o39K468m33j905O03J144j676J99K036r52j319J483l17
3311A40j417J086J533j231q27J477p60o02Q90N69j212M88Q06j306m69J342K08
3328G15r70K13J99j202P29J286q59p79R79j44m34J59M07m01J47N77n74n41N00
3347GK23l46N2L44n55L12N72k88q06N44N77m40l47J93k43j13P55l18n18K26L97
3368B28m5l79L89j03j63J50o5j05j99N41q2l37K69k2JL34j05o27j6O18Q4m46Q6
3391FNK3J70J6o77K54M48m59l8K90N6k72L75j73l75R7M93J61o39K52p5o7K98K19
3415C88o58J33O01k12o11M56N5n18O38K52r45K55N67l84n64P42k7o53L98N38p42
3436b91o3P96o43m95Q10M30r22L46O72r92k01J203n62o16O18M78j270L59J209
$$ y = [1687, -909, -997, 661, -552, -1191, 1277, 844, -1061, -458, 686, -990, -791, 1245, 293, -1026, 457, 140, -1277, -191, 1342, 111, -716, 761, 1, -601, 289, 858, -354, 134, 940, -366, -835, 507, 715, -255, -42, 157, -1045, -316, 970, 111, -668, 311, 167, -267, -108, 299, -102, 45, 622, 48, -493, 7, 230, -116, -64, 280, -275, 37, 609, 321, -485, 59, 636, 196, -151, 42, -201, -314, 441, 123, -395, -169, 228, 183, -196, 193, 90, -73, 77, 12, -93, -292, 249, 167, -170, 99, 77, 78, 412, 307, -320, -336, 282, 366, -80, 6, 11, 34, 204, 220, -457, -203, 245, -214, -252, 38, 94, -178, 197, 24, -351, -254, 239, 400, -239, 13, -62, -129, 169, 388, -270, -137, 464, 252, -359, 97, 152, -366, 272, 524, -421, -166, 401, 17, -547, 195, 168, -485, -87, 451, -291, -354, 442, -201, -696, 114, 544, -378, -32, 640, -352, -553, 650, 88, -528, 90, 568, -702, -343, 866]
3455H66j001l56J023m92j047J075Q22j813L80J715j483n31J662k04j571J238N97
3472H80j744L67J937j251j465J985L6j876J557J129k347k45K595j203j761K212
3488H06j03k033J271J625k438n72K726q63k233K372Q20k621R93J813k044j262
3504a743L494q29k827K374J281k872O82K394k661j236L950n62l327K069J617l516
3520a712M64L323k199j956L438R2m059K253K677l270j34L127k271k215L607J118
3536B283m078J312K916l557j017M205j090l061L335R74m649J080L926l213j247
3551a881M003j681l885L557K644m369M01M134l288k855M617L70m250L162K543
3566C222n302p45N078j706k658M356n4n708K140M188m003n56N154k570m787M235
$$ y = [866, -135, -491, 532, 40, -1007, 68, 890, -923, -543, 1172, -311, -842, 820, 616, -955, 283, 880, -864, -497, 1440, 189, -1276, 709, 745, -1131, 426, 1555, -792, -1037, 1558, 355, -1406, 806, 703, -1330, -59, 1566, -872, -1444, 1282, 419, -1814, 558, 1378, -1243, -250, 1563, -481, -1743, 1751, 922, -1905, 469, 1750, -1122, -440, 1954, -707, -1943, 2007, 1445, -1882, 187, 1804, -1712, -1248, 2075, -124, -2080, 1358, 1450, -2609, -356, 2321, -949, -1083, 2044, -227, -2442, 1165, 2283, -1795, -483, 2433, -1124, -2141, 2064, 974, -2087, 1248, 2222, -2427, -1347, 2579, -634, -1881, 2122, 441, -3444, 113, 2757, -1612, -1211, 2923, -365, -3220, 1397, 1767, -2483, 679, 3222, -2080, -2825, 2253, 547, -2111, 2245, 2191, -3517, -1377, 2811, -1192, -1748, 3406, 836, -3951, 284]
3582B84J771m671K552L957m893k919N493p77l711M390K236o166J60M707l257j595
3598b439N966q27o236L158K590m615J171O167l938m363M401P6m861M302M349n789
3614h88k088M779k856k945O231K029o557Q08L651m862m05P042j044n479L049J030
3630A495n788K981O019m002l101M357k050n225N694M131n232j52L663m890k743
3645d843P115J154n127K636J518o361M44O796j874l356M297r53o394K909N747
3660C708l484p16M053l839n119N496K750l881J974L036n952k544N855K48l356
3675a771M321R75p121J58N235k140o01M821k123o006K588L574l489J350M533m082
3691B22m288M149P71l284L781K843n365j983M179j344j705M816M92n638N39L150
$$ y = [284, 2055, -2616, -64, 3893, -1000, -3919, 1574, 797, -2914, 1476, 3712, -2454, -2294, 2413, -844, -2439, 3527, 2700, -3536, -378, 2212, -2403, -1232, 4935, 997, -3366, 1035, 1111, -3750, 552, 4901, -888, -2976, 1803, -1053, -3998, 2233, 4262, -2295, -1487, 2164, -2698, -3103, 3939, 2895, -2584, 465, 1495, -4293, -1312, 4707, 705, -2396, 1961, -89, -5314, 380, 4511, -721, -873, 2790, -2100, -4843, 2272, 3426, -1701, 935, 2453, -3908, -3464, 3332, 1458, -1898, 2399, 1446, -4948, -2039, 3708, 224, -492, 3561, -278, -5397, 99, 2849, -1032, 942, 3978, -1974, -4518, 1337, 1585, -1771, 2550, 3525, -3596, -3438, 1797, -343, -944, 3877, 1754, -4252, -1664, 1910, -1579, -229, 4304, 222, -4066, 83, 854, -2430, 1351, 4194, -1171, -3154, 1025, -319, -2024, 2792, 3284, -2354, -1815, 1335]
3707A335k893lM985j525m846K770Q42l425K385M795l643l181L327j136k800L962
3723I49K982m488j062L087k742j494M887N74l954P88J588l343L23M753j422l209
3739a783K528j44l458K133L192k466j258K486j451k683L352J807k904N78J600
3754A529k941r91L940m1k442J663Q67l433L89L321j511j500K281n45k686J681
3770d19K113k043n9J817j742j823K485O33j982J166J119k485j38K356m72j486
3786i60J676N33k367N4K216j279j78J666r08j863J362R87j530M56J295j327j173
3803a340J870k21j383J148P51j422j73J106m71p15J383L4j297K56J137r33p8J296
3821I48p95j050J073j16n42K99Q80p16p20J025m22k24O02L16j142J75Q73n04j79
$$ y = [1335, -1558, -1561, 3424, 1899, -2947, -177, 665, -2760, -375, 4420, 777, -2404, 923, -213, -3013, 949, 3931, -557, -1619, 1468, -1274, -2768, 2119, 2693, -1261, -473, 1115, -2228, -1905, 2848, 1426, -1783, 745, 601, -2857, -724, 2468, 2, -1256, 1230, -221, -2904, 448, 2255, -649, -71, 1529, -1412, -2403, 1537, 1496, -946, 717, 1584, -1849, -1460, 1861, 350, -1150, 1131, 586, -2100, -419, 1694, -349, -408, 1409, -333, -2156, 329, 962, -1020, 146, 1265, -1220, -1358, 998, 526, -960, 716, 1249, -1118, -1064, 1152, -127, -305, 1361, 453, -1410, -48, 939, -591, -135, 1160, -167, -1340, 530, 309, -1074, 74, 825, -597, -770, 336, -135, -850, 533, 567, -730, -474, 663, -270, -348, 948, 153, -897, 176, 60, -482, -183, 697, -19, -739, 286, -136, -360, 242, 558, -584, -409, 464, -40, -219]
3840b19N53l6p73N88K82o47q5O17n1m82N18m1n77K75M75m86j42O45n6n33K77K35
3862C37m92K54K33n22j2J58K84o70O05l9M0m90N38k74j64L43Q4l39O0K97J23l13
3884D1M4k94J37N4J30m03J57K17j73J45p6J59l53J36j3P1j87M61n06J92K44q7
3906I6k60K40K30l59nK75Kk08L18q3l48J94N3l22K46K17j44l30L38J02o01K70
3928g9J32k31O7K99l08p8J35K74l34K08J93m41K05M18m22l06N40J26o54J53P46
3949F43q88q1M88L5m92N92J02q79L63N77q16q3Q23n9r75P32K28r51J87R26p94
3970c22j99Q98p0q46P24K69j182O50R65q53n18O72J39j079R61O25j095k75J482
3989I46r07j147J327J42r54N92J066j563l79J715o86q19R08M04j868O43J532j060
$$ y = [-219, 334, 298, -475, 113, 395, -252, -337, 280, 229, -253, 265, 224, -353, -78, 397, -89, -231, 414, 358, -175, 102, 337, -155, 99, 332, -190, -202, -44, 240, -430, 175, 136, 176, -314, 224, -50, -214, 129, 213, -126, -66, 231, 354, 41, 85, -209, -72, -18, 112, -291, -134, 83, -90, 55, -21, 138, -215, -79, -92, -21, -208, 253, -253, -61, 183, 96, -164, 76, 306, -53, -58, 217, 219, 11, 329, 246, -102, 92, 145, -177, 69, 286, 142, -188, 150, 252, -349, -79, 53, -178, -111, 188, -120, -198, -63, 211, -123, 85, 278, -163, 42, 460, 38, -268, 272, 398, -256, -103, 643, -245, -326, 162, 197, -295, 297, 399, -480, -117, 460, -356, -439, 384, 325, -650, 82, 310, -641, -454, 472, -322, -521, 377, 307, -539, 185, 454, -728, -78, 887, 34, -484, 188, 327, -752, 209, 834, -261, -536, 946, 39, -1108, 219, 361, -593, -1, 1065, -498, -877, 838, 152, -667, 241, 645, -1223, -580, 952, -108]
4007a08m31J837q89j517J222P53j458K21J914j854q57J631J03j682J698R48k467
4024i36K17J406j011q65K309j00k475J250J228k255N90K460j298j699J611J70
4040F02k319J882J847k018r31J931j311j427K750O32k613L79J721k315o8K915
4056A657o87k294J547P03k855J020K963j874j098K066j077k421K332J893k129
4071b54k1K104k751j278L377L45j984J081J154l544r6L216p62j704K424k60l533
4088b486J324K740j955K6K629k033k820K087J849k165J138K174l341j744L448
4103H71k33j300K029N30l613n5K914j579m29L237q14m046J472J750j779Q28L483
4120C266k785k818K163N56k320K658K506l885j408K714r69j581L793R43m148l9
$$ y = [-108, -539, 1298, 409, -1108, 114, 867, -591, -370, 1544, -310, -1167, 464, 567, -1115, 583, 1531, -936, -719, 687, -324, -1189, 1120, 1020, -1455, -205, 1023, -1232, -642, 1818, 520, -1179, 432, 602, -1717, 165, 2012, -6, -937, 994, -317, -1744, 1006, 1638, -975, -596, 1125, -1190, -1258, 1657, 970, -1324, 223, 926, -1929, -909, 2054, 180, -918, 1148, 71, -2350, -18, 1875, -254, -275, 1829, -922, -2200, 1177, 1522, -462, 619, 1773, -1771, -1867, 1349, 587, -1117, 1307, 1047, -2486, -1162, 1578, -377, -351, 2278, 245, -2575, -488, 1361, -804, 334, 2508, -833, -2577, 871, 638, -662, 1367, 1897, -1716, -1771, 1143, -436, -865, 2372, 1558, -2488, -1016, 734, -1045, -217, 3266, 481, -2337, -174, 382, -1938, 720, 3226, -659, -2067, 647, -322, -1903, 1890, 2833, -1315, -1354]
4136a354K070k260P2M498j097l743J578P27k571J521L699k450k457K354j075k227
4152b715L323K511l525n70K010k629q58M401O50l426O17J032l197M87M270q12
4168A569k441K096o47l864K528L564k447p05K034k263k888L717J845k428O64J535
4184A869l461j185L853L06k161K377j84l807L86L487p39r13K251j427l390J874
4200h64K393j972Q46J819k416k527K665Q99j767J963Q64l134r51K689o62o97K462
4217A610k61l102M69J911j359N59K546j510k682J581O72j671J180K238k068j748
4233a635J788J4j341J795J453k658m56J363j075l61K481J14k401N39Q14j557L98
4250g25K485j174j786J145M13j866J516J749j638r02J651j080j054J678J010j779
$$ y = [-1354, 716, -1544, -1472, 3026, 1929, -1814, -236, 491, -2080, -559, 3140, 690, -1767, 587, -488, -2715, 608, 3119, -406, -976, 1034, -1595, -2453, 1948, 2598, -828, -211, 821, -2376, -1889, 2381, 1569, -872, 1224, 577, -3287, -759, 2805, 358, -347, 1687, -576, -3464, 253, 2098, -330, 334, 1869, -1592, -2777, 1076, 1382, -779, 1598, 1414, -2393, -2007, 1480, 741, -172, 2079, 652, -2738, -864, 1529, -443, 403, 2222, -194, -2721, -56, 843, -924, 1039, 1903, -1231, -2182, 507, -155, -852, 1610, 1349, -1753, -1284, 627, -732, -173, 2373, 863, -1819, -238, 434, -1237, -57, 2181, 113, -1635, 153, 167, -1174, 621, 2074, -584, -1040, 323, -752, -1113, 1368, 1482, -919, -380, 434, -1123, -725, 1760, 586, -1200, -55, 358, -1508, 8, 1757, 119, -783, 868, -212, -1266, 412, 1422, -357]
4266c57l4J256j560m68K183l56j299R81K55j809N92J681p25q00R73l17j420R44
4284b80J263j044l55J336j101r46J493L66j352N68Q82j381j40J297k13q61P64
4301B96L38j285K84R13q30k73J093o00j017J233O02j014OP99o35k39R03l88n47
4320c61N58N15p82m64R32k70n63P45Q4j017M30R55p08m62Q46k59n21L89l0o68
4340f51O63O19q16l25P20q0l63L33L8n44M12L82l76k23L82Kj21J54k10j81l5N51
4362C31l29l6l69P05l37q3J81j61K21Q1k13l2J08j42n2n5L49k07J3M48j60n12
4384b51K56J69l21J34J83l32J42M0R6k44p3L20K9l07J45k00j44L95j30r9J62K60
4406B30j61Mj27L24l97M74n9l13j29M04k07k08K5J86q8L85k92l73L43K89k34k68
$$ y = [-357, -391, 865, -695, -1163, 1020, 664, -635, 346, 601, -1208, -616, 1065, 340, -460, 513, 196, -1224, -280, 983, -61, -416, 920, -181, -1127, 366, 732, -620, -52, 830, -551, -691, 606, 393, -468, 296, 634, -651, -367, 546, -284, -557, 536, -64, -1081, 152, 754, -260, -254, 545, -90, -329, 574, 186, -361, 197, 712, -70, -534, 398, 128, -435, 310, 394, -623, -193, 762, 54, -408, 438, 179, -342, 47, 17, -651, 12, 631, -185, -510, 210, 130, -233, 100, 138, -406, 6, 388, 12, -211, 171, 173, 52, 206, -4, -185, -220, 331, 2, -34, -403, 302, -35, -118, 63, -98, 123, 204, -9, -41, 67, -75, -127, -182, 167, -40, -27, 421, 261, -251, 5, 174, -147, -13, 170, -162, -20, 20, 116, -128, -201, 119, 148, -159, -14, -214, -358, 37, -93, -192, -30, 230, 69, 73, -54, 270, -127, 347, 288, -25, -154, 250, 43, -165, -140, 46, -42, 343, 51, -322, 21, 310, 76, -192]
4428a92J37L51m31Q7J60j04qK77l54p6M28k20j19J2L05r0j32p3J94m88L03l6q6
4451a55J49M70n73lK63O0m48M08j69l44M35K93m90j03K23M2l70M63M1m71K50L91
4473C62k53j93J81m1l93Q00l37l82J84M02n68j07M61O7n75L09M51r68K5Q07l10
4494g8m53O23n6o33N99N47q22n3R49n86n68P94M0n38L38N15q91k57J075l92n21
4515c68P12j40n78J97P67p99l41J536p32j054L70R14q43L80J239j413n50R67L00
4534E64r24N69Q16j524j77J164o91k47J538r1j713M93N92r69L16J542j261q91
4552h94P83L48j137Q86J326j512m50R91n01q90J659O58j526l39R43q59j68J748
4570A066j58j748P56M81j683Q42K128j249j167J063l00j516J411J692j732k05
$$ y = [-192, -55, 296, -135, -48, 112, 8, 0, 277, -77, -153, 275, 55, -64, -52, 253, 163, 31, -42, 152, -336, -33, -69, -155, -6, 464, -109, -112, 151, 211, -237, 171, 2, -342, 93, 386, -104, -207, 16, 58, -312, 151, 192, -279, -29, 362, 109, -84, 97, 56, -337, 463, 126, -256, -72, 330, -238, -345, 116, 183, -392, -83, 368, -600, -575, 232, -78, -531, 92, 36, -597, 2, 549, -273, -326, 623, 37, -531, 263, 303, -235, 103, 618, -273, -530, 545, 153, -368, 344, 204, -374, -177, 590, -209, -550, 986, 254, -800, -430, 484, -359, 21, 1260, -153, -703, 264, 564, -360, 209, 1025, -499, -676, 488, -203, -450, 1088, 997, -716, -223, 369, -600, -284, 1258, -3, -894, -111, 237, -900, -14, 1312, -200, -650, 341, -160, -1050, 609, 1267, -259, -598, 345, -514, -682, 1066, 908, -840, -84, 397, -1286, -444, 1684, 435, -732, 331, 31, -1485, -74, 1618, -114, -319]
4586c19R24j328o62K047M97j670N80N66k050M78K173l97j099J037l12k415J277
4603f73J935r73m34J307j121k150J730J544j275M52R48k111j015K055N21j002
4619b62J108J45k282k31K084n74l51J915m99k891R27J869j404L02J899j626j845
4636a716J296R81j133R54J594k556j102J777o9o59J912J96k714L4J609o62l77
4653f35K351n99k476P16R38j358J073K269k144j421J092K24j053J741J140k396
4669e38l57J283r63n87K302N39k113pP36j627O94K260m46k038N91O41j760J198
4687a92J929j473n26O10p25j498K346J213j783M1N42j397n41K344J90j677Q29
4704B32L07j982N26K000l24j205J141p22j631J488J298j111l66J002r62j052J358
$$ y = [-319, 605, -723, -1385, 662, 1159, -511, 69, 635, -1415, -937, 1236, 839, -260, 777, 465, -1950, -673, 1262, 289, -145, 1162, 41, -2109, -379, 1165, -110, 342, 1290, -821, -1836, 219, 740, -262, 846, 991, -1291, -1522, 562, -12, -363, 1552, 1053, -1838, -911, 958, -446, -144, 1755, 129, -1716, -420, 561, -572, 382, 1976, -580, -1682, 95, 26, -633, 1279, 1475, -1239, -1205, 404, -258, -635, 1716, 1117, -1359, -643, 295, -1063, 10, 2279, 135, -1286, -194, 30, -1023, 718, 1858, -538, -895, 388, -575, -1162, 1140, 1679, -434, -441, 295, -1332, -638, 1622, 1176, -862, -271, 370, -1390, -192, 1737, 264, -262, 348, -377, -1875, 471, 1684, -99, -58, 484, -913, -1454, 890, 1080, -597, 232, 539, -1443, -917, 1083, 759, -446, 695, -27, -1658, -170, 1128, 17, -349, 653, -309, -1361, -3]
4721cQ96j209N74O33j830j30J655k7r95J069J63j913M81J099n31k07J382p98j474
4740a165O61J129p27R1Q72j090j135J405N16j226J057N11j436k83J114m36m06
4757e48J237o2j394K38R61o56Q7J172p89j228Q51M18q39M52P60o77m89M95J04
4776I3j135J381K79q85K19L49o58O7M90K07p96N84lo83K79P23l41n29L91K8n75
4797e15O28N32o90j49N00n28j70O02J70o54M29K72o50l86J073l3o06R2K18m10
4817b75L43M24m85j90L44K47o34L64J75n06O5M96m09m55M94L44m04j13L32k99
4837a42j4L52j89j55L99k27k23lL37j19k4K51m6m00K18L27n61NL5K43q8J01m8
4860B9l17L17l3j55J40J14k12l8K01n2k39R6qQ0k19L55N8k73J81L1Rj27K68j95
$$ y = [-3, 893, -316, 258, 891, -939, -1069, 586, 559, -436, 633, 796, -1117, -636, 463, -68, -275, 1107, 309, -1165, -504, 625, -102, -11, 861, -229, -1364, 41, 557, -669, 388, 899, -537, -820, 294, -142, -548, 689, 627, -767, -529, 432, -224, -137, 1035, 246, -982, -131, 287, -552, -100, 660, -17, -506, -11, 93, -1042, 339, 618, -267, -48, 301, -357, -290, 200, 407, -389, 195, 192, -491, -212, 511, 170, -359, 32, 60, -515, 113, 645, -45, -194, 306, -222, -392, 210, 380, -274, 155, 427, -223, -609, 464, 431, -175, -83, 135, -275, 68, 492, 7, -183, 161, 408, -226, 138, 313, -193, -128, 368, -41, -496, -2, 342, -62, -175, 157, -142, -156, 196, 7, -148, 251, 24, -199, -202, 135, 16, -8, 243, 197, -203, 15, 342, -219, -214, -179, 64, -24, 77, 29, -288, 29, -4, -159, -19, 95, -117, -155, 46, -6, -245, -149, -157, -77, -296, 59, 117, -156, 25, 56, 65, -62, 206, 11]
4884A1m1k2J0O8j78nkK86j56k9om5K39l59L10j3k56J82M9p7N3j19K90j99L7j2
4910A6j14pO5J36p8j8K24l10Q0q3N2k2J40m8k03K71Ll03N0J50N8j63L9R1j21K20
4936A25j98L0n6N5N5p0r8J97K1K11k92K4%P1J9kR6j50k03J85MK2k40J52J6k07
4962b33L85O8m27M37j62k17J39K32l62Q1J9Q9M6j87K15j07k15J62L17o13L71N0
4984H8l68J6L82lk42M6K10m37L95j37m4L9L40l29j87K72L9j69j6J20j72K71L10
5007D24j63k3l23J36j57J69M65m09o6J41k37l50M33J08j0j49R8k19j67M30k7j11
5029gJ96m0o84L05O65k25l83O46n65l66M68L71k18K8Q1l00l65M54L29j14J7l5
5051B58m80m52Q18N8j12L95k59o63J41K64J9o9Q36n23p08J77K93j04K30N29o36
$$ y = [11, -30, -52, -42, 26, -152, -157, -159, 127, -29, -58, -64, -109, 130, -229, 81, 68, -188, -6, 43, -34, 19, -100, 190, -9, 28, 16, -98, -105, -40, 96, 18, 0, 224, -86, -6, -89, -37, -59, 81, 33, -170, 101, 104, -199, -149, 1, 59, -104, -65, 26, -95, 125, -73, -43, -99, -44, 11, -59, -157, 40, 61, 272, -20, 4, 4, 75, 94, 92, 188, 38, -165, 20, 24, 46, -194, -42, -26, -233, 152, 220, -207, 230, 68, -149, -10, 222, -140, -59, -40, 49, 95, -92, 123, 16, -199, -37, 280, -333, 38, 88, -280, -264, 118, 115, -127, -81, 129, -308, 87, -50, -94, -55, 285, -44, -231, 41, 80, -89, -105, 15, -157, 114, 424, 261, 238, -85, 51, -106, 63, 528, 119, 53, 194, -43, -393, 40, 148, 138, -11, 87, -132, -299, 131, 104, -7, 189, 149, -535, -230, 435, 210, -173, 473, -92, -458, 10, 381, 163, 191, 272, -28, -393, 61, 390, 276, 293, 258, -222, -674, 144, 202, 90, 485, 226, -437, -296, -32, -13, -82, 754, 231, -477, -300, -7, -111, 119, 648, 12]
5072A2o72M85M4r2O11K79o74p47N29J70k09R06k11p64l1P4n0n5J223m80o99Q9
5094b62J70l23N67P95p10m74K23k85q4P08M70o14l40M0n65J02J379pp47m9l22
5115c28m50M44Q68J19n67Q1n54k38L43R25k41m95K64o94q5O24P49m91K0o4r36
5136g06L1P97L84n82N00j87j181L97O40L45k61K42l50r93O69N45k51L07K65j073
5156d62k82M83L63N7L03Mj015p3N27L50M0K46l09o68k28N75J6L13M39l41r78M22
5178b18N0J30L13M16p45m01j1K87j65R30M8p97l64K89O1M2O49l56k60k96J25K6
5200b47L77N78l57m71k8l05K32M57J70l20l49l1m6o4N54P6k49R7j91o3k12P70
5222C78Ok53o2M1l32K38L46J0m18J02L9n84M77L12k86J14k2l10l96R38r8l55J59
$$ y = [12, -660, -175, -131, -223, 388, 667, -7, -754, -225, -55, -264, 642, 431, -333, -364, -290, -340, -395, 828, 348, -351, -262, -92, -415, 152, 947, 237, -237, -14, -299, -383, 325, 795, 181, -159, -119, -684, -582, 797, 790, 43, -6, -328, -778, -334, 534, 653, 86, 167, -387, -625, -282, 643, 402, -93, 171, -523, -608, 16, 765, 274, 294, 230, -706, -675, 122, 506, -76, 424, 237, -944, -547, 93, 438, 177, 419, 69, -924, -255, 290, 39, 346, 611, -462, -744, -261, 102, 159, 462, 466, -549, -622, -95, 255, 295, 541, 232, -436, -664, -89, -73, 240, 679, 338, -640, -218, -168, -38, 275, 691, -54, -455, -466, -179, -344, 586, 634, -163, -527, -238, -177, -135, 514, 158, -102, -398, -273, -247, 130, 708, 351, -120, -148, -453, -221, 236, 406, 86, -263, -294, -340, -404, 150, 226, -23, 74, -117, -180, -392, 378, 384, 131, 69, 110, -222, 16, 362, 372, -46, 56, 95, -489, -12, 300, 14, 128, 106, -204, -600, 338, 240, -115, 44]
5245D4K39j06o08O85m2n00M28o3m67P8N37J7L1J91n71r2O3L93m07J82J41j97q3
5268a07N05n09j68L3N85l65k15J32n5K85k42P1j11j19K33K5j5k3L0n3J0j58L57
5291A26j44L9N1l1K47o0n83K63j6K80k85J35j79m9K97j93J48n5K9M2N6j5j97L2
5315f2R9j37M6J28j36l5l2M6K7L7J50j58m11M29Q2JO6p5KO7l5k5k36j61L25Jr7
5342i4K05k9J79j81joj03j16J81rj16O4nJ04J03k06j61L09J0j89L7Q2O0k55K84
5367A47j65l1P0j71J53j63J40j17R8N8o7k7K80j44l7k8K3K02J40l85Q4j69j12
5390b21J58J72j12J2K1L9j06J11k32K71k80j29L21N8k81J84l8j40N67m32J06m2
5412Gr4O3J2j13K9K33L5o2j06k45L64k7J5j85K33l31K01j54J73j66N8J89j83P3
$$ y = [44, 283, 177, -431, 254, 212, -288, 140, 77, -390, -312, 225, 242, 273, 464, -107, -199, -136, 257, -150, 32, 173, -24, -107, 398, -111, -279, -246, 339, -26, -241, -109, -164, 121, -121, -50, -161, -280, -47, -22, -37, -60, -30, -83, -73, -231, 126, -18, 21, 72, 41, 288, 228, -355, -92, -108, 172, -113, 22, -157, -206, 91, -102, 46, -9, 20, 62, 118, 103, -94, -62, 37, -100, -54, 74, -62, -97, -129, -83, -56, -19, 131, -27, -438, -9, 73, 74, 140, 65, 67, 134, 99, 74, -162, -323, 2, 3, -94, 111, 82, 261, 80, 79, 73, -30, -146, 35, 26, -90, -26, -31, 73, 176, -30, -191, 118, 128, -61, -24, 58, 118, -137, 147, -18, -49, 21, -150, 3, -160, -20, -137, -39, 19, -48, -75, 205, 61, 24, -4, 19, 221, 361, -24, 60, -109, -221, -63, 109, -3, 9, 30, 69, -37, 74, -158, 113, -167, -296, 25, 83, -198, -14, -52, -192, 375, -57, 49, 7, -87, -24, -12, -125, -96, 137, 172, 110, 4, -241, 123, 96, 111, -74, 159, -172, 29, -125, 48, -118, -60, 129, -54, 19]
5436A9P1j72m0J50k9J21J8J26l04o8L85m64J50m6K21r1r3k1L6J18on0J2p3j71
5461b01L36p2P1l09K21O4j91r9Q3k58L94m9r9j8J35K28j49m61M22O2q6j40O8K08
5485A60Nk10K25k26l40M05o2r8L07r3J4Q1j77K70k06n9r3J11j44p9J44K51j47
5508C9k20M0J54m8QQ7o5j81J73l72K34K19j7J42k41l3R7n3K94j97k8j48N4J42
5532H0j03R8K0L35l77k25n9L51R9j17k7l93J57k6J61K59j99N8j66l39M47J58k94
5555a02K84M9l56q8J39J12J5J94j48l51j55R4L50K39J01j08k03l48M17l62K73
5576D6L09k68r9Mk87J38M52l0M4n72L7Mk7Q79k23l14j69k94p2K69N81r7l84R0
5600A7l64o3N48K38n0m2m06l26K04P9N68j52k04j81m05J32M06L57l30J67j80n27
$$ y = [19, 90, -82, -122, 28, -1, 120, 138, 264, -40, -108, 277, -187, -37, -83, 138, 47, -46, -67, -31, 87, 81, 31, 43, -30, -201, 135, 63, 134, -175, 46, 110, -81, -180, -97, -355, 39, -10, -109, -127, 8, 236, 87, -374, 48, 110, 24, -116, -48, 160, 165, -45, 180, -46, -386, 19, -43, -141, 166, 73, 87, 168, -9, 261, 55, -4, -97, 14, -130, -209, -65, 186, 39, -181, -141, 13, -35, -27, 60, -5, -186, -13, -385, -151, 68, 51, 193, -48, -81, 16, -37, 257, 60, 32, -116, -62, 80, -23, 75, 95, 430, 53, -172, -231, 120, 219, 102, 75, -318, -161, -187, -26, 233, 34, 92, -74, -413, 34, 192, -102, 182, 231, -125, -213, -74, 38, 53, 247, 99, -252, -407, -313, 37, 276, 377, 269, 66, -282, 135, -227, 46, 355, 87, -12, -8, -295, -157, 295, 265, 309, -263, -226, -222, -249, 630, 407, 93, -76, -370, -442, -173, 408, 311, -73, 17, -347, -410, 138, 376, 326, 284, -122, -448, -244, -165, 403, 251, 47, -134, -539, -407, -1, 356, 26, 193, 13, -514]
5622e14K16N42J09j84O4o68k47O17L81p0k2k38l38r4K94K06r6K65l39k74J57J69
5644f4J86J37K25m37n09J56L2M11JK94l79m57ON16k17L72K10m74n16M38J37j67
5666i9N61J13n51j04Mj25J85N77l26k44K12k25j80J28L97k6j90j67n5N9K16J68
5688C28r0l45j45L0r4P21j80l48l1K12l37J82K42R1j82j56r8m4k8M74m2j39J59
5711A80l93j9J15M42l00J09K3k87j43M22J65j55KK2l61m3K98N6k26N03k09m23
5733b22J14L94k83n3K68k38m40M87J48l05j4L94k43k02M90l88O7L78n9n00L10
5754A03kj83J00K12J49m55K13J20k52Q2q1po4L8O7j38N1L21k92m18J69L99m09
5777b77J36K77j02q4J87j35j00J60K26l80K42Rk48r4L15j10j11M22k44l9J72o1
$$ y = [-514, -298, 244, 353, 169, 233, -435, -682, -65, 316, 246, 224, -14, -352, -446, -152, 54, -42, 223, -116, -390, -233, -64, 122, 259, 484, 47, -462, -306, -274, 137, 138, 432, 53, -404, -398, 118, -99, 273, 483, 9, -507, -69, 68, -99, 462, 575, 24, -80, -76, -201, -16, 561, 235, -9, 203, -22, -202, -74, 323, 297, 107, -60, -115, -56, 160, 328, 238, -107, -252, -222, -316, 405, 225, -123, -154, 58, -279, -97, 145, 236, 54, -102, -200, -244, -272, 202, 160, 21, 180, -213, -232, -117, 325, 25, 134, 157, -130, -273, 149, 314, 159, 161, 183, -178, -221, 77, 133, -93, 410, 201, -222, -108, 286, 3, -50, 218, -20, -460, 27, 175, -130, -144, 250, 7, -195, 295, -93, -26, 352, 293, -207, 103, 101, -82, 18, 230, 379, -76, 137, 257, 5, 87, 6, -1, -65, -27, 40, -98, -47, 274, -18, -436, -267, 132, -277, -141, 136, 34, -50, 137, 2, -98, 62, 288, -92, 150, 159, -89, -183, 132, 22, -89, 333, 89, 50, 222, 161]
5799A61l57L33L7k68Q4J29K2l02J04Q0j57O1K55l59j0K34n4L0j24kJ38o1J12p0
5823A6O1k4j40K91k77m0L79l39J13j57j55M72l2j53p4L20l94LL40k68j79J30L11
5846B04j00p6K5Q0j80r4P6P1l04J18J52K7j1J35k34K5J30K8k47O18m44R3k25J34
5870AK1J97j85j17r1M10l22R9K42o2k18P0j29K53j17r3J66j72k1K5J16n6k2j09
5894a14M4o4K38M4j80p1N0l8J81j01n2o1J45k45L24O4l22K36l27L06N1J5m9O9
5918A43j63m8k48L16J56K6j59k38K49j74K40m1J11k43L5M3j01K58Q5l04RO6r8
5941h0K49k14J88Lj27K28m18J90K88l87N7j72R7J06k7J47j73j19L93l71K95K8
5963A81k97q4j5J18J15L5k08J48q7Q1k2n0l6L09k41N9Kn7j45K65j37P7J42L36
$$ y = [161, -196, 137, 174, -94, -10, 119, 141, -161, -57, 23, -134, -73, 182, -177, -187, 47, -7, 23, -101, -103, 35, -26, 86, 16, 77, 53, -87, 204, -73, -113, 266, -73, 40, -117, -272, 200, 168, 15, -59, 261, -133, -130, 210, -58, -237, -107, 204, 104, 28, 53, 133, -47, -141, -65, 6, -298, -180, -28, -1, -12, 123, -111, -86, 44, 72, -175, 443, -1, 92, -133, 1, 22, 219, 34, -83, -174, 236, -86, 13, 255, 193, -25, 45, -84, 169, 52, -41, 125, -47, -68, -43, 73, 17, -5, -114, -70, -134, 104, 148, -32, -103, -53, -91, 90, -11, -63, -124, 21, -224, 100, 164, -158, 78, -249, 57, 108, 123, 74, 143, -20, -68, -316, 0, 156, 182, 23, -215, 34, -140, 100, 59, 170, -73, -38, 5, -96, 162, 247, -57, -48, 18, -80, 169, -45, 143, 146, 19, 247, -171, 19, 307, -80, -23, -195, -98, 8, -19, 128, -45, -164, 229, -142, 153, 181, -116, -200, -215, -97, 18, 53, -155, -7, -94, -13, -35, -85, -121, 188, -53, 6, 8, -49, -194, 71, -66, 11, 153, 489]
5987D89n15k64K04P7p6K29j90o4K4k1L62m25J01J13m1P9K5j4n7q8KJ6l66M75p6
6012aLj3NQ1J77l22k59L57pj0nk37pK16j2J29k58L56j68l09M08j56lp2Q5j5r7
6039a34j20M49j6j62p5r6j17K25J56Q7j35l1j86J77K05k26l1M7j35J1K07m4K2
6062G8K37k49k93p4K55L32k21O2J0j22j54J69j41J14P5P6m85K12J48r8L69J30
6084D30l15l14J60j75k4L22Q7k60K4J0j75K03L17P0k93k21L2K30o2K84k87k58
6106b15J43j8k13L18J35R7m63L12k49j79M97K84o96P8L94k75k77O36Oo07L00k
6128Fj35j9K85r4k6J05k40m67R11J40k30j81L8l36j99M92O7j0j32M0n76K05O61
6151C05j69m65O24j23m87J45L86k98OL89n81j94L38J77j05K62K20p89m1L68J89
$$ y = [489, -26, -290, -86, -9, -85, 144, -46, -110, -86, -107, 255, -170, -69, 44, 3, 82, 107, 93, 36, -52, -50, -34, -400, 75, -1, 2, -11, -6, 75, 252, -70, -329, 28, 21, 11, 6, -231, -238, -22, -34, 95, -163, 193, 25, -284, 124, -32, -35, -107, -22, -37, -134, -254, 195, 179, 17, -58, -154, -271, -46, 110, 197, 62, 31, -155, 22, 227, 1, -30, 17, -118, -107, 100, 56, 78, 315, 66, -227, -301, -46, 286, 65, 127, 137, 15, -139, 30, -111, 3, 78, 154, -331, -119, 29, -69, 300, 430, 115, -199, -39, -214, -238, 84, 171, -89, -65, -55, -230, -27, 290, 360, 67, -154, -122, 108, 46, 330, 43, -215, -72, -90, -303, 15, 150, 247, -216, 96, -153, -332, 165, 449, -247, -169, 225, -50, -327, 309, 315, -292, 8, 6, -129, -148, 137, 43, 17, 122, -118, -585, 326, 466, 236, 55, 93, -243, -442, 50, 117, 107, -25, 15, -561, -356, 305, 136, -329, 295, 172, -315, -170, 216, -82, -76, 313, -268, -462, -124, 53, -52, 210, 430, -359, -400, -32, 157]
6172A57m99O83l2n72O2L77l87J39O49n39n94L96L33m43K52L16l60j39L43o3m17
6193c38L66K69o13K10L33l36P9J53R9k63j53K51j52l52O49j17n52O13J41n82J30
6214a65O65q29K52L31l54m3L94r6l75K22J98k37k48L89J41n06L51m5j57PK90k03
6236a8k78L15%k51M35J27m41p9M47o8m34N67m21j47Q7K35j91Q1J79j84l85M58
6258C4j46Q8n5L71l80j46L36m3M5M0Pm21m1K61Kp7M26k01m82L99J33j72n1L85
6282C12l52R0L0J9j73L27j45l29l1N87l62j65L43M5j59p4K01l80K17J44K25o46
6304b76L14m05P8L20k01O5K6J67k69K4J61J19n2r2p6k8J59R6Q3j56j29Q0R0J6
6328A14K87m98Q2J32J0m47J89M81k24m88N22k68P8J03L39m46K1o7J79k34K28K24
$$ y = [157, -342, 341, 309, -263, -201, 176, -211, -72, 577, 38, -556, -160, 173, -270, -18, 298, -62, -201, 142, 79, -338, 28, 297, -316, -106, 227, -109, -30, 123, 222, -41, -194, 57, -95, -447, 202, 85, -467, 146, 287, -295, -165, 500, -329, -77, 254, -100, -143, 251, 155, -220, 2, 200, -37, -285, 104, 245, -261, 90, 45, -112, -105, 185, -18, -296, 19, 19, -232, 203, 330, -111, -190, 257, 189, -245, 322, -99, -246, -159, 76, -115, -34, 145, -39, -424, 34, -112, -24, -79, 292, -88, -234, 102, 59, 104, 144, 151, -270, -311, -50, -48, -125, 301, 100, -382, 17, 150, -22, -73, 312, -40, 50, 80, 99, -74, 253, 108, -221, -252, 335, -27, -192, 151, 196, 37, -37, 164, -216, 1, 145, 370, -276, 38, -367, -289, 31, -170, -105, -79, 88, -181, -157, 4, 123, 71, -21, -97, -125, 34, 130, 213, 57, -72, 8, 98, 114, 401, -97, -15, 117, 127, -320, -131, 350, 126, -362, 160, -108, -30, 73, 412, -34, -13, -80, 99, -135, 93, 317]
6350C17m24oJ13k74K76N3r4mK4J62j91J07J12k10j69Q4k46K16M20l60q9M22k10
6373B9l00L8K01K47l26K25k6j21J40o5m0J06r1m03M19J75O4m93Q9O7J4j84L53
6396A18j40N9j2P6k17J85j59O5l98P43j43k17n8K68j60N2j90J9P2K0K2K05k26
6419a6j7L8j43K68j35k31L73q8pr0lK28r2j93M87l36M1k80k15K30J73j25J01Q5
6443E3J65j50k04N2N8LP0J08k21J33n6P0p4q1k87K59j05K68J17j56L4j71J34r3
6467g4J92j36P5L9r0o0J53p6k41L14j58j45L06J7j77L6K21j14j75K36k87J27j12
6490a29J41l05M49j15l4k1P0m16L37j87M17l18j61K72k4P6p3Q5k17L0L12k25Q1
6513D5Q1r2J39o5j15J28R2j52k52j7J81L7j54L91L1m81J81J48lm64L16J57l58
$$ y = [317, -107, -113, 0, -274, 2, 55, -39, -43, -19, 143, -48, 59, 171, -39, -208, -124, -370, -154, 266, -94, -183, 239, 29, -271, -233, -32, 215, -111, 114, 88, -33, 107, 42, 2, 108, 17, -386, 33, 208, 272, -221, -132, -65, -51, -235, 118, -22, 37, 25, 101, -116, 69, -90, -25, -423, 320, 177, -40, -98, 170, 10, 62, -128, -109, -37, -17, 5, 210, -16, -33, 5, -138, 130, -5, -236, 137, 49, 42, -48, -51, 177, 85, -108, 379, 43, 84, -196, -411, -181, -8, -133, -32, 53, 218, 68, -136, -84, -26, -23, 47, 155, -66, 67, 11, 81, 7, -74, -361, -102, -207, 61, 178, 22, 56, -115, 19, -74, 118, -18, 57, 96, 6, -54, 99, 23, -218, 96, -62, -207, 99, 116, -61, -25, 196, 82, -93, 143, -144, -17, -129, 12, -293, 156, 41, 7, -14, 56, -360, -23, -210, 207, -111, -272, 0, -24, 52, -21, 64, -153, -123, 189, -36, 45, 126, 34, 173, 108, -7, 121, 213, 61, -191, -208, -27, 10, -144, 247, 278, -203, -22, 126, 123, -341, -25, 132, -226]
6536b26K49K56o56M14O8r4j06K8l7N4J63M3j02K2j9l25J83K71Q0l60K0J16m14
6559c72K17L05j49n0K39q5l81L97M7k72J9L46k49p1R7J8k88K46L15o81M5M71j98
6582c4j58L52k64r8l2N71n96L44M33m62l54K76J55l09J63K07l13n9L69j88k50
6603b47K31L98m92N9O9j23mK77P8m90N6L68k76m3N62l42k90L22j18k60K04N14
6625D53o70L7N06k84l17N07M6m14K35J67m60J14N90m02k77K94jn30M26M21n56
6646a15J34L61n11j29K81J75m29rR39r14k04N85Q5n45K55M59n84N8L60k44k54
6667b46L02L26p50L69N61n50j80O24l86m00L81K14p26J72N98o30P5K47P2m95O12
6688A90J77p75L53L15l81j81N78k95l33L12M21p13J08N35j71m97P45k32o63N70
$$ y = [-226, 23, 279, -377, 37, 105, 11, -95, -67, -104, -50, 113, 156, 54, 76, 57, -268, -85, 186, 266, -94, -74, 42, -372, -155, 150, 1, -49, 190, 105, -276, 121, 168, -104, -85, 261, 12, -59, 38, 56, -232, 14, 329, -352, -307, 164, -34, -192, 160, -104, -202, -234, 337, -259, 85, 518, 56, -298, -22, 133, -176, -13, 194, -119, -178, 191, 3, -247, -16, 382, -110, -51, 18, -105, -109, 168, 246, -244, -188, 180, -96, -139, 423, 81, -209, 113, -5, -265, -61, 453, -217, -180, 326, 42, -275, 232, 278, -136, 99, 266, -194, -80, 510, 108, -169, 125, 124, -406, 20, 441, -115, 19, 380, -131, -260, 21, 196, -233, -242, 697, -217, -421, 164, 249, -296, -41, 418, -166, -108, 252, 8, -246, 56, 382, -368, 1, 562, 12, -168, 456, 70, -330, 51, 265, -461, -289, 309, -321, -246, 1, 73, -422, 190, 367, -408, -55, 260, -121, -302, 276, -19, -352, -40, 381, -332, -224, 311, 140, -357, 388, 156, -507, 63]
6708F3J60m22k27P46l07l45O26j92l33K28L67k93k50L05j20m42M84L63n69KO80
6729E24n92k70O91j84n37M04L16o72K90O27q18K4M00o9m52J28O16q74K17N26l86
6750i1m13M80L97n62q8L44N4j71L47l17l23M90N8p24M08M06k17n47P58J7j155
6771h49J146O0m38J25J09k07l25O53J21o11L73J70n59Q5L64k28r7N18m29m65R0
6792c94P14n12O4N70j21n32M29p8m92L06N01p65J38m0M78m81N31J43r72M23J72
6813H2K1l08M38l60j9M7K49l35J77M15l17k07J58K35m38L01K79k44m35L47J5m51
6835c50N70J38m76N7K59n12N0P39p7n06N3K97n07K24M04l69q4J78m1j24J39qj74
6858a20Q7j26K3ML02j44j48J7P7j75L8K84l21K1J96O2n32L23L00l10P8K28o6k23
$$ y = [63, 223, -199, -426, 320, 13, -332, 294, 102, -231, -3, 364, 71, -179, 126, 6, -436, 48, 411, -158, -156, 524, -68, -338, 353, 169, -368, 36, 352, -320, -30, 597, -221, -197, 203, 134, -318, -190, 426, -448, -231, 295, -91, -504, -24, 373, -189, -277, 67, 121, -50, 297, -20, -343, 147, 205, -519, -111, 295, 78, -469, 289, 306, -849, 297, 357, -81, 44, 153, -54, -379, 274, 395, -216, 157, 327, -232, -147, 217, -11, -108, 410, -19, -484, -394, 320, -192, -128, 442, 321, -211, 218, 140, -352, -46, 455, -310, -172, -212, 266, -215, 316, 459, -513, -90, 82, 103, -205, 233, -127, -146, -99, 150, -185, -8, 407, 90, -117, 41, 276, -162, 139, 418, 174, -261, 86, 101, -350, 220, 358, -118, -61, 198, -314, -264, 475, 398, -108, -55, 242, -265, -41, 363, -6, -90, 88, 47, -77, 62, 54, -120, -33, -159, -136, -132, 170, 26, -122, -105, -28, -203, -165, 119, -202, -181, 15, 77, -455, -132, 168, -142, -64, 164, 98, -125]
6882a25J23K87l99j09K71J9l78M84k69j36K39K10k87j25K73R3k53J33qQ5n5q6
6904a3J14j28J62k55R6J96L5m53L20J05m34K24k11L40l24M23J19m78K38J37j32
6925H1k52J94r0K8k0J88J26k97M1J84l87J51J73m5r6M8o7j20J58j27K72oR7l60
6949a26J33K57l2n63L32K13l45j58L26Pj8J7j60M3k5ko5L22L4l67L37j98L7j04
6973a05J09Lr3J65k9lq1krJ79j32J21k11j54K60j1J52mJ9k23j50K96K2k74J06
6998d9l37K68Q7O5j31L9J81k57J67J24k3l80K88J12m05K06j3J30j86J85o3K76
7020B84k63J86k99N5Q4l10K63J83j38J09j74K32l75L39l8k11p5O8j9N01j33K8
7042B97n54K54L24m15J99r5J32m57J86K81j71M7M00n48j94L27K4k56K51p4l01
$$ y = [-125, -2, 285, -114, -223, 48, 67, -311, 173, -96, -232, 7, 217, -70, -195, 78, 171, -82, 51, 43, 128, 73, -13, 101, -27, 135, -120, -24, 172, 207, -246, 74, 179, -255, -31, -242, 98, -226, 197, 316, -162, 76, 213, 81, -171, 23, -67, -39, -59, 129, 255, -42, -1, 183, -204, -53, 120, 75, -21, 27, -40, -160, -2, -129, 143, 137, 234, -126, 7, 264, 232, -331, 1, 214, -131, -289, 37, 44, 26, 43, -117, -74, -99, -101, -166, 156, 190, -177, 160, -38, -1, -105, 4, 7, -86, 79, 50, 47, -34, -36, -45, 134, 2, 123, -88, -242, 18, 7, 159, 155, 174, -49, -199, 97, 119, -155, -49, -386, -118, -31, 34, -97, -58, 123, -134, 33, 157, 134, -246, 42, 154, -251, -45, -58, 72, -114, 71, 8, 284, 21, 207, -92, -37, 47, -263, 0, 183, 45, 154, -20, 212, -163, 176, 138, -73, -148, -80, -99, 402, 269, 297, -257, -3, 321, -94, 105, 10, 142, -315, -129, 152, -19, 28, 428, -120, -314, 13, 37, -219, 32, -42, -343]
7063c43K25M34m38J4J55J01l30J79L39m36J05J60J2l51J60L20n07K23J78m40L80
7084A40K22k58k19J91J23n63L46K64m08k17N63n4m56L01J02k96j08N50q0k79K79
7105A43o6l27K36L32n26N7K85L9l51mM9m11L56O60p59j30N35j92J9K46N8l19K0
7128e0J83j9l71N68j12m57L86K40m96n2M09l2n54P46k08l82L60Jm37J43M90m16
7150f0l2L37j32o79L66L16n57L4R21m72j79K72ro41M62L84q59K38O71k61m07N76
7172B89M3n29J80L81k12l84M89L4o42L73J82m83N9Q48j097K12N36J07o52M63L11
7193E08o89o5O14n73j7M70J5p88O02J49n97K1Q34m61m68N96r8l30K90N02o59m
7215a48L18k10r1K72K04n66J73K07o6l93N43j7o94N57J01n19L80L69m00o13P92
$$ y = [-343, -118, 316, -122, -108, 47, 148, -182, -3, 336, -100, 5, 165, 177, -174, -14, 306, -201, 22, 200, -240, 140, 362, 104, -115, 76, 199, -364, -18, 246, -162, -379, 184, 130, -326, -25, 77, -219, -327, 223, 143, -136, 143, 77, -250, -14, 318, -208, -151, 134, 173, -178, -182, -133, -544, -188, 472, -287, -417, 118, -74, -55, 191, 249, -70, -50, 133, 114, -257, 311, 199, -258, 128, 368, -128, -180, 229, 197, -357, 389, 181, -201, 159, 160, -277, -134, 356, -60, -92, 245, 113, -566, -200, 116, -441, -407, 514, 42, -137, 135, 126, -515, -53, 331, -528, -290, 381, 120, -287, 289, 332, -197, -17, 364, 152, -232, 257, 291, -351, 22, 204, -279, -220, 628, -469, -257, 279, 386, -266, 197, 508, -181, -246, 368, -205, -222, 248, 263, -525, 77, 226, -371, -350, 484, 23, -445, 151, 53, -277, 13, 515, -144, -148, 170, -40, -131, 141, 345, -221, -48, 159, 93, -300, 243, 226, -468, 89, 190, -329, 51, 420, 20, -593, 199]
7236A99k09k52K24M66n80l47P97l59k44N84j99l15K83K24n59K01N48l51m57M93
7256A47j84j59j3O63n39k69N16j38j70K41N60p42q4K52j11k37N58j07n76J47L23
7277G8k08k38Q64l34m07M56j07n32M15L34n38p7N96l31l14M71K44o23K51K03m59
7298b56j0O00k02m04L92Rm32J74J88n4l52O67m51j96L56K03r7j14K58m46r1K14
7320d4J29k98K94K10n53J23L02k82q8N95l51j42K8R8l90L92J4J16m19L40N9l07
7342a74L71L9M8p13N10q0k37J80L53l76L6L50k37k32K93k0m2j19L25k56n8k4J09
7365D6m16M92J24k82m4K43K4n01J91K90n56L76P9l81L37J37K81n00J69K7k93K38
7387H1R3l45K6L64k27J6K47j81k01L26j01M9j70n5n1r0J44J73j64K57o6k51r1
$$ y = [199, -10, -262, -38, 428, -152, -499, 298, -61, -305, 279, 80, -235, 48, 272, -287, -86, 462, 111, -346, 147, -37, -196, -209, 454, -85, -354, 162, 24, -146, 95, 655, -87, -171, 81, -30, -267, 291, 184, -392, -245, 78, -130, -368, 496, 162, -245, 211, 104, -428, -13, 321, -217, -294, 302, -29, -343, 128, 372, -251, 0, 203, -256, -266, 334, 132, -272, 120, 129, -303, -129, 59, 5, -347, 320, -131, -327, 29, 232, 135, 21, 279, -167, -258, -44, 85, -213, 81, 291, -262, -139, 163, -119, -207, 388, 37, -105, -77, 21, -369, 23, 37, 153, -266, 74, 133, -174, 197, 236, 284, -429, 81, 1, -236, -56, 297, -79, -43, 307, 70, -162, 131, 111, 69, -50, 275, 19, -39, -63, 46, -370, 122, 246, -36, -80, 163, 187, -314, -123, 167, -389, -13, 66, -315, 22, 159, 440, -60, 109, 136, -157, 81, 174, -171, -145, 219, -8, 8, 255, 74, -127, 199, 98, 147, -23, -78, -129, -219, -75, 98, -66, 191, 125, -126, -217]
7410b17K51L1k80R9K53j11k04K86o2l16L37j10Q6r8K73k17k72O18l28k3O6r7j18
7433a53L15l9r7m9K17m56J86N9k2MP7Q1L7j80k28K62jJ76l30j04J18J85o5R1j03
7458a9J27k20K78k29R2j76J91P9k78n4qk2J69K61l1m40J72Q5O3q2J36P3mj90j5
7483d2L8O0p8q0L32j21j01L6p0m2K51l74M3J52j80K24L8k20p6K55Or0L08l37j32
7508b00J49Q7N9j48K76j24j82M8j92J23K20j59k6J35j12n4J03P4k58J72K6l86
7530c69M04O0j6j76K04k4k32O3J07k44R5L05l56mL29r5j05J4j05K43l62R6J87
7553A9j62J64P2k37oJ48J75m38K31K65k80o4L90m75r9M73k74qR0P2k59J78j7j01
7577a43J19N6r7k85L10J1k05M3L18j01m36M71j71P8PJ08m26L88L15o06L9L43J20
$$ y = [-217, 34, 65, -215, -116, 137, 26, -178, 108, 46, -270, 67, -43, 43, -55, 218, 1, -271, 347, 19, -4, 62, -35, -153, 162, 123, 26, -23, 194, -262, -76, -17, -39, -35, 42, 123, 160, -20, -248, 14, 13, 189, -141, -245, -127, 58, -7, 84, -19, 108, -112, 166, -63, 29, -147, 44, 123, -155, -209, -217, -239, -70, 191, 160, -280, -108, -23, 40, -42, 94, 167, 163, -27, -42, -4, 56, -22, -102, 230, 109, 8, 44, -26, -68, 183, -191, -148, 4, -176, 48, 86, -134, -210, 45, 51, -39, 269, -68, -200, -51, 36, 95, -53, 223, 99, -83, -35, -227, -104, 116, -43, -69, 66, -46, -100, 3, 77, -181, -9, 17, -369, 35, 95, 79, -97, 107, 83, -149, -86, 21, -223, -128, 177, -179, -183, 146, 51, -54, -40, -145, 98, -264, -168, 19, -143, 21, 93, -144, -150, -2, 173, -265, -34, 231, -49, -113, 277, -198, -297, 176, -98, -106, -16, 56, -203, -25, -42, -143, -24, 32, -65, -350, -40, -29, -234, -191, 127, 26, -410, 61, -110, -32, -25, 83, -343, 45, 360, -246, -207, 136, 256]
7600B56l21K4K55l53R1K15k29k06N20k28k84J12K10L7k68L26l74n1N96k80j61
7621a13J52K40l06j34M66q7m83N73q6m25K0Q4j53J60L17j90l88K72M25l21k8J04
7643I9k38J11J94l4j06k21L42k19qL52k38J04J10j38k57K88L6j36J21J97k55m00
7665b96L25%o6k25M36j31k86L15O5l92K83K15k09q9L48k97k58M97j63l32J67L01
7687B08k95r4O65l45l01L56p4j22QJ11o0L2j40j43j73N39ok89J2J91m19J96K90
7710A47p5R6Q9N6n13Q0K34ql5nj48k48N74n2m31RL49j17j69L01k29j07K70J98
7734B66l19j93M03k75J58J82j68j78L02j03j66K11L36p42j14K92J18j33L61J69
7754D07m54Q4j71J87j75J63K29k71K13k10j11K5K92l36p9J11L55n20J84L20k4
$$ y = [256, -65, -41, 214, -139, -48, 167, -62, -268, 252, 24, -260, -148, 62, 99, -169, 157, -217, -268, 328, 48, -113, 39, 279, -27, -161, 305, 218, -265, 308, 222, -203, -183, -99, -252, -92, 225, 35, -353, -81, 344, 23, -5, 99, -139, -28, 166, 132, 26, -195, 147, -72, -80, 272, 34, 138, 248, 110, -147, 141, 177, 41, 162, 359, 104, -296, 29, 29, -37, -262, 174, 43, -243, 72, 137, -255, 28, 243, 34, -55, 293, -4, -262, 235, 72, -260, -93, 208, -87, -181, 484, 139, -162, 194, 120, -2, 6, 117, 57, 89, -51, -194, -367, 172, 166, -123, -111, 80, -339, -143, 147, 72, 168, 257, 313, -200, -120, 114, 106, 71, 66, -82, -330, 244, 192, -239, -230, 119, 2, -167, 134, -95, -202, 68, 266, -53, -246, 157, -118, 40, 222, 54, -124, 178, 75, -91, 120, 456, -286, -400, -108, 10, -123, 238, 407, -47, 37, -134, 53, -122, 41, 270, -1, 212, 2, -109, -84, 208, -128, -207, -96, 259, -261, -77, 243, 219]
7775B19n42L50j71k62K67J72n1jL25m24k3J53J66k93K27Qk28J07J78j62j27J58
7797D6N0j45O4L61k22m81O03k63m95M32K27l35L41l8l67Q0L12R5m47J89m1j81
7819b15O5J40Mm9L35m05q2J78Mj12k70O88m39J34j7J53l67J65L57m16Q6J74q5
7842B6p8K06Q3l26Q3J24j59R3j71K52k09P4P7j5k36K74k99J50R8L2J2m81M74j35
7866e1m8K09j82%K87n0l69oL09k76R1L72m03K33k15J24j7K74L4l90K27j02l1j07
7890h7K58j65j32PK9K38q2K4p9j88J61Q9j07p6K31j65n7k2L42k99j74N30k71j67
7914a62K95j60r4R7O5j04M3O4j78j31K82j45J21J03K13m92K9J01n0l4K40K16l22
7937cK3k9NR4k01J87k41L27m7M8j33k7L4j16p2nM6P4P9P4k04J87J6J2j58K62k22
$$ y = [219, -323, 27, -144, -406, -139, 33, -18, -19, 306, -118, -141, 12, 178, -115, 112, 120, -108, -1, 177, 15, -112, 46, 96, -49, 15, 376, 154, -327, 276, 13, -482, -50, 177, -158, 183, 145, -222, -142, 170, 265, -182, 7, -34, -215, -150, -10, -6, -55, 280, -125, -207, -29, -25, -137, -407, 281, -158, -24, -41, 112, -255, -90, 267, -149, -63, 111, 26, -52, 154, 237, -89, -6, 118, -41, 52, -119, 133, -76, -2, 75, 60, -176, 98, -201, -51, 47, 79, 91, -390, 84, -51, -99, 110, -72, -72, 215, 165, -204, -210, 99, -177, -86, 286, -117, 116, -99, 25, 8, 282, 316, -74, 153, 51, 20, -87, 171, 6, -126, -119, -90, 148, 66, 90, 11, -177, -16, 73, -34, -110, 121, -44, -101, -123, 219, -80, -254, 276, 5, -162, 133, -27, -121, -24, 41, -63, -20, 44, -134, -265, 17, -128, -7, 96, 309, -183, -154, -53, -103, -137, 103, 319, -3, 20, -9, -4, 90, -111, 76, -165, 162, 115, 163, 30, 3, 37, -79, -151, -156, -110, -36, 43, 117, -87, 100, 116, 128, -30, 232, 10]
7964A0o3J39k78L12l86L99k88J34p5L0q4K16q9o1K69j27k86K29K03k44k5J43k62
7987a84K68r7J07k33P3j39K44m4j66L65l76K91ll05J09L56l78J70j98J39Q2j82
8009a01j04K70l1k0j43j9J66j45J88J22j54l4r7J3Q7k10K93j27N9J04k04Q5N0
8032D8Jk08J9K97q5k54N6K00o7P8k55J96j85K30J35k00j62M80l28j23K27J9j04
8055A5K43l10k7Q9KJ7Q8j52J4j36m2K93m13M46P2k35mJ84j36K9M8n1N9o4M0k47
8081a78J27K01j04n7m7k7j95K10Q6j60J52L9N7l29M84m94J33J15j20J51q4L16
8103B76k60k11L73Ql62Q9J45j30J00L59j59k39K32N4l87j54L42k78J64j31J79
8124A0j8q0J94R7l14L75k98j79L44n3j3r2K02n26J89M11n2l83L45l8k96KK51j58
$$ y = [10, -53, 86, -192, 120, -266, 133, -155, -21, -96, -66, -150, 66, -23, -84, 185, 58, -228, 1, 204, -40, -65, 78, -184, 84, -13, 94, -139, -66, -205, 39, -5, -171, 194, -182, 109, 106, -199, -90, 266, -112, 58, -140, -1, 81, -101, -205, 65, 34, 14, -129, -148, 18, -127, 61, 183, 29, -5, -102, -89, -2, -212, 81, -46, 13, 117, -87, -2, 48, 49, -159, -140, 157, 72, -182, -126, 74, 7, 85, -170, 26, -159, 71, 206, 6, -156, 324, -4, -127, 100, 119, 15, 258, -52, -79, 10, 12, 29, 117, -35, -21, -157, -199, 94, -319, 127, 199, -36, -40, 144, 8, 37, 85, 34, 93, 29, 69, -178, -51, 150, 46, -11, -58, -85, -280, -70, 16, -144, 8, 47, 104, -225, 259, -235, -102, 13, -107, 44, -40, 276, 16, -195, 178, 186, -176, -87, 58, -72, 28, 387, 228, -11, 221, 275, -112, -266, 76, -202, -38, -169, 10, -8, -88, 106, 203, -111, 264, -34, -213, 131, 78, 65, -27, 175, -351, -162, 249, 197, -186, 159, 121, -175, -173, 78, -80]
8148h0N9P5K9m35M23O9j35r2J57k37L8K26p2j05L78k99j65k2J35J91M2K27k72
8171A35n13K97J61k04K31k39o4M5J36j7k21L47K38o13K27P0jq3L67J04
$$ y = [-80, -21, 54, 83, -352, 71, 140, 5, -87, 70, -167, -129, 97, 25, -80, 298, -1, -166, -188, -53, 138, 180, 407, 135, -378, -81, 80, -124, 107, -132, -196, -151, -15, -32, -253, 94, 332, -281, -54, 16, 15, -68, 299, 403]
8191D03
$$ Imaginary data points
##PAGE= N=2
##DATA TABLE= (X++(I..I)), XYDATA
0@%%%%%%%%%%%qJ6j6J6j6J6k4L2l2M0m8N6o7P5q8J04j20J37j57J80k05K33k64
34a40K97l33L75m21M69n21N79o43P12p88Q70r62J061j166J284j414J557j717J893
53I92k089K311k562K853l184L568m031M593n289O177p354Q993j1427J5404k2947
68a3992M1880j69722k78825M83148L4947k21118L40647R0683n43253R94L77206
79A42595j83543p6451M41292j18689m91028J66576K19449k64336J45142L84041
89C65048l11024l44297K76815L8120k46546K93703K64231l89716j48824K67408
99F4918j43355j33510M12594Q3561m04920J9611J78271k40092K9343M11405j05051
110A72775l31126J60937N4770k78105J63929L23678k20057j74146K03392j01146
$$ y = [0, 0, 0, 0, 0, 0, 0, 0, 0, 0, 0, 0, -8, 8, -8, 8, -8, 8, -16, 16, -16, 24, -24, 32, -35, 40, -48, 56, -64, 73, -84, 96, -109, 124, -140, 157, -176, 199, -222, 247, -274, 305, -338, 374, -414, 456, -506, 555, -611, 673, -741, 816, -901, 992, -1097, 1214, -1348, 1505, -1679, 1889, -2142, 2451, -2838, 3339, -4015, 4978, -6449, 8955, -13992, 27888, -141834, -420659, 62489, 97436, -123682, 216965, 307648, -235605, -234611, 142595, -40948, -117399, 323893, 205204, -285824, -119248, 100201, -164135, -18993, 365048, 54024, -290273, -13458, 24662, -221884, 71819, 336050, -53666, -202490, 64918, -78437, -211947, 200647, 284208, -120712, -101101, 77170, -162922, -133579, 277826, 172775, -158351, 2586, 57356, -220749, -56820, 266858, 46801, -127345, 76047, -25099]
120b5099k20593K79090J97093k68709k8312J77315k06775j11362L20981M4248
130A57877k38658J03678R1287k63144L782K94544o4158j57427J60753k5979k54952
141a92397J21486K22128j45349n2120J67991j25322j85010J91572J15111j66924
151d8834M4538J29047j89042q9947K18321R123j40483J19120N1577k09700P666
162i8614J84678p1280p5144J53922l0766j90035R0921J26322j26467k502J44985
173A06020r9340j21923J36774L9130j30481P1405J06614j41142n4025J38174l5572
184A5634q8826J23853L3060j53295K2464J09671q3088l7313J26767k5936j18194
195g5203P0880N1210j03719L0704J10958p9745p3073R1144J058p9172O9801N6076
$$ y = [-25099, -245692, 33398, 230491, -38218, -66530, 110785, -95990, -207352, 113629, 157877, -80781, 22897, 114184, -148960, -145178, 149366, 85208, -72219, 88534, 62555, -192397, -70911, 151217, 5868, -46252, 121739, -3583, -188593, 2979, 118090, -48834, -4296, 124751, -64291, -154238, 64083, 73206, -67277, 51843, 103420, -106280, -98614, 86064, 14784, -60360, 93562, 62796, -127239, -36318, 90004, -36463, -38965, 106020, 6680, -115243, 21531, 60661, -69820, 1585, 108199, -32943, -86968, 51206, 15634, -73192, 50661, 83721, -69574, -47110, 62561, -20527, -57840, 68927, 42991, -75203, -4323, 46887, -56832, -26128, 84830, 5085, -67988, 23156, 24214, -54958, 14843, 70919]
207G0919j03141j1843R3275m4354n7392Q6081J1258q6967L2309M9525p0113l723
219c4166Q4411l3905o7624N6674K2308o5286K7873N2209n9187j7591O8488j9985
231A4219n6477M5599L1282m9484P463M0448m2045k0388N7801o807m9025K9929
243B515K3311m3004K048L7056k4783k0866L8817k319m2924J9843L1561k7224o413
256a2382K4939j7608j4557L1288N038k8990Q457K0600j8367o586K2005q517j6087
269a0767J9275L865k2322N920J6919j2464j0824J0756n64q343J0035L831j6374
282a1057K075J4306n844n102P265k496n212Q703N754q818k430Q178j575n065N181
297C863O21m140K634n40m574J844K631k479l010N12J254j122K568J071m638j175
$$ y = [70919, -32222, -44065, 49210, 4856, -52536, 33545, 44803, -42164, -9855, 39670, -30443, -34166, 50245, 16340, -51284, 5390, 27698, -37588, -9715, 42494, -16693, -34284, 34204, 14219, -42258, 3341, 34623, -14861, -7398, 33050, -8995, -29383, 28418, 21611, -27414, 2515, 25826, -17178, -15130, 21926, -2857, -23723, 15094, 12775, -30149, -10306, 21255, -5969, -12382, 12557, -5051, -19608, 11680, 16718, -12272, -3815, 16785, -1582, -8168, 13837, 5320, -10767, 8508, 12373, -9949, -4029, 12890, 426, -10398, 358, -206, -8549, 1486, 5317, -11057, -8982, 5324, -520, -5622, 1643, -853, -6065, 2638, 8392, -426, -2856, 5322, 3747, -1318, 3863, 4484, 344, 2978, 2438, -2136, -292, 2339, -140, -3150, -2638, -1384, -2506, 62, 1133, -3505, -4680]
313d680K555P9J845Q10j601N91Q98O96J231J26j712k226R00M361o23j912j71j711
331e44K32K088j556j023l08M53K79j749J50K151r21K5J96j992J543L534l80n082
349b904k083N600K652k143Q08j941l562N605L280o620k623N974J184m973K027
364B81K904n909K656O350j0293m300J2355J487r725K595M137p475J698J1216q978
379a001r773J5438M186j6324L189R089j0568K660J6103j0063j6010J5566Q428
392A0920j8679M094J7407j6257p965K0470p279j6818K1902J1206k8658l768K0833
405G408j2878p642K9704m509l2583J6686J7994k8241K959L3037j6993k3409K5080
418F613N54k9787K4386L0767l4670j3929L1240j7224k3095L9997J1131m2178R133
$$ y = [-4680, -2125, -2046, -201, 609, -992, -401, 497, 1193, 2424, 2550, 838, -1388, -488, 3873, 3250, 1338, 1167, -544, -312, 1776, 220, -803, -1111, -658, -379, -2128, -1978, 173, -748, -723, -527, -2519, -976, 2558, 2178, -2904, -4987, 613, 3265, 1122, 1930, -11, -3573, 2032, 5312, -1308, -3931, 2043, 3227, -1746, 281, 3185, -2724, -68, 6282, -4011, -8311, 4044, 5531, -4194, -1599, 2538, -4937, -3239, 7977, -1001, -10774, 4664, 8850, -7474, -4285, 4804, -5764, -3104, 12999, 2936, -13074, 2492, 10920, -7759, -3665, 13742, -2515, -10480, 9990, 2711, -14107, 7795, 19001, -9657, -13425, 7408, -5470, -13112, 16592, 12083, -20500, -3814, 14180, -14061, -11102, 21935, 4942, -18467, 6613, 7167, -22620, 1766, 32533, -2137, -16066, 15174, -2050, -25145, 14852, 25983, -16195, -7062]
431g062K7191l5682j0666N0518n579m0004K5449Q543m8062J7933N2914k8448k5416
444a8371L6955j4739m5495M1627L8043m5407j234L9821m2969l2563O3572J3700
456C2940m8979K4095K1975o4093m533P0364j5355l8538M6427m219p2084K9580
468b2420N9887m1066r640N3824m0610o0771N8550L6566n0007K1986M4552p0392
480a9541l5577P3799J587m3741N1519J6173q5403J520O9496k9012k1099O7963
492D7684j9778q5963L5474M9545m9314J6202O9072n7105o6426N7979J7764m8156
504c3022N1208M8334q5478l3995O7635j7685l1314Q1455J2942r7776K441N3578
516A8323m4436K650R0791k8630r0828L6334K9265n6470M0263P9035o5839o0043
$$ y = [-7062, 20129, -15553, -26219, 24299, 18720, -21284, 4165, 12708, -35354, -17421, 35493, 7045, -18371, 18584, 3845, -41650, -23, 38020, -7387, -8621, 31200, -11769, -44332, 19240, 32940, -16039, 8056, 30031, -34062, -38595, 31769, 16414, -22124, 24303, 20084, -52000, -22420, 37467, -3599, -13239, 40585, -25, -60796, -2246, 34320, -15687, 6299, 50851, -19541, -55118, 18681, 20268, -23473, 28046, 44219, -41184, -39664, 29832, 820, -20279, 47684, 27906, -58057, -22583, 26962, -22352, -6150, 62922, 5817, -60609, -2630, 15134, -33022, 18186, 66520, -18958, -52953, 14682, -3003, -34317, 47138, 60080, -37696, -35255, 18323, -26113, -23463, 67328, 38698, -52130, -15796, 13469, -43001, -2738, 76297, 10458, -49585]
528d9585N4394j0036n0204P6490N5087q4534k5513N0438m5233k4256J00781J6251
540F4080q8458J0058K9353o5935J4191J04271k1662p3781L3127m681p0996N6410
552a4023R1617n5326m5241M2637m0277n4278Q7942N7659p0929p712L5560p2029
564d4400k6209J06835J8638o6422K8622P755r2694J4580J04524j9121m3472M9759
576C8395k8183r0947N3678Q1654m5756o704N1603o9124o8600Q2125M5165n0489
588g183L0534L1615r7205l1986R2114N548l7461N8890k591j03975J0009P7849
600B6158k5783o292O8457l9863r0747M2374M7898m1406L1244O0181p3833o1575
612f3187O0611J0601l6450O1097L3377r0174k4904N7925k1524j4767P8669l167
$$ y = [-49585, 4809, -5227, -55431, 21059, 76146, -8388, -33901, 16537, -28696, -52952, 47829, 64080, -24378, -14320, 15033, -50902, -36711, 67560, 45898, -27883, 5244, 563, -70433, -14023, 77594, 22268, -22973, 19664, -20613, -74891, 13051, 70710, -219, -7931, 27629, -44400, -70609, 36226, 54864, -11558, 17064, 24819, -67875, -53295, 51229, 32108, -11364, 38395, 10212, -80735, -27057, 54597, 8841, 2137, 53740, -15384, -83984, -1859, 43306, -7183, 23351, 54966, -42239, -74225, 17889, 23437, -14024, 44866, 42275, -61700, -51691, 26158, 375, -5917, 62540, 22677, -68070, -25696, 22202, -19204, 12040, 72221, -1612, -63187, -2576, 8025, -28425, 32672, 66049, -24125, -49029, 8896, -12628, -27395, 51274, 48107]
624D8107q7050J2034L6751m2342J7477P6377l5789o5610L5800Q420m7385M6781
636C571N8678n7603l4408M1534k2148l1407O5368K7267o1942l662K9945m2389
648b7196p256P0328l116n3090K1775R115n0408J8322O0036k4234l1528L1038j2455
661A331m3276L6877M0830l5880p344K9647l1889k6098M7008J4882l5640J3212
673C660J8452m1601q090M6621n170k7769K6482K428m3222J1762L6154j9668j0582
686a0543K9813j3862l4241K4301K1225k5680O209K6392k8448j9561L2511L836
698A1952k3989J7071J5084l1250l598K8572j1142j6359K5746K089k9789R318J8457
711A2162j8671j499K3728j2479k2063J9141J0221k0841O589J9025j8837r419K1684
$$ y = [48107, -38943, -26909, 9842, -32500, -15023, 61354, 25565, -40045, -4245, 4175, -43210, 3571, 62249, 4646, -29762, 11772, -10376, -41783, 23585, 50852, -11090, -14752, 15193, -27196, -34452, 35876, 32760, -20330, 1445, 10560, -39848, -21526, 38510, 14276, -17252, 13786, 1331, -41945, -5068, 35762, -118, -7462, 22185, -9704, -35802, 11206, 26088, -9552, 3660, 22112, -19489, -27579, 19042, 13872, -13897, 12585, 15013, -28209, -16447, 19707, 39, -10543, 19270, 5408, -28833, -4532, 16693, -8987, -2778, 23614, -4834, -24395, 8116, 11952, -12037, 5034, 20118, -11132, -14730, 13842, 2700, -13659, 12087, 14176, -15613, -6295, 12162, -6509, -8008, 15720, 3241, -18822, 319, 10540, -10301, -3712, 15313, -3524, -12943, 8741]
724H741n131j6942J6899R810k0727J230J7023j1455q597J8885l020j8926J2532
737C22J0900j6900o7J5466r203r620J3640K40j4684Q643J0715j4004l043J3864
751F269n835q025J1279J194j1761N442R205r676m066J0616k144p269P468K367
765E064r783M341P519q029l729P446n39n880M558K530p500J193O914m434l410
780c739M866n66l866L350J348l935R28M118j534l327L682R99l912K045J638k967
796h72j20L056p7j636O57L99j947l09J453j625k31J759o59m63J395p28j529j21
814a598J201L00p64L5J372o03L19O85n33K17k25N6M83l66l53N49l00J74p91q1
834b23J215r7j721j73q2P28l81p63O29N1O29P77j174l33L07l54J103J88j417J293
$$ y = [8741, 3610, -13332, 3567, 13377, -7350, -6120, 10903, -552, -9149, 9736, 6716, -12210, 322, 11222, -5678, -5745, 9721, 518, -9102, 4538, 4778, -9906, -1263, 9452, -4552, -7595, 6269, 434, -7591, 3688, 4882, -6879, -1437, 7768, -1908, -5974, 4642, 2498, -4771, 2697, 5064, -4719, -378, 7141, -888, -4617, 2829, 2290, -3590, 968, 3498, -4002, -2809, 4105, -329, -3739, 1127, 561, -3305, 45, 1393, -2542, -1614, 2504, 970, -2357, 1325, 2324, -1588, 457, 2095, -872, -992, 2064, 1987, 351, 1008, 1407, -540, -849, 604, -1021, -1252, 507, -152, -615, 780, 52, -1477, -1598, -397, -97, -861, -826, 546, -57, 262, 947, 414, 631, 406, 462, 945, 579, 226, 775, 475, 649, -142, -223, 992, 895, -826, -999, -1081, -353, -734, -1497, -868, -817, -188, 589, -585, -918, -611, -965, 138, 326, -1091, 202]
854B02J812k55j950k69J649M76j237n48j243N96L471j175k724M30P70n61P20N5
872B19k063r31L846J81m581J576L957j935o37J331k890k91M466L53m757J342M494
889C680l186j827L862k749k326O050j5q689J814O706k455k057M508l451o277N821
905e91L604p358L654P408p661n532P254L44m068P955K423j3383j494J1880l416
920A019l495R748k397j2059N331O293r227K711J2833p777j2679Q467K262q457
934g427J1346R101j6072o831J1765m458o117J5472M986j6438L47Q016j2366L75
948h301K2334k934j7791N772J606j3652J1157K0202j1771j3184R281o181j3786
961a7248J9957J5850j7562m781Q663j6432o595K7520O687j8931L906L535k2098
$$ y = [202, 2014, 1759, -191, -460, 1189, 1665, 428, -120, -1363, -767, 2704, 1529, -1195, -765, 5, -556, 164, 219, -1844, -2775, 1071, 1252, -3329, -1753, 2204, 269, -368, 963, -1927, -2218, 2248, 2601, -2156, -814, 3680, 494, -1333, 2529, -220, -2546, 3504, 3489, -5200, -3386, 3320, 865, -1192, 3316, -135, -6412, -591, 3013, -4345, -691, 6717, -944, -6476, 778, 1122, -2946, 5009, 7432, -5951, -7445, 4435, 1019, -2476, 7272, 4875, -7184, -1853, 4440, -4787, -2076, 10757, 2980, -9699, -1232, 1030, -7427, 3919, 13020, -3052, -9883, 1882, -2576, -8693, 6779, 11765, -4673, -4326, 3690, -8676, -8301, 14033, 11099, -6692, -920, 686, -12966, -1809, 18393, 6622, -6562, 2719, -3462, -17248, 2709, 18559, 997, -3784, 4879, -11553, -18148, 9372, 16059, -2872, 1034, 4569, -17529]
974a7529K210L0361l364j4826J2185o713k5227J4347K5612j1367n202J3499j7770
987c784k2234K4065J7592j4959O254R728l0737j3541L1146P475j2189J5004m38
1000A3382l5328l98L0172m315m790K3645j2846l6539J2375K2730j0344R259K1669
1013B8672k9058k9662K4030J3431j4041J9924J4913l8026j4911K6308m625p713
1025a0758L4118K292m3932k209K2451j3087O749L6349j6937l9672J5658J1656
1037B678k0563J9790L2030k7859k5147J9818o463j7234L7064K2144l9489j2522
1049a5753J8873j8219l463M3928R74l8120O163R508k8969R726M4996j1576k9431
1062a1363J4755p898k8433L1238L6345k7781j6691J7548j8853j8358M0244J7570
$$ y = [-17529, -15319, 15042, 11678, -3148, 9037, 2324, -22903, -8556, 17056, 5689, 487, 13986, -3784, -26018, -1953, 15639, 680, 6934, 16662, -14075, -27616, 3530, 11005, -1184, 13820, 13382, -21946, -22344, 7828, 3513, -1277, 22368, 9522, -27017, -14642, 8088, -2256, 7003, 28672, -386, -30048, -6018, 7413, -6628, 13296, 28209, -9817, -24728, 1580, -3045, -10758, 23360, 25652, -18280, -20489, 1962, -11125, -4376, 31973, 15036, -24636, -8978, 2678, -17885, 1905, 33935, 6076, -19071, 747, -5716, -22950, 14114, 36258, -3231, -15753, 3120, -15099, -18562, 25366, 26340, -11780, -5617, 3891, -25078, -15352, 29644, 18068, -11363, 3392, -4506, -32939, -1701, 34644, 6863, -9828, 7720, -11133, -29491, 10753, 28323]
1074B8323l2228L661J3836l4590n589M5502J177k5843J4790k206l7695J4502M1132
1087B4772j5846j5362K2504j6529l2856K7720K5998k2341M167J9596l2185k2347
1099c2709L6686J2280k0938J5651P629m0015l255L8334n979j4069K4746n486l8566
1112b5691J1784K7520j5938kK7016k1775l1228K4477J4944k0069J3700J9251l1990
1125h001j5281K8657j914j6121K5263Q791l5744n09K4814j5096n238L0959p488
1138A3092l1254J3720J4051k0884P451K7294j9713k1453K1527O67k0794K0044
1150C748J7220k6958n738K1133j3019j3440K7155O173k6360O070J3948k1297o10
1163a1975K8792q303k0757J5392M209k0736J0165J9699j7387r022J9845p596j7928
$$ y = [28323, -3905, -244, 13592, -20998, -26587, 18915, 20092, -5751, 9039, 6833, -30862, -16360, 24772, 8926, -6436, 16068, -461, -33317, -5597, 20401, -1940, 2227, 21823, -10362, -32709, 3977, 16257, -4681, 10970, 18599, -21416, -24671, 13663, 7684, -6385, 18361, 12875, -25691, -13907, 13613, -2325, -2327, 24689, 2914, -28314, -3837, 11107, -8962, 4738, 23989, -8001, -23282, 5375, 3461, -12660, 12603, 21394, -14350, -14859, 9955, -5141, -10379, 20580, 13092, -18162, -4442, 9609, -11275, -3824, 23470, 3757, -17696, 3831, 4498, -16296, 3748, 20968, -5990, -11728, 9405, -3614, -17054, 10101, 16274, -10086, -4016, 9932, -11365, -11975, 16817, 8514, -12243, 3149, 7358, -13378, -3213, 16486, -901, -9923, 9922, 2326, -15602]
1176a5602J9009J0942k0365J250J4830j4897p336K0963j788j8533J1435J0152
1188A0060j7407O04J6198j0837q355J7578j316j8014R566J2195j3999k058J4718
1201H933p844j0039J4489J431j6052P315J1573j2168l973J1564m513q504J1662
1214C874K827j4775M122J2148r651n799J0943j765p891Q838L869j2455L74J0911
1228E570m852n458Q996m94q824N918M275r503J247J0330n013p794N526K136n607
1243c547M843M848r285k459Q434j619n156N139J738o088J793M287n014j174P901
1258D641j166p025K526L478m548J565M750m298k584N289m8n562J935L869l309
1273d87m94L059l553k224N427J060m621R57K021k326q96L458r54k365K912P58
$$ y = [-15602, 3407, 14349, -6016, -4766, 10064, -4833, -12169, 8794, 7006, -11527, -92, 10060, -7347, -6743, 9455, -1382, -9737, 7841, 6525, -11489, -1923, 10272, -3727, -5785, 8933, 1089, -8950, 5539, 6970, -9082, -1767, 9806, -2362, -6335, 5229, 716, -7788, 3874, 6701, -8074, -3952, 8196, -1455, -7254, 3689, 1924, -5967, 2871, 6740, -5715, -5341, 5570, 718, -4740, 4256, 3762, -5062, 856, 5131, -4372, -3125, 7205, 2192, -5602, -76, 2060, -3547, 1296, 6144, -3141, -5600, 2834, 1215, -3941, 1198, 2936, -3152, -1359, 2928, -2086, -3260, 4641, 3475, -3550, -1024, 2454, -2094, -529, 4221, -77, -2661, 2628, 2580, -2982, -1047, 2822, -487, -981, 2078, -1475, -3699, 1728, 2788, -1833, -876, 1145, -1181, -2077, 1381, 427, -1938, 974, 1732]
1289A732l930J311K960j534p14J122j074j462J981J669k120k2J089j220p00J839
1305I27n41j551O63N23p17L03R95p80j027J180N07j493N24M02p78R73Q53r19k05
1324a61O01n3l53n94O86N21r9K21j147K33Q19K86r21p66l21O75R25o41l84n69
1344a042Q63M09n03K92n51L91N60k68r95Q57R40J08o44j095Q57Q48k94j57j100
1363e24J52J652J7r33j067N9N95J81J67r27m26J355P96j917q65J266R33j94k71
1382D9n29k46J311J454j888j115Q91J008n22N61o02j360J325J365j969k142K171
1399b38J932j549O4M1k530Q19K717j115j822K299N25k478M40K151j508p5L104
1416B777k583l817L534L228k603K32J446l605j662M310K94l140L235J279n497
$$ y = [1732, -2198, -887, 2073, 539, -175, 947, -127, -1589, 392, 2061, -59, -81, 1008, -212, -912, 927, 386, -1165, -502, 21, -696, -393, 602, -178, -1205, -25, 482, -1011, -487, -85, -863, 110, 963, 44, -161, 440, 387, 34, -560, 126, 647, 548, 769, -378, -145, 674, 960, 39, -727, -1048, -373, 552, -89, -473, -1042, -179, 230, -273, 19, -532, -141, 419, 151, -844, 13, 953, 1061, 417, -678, 179, 1027, 733, 576, -524, -372, 1280, 1297, 364, -703, -644, -49, 132, 299, -628, -1054, 301, 1097, -820, -1685, -419, 514, 320, 49, -480, -726, 585, 2039, 151, -964, -73, 935, 413, 974, 372, -988, 337, 1702, -267, -2409, -238, 1694, 145, 209, 250, -2280, -1461, 1256, 141, -1681, 618, 1143, -1335, -895, 1256, -252, -327, 2777, 194, -3623, -89, 3139, 536, 768, 2214, -1391, -3053, 1257, 1551, -1589, 1646, 2925, -2572]
1431b572p25M706j737k67M608k688o985L210M572k703L03N021m305n629N079J072
1447I60l900N300M510p895l733N252j079k184Q408M48j0081j37N148m115J159
1462a939R588l174r580K906J814n161N793R033p390p390N138k079m621J1304N825
1477A0067j0707k822L938o189l85J3765J279j1060Q60J484q495M267J3704l918
1491E788p809L945m120r241R981J1588o518m461L948r002o159J4271P096q347
1505I60J056J520j2486j390J4660K973n484L802l717j4324M232J4905j308l006
1519B393M888q261j2357Q898J0415m034J941M862j2568j0292J1305P022l288O593
1533G517N90j6404m268J2930K179j659Q702k695j6150J11J0540k029K747J0613
$$ y = [-2572, -3297, 1409, -328, -595, 4013, 1325, -5660, -2450, 2122, -581, -278, 4743, 438, -5191, -112, 960, -2940, 2360, 6870, -1025, -4758, 494, -585, -2769, 5639, 6087, -3994, -4131, 1017, -3098, -1939, 7649, 4475, -5105, -2199, -385, -5546, 247, 9280, 1890, -5500, -362, -2441, -7062, 4242, 10067, -640, -3462, 476, -5713, -6098, 7667, 8946, -2114, -1254, 230, -8265, -3998, 9706, 5788, -2021, 1924, -2196, -11437, -1456, 10132, 3614, -847, 3101, -5901, -12060, 2211, 9307, 960, 2016, 3536, -8950, -10340, 4320, 7293, 1809, 5611, 1894, -12430, -8198, 6707, 5399, 2393, 7281, -980, -13337, -4439, 5976, 1942, 3883, 8745, -3823, -14115, -2810, 4212, 924, 7517, 8107, -8297, -12565, 365, 2544, 885, 9587, 6892, -9258, -9147, 1393, -636, 2111, 12724]
1547A2724q221j5879M036Q136k309O797P781j2792j1868Q111L038l636J0374N981
1561A2273j4816o872P453j929pJ3927J082j6461k004O656m935L919J4373n163
1575G496j4158L599K336p075Q680J2789r283j0526N039k141n576J3765Q118j4242
1589a179l943O423p118k101J4885J592j2181K476L229j1043K818J5767l709r051
1603c135N893k694j0862R060J1420p736l896O992p370q097J2395O445r876J875
1617D14M677j1323k331J3553L6p922N217J126j1437K532J1793n111m080P966l744
1632A366r587P091O708p246P28P397p435o387R074K121o846N016M124r875j499
1647e250Q594k248m581O854K04r184K643P040n402j773P552l239o838N925L039
$$ y = [12724, 4503, -11376, -7340, 796, -1513, 5284, 13065, 273, -11595, -3484, -446, -4082, 6292, 12273, -2543, -9415, -1962, -3891, -3898, 10029, 11111, -5350, -7354, -698, -5633, -1714, 12659, 7496, -6662, -3063, -727, -7802, 878, 13667, 4384, -6142, -1103, -3244, -8820, 4945, 13063, -1179, -5122, 1301, -5817, -7918, 6967, 8559, -3622, -1146, 2083, -8960, -6142, 9625, 5916, -3135, 2758, 64, -10798, -1738, 9682, 1946, -1950, 5042, -2328, -10425, 1970, 8415, -1461, 414, 5091, -6232, -8563, 4990, 5026, -2896, 2321, 3447, -7990, -5458, 6335, 1224, -2856, 5110, 1366, -8221, -1130, 5578, -1668, -940, 6457, -978, -7365, 1709, 3830, -3016, 2000, 6124, -3751, -5250, 3344, 1096, -3485, 3369, 3573, -5611, -2968, 4072, -1330, -3103, 4449, 1210, -5628, 297, 3336]
1662C336o315J997N633n322l185O703o44n545M003L341o635N10N989l340l746
1677c220N153M61n661K643M207m843j285M918k380l623M949K064n556Q63L285
1692A975l549r85N488o88m965K466K375m321R50N017k980k742L122n65l711L239
1708A26L488l749j319K952k299k458M807J127l839P10J503l311j81M483L7l106
1724a029J757J56l920J605L876j699j414K084j281k616K382K523k046n77J969
1739A770k639k129L861J196k170Q99J95k940k49K721J13r17J414j82l171N71K335
1756F78n07K15J296j575k037J322J281o03N46R65j431j502J390O06q34J462k59
1773A013j924l05J006K38K04N14l45j408k6P22k68K70J197p26j048P63O3q6M36
$$ y = [3336, -2979, -982, 4651, -671, -3856, 2847, 2203, -3342, 661, 4002, -2633, -2123, 3866, 526, -3220, 1933, 2394, -3267, -624, 3583, -1260, -2545, 2373, -7, -3630, 1319, 3383, -2173, -1310, 1975, -1574, -2559, 2929, 2241, -2724, -258, 2117, -2204, -1254, 3763, 783, -1959, 1163, 598, -3113, 126, 3614, -135, -1454, 1498, -801, -3259, 1548, 2675, -1164, -454, 1049, -2262, -2443, 2040, 2077, -1029, 728, 884, -3036, -1431, 2445, 746, -668, 1416, 135, -2481, -99, 2424, 378, -199, 1770, -869, -2998, 863, 2059, -111, 788, 983, -1957, -2206, 515, 628, -289, 1125, 943, -2228, -1657, 678, 171, 386, 1682, 107, -1930, -608, 673, 70, 616, 1581, 150, -1352, 38, 644, -190, 1272, 1013, -911, -1216, -210, 28, 232, 746, 401, -1007, -1033, -311, -579, -309, 888, 162, -886, -123, -60, -146, 290]
1792B90M37n46m14L71L6m2N99K10r05m8j48Rm7O18M0o86j66L65o4l75L89J22j98
1815a53j94R4Q4J14O7q0j7R5J52j77L10J50l80L4M40n85K68K23j15l45m12L88
1837c9p3J07j25O2n6J77k24l70K86r0M65l05K56k79R3J06M34o05J22K61J38j49
1859A92J9o06M07K63J9o7n15J91L08l73n6m38P9M46K40j51l41K7L42j01j0k86
1881d11R8L99K96r0k57K98k12K48l93l13L94J55M44k70r23N97n7J68k69J47j68
1902a19m9j62q4l08O38P61n09p56M5R3N30M08k39n50j98N27J8J08M23K89q52J31
1924A45n98k85R65J060n55r26m67J50j7J081P51j120r81L84p18j78J682O16o54
1943C35k46n32j194N25K593M5j302m17p82p51J413K052l90n03m34j424j276J788
$$ y = [290, 727, 181, -233, 138, 174, 132, 731, 941, 36, -12, -160, -151, -198, 420, 460, -226, -392, -27, -91, -466, -77, 45, -153, -347, -253, -169, -55, 12, -68, -85, 10, 162, -15, 295, 445, 65, 99, 539, -46, 222, 445, 330, -15, -427, -39, -112, -5, -130, -68, -124, 53, -171, -541, -255, -345, 120, -185, 71, -208, -115, -9, 425, -180, -58, 203, 341, 192, 211, -395, 12, 275, 294, 227, -288, -97, 211, -162, -218, -656, -577, -131, 109, -42, -383, -356, -14, -115, -125, -411, -313, 86, 382, 292, 35, 333, 121, 369, -24, -337, 57, 212, 656, 386, -537, 60, 3, 171, -98, 49, -119, -168, -330, -414, -722, -84, 677, 168, -588, -543, -450, 80, 488, 249, -301, -499, 28, 46, 154, 577, 866, 14, 145, -453, -738, 227, 1287, 732, -194, -661, -511, -528, 553, 1304, 184, -797, -413, -1131, -1309, 373, 989, 335, 89, -443, -1637, -1112, 1481, 1526, 224, -193, -975, -1726, -313, 1739, 1349, 846, 412, -1012, -2288, -500]
1961e00K214o67n78M8k314p68K849J123p49L23r87k687J57L128J174o68N83j686
1979el107J411K671j43J014N37l057k395J424K403M57J288l9l897k124K563J270
1996B71K75K129j086l536j043J600O21K018K317j929m339m38J983J021K460J519
2012C843k949l500O44J327K95K396K112l112l458N7M52J260M048O47m460k930
2028c328N22J199J433L361l84m212p94Q92j055J811M172l78l703j088k83q95L539
2045H09M022k368l768K56p86r04M170K727k959j697K18k528p10N389K561m221
2061B11j319M80k969J641N532j137l536J122R5l514J914M592j656j734K764l164
2077f78m345N277L559l542k61K041l972j615N219K17l286K584J212n467M1M727
$$ y = [-500, 1714, 1047, 469, 517, -1797, -2565, 284, 1407, 658, 981, -6, -2693, -2536, 592, 1766, 1098, 1681, -5, -3112, -1701, 970, 827, 1841, 2378, -679, -3074, -1650, 753, 1210, 2498, 2459, -1438, -3562, -999, 271, 546, 2675, 1589, -1947, -2990, -1390, -769, 1249, 3566, 1637, -2702, -3140, -1157, -136, 2324, 3843, 894, -2606, -1962, -635, -340, 2056, 4168, 1056, -2402, -2345, -1893, -633, 3415, 4062, -398, -3328, -2806, -1607, -174, 3187, 2803, -1409, -2203, -1311, -2366, -555, 3617, 3239, -464, -1552, -1835, -2730, 809, 4831, 2463, -1305, -1049, -1835, -2739, 1431, 4158, 1199, -498, -280, -2808, -3518, 1871, 4432, 211, -1108, -628, -3597, -1956, 3576, 2439, -1097, 25, 120, -3394, -1480, 3112, 1456, -278, 2486, -678, -5023, 254, 3813, 271, 10, 2051, -1921, -3536, 1683, 1900, -1386, 1198, 2410, -3057, -3016, 1711]
2093A711j231j613L730j781m808K732M061l489l74L999k899l456M564R96m224
2108b082K218L031m290j036M278j657k895L818O99m431J545L334l865j088M158
2123A737j127l398L567J635m289r0L757k662j218M545n56m316J984J749k907J008
2139e81L719k335l416L021J70k872K657L184l461k368K570j009j548L891J709
2154C331m208j118K501k094r00M915J49l718O08M17l133J857N380j434l842J145
2170a44j41k553K957L713k848j714K195k301l017M093L496k924r78O70l579p97
2186c872N868J590m123M45P59m106R07M973q23j870K547j527n299K197N367j137
2202A896j354K223m005l399M891K741l026N96K108m256k178L933P55j631L311
$$ y = [1711, 480, -1133, 2597, 816, -3992, -1260, 2801, -688, -1062, 2937, 38, -3418, 1146, 2142, -2082, 136, 3167, -1123, -2159, 2119, 462, -2433, 1385, 2084, -2347, -802, 2532, -1333, -2421, 1737, 610, -2788, 779, 2414, -1875, -1965, 1792, -870, -2088, 2457, 1901, -2415, -431, 1318, -1589, -581, 3138, 803, -2613, 408, 578, -2294, 363, 3547, 86, -2282, 288, -721, -2269, 1622, 3331, -877, -1995, 506, -1588, -2488, 2427, 2576, -1142, -534, -117, -3250, -1393, 3987, 2553, -1289, -144, -285, -2838, 119, 3832, 984, -730, 1465, -836, -3853, 240, 3736, 812, -166, 504, -3075, -3872, 1996, 3586, -537, -92, 667, -3439, -2532, 2441, 1618, -252, 2295, 768, -4531, -2334, 3033, 1896, 542, 2765, -1240, -4639, 252, 2993, -33, 563, 2671, -1585, -3763, 170, 925, -706, 2605]
2217B605l08o259J40M881j45p19K392k101m279K566K938k409Q18L645l289l628
2233c152K732N02j031L439Q53m745j648L350l41n14K686n20l589Q56J643k513
2249a992J242L694j329l473R28M45q81J865K454l172j853K576p69q62K310Q87
2265B070k260m2Q11j597k55L048j50k494N47L40j524J232J953j029j437O71k86
2282d02j167J428J475j091q00R66j062n92J842L11j157N3N19r08k3J579O4j119
2300h4N61k9j288M44R02m23k32M09J18j121M01M57n23K06O10q81n46Q75N18o42
2320b68K51j2j90J71M98j87m58K96P87r45j30Q5M11j06M59o33q91O26P66j51p23
2341c44R3J09p9L32k49k69J54L97R7o96J63M49L72j4n93j44L77Q41p96o17M37
$$ y = [2605, 2297, -3962, -3822, 1059, 914, 195, 2587, 486, -3793, -1227, 1711, -698, 120, 3765, 476, -3152, -420, 82, -949, 2490, 3343, -1402, -3050, 300, -41, -555, 2131, 1611, -1978, -1122, 521, -1992, -750, 2944, 1615, -1858, -930, -485, -1366, 499, 2953, -219, -2072, 504, -265, -1127, 1183, 2070, -190, -232, 579, -1018, -1273, 1775, 1625, -869, -322, 18, -1506, -274, 1679, 650, -787, -116, -402, -1569, -141, 1334, 243, -557, 409, -653, -1245, 597, 908, -249, -196, 323, -585, -608, 971, 1035, -84, 477, 448, -840, -396, 506, 83, -149, 260, 378, -743, -342, 115, -408, -202, 408, -473, -1019, -144, 374, -268, -17, -29, -219, -48, 450, 263, -195, 101, 888, -57, -187, -102, 309, 203, 662, 29, -862, -236, 530, 379, -344, -251, -142, -221, 111, -138, -407, -253, 144, 241, -455, -292, 157, 529, 515, -78, -222, 155, 996, 200, -417, 20]
2362B0J63M18k42m81k16L80P29m12j263K46O20L24P2p31k2L38M54k47r39L16P82
2383C09K96k24m80j54L88P97n86p53M24N15J18o84m6k99J81R80q34o93O04L57
2403B16m83J07M7l15J33N59m12r11P77J058o55J89l05n03K79R37m77p35P05M41
2423F52q53j73Q45k40n00J223o14j657J243P37r23k24R48r19j005J519L40j194
2441g95J142Q31j609m94J633n31q61K107l2k734N12J677j036p3K393j446k221
2458a537J589N02j647J325J713k006j846K265n49j434K482J406l300m00K208j496
2474g25p71L841l47l546J004J491k474O25L670j678k935L010l57l790L037L258
2490C313l092j564K755k372k167M868J243m360M20K702l946p23N516r70l012K473
$$ y = [20, 183, 601, 359, -122, -338, 42, 771, 359, -904, -658, -38, 286, 358, -373, -395, -57, 397, 150, -789, -473, 309, 605, 381, -99, -253, 135, 932, 346, -407, 17, 532, 650, -34, -80, -379, -198, 782, -52, -745, -141, 216, -267, -160, -113, -428, -295, 264, -148, -1059, -282, 776, 121, 310, 5, -498, -219, 718, 241, -494, 211, 652, -201, -374, 471, 231, -269, 954, 340, -1317, -74, 663, -260, -484, 464, -455, -1460, 59, 399, -795, 347, 1178, -431, -925, 708, 177, -684, 1423, 1391, -1343, -831, 846, -190, -263, 2130, 684, -1537, 52, 554, -1093, 232, 1945, -61, -1907, 358, -191, -1625, 857, 2263, -1037, -1437, 771, -725, -1496, 2345, 1998, -1548, -544, 947, -1527, -902, 2768, 1090, -1845, 1165, 808, -2982, 55, 3313, 221, -1343, 1412, -960, -3127, 1741, 2984, -1376, -956, 1746, -2200, -2923, 2593, 1623, -1389, 1084]
2506A084M22n188J908N350k584k646L613j704m393M460L402m696K56M057m105
2521g64l170N245R33m003K908K033o242n75O323j631l850N126l07n917K324M909
2537C342m552q51O190k662o114M680K573n084K751M480o082k746O486n34n348
2552c471M714K734o843Q76N686m732k774O981m21p114L682L832n706M92O510m181
2568B65m909O579Q38p094L662N315o548j118P001l303n337O695J705p605K645
2583a209O127n946k918P243j940o465O570K894p905Q83P033n780l350Q664j064
2598B837p563N032L728q147J144Q541m668n052P215o25p744N091N864p035j502
2613b884P470n104n424Q414J961p697L133M908q229k017R639j930o167O334J034
$$ y = [1084, 1506, -3682, -1774, 3576, 992, -1654, 1959, 255, -4138, 322, 3724, -972, -716, 3341, -764, -3934, 1311, 2244, -1759, 1149, 3182, -3060, -3635, 2688, 1057, -2793, 2333, 2026, -3891, -1567, 3342, -1210, -2061, 4129, 1467, -4647, 33, 2606, -2478, 273, 4753, -1329, -4075, 2411, 1877, -3471, 1243, 3977, -2866, -1990, 3696, -1036, -3810, 3171, 2750, -4364, -682, 3150, -2556, -2064, 4446, 265, -4644, 1935, 2773, -4321, -659, 4656, -1892, -3010, 3991, 688, -4649, 2046, 3751, -3854, -1209, 4918, -1028, -3946, 3297, 1357, -5108, 1462, 4356, -3549, -2666, 4367, -1413, -4763, 3901, 2837, -4726, 306, 4034, -4113, -2969, 5572, 904, -4148, 3067, 2442, -5302, -211, 5653, -1382, -2884, 4586, -518, -5942, 2472, 4433, -3264, -131, 4777, -3452, -5469, 4170, 2240, -3927, 2407, 3441]
2628C441r206K561Q169m999k460P367l663p815O546M514o426J328O595p569m529
2643f146Q484L30o026N713K960r278p89Q044l067l085P669j216r402L127O048
2658C366n774Q42P388m681p029N617K090n222M522N446p592l956O588j222l984
2673c601P142J795q703M04N310m436p42P821j183p759K695K511n130K945P197
2688F266m800n354L936m7m362N112N129o345k056M118l176l086P555K125o187
2703a172R1K648m923L22P358j063n461K460Q16n541K518O558l227l117L256k059
2719e36m605M953M413m150p74L051m239k673O262J481m461K149J389n310m54O342
2735B838p68l100L285j137n212K092M837k454j156L421k725m148M072K264k945
$$ y = [3441, -5765, -3204, 4965, -34, -2494, 4873, 1210, -6605, -59, 4455, -1971, -643, 5952, -1617, -6146, 2338, 2668, -3358, 2355, 5315, -3963, -4752, 3292, 225, -2860, 4809, 3593, -5809, -2682, 3366, -2408, -1566, 5822, 1141, -5888, -271, 1819, -3403, 1119, 6565, -1027, -4983, 1605, 383, -3601, 3541, 5336, -3367, -2963, 2347, -2089, -2831, 4990, 3807, -3952, -1257, 1254, -3876, -931, 6266, 1466, -3888, 48, 1, -4361, 751, 5880, -465, -2521, 1597, -1579, -4665, 2890, 5015, -1172, -1081, 1567, -3356, -3034, 4324, 3261, -2200, 260, 1076, -4465, -1947, 4611, 1384, -1733, 1523, -536, -5141, -188, 4225, 75, -699, 2352, -1887, -4560, 1702, 3183, -1278, 871, 2260, -3050, -3504, 2838, 2070, -1030, 2255, 1118, -4094, -2002, 2835, 381, -775, 2646, -79, -4227, -155, 2109, -836]
2750h36J162K293l877k636M739L62k413K794Q20n084M36L818j264r05K842q80
2766A371m102J770K413k134K63L234k605k613K541M90k101K264J830l567j013
2781a959K453m72j468K730N79l224L54J859j734K67K432r95k308J425N63j753
2797a251R92K069j787j002J515k66j486J771O64j456k49J282j175o53J713n2j531
2814i02M70R05j126J82J210m14r96J172p0j074M73R97p30l11P20m22o42O41N71
2833F54q57L8K32K8m74M00K96q11L06L91o41J00M87k51k89L57J68l97L8K98K78
2854C51l19K07j90j63p2K93j0l7o1l29K83J49N2l95R5M55n28j80K24r1n0K19J31
2877C4k97j91M23J11o9K53l52k16M60J15k41l71P33j89l10L88j79k55K38J84o10
$$ y = [-836, 326, 2619, -1258, -3894, 845, 1207, -1206, 1588, 2408, -2676, -2240, 1578, 314, -591, 2251, 1371, -2731, -961, 1452, -682, -419, 2815, 210, -2403, 138, 628, -1473, 791, 2621, -946, -1959, 494, 22, -1446, 1284, 1863, -1361, -1007, 852, -882, -615, 1817, 822, -1486, -61, 502, -1251, -259, 1810, 23, -979, 536, 270, -1216, 555, 1219, -237, -486, 796, -379, -1032, 681, 629, -902, -432, 473, -653, -471, 739, 325, -671, 501, 431, -643, -170, 827, 97, -214, 506, 84, -558, 83, 654, -203, -165, 67, 95, -379, 21, 317, -494, -188, 203, -438, -338, 149, -102, -391, -34, 134, -263, -225, 73, 351, 32, 239, 49, -114, -186, 107, 97, 60, -1, -330, -47, 102, 154, -241, -146, 309, -219, -399, -175, -266, -316, -97, 34, -263, -454, -31, 80, 11, 264, -88, -304, 156, 271, 30, -341, 392, 203, -107, 281, 102, -153, 85, 269, -341]
2898c41M36K30n34k19O38r8o24N00L39q74K15M88l11j96O36J9p62N56L69n75n6
2919a64O11l54m02N60N2o89O43N10j079R3R87j117l80J419m72j055R46M63j305
2938g33PJ546o84q46J218j27j246O77J282j164n56J624r48j557J981N18j805P89
2956b4J196k091K13J979j059j390J577M40k222N34K100j479r07K457j118k313
2972b107J949J160k182P84K464k660j120K503J13k463K232J378l139k56K803j545
2988h6j637L296k20l351J473K279k936k0L496k072k664L252J57l272K006L174
3004B875l569j228L570j414k772L613J256m210J108L359l601j113M228o95l609
3019b202K956J399m387J060M393l481k419M294m16m085L232K470m628q3M766k953
$$ y = [-341, 95, 325, -209, -428, 210, 112, -512, -12, 327, -547, -332, 156, -155, -351, 285, 304, -458, 98, 467, -108, -164, 447, 93, -309, 251, 303, -386, 257, 767, -312, -219, 768, -349, -729, 690, 218, -837, 109, 572, -733, -726, 820, 136, -710, 508, 381, -865, -188, 1094, -70, -626, 998, 50, -1507, 474, 992, -813, -24, 1172, -919, -706, 1273, 214, -1176, 401, 841, -1381, -847, 1253, -226, -1133, 1324, 206, -2107, -158, 1002, -1180, -396, 2068, -592, -1712, 791, 904, -1559, 673, 2051, -1088, -1344, 1459, -86, -1723, 1573, 1353, -1998, -525, 1754, -1182, -1202, 2294, 222, -2442, 810, 967, -2305, -299, 2875, -694, -1922, 1648, 234, -2538, 1075, 2331, -1879, -771, 2588, -1013, -2126, 2102, 1407, -2202, 754, 2153, -2234, -1174, 3219, -262, -2681, 1613, 1197, -2888, 344, 2814, -1814, -1897, 2869, -84]
3035h4l409N091Q85n445K779L291m857m48N414k569l886M697J480n488J666M576
3051C693n143j239N837j843m790M485K150o321J503N157m138k260N889j350n902
3066d272M258L490n591O50N307m797l295O546k9n243M034L246o516r87O310k996
3082A15k951O049mp633L103M455m860l56O627l256n785M975J460n877M009N571
3098E642o448l350O172j601m575O508K768p803O3N168m461j654Q356j096p268
3113c579K785L058o065J855P649m378m768M850o62o339N637N857o305j867M992
3128B720m234l897P916K333o650J314L456o732p82Q609o06n637M056J48p851L028
3144b809P725l740k954N011l206o505O098M711m934K01M655o337m076P363J790
$$ y = [-84, -3493, 1598, 2483, -2962, -183, 3108, -1749, -2197, 3217, 648, -3238, 1459, 2939, -2549, -883, 3693, -1450, -2689, 3148, 1305, -3485, 1000, 3150, -3171, -1668, 3489, -649, -2909, 2980, 1630, -4272, -14, 3476, -2115, -1465, 3842, -955, -4250, 2296, 2267, -2976, 1058, 4304, -2212, -3199, 3111, 115, -2836, 3213, 3209, -4424, -1321, 3134, -1726, -2082, 4545, 1289, -4496, 479, 1939, -3938, 71, 5642, -806, -4156, 2016, 415, -4160, 2348, 5116, -2687, -2624, 2544, -1917, -3571, 4785, 3689, -3579, -794, 2264, -3801, -1946, 5703, 1325, -3443, 1407, 745, -5594, 43, 5900, -405, -2272, 2720, -1514, -5411, 2505, 4838, -1812, -498, 2958, -3774, -4556, 4053, 3447, -2190, 1866, 2014, -5837, -2809, 4916, 1176, -1778, 3233, 27, -6478, -380, 4331, -603, -402, 4253, -2084, -6160, 1203, 2993]
3159B993m729L608K052q576l37Q028j584l221N497r67q371L007N606l894K41O050
3175E403m299p022N081K718l796L490M001p138l615O111l27l204N593J501p727
3190c230l30N154k964n73O975j552p528K475K725l667K285O022m961m799M490
3205E22K83m081M364M248n835k386L724k327k009O697J045o595P00L027l908L53
3221b178N845j491m752K823O74m501K635M880l241k317K938j626l351M317L331
3236C986m203n83K653l443j305M698O07l609J562R03m099K23N080j021k786K499
3252A162p85l804K762L300k543j025K672k112k607L147J870k514O80J795l301
3267a303j064L495j14k004J988M53l281n5L336j236r41K171n84l048J803J499
$$ y = [2993, -1736, 1872, 3924, -4652, -4989, 3039, 1455, -1766, 3731, 2764, -5607, -2600, 3006, -888, -647, 5403, 1104, -5918, -837, 1881, -1915, 1575, 5576, -1562, -5177, 934, 607, -2597, 2996, 4497, -3230, -3560, 1594, -1370, -1943, 5032, 3480, -4048, -1573, 1152, -2515, -230, 5792, 831, -3968, 522, 805, -3276, 1088, 5336, -499, -2885, 839, -1488, -3497, 3200, 4245, -2350, -1650, 1377, -2531, -2178, 3667, 2176, -2576, 247, 921, -3580, -945, 3935, 694, -1623, 1315, -311, -3662, 655, 3986, -217, -800, 1853, -1590, -2895, 1803, 2410, -1199, 363, 1266, -2833, -2610, 2470, 1449, -1337, 1162, 377, -3427, -665, 2635, 92, -933, 1739, -373, -2980, 167, 2037, -477, 203, 1998, -1303, -2367, 1128, 1014, -990, 998, 1451, -1830, -1885, 1451, 215, -726, 1445, 861, -2187, -384, 1115]
3283A115j474J01J739j576j755J971Q51k014J356J269k239q08K160k70j332K022
3299A116J62k454L83J562j127l53J761n53j543J113M00j111M31J436j575r55J675
3316C68J18j025P48M75j284q2J291m37j022J453J73j107M36L91j004M91P91n96
3334A78j025P92M60p22Q9N29l32l53Q70o46q27Q79P15p42j78J86l57J98P63j90
3354B87o00K50L05J06m43L74j31J11K05k35o20L41N68l05o25o2K61L33K13l93
3374f0l53K01M30k28l39L92P9p7L21j73m38J25O53o86k52L55N38l87K16k36l98
3395c17K14P38n75j62q6L49k69K84m7o66L43M90j79l18J89P1j77K4N07m50j56
3416a93N74j2m90M44J67n70J09P8k17j22Q29j67q66O58J32l68J4N37p66k55M94
$$ y = [1115, -359, -258, 1481, -95, -1850, 121, 972, -1042, 314, 1583, -656, -1464, 696, 426, -906, 1116, 1278, -1176, -793, 769, -358, -711, 1050, 497, -1046, 67, 467, -644, -213, 1223, -352, -1307, 368, 486, -539, 209, 684, -600, -682, 609, 172, -850, 603, 776, -331, 105, 496, -508, -17, 774, 178, -847, -55, 405, -317, -228, 301, -31, -384, 486, -160, -987, -108, 607, -135, -313, -127, -484, -286, 477, 287, -313, -63, 242, 348, -95, 279, 148, 259, 464, 229, -391, -50, 518, 213, -412, -474, -213, 120, 333, -60, -413, -212, 218, -10, -349, 43, 122, 45, 366, 193, -245, -120, 533, -153, -405, -50, 488, 101, 317, 81, -317, -103, 635, 60, -102, -188, 161, -108, 176, 129, -537, -194, 296, 117, -201, -12, 59, -118, -94, 413, -37, -193, 381, 369, -121, 323, 490, -80, 29, 107, -110, -232, 597, 430, -436, 222, 354, -14, 0, 537, -229, -484, 10]
3437A0K41p51L96O07j146K62J170q76n92J222j77j262R58P93j188n2J034o74n94
3456f19J118J74j608P36J122j568j76J967r57j494J613J79j352O18J268j627m39
3473a045K060o24j716J667N39k026R90J208j566n40K560r99k002J771R77k295
3489a041O17J767j698j281L199m68k944J450J887k632J39K805j763j987L062j67
3505I45k738J550K172k586q68L350j738k208L536L12l655J397K535k793n93L326
3521A944j439k826L310O94l699J106L058k434j888L767j164k858L021J858m167
3536a717K70L830k809j900L830L44m039K416K134m370J14M558j959k879L574l64
3552A033m135K934L299l786j202M086k221l417M492J519m520J294L405m373j447
$$ y = [10, 251, -500, -104, 503, -643, -381, 789, -87, -679, 543, 366, -896, 62, 855, -333, -385, 649, -25, -619, 499, 673, -935, -199, 923, -645, -821, 1146, 189, -1305, 308, 487, -865, -247, 1021, -606, -1045, 1015, 391, -1325, 342, 881, -1145, -155, 1053, -513, -1053, 1507, 508, -1494, 277, 1254, -1041, -424, 1343, -355, -1636, 1563, 1095, -1849, -399, 1488, -1144, -1005, 1800, 37, -1950, 1112, 945, -1793, -243, 1929, -657, -1525, 1825, 87, -2121, 1415, 1727, -1928, -531, 2004, -789, -1382, 1944, 505, -2321, 989, 1683, -2016, -910, 2148, -286, -2174, 1593, 429, -2429, 592, 2450, -1717, -1447, 2383, -426, -2326, 1504, 1848, -2191, 225, 2359, -2011, -1897, 2661, 702, -2177, 1397, 1033, -3102, -168, 3131, -655, -1857, 2229, 8, -3409, 1083, 2602, -1918, -624, 2781, -1592, -3039]
3567c039N346l46m378L187J729n471R82N346l253k306M767j143n329L595L290
3582B977m161J36M488l907l627N268J041m583L065K934o224p60N758j757l004
3597b356M851K40o521J684M807l698m99N723k996n972M420K794m908K513M812
3612D894n600l275N118j67l785M869K721p436m68N305l074j678O350r00o528K680
3628i74L053m712J281O393l735n125M252M58m374M063M542n480k216M499k816
3643h91l154O539K187o387L58L097m891j11P521j574n504L117J007n474K338O435
3659D613l429l399L943k199m716N370M586n099o41L366m276k826O603J719m954
3674a339J645K240o123j17O703j207k777L245p11o128K105N820k911j180L806
$$ y = [-3039, 2307, 1961, -2417, 770, 2499, -2972, -1990, 3356, 103, -2203, 2564, 1421, -3908, -313, 2977, -1184, -1048, 3440, -467, -4094, 1174, 2215, -2368, 697, 3631, -2593, -3353, 2405, 648, -2356, 2495, 2735, -3786, -2102, 2705, -993, -1492, 4231, 1235, -4737, -317, 2477, -2431, 82, 4894, -706, -3981, 1137, 970, -2815, 2054, 4775, -2661, -3129, 2176, -898, -2576, 3774, 2874, -3654, -974, 2079, -2633, -1352, 5041, 1306, -3819, 433, 891, -3483, 580, 5122, -358, -2574, 1925, -891, -4045, 2494, 4681, -1706, -1348, 1749, -3142, -3253, 4268, 2694, -2810, 307, 1314, -4160, -1822, 4613, 1184, -2215, 1728, -471, -5187, 183, 4769, -330, -971, 2395, -1881, -4707, 1896, 3615, -1339, 306, 2546, -3577, -3694, 3009, 1802, -975, 2270, 1559, -4569, -2464, 3356, 445, -735, 3071]
3689C071k964m984M434K971l863J691L278n118k927N282Q49l299L701J118o132
3704b892l22M878j338j422M096q80n563J750L025k600O30M694l428m319L305J491
3720A105k961K593K625m321j992L679o01k293M033J216m739OK763k196m48M660
3736C129j258m144J598J507k518J013L846k748k547K701m81k405K910K197l421
3751f21p41K495j865j468L855N24l413Q79J537k663o0L553p61k518K085k09k608
3768a999J544K261j591j129J819j043j701K096J319k314J98J878k100o39K286
3783H85J39k016J223L59j846L36K084r44j020J682k70k007J057J508j248j85J322
3800A059j134j457J799N25j392K75J177j271n34J803n37q71R48K06j459L98J216
$$ y = [3071, 107, -4877, -443, 2528, -1335, 356, 3634, -1484, -4411, 871, 1720, -1579, 2122, 3240, -2892, -3214, 1664, 326, -1096, 3000, 2120, -3443, -1693, 1332, -1268, -638, 4056, 628, -3691, -386, 1105, -1856, 737, 3362, -959, -2951, 728, 127, -2166, 1867, 3083, -1656, -1650, 1113, -1083, -1531, 3129, 1871, -2273, -675, 832, -1686, -673, 3173, 425, -2122, 579, 98, -2307, 603, 2800, -621, -1362, 1133, -732, -2200, 1655, 2179, -1234, -355, 1182, -1481, -1541, 2012, 1251, -1267, 818, 609, -1999, -455, 1806, 215, -914, 905, -138, -1839, 257, 1576, -738, -540, 1338, -762, -1401, 885, 1024, -992, 231, 590, -1256, -920, 1164, 220, -800, 882, 612, -1395, -338, 1170, -78, -263, 1059, -75, -1532, 267, 792, -600, -325, 852, -419, -953, 850, 313, -558, 390, 596, -863, -465, 751]
3817G51o16n26Q65o3j025M87O30q06J78R76p12r97J280m8n27K66N89r55j63O67
3837B51k45m32N81K05j016K05L85l29K36M07k50n76P08J04p24M64O38p29l02L46
3857g3L34m80M06J98l64M0J1p6j18J49L23j33m99J43Q3k56N93p8m85N19r3j12
3879C2l89M88j72j38J62K5j36p8L91L8k04J84k73J26kQ5k78j2L75k38j54L14j50
3902dj06P8L02m90J26K48r4k56J02J89l37P1K13pJ41L8K2m67M74j79p2P4K43m66
3926a57m0L73k91k58M54j89l11N07K72o30K46L30l79l13N39L5l12O5N61q53P0
3947b81N65j98n65O81J24p81O22K08n49NP00n82m98J018k42q59O65K99o14j01
3967c83R87m97p22J074k25o74R0Q44r11MR09k57p89R85K29j225M49R69j151JQ13
$$ y = [751, 135, -391, 474, 411, -614, -127, 503, -303, -125, 851, 139, -858, 422, 374, -153, 113, 702, -253, -416, 251, 6, -426, 155, 360, -656, -451, -66, -395, -159, 248, -2, -578, 130, 234, -490, -26, 612, -117, -419, -73, 261, -219, 187, 385, 21, 61, 72, -4, -122, 27, 350, 217, -282, -139, -56, -312, 281, 203, -282, 237, 144, 32, -357, 131, -41, -179, -17, 8, -128, -206, 185, 223, 19, 203, -70, 56, 54, 139, -139, -151, 224, -14, -168, 146, -4, -110, -32, 270, -220, -94, 154, 60, -196, -94, 95, -242, -171, 42, 35, 176, 214, 236, -231, 243, 64, -8, 66, 309, -157, -197, 176, -115, -373, 81, -108, -419, 88, 360, -270, -24, 306, -73, -386, 153, 188, -124, -59, 502, -351, -281, 284, 86, -479, 202, 326, -455, 167, 375, -174, -169, 531, -51, -549, 469, 227, -632, 33, 332, -282, -383, 604, 107, -615, 459, 234, -440, -350, 494, -417, -413, 496, 239, -550, 435, 664, -561, -112, 857, -294, -293, 520]
3988E20k90j013R66O03j409N74R00j160p67J743m3j582J101P34j829K91J730j132
4006f3q51J669l35j534R23J343j612k30J913j229j440J801L05j584J019J174j819
4023e50p92K172m29j640K123M04k574O66J596j525l11K212q99j832J418O80j805
4040a086Q32K192k238j475K569m25j671J955J268k599j84J859j544q34K921k47
4056A293k583J087J199k307L09L309j510k245J858R0k386J987K229k418j077K089
4072I24j341j601K994R15k579K57J538k503m90L378O6k707J526N83l144R20L494
4089B230j738j536K242j184k796K246K763k375k20K249k551j829K867J520k825
4104i37J600R41l522k47L574o66j285J986j76l853J087L242j636o25K414j319
$$ y = [520, 230, -783, 183, 786, -623, -49, 851, -309, -1076, 667, 624, -958, 143, 877, -952, -661, 1069, -63, -914, 755, 420, -1114, -191, 1152, -460, -690, 1223, -6, -1446, 355, 660, -924, 95, 1269, -550, -1342, 830, 401, -1239, 884, 1288, -1286, -620, 976, -549, -860, 1352, 453, -1379, 39, 719, -1086, -254, 1938, -300, -1775, 794, 369, -1302, 653, 1921, -678, -862, 997, -547, -1381, 1540, 1293, -1290, -203, 996, -1311, -1002, 2307, 797, -1448, 410, 500, -1886, 101, 2330, -88, -1165, 924, -417, -2018, 976, 1891, -688, -431, 1107, -1396, -1886, 1492, 1558, -1149, 377, 960, -2184, -1264, 2230, 492, -1044, 1198, 14, -2782, -536, 2227, -148, -368, 1881, -670, -2499, 368, 1888, -937, 663, 1604, -1918, -2165, 1409, 743, -542, 1444, 1268, -2585, -1498, 1744, 108, -517, 1897, 578]
4120E78l575K736J756k075J012K075l509k092L449M45k068K596J123m200m78L289
4136A062j317o67L628r97m120J067K465k188R06L430k712l217K419Q05k271K378
4152F71K623l554k147K880j047j571M039R57m403J04K120k156L9M198q66l481
4168a594J409N97k784K146L627k337k690K102q87k170L358K129l186q36K157k316
4184a275j257L886R20l188P79R80l321M05M147p02k109J489k42l036J682L310
4200B468k267o60K146k117k441L137J374k060O20J537l141j027L179O50k011J543
4216I30ml040L28L045r29p80J904q36k895J287K158j429J36K051j932k458K585
4233A21J043j853J186J085k332j031K501n24j126K091N27k962Q8J968j063j41
$$ y = [578, -2997, -261, 1495, -580, 432, 2507, -1002, -3094, 355, 800, -1268, 1328, 2451, -1749, -2227, 1062, -255, -922, 2706, 1709, -2411, -1344, 1121, -1067, -161, 3269, 557, -2660, -241, 564, -1707, 671, 3294, -260, -2407, 473, -574, -2145, 1894, 2851, -1552, -1448, 672, -1484, -1445, 2753, 1887, -1594, -185, 412, -2372, -226, 3401, 1064, -1626, 476, -411, -2581, 777, 2906, -280, -1116, 1041, -1275, -2532, 1354, 2274, -914, -135, 845, -2476, -2071, 2076, 1374, -735, 754, 512, -2524, -842, 2468, 201, -459, 1687, -430, -2871, 266, 1640, -420, 200, 1737, -1404, -2431, 748, 1398, -613, 930, 926, -2114, -1786, 1259, 330, -450, 1454, 618, -2277, -990, 1168, -261, -125, 1926, -6, -2464, 121, 1164, -689, 497, 1582, -750, -1781, 720, 196, -930, 1161, 1688, -1274, -1186, 782, -281, -422]
4249d22J789n07k327J070J099j694Q01J982j573j496J436j3j023J249J181j948
4265c96l08J411r06n54J749m4j751J56J126j141j2J638m35j647J338K30j215O19
4283a42J139j221l37R64n36r72J467O42j451N26Q08j257k79J363n9j360Q24P28
4301H47j222k84J259n85l41P93j36j114O19P25o49k53O01l68n05J031k18q09L85
4320b24N79n40m88R14m2n16N42j5m17K20M40l58k41L30K4n11K59M82p15K7M75
4341B25j01m42L58K4n8J01j15j61m12J020l55q09P02N5l25M51M3l05J8L94j61
4362A47q10P19J61k5k28K76l09j34N04n77m5M34J86l16l34K80J42j49J14L0j82
4383a16K1N18j33l78O3J66j67K24K67q16Q1L06l1j17N8M3L3j21K22k53j7K84j01
$$ y = [-422, 1367, 860, -1467, -397, 702, -992, -191, 1791, 218, -1278, 158, 145, -878, 371, 1552, -396, -704, 707, -199, -753, 996, 952, -799, -643, 483, -658, -670, 968, 533, -1114, 224, 454, -761, -142, 997, -224, -561, 403, -133, -1105, 362, 1004, -447, 79, 887, -370, -649, 714, 655, -705, 119, 847, -375, -659, 600, 15, -326, 467, 331, -783, -164, 561, -88, -341, 260, -108, -613, 418, 200, -609, -224, 355, -185, -673, 241, 199, -317, 225, 210, -207, 13, 453, 95, -146, 184, 208, -303, -44, 438, -277, -250, 225, 124, -318, 40, 64, 6, 107, -8, -169, -581, 439, 84, -725, -23, 32, -293, 158, 201, -104, -86, 308, 147, -663, 56, 217, 192, -36, 240, -69, -203, 301, -276, -321, 113, 299, -17, -351, -71, 71, -78, 36, 66, -116, -95, 423, 290, -88, -25, 141, -26, 198, 465, -351, -270, 36, 5, -112, -54, -11, 22, -99, 123, -130, -147, 137, 36]
4406C6l87M53J1o4k64L67l11k4L18j84J7J19j1j56K48J92n22k7J67J03o02P08
4428A87N7m38N5K61k83R8Q8k47K00q5J95j02j42L20j99j76L39j55M4J01J01l68
4450a49rN88n00M3J3K83n92N84J58n29K61J58j92o04M07J90m54L40J70l15n3O80
4472D78o49j61M86n8l54K73L96n85L6L76j10n47L91L20m18J11L89p77K75O95l36
4493B31o72N94j90k77K43N15n93k02N06k21o51N43O18o63oP27p31o00J469j24
4513E16q96N23N25j245M17Q97o13o42J014k38j055O43Q48q75K0Q68j067o24J054
4532G0P07j211M77M29r14l88J019J41r38J344j54j416J23J444p17m28J132l98
4550C22j547R15J055q15j66J270j107j427J482K53j036J427Q03k124k17J242l87
$$ y = [36, -351, 102, 113, 49, -215, 152, -159, -183, 135, -49, -32, 87, 76, -80, 168, 360, -162, -189, -22, 81, -521, 187, 244, -194, -139, 122, -161, -63, 25, -222, -22, -107, 88, -14, -156, 164, -35, -211, 128, -27, 17, 118, 219, -149, -158, 430, -70, -27, -14, 269, -323, 261, 419, -110, 151, 309, 117, -487, -80, 110, -344, -4, 166, -149, -202, 478, -171, -332, 154, 96, -258, 15, 411, -174, -138, 238, 128, -419, -28, 292, -126, -15, 374, -403, -128, 567, 231, -441, 153, -37, -314, -71, 444, -149, -351, 155, -66, -717, -174, 444, -219, -225, 502, -229, -829, 640, 516, -380, 143, 668, -577, -160, 737, 124, -518, 496, 258, -797, -154, 694, -181, -161, 707, -360, -984, 70, 777, -434, 43, 472, -442, -830, 189, 330, -608, 736, 582, -834, -711, 733, 16, -412, 720, 322, -1225, -310, 745, -70, -236, 1034, -73, -1500, -18, 235, -801, 626, 1429, -695, -912, 330, -57]
4567e7n18J642P9k077N64P67q78j44J906r05j685J086J91j030J222J587j747q37
4585h34J227o04q85J875P81j918m13J270j465M5K248j96k079N65O20j818J043
4602e38K153j191r68J014m73j892K091J639j451o83Q39j357q12K206R43j622J95
4619I3Q14k286l03K697n0j453J134j17k358R80K144r10n52J237j062j725J486
4636b31J573j273J73J083j894j435K204N67r42R49L94k558Q3K071l92q63J629
4653A138k87k615Q10J281l81R9J680j529j917J137J159j317J368R87k066q34J671
4670C84l78o84J930K18k592l6J476q14K04J687j10k583L60J119r89P12J982j671
4688B15j282J002nj136J522J457j902q64R87m83o10K235K91k028oQ32r97J66J801
$$ y = [-57, -575, 1067, 1146, -931, -367, 400, -478, -622, 1284, 379, -1306, -220, -29, -1059, 163, 1750, 3, -834, 393, -211, -1096, 779, 1560, -358, -771, 499, -966, -921, 1327, 1131, -948, -383, 237, -1581, -538, 1615, 424, -544, 470, -3, -1895, 196, 1835, 384, -299, 540, -817, -1629, 577, 1520, -102, 93, 907, -1379, -1682, 1015, 965, -488, 646, 529, -1829, -849, 1295, 385, -167, 1070, 8, -1717, -231, 1342, 69, 242, 1325, -569, -2004, 200, 767, -175, 774, 1168, -1390, -1307, 764, 372, -491, 1138, 851, -1764, -954, 327, -54, 45, 1725, 196, -1721, -584, 575, -742, 626, 1613, -453, -1287, 384, 6, -678, 1252, 1470, -1122, -1158, 318, -496, -292, 1395, 1285, -1298, -938, 181, -808, -96, 1886, 215, -1067, -65, -70, -1206, 316, 1773, -129, -993, -6, -489, -1099, 1136, 1427, -601, -607, 225, -772, -606, 1195]
4707A195l16j416P24j50j522J318J690j221j051Q30k52j296J774Q26j141k42P46
$$ y = [1195, 879, -537, 187, 37, -1485, -167, 1523, 302, -749, 81, -171, -1467, 307, 1133, -8, -250, 496]
$$ [...]
8191h6
##END NTUPLES=NMR FID
##END=
