##TITLE=1H_LR-746-R-H-BtOAc
 CDCl3
 8 sc, 
 17.03.2022
##JCAMPDX= 6.0         $$ Bruker NMR JCAMP-DX V2.0
##DATA TYPE= NMR FID
##DATA CLASS= NTUPLES
##ORIGIN= UXNMR, Bruker Analytische Messtechnik GmbH
##OWNER= root
$$ XWIN-NMR		Version 3.5
$$ Thu Mar 17 13:13:24 2022 Russian Standard Time (UT+4h)  she@DPX200
##.OBSERVE FREQUENCY= 200.131346
##.OBSERVE NUCLEUS= ^1H
##.DELAY= (6, 6)
##.ACQUISITION MODE= SIMULTANEOUS
##.ACQUISITION SCHEME= undefined
##.AVERAGES= 8
##.DIGITISER RES= 18
##SPECTROMETER/DATA SYSTEM= spect
##.PULSE SEQUENCE= zg30
##.SOLVENT NAME= D2O
##.SHIFT REFERENCE= (INTERNAL, D2O, 0, 15.7039)
##AUDIT TRAIL= $$ (NUMBER, WHEN, WHO, WHERE, WHAT)
$$ ##TITLE= Audit trail, XWIN-NMR		Version 3.5
$$ ##JCAMPDX= 5.01
$$ ##ORIGIN= Bruker BioSpin GmbH
$$ ##OWNER= she
$$ F:/spectra/data/she/nmr/H-F/1/audita.txt
$$ ##AUDIT TRAIL=  $$ (NUMBER, WHEN, WHO, WHERE, WHAT)
(   1,<2022-03-17 13:11:17.62 +0400>,<she>,<DPX200>,
      <created by zg, POWCHK disabled, PULCHK disabled
       configuration hash MD5:
       00 E9 B6 7A A2 85 ED C7 34 08 36 98 17 FE 4E 26
       data hash MD5: 16K
       4B F9 26 D4 5C 78 FF 10 90 7B C0 3F 52 26 28 C4>)
$$ ##END=
$$ 
$$ hash MD5
$$ 20 43 8F 49 88 94 B5 59 89 CD 5E 76 38 73 18 F9
##$RELAX= 
##$RELAX= 
##$RELAX= 
##$RELAX= 
##$RELAX= 
##$RELAX= 
$$ Bruker specific parameters
$$ --------------------------
##$DU= <F:/spectra>
##$EXPNO= 1
##$NAME= <H-F>
##$PROCNO= 1
##$TYPE= <nmr>
##$USER= <she>
##$AMP= (0..31)
100 100 100 100 100 100 100 100 100 100 100 100 100 100 100 100 100 100 
100 100 100 100 100 100 100 100 100 100 100 100 100 100 
##$AQSEQ= 0
##$AQ_mod= 1
##$AUNM= <au_zg>
##$AUTOPOS= <>
##$BF1= 200.13
##$BF2= 200.13
##$BF3= 200.13
##$BF4= 200.13
##$BF5= 200.13
##$BF6= 200.13
##$BF7= 200.13
##$BF8= 200.13
##$BYTORDA= 1
##$CFDGTYP= 0
##$CFRGTYP= 5
##$CHEMSTR= <none>
##$CNST= (0..31)
1 1 145 1 1 1 1 1 1 1 1 1 1 1 1 1 1 1 1 1 1 1 1 1 1 1 1 1 1 1 1 1 
##$CPDPRG= <>
##$CPDPRG1= <>
##$CPDPRG2= <>
##$CPDPRG3= <>
##$CPDPRG4= <mlev>
##$CPDPRG5= <mlev>
##$CPDPRG6= <mlev>
##$CPDPRG7= <mlev>
##$CPDPRG8= <mlev>
##$CPDPRGB= <>
##$CPDPRGT= <>
##$D= (0..31)
0 1.2 0 0 0 0 0 0 0 0.06 0 0.03 0 0 0 0 0.0002 0 0 0 0 0 0 0 0 0 0 0 0 
0 0 0 
##$DATE= 1647508277
##$DBL= (0..7)
120 120 120 120 120 120 120 120 
##$DBP= (0..7)
150 150 150 150 150 150 150 150 
##$DBP07= 0
##$DBPNAM0= <>
##$DBPNAM1= <>
##$DBPNAM2= <>
##$DBPNAM3= <>
##$DBPNAM4= <>
##$DBPNAM5= <>
##$DBPNAM6= <>
##$DBPNAM7= <>
##$DBPOAL= (0..7)
0.5 0.5 0.5 0.5 0.5 0.5 0.5 0.5 
##$DBPOFFS= (0..7)
0 0 0 0 0 0 0 0 
##$DE= 6
##$DECBNUC= <off>
##$DECIM= 32
##$DECNUC= <off>
##$DECSTAT= 4
##$DIGMOD= 1
##$DIGTYP= 9
##$DL= (0..7)
0 120 120 120 120 120 120 120 
##$DP= (0..7)
150 150 150 150 150 150 150 150 
##$DP07= 0
##$DPNAME0= <>
##$DPNAME1= <>
##$DPNAME2= <>
##$DPNAME3= <>
##$DPNAME4= <>
##$DPNAME5= <>
##$DPNAME6= <>
##$DPNAME7= <>
##$DPOAL= (0..7)
0.5 0.5 0.5 0.5 0.5 0.5 0.5 0.5 
##$DPOFFS= (0..7)
0 0 0 0 0 0 0 0 
##$DQDMODE= 0
##$DR= 18
##$DS= 0
##$DSLIST= <SSSSSSSSSSSSSSS>
$$ [...]
##$SUBNAM2= <"">
##$SUBNAM3= <"">
##$SUBNAM4= <"">
##$SUBNAM5= <"">
##$SUBNAM6= <"">
##$SUBNAM7= <"">
##$SUBNAM8= <"">
##$SUBNAM9= <"">
##$SW= 18.0517287032376
##$SWIBOX= (0..15)
0 0 2 0 0 0 0 0 0 0 0 0 0 0 0 0 
##$SW_h= 3612.71676300578
##$TD= 16384
##$TD0= 1
##$TE= 0
##$TE2= 300
##$TE3= 300
##$TEG= 300
##$TL= (0..7)
0 120 120 120 120 120 120 120 
##$TP= (0..7)
150 150 150 150 150 150 150 150 
##$TP07= 0
##$TPNAME0= <>
##$TPNAME1= <>
##$TPNAME2= <>
##$TPNAME3= <>
##$TPNAME4= <>
##$TPNAME5= <>
##$TPNAME6= <>
##$TPNAME7= <>
##$TPOAL= (0..7)
0.5 0.5 0.5 0.5 0.5 0.5 0.5 0.5 
##$TPOFFS= (0..7)
0 0 0 0 0 0 0 0 
##$TUNHIN= 0
##$TUNHOUT= 0
##$TUNXOUT= 0
##$USERA1= <user>
##$USERA2= <user>
##$USERA3= <user>
##$USERA4= <user>
##$USERA5= <user>
##$V9= 5
##$VALIST= <valist>
##$VCLIST= <CCCCCCCCCCCCCCC>
##$VD= 0
##$VDLIST= <DDDDDDDDDDDDDDD>
##$VPLIST= <PPPPPPPPPPPPPPP>
##$VTLIST= <TTTTTTTTTTTTTTT>
##$WBST= 1024
##$WBSW= 4
##$XGAIN= (0..3)
0 0 0 0 
##$XL= 0
##$YL= 0
##$YMAX_a= 480743
##$YMIN_a= -548951
##$ZGOPTNS= <>
##$ZL1= 120
##$ZL2= 120
##$ZL3= 120
##$ZL4= 120
##$ABSF1= 10
##$ABSF2= 0
##$ABSG= 5
##$ABSL= 3
##$ALPHA= 0
##$AQORDER= 0
##$ASSFAC= 0
##$ASSFACI= 0
##$ASSFACX= 0
##$ASSWID= 0
##$AUNMP= <proc_1d>
##$AZFE= 0.1
##$AZFW= 0.1
##$BCFW= 1
##$BC_mod= 2
##$BYTORDP= 1
##$COROFFS= 0
##$CY= 11.3945322036743
##$DATMOD= 1
##$DC= 2
##$DFILT= <>
##$DTYPP= 0
##$F1P= 2.36226072786647
##$F2P= -0.459571619588291
##$FCOR= 0.5
##$FTSIZE= 0
##$FT_mod= 4
##$GAMMA= 1
##$GB= 0.15
##$INTBC= 1
##$INTSCL= 1
##$ISEN= 128
##$LB= 0.24
##$LEV0= 0
##$LPBIN= 0
##$MAXI= 10000
##$MC2= 0
##$MEAN= 0
##$ME_mod= 0
##$MI= 1.114404
##$NCOEF= 0
##$NC_proc= 0
##$NLEV= 6
##$NOISF1= 3.799351
##$NOISF2= 2.8
##$NSP= 1
##$NTH_PI= 0
##$NZP= 0
##$OFFSET= 15.70392
##$PC= 1
##$PHC0= -16950.78
##$PHC1= 11.40078
##$PH_mod= 1
##$PKNL= yes
##$PPARMOD= 0
##$PSCAL= 0
##$PSIGN= 0
##$REVERSE= no
##$SF= 200.130013532006
##$SI= 16384
##$SIGF1= 3
##$SIGF2= 2
##$SINO= 400
##$SIOLD= 16384
##$SREGLST= <1H.CDCl3>
##$SSB= 0
##$STSI= 0
##$STSR= 0
##$SW_p= 3612.71676300578
##$SYMM= 0
##$S_DEV= 0
##$TDeff= 0
##$TDoff= 0
##$TI= <>
##$TILT= no
##$TM1= 0
##$TM2= 0
##$TOPLEV= 0
##$USERP1= <user>
##$USERP2= <user>
##$USERP3= <user>
##$USERP4= <user>
##$USERP5= <user>
##$WDW= 1
##$XDIM= 8192
##$YMAX_p= 0
##$YMIN_p= 0
$$ End of Bruker specific parameters
$$ ---------------------------------
##NTUPLES= NMR FID
##VAR_NAME=  TIME,          FID/REAL,        FID/IMAG
##SYMBOL=    X,             R,               I
##VAR_TYPE=  INDEPENDENT,   DEPENDENT,       DEPENDENT
##VAR_FORM=  AFFN,          ASDF,            ASDF
##VAR_DIM=   8192,          8192,            8192
##UNITS=     SECONDS,       ARBITRARY UNITS, ARBITRARY UNITS
##FACTOR=    0.0002768,     1,               1
##FIRST=     0,             0,               0
##LAST=      2.2672688,     0,               0
##MIN=       0,             -548951,         0
##MAX=       2.2672688,     480743,          0
$$ Real data points
##PAGE= N=1
##DATA TABLE= (X++(R..R)), XYDATA
0 0 0 0 0 0 0 0 0 0 -1 8 -8 8 -16 16 -24 24 -32 41 -51 62 -73 89 -105 125 -145 169 -199 230 -265 303 -347
31 -347 396 -453 509 -575 647 -729 818 -914 1017 -1134 1260 -1399 1548 -1712 1892 -2090
47 -2090 2305 -2540 2795 -3079 3394 -3741 4128 -4558 5044 -5600 6234 -6970 7836 -8876
61 -8876 10144 -11739 13806 -16609 20648 -26993 38462 -65751 271821 20420 -425077 70392
73 70392 -109117 -203264 326586 357533 -257540 -104396 133803 -279400 -241297 401964 256436
84 256436 -168701 -3850 -47418 -382134 36650 462846 18658 -241288 106928 -16096
94 -16096 -287546 81657 246799 -112747 13638 248840 -184599 -341466 160402 200866
104 200866 -79958 110847 126772 -285451 -155522 224456 -251 -118502 236808 110358
114 110358 -291963 -101519 104965 -80705 62817 302159 -65465 -330201 7965 111066
124 111066 -79436 108785 210597 -147883 -188794 98111 -2933 -107483 179470 165762
134 165762 -177124 -105946 89905 -68106 -42384 205193 37079 -187722 20126 81699
144 81699 -130758 -12959 171335 -28772 -105521 91241 3134 -162223 37951 134395 -61604
155 -61604 -20312 110347 -74945 -147464 81214 95501 -46725 43630 64189 -134819 -83099
166 -83099 125899 37950 -57571 77425 31518 -142863 -32242 95499 -15606 -6939 102820
177 102820 -42728 -157925 31483 107070 -30653 -6455 47789 -72633 -53241 96397 19256
188 19256 -90998 30880 76794 -50574 -32854 46869 -28662 -29148 82414 11621 -92859
199 -92859 19458 77011 -44723 -48846 42955 7438 -12413 53038 -15238 -109065 10947 107346
211 107346 1572 -49980 -2194 -27527 -20609 65128 25764 -67351 -2637 58128 -27859 -46591
223 -46591 35190 24091 -9396 23900 -15070 -71745 18968 91320 -3853 -68210 -9798 16137
235 16137 9147 36114 -539 -66620 -7343 63360 4426 -41154 -314 7542 -7877 15610
247 15610 2482 -36792 6943 49951 -15293 -51934 10146 36558 10767 3057 -19055 -39241
259 -39241 13196 59056 6352 -45991 -18111 11957 11884 16898 -1923 -29963 -2995 25836 -2763
272 -2763 -19831 7491 15015 -4584 -9094 -9206 -9912 16144 27246 -14369 -36708 -2578 23713
285 23713 17535 1873 -15928 -19029 6628 25313 8861 -10857 -6129 -1297 359 6822 2550
298 2550 -3567 2634 -940 -12532 -4883 10915 10093 -3174 -10293 -9424 -1752 11604 10607 -5156 -10817
313 -10817 -6382 -709 9518 10518 -1966 -7824 -4498 -855 6031 13560 5689 -11946 -10619 5395
327 5395 9911 5588 -255 -9667 -7307 3820 4781 -1153 -2000 90 -1949 -5075 -3989 756 8368
342 8368 8938 -7873 -17375 -399 17495 14263 -3295 -16955 -9029 10779 18487 5242 -13013
355 -13013 -12726 4714 14291 4143 -10917 -6967 8693 5237 -8458 -7683 1590 8664 7828 -8758
369 -8758 -20760 -2497 21437 13228 -12422 -17712 -6009 9885 20878 2094 -24390 -7195 20838
382 20838 9687 -8898 -4236 -414 1884 13555 4133 -21427 -5211 24793 3761 -20607 -3232
395 -3232 7415 2404 8217 -4566 -28913 -2880 35492 9224 -25779 -9653 393 -2962 20692
408 20692 15827 -26062 -12986 26026 528 -23367 12037 20963 -8384 68 4549 -27281 -5359
421 -5359 43841 9863 -32155 -2317 8597 -14243 7982 20972 -20106 -13742 30282 -2658
433 -2658 -40380 7183 27193 -11150 3456 19500 -29109 -26067 34521 16267 -25550 13917
445 13917 24755 -30963 -18113 25043 -6272 -8062 42141 4267 -54327 -6639 28001 -11064
457 -11064 6226 39917 -20249 -46878 17490 13637 -28613 23056 43398 -33507 -35832 21206
469 21206 -7115 -21256 45477 31106 -44159 -14771 23859 -25839 -10084 57596 12296 -40862
481 -40862 7707 6274 -45491 7830 59843 -7978 -30405 22070 -16067 -54601 28687 55056
493 55056 -18420 -8738 22379 -43535 -44768 49939 39152 -25099 11604 15925 -59379 -25907 55166
506 55166 13773 -14025 40005 -3035 -76309 -4934 55198 -2224 2265 45522 -30689 -72320
518 -72320 22056 36582 -25586 22441 50546 -47232 -58355 26720 7261 -18895 55764 36370
530 36370 -69981 -36185 34204 -13971 -7006 68725 11003 -66073 -2049 18546 -42583 13783
542 13783 82146 -6946 -58779 9254 -6695 -44453 45535 70197 -36686 -38043 23404 -30223
554 -30223 -40934 60715 47592 -40368 -3864 15857 -62228 -21364 80625 22267 -39284 19044
566 19044 -2065 -69503 10195 72790 -10759 -20607 42152 -24180 -72130 30607 52679 -24071
578 -24071 10441 39095 -55371 -53927 49622 24473 -28753 34373 25519 -69022 -25396 49328
590 49328 -8814 -15193 58729 2593 -73486 935 38148 -26014 8661 62414 -23465 -60336
602 -60336 24713 15190 -36135 32602 51953 -42379 -34884 30893 -14928 -29508 52609 30216
614 30216 -51596 -7819 26075 -38021 -12486 61449 3353 -45464 17507 10449 -48481 10082
626 10082 57120 -16743 -27567 31494 -10553 -46131 31130 39662 -30275 -2603 31476 -32423
638 -32423 -31644 42510 15343 -32332 18867 20481 -46343 -11881 42968 -8155 -22695 32871 2315
651 2315 -46628 7755 31960 -22092 -5800 36409 -14116 -36111 23093 15384 -26440 14015
663 14015 29885 -27749 -18982 29474 -2321 -23428 25410 15536 -33058 -543 25664 -20288
675 -20288 -13279 32903 651 -29866 11919 14019 -25009 2421 28719 -14705 -19707 22674 2607
688 2607 -24913 12241 18324 -19072 -2224 21396 -12375 -16302 24135 9304 -22982 5163 16030
701 16030 -16848 -4686 21665 -8604 -19246 16715 8634 -21115 311 15607 -11006 -7031
713 -7031 15445 -5576 -15367 15143 9689 -18600 -2021 13930 -5962 -4557 13035 -4222 -14981
726 -14981 12042 12463 -14327 -3573 13807 -4094 -7523 9242 -1178 -11483 8640 10437 -13565
739 -13565 -7956 11017 1 -6825 6122 -1190 -10370 7365 9304 -11419 -6526 10881 2303
752 2303 -5681 4369 -82 -8657 6091 10948 -7683 -6813 8054 2330 -5567 2030 2009 -4104 2882
767 2882 5169 -7548 -6577 7348 4027 -4507 -587 -1104 -4840 3193 6313 -4695 -5961 4653 3243
782 3243 -3829 652 2527 -2574 517 4028 -2678 -2721 4650 2999 -2949 -1183 1169 -305 1126 2112
798 2112 -3265 -3236 2986 1709 -1952 -463 -702 -2798 -201 2411 17 -1905 -2 -188 -1162 1599
814 1599 2628 -676 -1399 -35 833 1622 1389 -532 -359 847 240 -1483 -67 1796 14 -1126 -1697
831 -1697 -2241 709 3680 -71 -4668 -3741 1417 4342 1298 -3445 -4018 93 4352 1877 -2358 -2177
847 -2177 646 2585 1633 -1765 -1961 2308 4140 121 -5450 -2022 5282 4615 -1504 -5739 -3857 3228
863 3228 6084 960 -6197 -5866 2734 6674 145 -5430 -3631 1605 4949 1161 -5130 -2659 4244
878 4244 4514 -2954 -4829 1205 4931 4267 -302 -7755 -4942 8351 9326 -3657 -9435 -2266 3799
893 3799 4438 1755 -5140 -6862 3846 7221 -4242 -6132 2594 4251 1206 -561 -5056 -4757 7537
908 7537 9225 -6588 -8780 4417 5959 -165 672 -3993 -6108 7747 11073 -6703 -11420 3341
922 3341 5794 -501 2577 -1097 -9590 954 7929 -5717 -6327 9319 4143 -8682 -2619 1097
936 1097 -3962 7714 13718 -9057 -15420 5730 7745 -3163 4826 4902 -9995 -3234 10034 -3434
950 -3434 -7608 11248 6963 -11216 -1617 5329 -7926 -182 13741 -3518 -12064 7496 4223 -13914
964 -13914 850 13192 -5131 -4017 11395 -6129 -16274 9933 12550 -7363 2069 9251 -14081
977 -14081 -12244 15380 7950 -7167 7791 2525 -21575 -2909 19235 -1354 -6735 12270 -2926
990 -2926 -21030 3671 13733 -7096 2336 15852 -13554 -21336 12691 11649 -8677 5865 9061
1003 9061 -16862 -6264 17104 -4426 -13381 17536 12280 -17860 -4426 7432 -11710 1633
1015 1633 25658 -3592 -24240 6322 9328 -16084 2319 20240 -7034 -9411 11308 -10895
1027 -10895 -22060 20277 26325 -13551 -12372 4294 -12505 -3235 28473 4476 -24056 5886
1039 5886 12999 -19802 -5544 22952 405 -8997 12456 -7303 -27632 12956 29094 -12219
1051 -12219 -14016 12082 -6506 -12749 17511 4247 -21599 9598 22642 -18754 -19003 15821 3716
1064 3716 -7550 17644 2591 -28665 2249 25157 -10804 -11778 20889 2673 -19576 6484
1076 6484 5415 -18565 9496 28938 -15978 -26302 12565 6908 -10278 14177 8710 -25541 -3385
1089 -3385 23332 -9336 -16317 20133 7389 -20299 4574 10917 -17822 1512 25916 -9481
1101 -9481 -22430 15394 11141 -16609 4293 13122 -16477 -3818 23107 -7010 -21983 13255
1113 13255 11231 -16242 3320 14213 -16316 -8785 20816 -1940 -18163 13693 10999 -19941
1125 -19941 -804 17973 -9255 -8093 18277 -2107 -20462 11242 14831 -15177 -1860 15415
1137 15415 -11542 -11595 19067 3646 -17445 6294 9105 -16998 -476 20204 -7378 -16051 11590
1150 11590 3426 -14904 8805 13199 -15558 -6027 16161 -5070 -12707 14179 8078 -14973 1176
1163 1176 9776 -11124 -1434 18302 -4886 -17125 9314 9267 -11031 1100 8915 -10710 -3596
1176 -3596 16772 -3254 -18027 6945 11123 -8799 -517 7936 -9150 -5155 13790 -831 -13436
1189 -13436 8023 12061 -10364 -6258 6526 -3154 827 14691 -3699 -19411 3500 14215 -3565
1202 -3565 -3474 5208 -6325 -5629 10771 668 -12783 4836 11788 -6995 -8700 4192 362 -407
1216 -407 8779 -1905 -14098 3236 13420 -3175 -7219 3094 500 -660 7230 -1210 -12110
1229 -12110 2216 13016 -1216 -7843 1613 554 -2369 5099 883 -8001 1820 8632 -4125 -9155
1243 -9155 2503 5100 1006 2091 -3112 -9653 1936 11722 250 -7220 -49 1819 -523 3180
1257 3180 1760 -4776 -82 6677 -1358 -6391 1820 4260 -559 -780 -1493 -3669 1161 5887 -1166
1272 -1166 -6394 -307 3906 576 93 -364 -3748 -79 5148 867 -4166 -80 2153 -602 -23 2153
1288 2153 -226 -867 1858 -558 -2282 1566 2688 -500 -1722 -565 -654 156 2093 224 -2632 -939
1304 -939 948 -449 671 2023 -933 -2426 12 1283 953 667 -299 -1791 -257 2441 1453 -1182
1320 -1182 -933 232 720 506 -338 -710 620 1210 -952 -2495 -251 1971 1150 -1060 -2692 -1583 1795
1337 1795 3215 -61 -3729 -2192 2111 3193 193 -2566 -1744 1438 2979 106 -2103 -647 1671
1352 1671 1842 -723 -2722 -796 2937 2671 -2009 -4519 -816 3878 2664 -1677 -4190 -1951 2919
1367 2919 3783 -788 -4175 -1427 2745 2893 -950 -2690 -892 2696 2894 -1487 -3351 522 3887 1672
1383 1672 -2286 -2915 43 3171 3175 -1966 -5140 -229 4610 1871 -2780 -3018 -627 2104 2874 -965
1399 -965 -4088 -375 3785 1186 -2384 -1154 512 1354 1650 -1645 -3680 1372 5411 850 -4121 -1587
1415 -1587 1369 1908 2559 -140 -4711 -1284 4048 356 -3100 -118 1093 -615 570 78 -3521 -217
1431 -217 4617 -136 -4210 439 2027 -1403 1189 1828 -2955 -767 4804 373 -4819 1128 3461
1446 3461 -1159 262 2331 -3619 -2679 3966 1397 -3634 1130 2228 -3993 -1353 3703 -1170 -2069
1461 -2069 4092 118 -5945 979 4563 -2682 -809 4635 -2252 -4852 3674 2850 -3824 1795 4285
1476 4285 -4869 -2746 5460 -208 -4115 3641 2526 -5569 190 4125 -4640 -2165 6880 -206 -6974
1491 -6974 2019 3064 -4718 1176 5994 -3910 -4306 6191 469 -6913 3195 6015 -4375 -1371
1505 -1371 4245 -4340 -3693 8492 2565 -7832 466 4766 -4774 -961 6835 -2802 -5160 6388
1519 6388 1591 -9246 974 8123 -3325 -3185 4492 -3083 -5542 7344 4404 -8736 -252 7374
1533 7374 -3642 -3792 6441 -740 -5404 6517 3678 -9777 -790 9059 -2446 -4874 5703 -947
1547 -947 -7165 5524 5553 -8804 -1776 8871 -2777 -6519 5394 1559 -6375 4875 5250 -9079
1561 -9079 -2743 9478 -790 -6374 5155 1530 -7554 3462 6923 -7239 -3180 9593 -1116
1574 -1116 -8689 4808 3863 -6220 2223 6231 -7608 -5333 9147 724 -7739 4370 3963 -8352
1588 -8352 468 7690 -5320 -4141 8923 -83 -9221 3461 5496 -6062 608 8312 -5427 -6505
1602 -6505 7555 2184 -7739 3803 6144 -7342 -2875 6953 -3223 -5415 7923 2363 -9268
1615 -9268 905 5734 -5712 -1500 8749 -2032 -7719 4999 2820 -7382 2633 8253 -5279
1628 -5279 -4608 6661 -1230 -6319 6306 5109 -6988 -523 5643 -5132 -3939 8182 1453 -7381
1642 -7381 3116 3121 -7335 272 8117 -3156 -4782 5427 -307 -7993 3670 6383 -5205 -1261
1656 -1261 6137 -4371 -5552 6727 3410 -5577 2181 4206 -6225 -2477 6622 -968 -4176 5349
1670 5349 1046 -7865 270 5819 -3222 -1533 5776 -2490 -6767 3686 3558 -4778 1132 5567 -4321
1685 -4321 -4334 4652 191 -3800 4780 3478 -6073 -1688 4616 -2142 -2076 5681 262 -5653 1948 2885
1701 2885 -4490 40 5774 -2076 -4145 2591 188 -4216 2990 4231 -3694 -1918 3294 -1947 -2945
1716 -2945 4021 2105 -3477 732 2220 -3368 -1171 4724 223 -2962 2017 754 -3961 926 3872
1731 3872 -1955 -1579 2506 -1158 -3642 1918 2174 -2445 87 2125 -2360 -2059 2647 279 -1812 1750
1747 1750 1201 -2763 -522 2581 -808 -1154 2312 -114 -2727 1125 1772 -1288 35 2151 -689 -1915
1763 -1915 1036 569 -1474 901 1375 -1907 -987 1273 -398 -912 1148 487 -1494 333 983 -1047
1779 -1047 -296 1791 69 -1629 616 629 -941 558 1546 -520 -687 654 418 -817 549 652 -613
1796 -613 -612 559 -580 -506 699 39 -442 123 340 -504 -296 607 189 -518 466 123 -549 397 897 -188
1816 -188 -444 270 169 -292 129 -196 -320 517 353 -571 -408 377 326 -97 11 -349 -253 99 204 -467 -682
1837 -682 518 660 -122 -221 -64 46 380 106 -253 -498 476 778 112 -502 -271 418 624 53 -570 -555
1857 -555 454 671 -261 -655 -503 128 603 -73 -1110 -735 563 641 -263 -825 -161 449 810 344 -933
1876 -933 -483 497 852 -55 -547 -304 360 860 147 -796 -356 1028 728 -442 -855 191 462 468 112 -943
1896 -943 -775 785 852 -714 -829 -50 484 684 51 -850 -439 1141 1044 -958 -957 238 178 243 238 -891 -848
1917 -848 912 1033 -940 -1053 698 306 -431 -167 -329 -791 678 724 -862 -823 732 403 -236 55 -41
1936 -41 -899 712 1160 -1010 -815 1014 403 -641 447 407 -970 -87 1007 -890 -1149 1030 172 -911
1954 -911 578 621 -1261 -318 1200 -774 -906 1094 354 -1658 502 1084 -1378 -225 1596 -411 -1261
1971 -1261 1456 573 -1342 624 1871 -1286 -1140 1517 413 -992 866 379 -2019 436 2019 -1436
1987 -1436 -1505 1986 242 -1546 899 527 -1885 537 2534 -1512 -2485 1677 1275 -1637 947 932 -2099
2004 -2099 310 2835 -1333 -2412 2370 1344 -2091 -250 718 -1914 479 3138 -1282 -3470 1683
2019 1683 1796 -2237 -163 1916 -1738 -247 2522 -1817 -3440 2758 3219 -2047 -1004 1064 -1526
2034 -1526 4 3550 -959 -3829 1616 2364 -2747 -1013 1984 -830 -759 2416 -1156 -4168 1952 3719
2050 3719 -2230 -1861 1756 -1160 -1201 2856 -115 -3317 1982 3523 -2604 -2197 2304 470 -482 2797
2066 2797 -92 -4362 762 3971 -1657 -1860 2378 -385 -2499 1759 497 -2924 1594 4196 -2667
2081 -2667 -3481 2026 982 -1621 2113 971 -3752 -153 3783 -1288 -2357 3132 886 -2961 978
2096 978 1268 -2793 489 4192 -1595 -3362 2096 1155 -2735 1825 2445 -2833 -971 2883 -1679 -3106
2112 -3106 2741 1795 -2659 377 1562 -3066 -874 4184 53 -2731 2010 880 -3564 537 3499
2127 3499 -1554 -1318 2488 -554 -3124 1885 2412 -2312 -87 2574 -2275 -2472 2691 957 -2160 1318
2143 1318 1193 -3236 -358 3640 -965 -2116 2172 370 -2682 739 1657 -2528 54 3387 -969
2158 -969 -3234 1550 1925 -1693 782 1754 -2600 -530 2862 -701 -2962 1678 1984 -2140 -550 1013
2174 1013 -2137 91 3435 -777 -3743 948 2055 -1397 50 1373 -1629 -1000 2653 -305 -3047
2189 -3047 1445 2882 -1319 -1343 538 -1167 21 3190 -454 -3563 384 2596 -654 -1166 975 -815
2205 -815 -382 2281 -504 -3102 471 2886 -642 -1527 594 -584 -621 2209 235 -2764 729 2751
2221 2751 -743 -1844 634 465 -81 1520 -398 -3093 440 3042 35 -1616 167 -408 -932 1262
2237 1262 453 -1607 401 1812 -749 -1988 479 877 -114 692 -356 -1990 501 2440 -42 -1566
2253 -1566 248 289 -262 698 288 -1223 118 1888 3 -1514 45 422 -299 228 316 -931 -251 997
2271 997 -397 -1253 461 576 -309 -101 44 -674 160 1285 328 -998 -40 369 -252 31 1038 -335
2289 -335 -711 174 -101 -299 183 409 -806 -470 302 -56 -354 247 122 -262 173 232 -306 118 673 -156
2309 -156 -613 274 465 238 -118 -48 -920 263 1107 350 -819 -340 99 439 158 -379 -479 -72 600 83
2329 83 -587 -218 363 347 -225 -786 -564 513 923 -51 -1115 -504 978 1170 72 -771 -473 448 985
2348 985 593 -770 -685 487 770 2 -939 -355 441 537 -464 -1359 -369 1012 833 -543 -1243 -356 941
2367 941 1103 -55 -1351 -960 980 1201 -285 -783 -304 563 825 -292 -1152 -221 706 624 -325 -858 82
2386 82 950 706 -698 -1328 -187 1108 698 -352 -1183 -532 861 974 -68 -1084 -500 950 464 -272
2404 -272 -604 -21 299 414 -324 -610 53 1041 235 -669 -640 262 578 375 -426 -1360 -196 704 368 -726
2424 -726 -665 -87 167 7 149 -546 -47 383 191 -323 -126 288 -22 59 85 -491 197 670 101 -723 -106
2445 -106 439 111 262 326 -319 -610 599 274 -425 121 99 -520 -117 532 90 -516 408 -192 -498 437
2465 437 567 -336 -194 637 76 -408 303 407 -373 294 365 -798 -412 804 37 -951 -142 269 -416 207
2485 207 344 -1378 -506 1232 397 -906 -117 -84 -285 249 719 -450 -347 1064 1 -1036 195 943
2503 943 252 235 60 -1075 -306 1369 593 -1258 -465 511 -47 71 387 -781 -757 1197 147 -1409
2521 -1409 -568 1207 198 -202 477 -721 -785 1190 675 -1468 -8 1453 -30 -592 85 -536 -519 1651
2539 1651 763 -1706 -865 1058 -262 -462 671 -212 -1069 335 487 -1471 -291 1721 114 -1435
2555 -1435 -218 36 -600 1240 782 -1243 -696 1283 379 -813 401 314 -750 769 634 -1440 -883
2572 -883 1443 332 -944 387 418 -974 357 1037 -816 -262 1406 493 -1428 75 687 -743 571
2589 571 967 -977 -1112 1098 508 -887 734 699 -1342 -584 974 -346 -880 1347 534 -1500 -129
2606 -129 855 -1025 -269 991 -527 -723 626 17 -1375 339 1071 -821 -393 1154 -558 -1450 753
2623 753 844 -923 327 950 -1358 -919 1278 355 -883 664 474 -1318 -182 829 -491 -540 1112
2640 1112 51 -1609 -49 724 -913 79 953 -550 -1010 1217 459 -1092 449 924 -738 -257 987
2657 987 -656 -971 1078 855 -1053 -48 198 -767 -133 930 -217 -645 884 157 -1230 -68 1021
2674 1021 -172 -365 249 -627 -1283 666 1327 -501 3 1052 -370 -690 743 -75 -335 869 818 -1116
2692 -1116 -475 634 99 -386 657 -217 -926 378 642 -803 -522 873 11 -620 175 -254 -572 496
2710 496 927 -476 -600 522 -128 -427 633 530 -429 302 199 -843 -289 821 504 -455 228 -146
2728 -146 -735 498 937 -423 -809 574 -254 -680 82 332 -178 -19 473 -706 -619 538 139 -403 399
2747 399 241 -302 148 363 -230 -454 701 505 -487 -183 198 -300 -138 516 -206 -596 25 234 -354 -34
2767 -34 308 -240 -277 -158 -178 -342 518 186 -215 -152 140 -280 -422 518 38 -217 7 -28 -119 -65 253 -102
2789 -102 -265 353 8 -147 99 100 -69 -222 -11 -161 -189 185 175 64 196 -66 -146 76 103 -113 51 100
2811 100 -1 -30 -80 -94 113 -7 12 63 -216 37 40 -73 134 -13 -199 58 95 -150 268 -105 -178 59 -116
2834 -116 166 -240 72 162 228 -39 16 194 241 -31 133 248 -82 62 75 -304 -81 -12 -149 -197 -144 95 -155
2857 -155 134 89 -149 -77 -222 20 -115 -104 66 -101 37 179 228 -133 80 111 -79 35 33 68 80 -19 -52 -265
2881 -265 -137 117 87 67 -10 -82 -100 65 -1 -250 -76 2 80 -64 -71 -94 39 198 -59 19 -43 92 -69 -127 -89
2906 -89 90 205 147 208 137 -222 -61 12 31 -9 -154 -87 194 -384 107 -76 -257 -325 -155 37 103 -167 117
2929 117 18 -19 44 210 219 114 -2 -270 -68 194 126 -199 -56 67 18 -73 66 -245 -24 45 45 -128 -191 148
2953 148 -134 -7 154 30 -136 283 -97 30 228 186 283 100 5 -197 295 310 111 -77 -38 21 -436 141
2975 141 414 -47 -93 -6 -310 -243 256 410 -283 -117 118 20 -136 -276 83 -71 388 63 -304 169 277
2996 277 -37 -197 253 252 -104 -116 -236 -332 83 532 -271 -451 -25 202 84 37 82 -242 -336 159 -329 -426 682
3019 682 250 -50 77 -110 -429 195 517 4 -362 -15 253 -207 -313 221 63 279 392 -247 -644 148
3039 148 403 -3 191 -140 -360 16 317 -214 -220 284 633 -608 -414 45 360 398 501 -25 -900 -225 318
3060 318 43 -20 648 137 -425 -83 -278 51 486 756 -293 -739 -132 181 14 320 148 -615 -55 329
3080 329 -308 -336 354 159 -51 -220 -296 -831 3 726 43 -47 -137 -131 -314 208 150 -243 349 385 -786 -646
3102 -646 281 405 179 319 -40 -691 -524 198 120 97 293 -49 -681 -239 395 -160 274 524 -187 -649 247
3123 247 221 -136 192 292 -267 -296 -9 -142 -175 187 461 -480 47 239 -292 -296 185 235 91 274 -366 -747
3145 -747 -112 843 114 274 -230 -166 -281 149 593 -94 40 299 -602 -860 162 555 154 101 83 -633 -140
3166 -140 661 110 -337 -14 173 -37 -104 -190 -308 30 681 -119 -762 129 413 -148 56 228 116 21 434
3187 434 -172 -815 355 789 112 -486 -661 -500 347 603 210 -481 -271 -123 110 -149 102 -21 52 285
3207 285 -264 -489 252 842 321 -234 -211 -324 -48 341 -14 -352 -10 421 -16 -273 -161 -201 21 324 143
3228 143 -184 -318 222 152 -123 67 68 -320 -93 -183 -280 191 552 176 -579 -177 158 200 581 42 -450 -169
3250 -169 270 -70 -32 -24 -110 -217 -2 15 -174 230 88 -174 -257 21 296 191 -86 -165 -193 110 258 114 -231
3273 -231 -202 167 -38 231 82 -185 -224 -231 196 91 214 244 -116 -158 204 257 -193 126 -105 -277 -162 -47
3295 -47 -136 266 83 -151 -165 21 245 231 348 -360 -270 -173 399 296 -124 -216 23 219 38 27 -260 -82 198
3318 198 38 -247 -263 -117 -94 -197 -157 -138 156 336 -227 -411 -264 132 244 272 -275 -442 54 327 96 -303
3340 -303 -319 101 160 114 -243 -396 452 217 25 -473 -159 125 186 -232 -461 -285 340 483 -146 -410 -461 268
3362 268 561 194 -208 -286 33 449 214 -359 -256 421 108 -435 -273 348 522 223 -96 -457 -86 341
3382 341 406 -221 -341 -269 248 464 -73 -598 -229 3 163 396 -13 -238 -44 320 -63 70 -86 191 -132
3403 -132 -162 -193 -173 327 236 -294 -328 -175 217 163 -128 -440 -343 104 154 45 -252 -55 -237 -208 -42 303 199
3426 199 -183 1 4 -30 164 387 48 -16 22 82 183 221 -29 -140 -133 21 253 32 -38 -289 -189 50 324
3449 324 34 -51 -339 -283 -117 233 190 -13 -169 -149 -225 31 98 188 -108 41 -169 -85 -74 302 -4 -276 -230
3472 -230 -36 295 216 41 -270 213 272 310 -44 -386 -271 58 25 140 -126 -128 -154 -160 -111 -84 191 550 137 -205
3496 -205 -228 113 698 367 -111 -155 69 127 106 101 -277 -476 131 66 -298 -2 -5 108 54 -102 -229 21 485
3519 485 55 -120 -86 191 324 100 -152 -519 210 463 343 -171 -675 116 222 373 103 -205 -131 -18 113
3540 113 -160 -66 498 128 154 -228 -90 314 716 5 -460 -470 78 122 290 -23 -189 59 -47 -161 -347
3561 -347 -159 220 360 216 -85 -82 -160 152 -26 -204 178 -216 -73 -300 -248 28 191 156 61 -304 -315 -34
3583 -34 207 184 108 -117 -161 -160 11 179 298 139 -195 -449 -121 -138 417 103 152 -149 -187 -219 -79 31 259
3606 259 74 -108 -29 -183 -18 -43 375 -149 -113 -7 -510 -187 103 453 280 34 0 -363 -125 39 84 349
3628 349 196 -364 21 -100 66 232 259 132 -25 -345 -70 -25 237 167 -277 -194 -157 120 72 -63 21 251
3650 251 246 -95 -282 -64 186 -2 -13 83 17 232 -1 -109 75 29 182 36 -165 -518 119 283 264 39
3672 39 -618 -413 -142 326 122 -138 -123 -38 -103 -222 -115 92 503 94 -244 -228 -79 286 35 -270 -216 -106
3694 -106 71 169 -34 -310 -48 205 403 108 -261 103 68 6 0 -59 -183 119 -190 -15 -260 83 141 239 -145
3717 -145 -350 -29 123 -225 84 38 -519 102 3 -40 -264 95 -63 -162 -29 -230 74 -37 31 -59 -114 -215
3739 -215 455 -55 -41 -114 -140 -22 47 -198 163 96 210 87 44 11 7 23 148 -25 -100 -44 -176 -283 -29 -133
3763 -133 -127 -32 -17 28 -161 242 -58 -48 -273 -25 4 100 73 84 109 217 -52 61 75 43 168 -71 218 30
3787 30 208 36 -143 -104 67 120 -289 -37 -85 -32 -174 94 376 85 533 -74 -36 -170 225 60 6 -153
3809 -153 -19 -213 138 -25 65 -127 -60 -85 -23 -147 -167 -217 162 8 -44 -126 52 283 -105 102 127 197 58
3832 58 164 -7 46 12 362 131 -33 -54 59 13 -75 105 -14 -128 321 66 -18 38 73 36 -103 27 180
3855 180 -52 58 152 -221 -126 -318 51 -35 -75 355 230 -11 207 9 119 101 -35 -24 -73 -87 168 14 10
3878 10 98 -154 320 -179 -234 -122 63 153 148 -11 -4 -132 113 5 -307 124 8 -59 -200 -53 104 -100 -197
3901 -197 132 30 -134 -13 -46 -158 -71 73 161 -113 27 -103 37 126 -121 11 -80 -214 40 -59 41 275
3923 275 88 -158 -12 118 75 146 -21 44 -99 109 163 41 -44 124 -17 -327 114 -71 80 -79 131 241
3945 241 146 2 148 153 -90 37 -106 -22 94 4 -226 -228 251 276 51 14 -83 61 -47 243 -76 43 -52 71
3969 71 1 8 -24 -195 176 149 -62 -126 77 -36 18 1 -155 -65 118 23 -12 -326 39 -65 -106 -176 -66 67 54
3994 54 -24 -22 -172 96 42 61 -109 57 -32 59 -62 -28 97 43 47 -115 115 128 66 241 169 212 -109 39 -91
4019 -91 -50 121 69 199 -40 -27 -259 -202 -86 78 7 142 -168 -307 -130 150 -112 -102 279 -79 -87 33 -108
4042 -108 -29 45 181 75 42 94 -27 59 443 55 -146 59 338 76 -129 365 82 154 118 -9 -243 7
4064 7 82 12 -237 -248 -117 48 262 138 -250 -117 163 -72 -20 127 -14 -36 69 104 -185 162 -86 -239 -37
4087 -37 -10 -109 -214 -248 147 -206 176 131 73 -71 -52 23 -222 173 59 -299 -183 64 18 -53 72 22 -329 -123
4111 -123 -112 -42 23 -153 -120 -259 55 -17 -180 175 253 -126 226 165 69 67 100 -74 -240 -42 158 225 -191 153
4135 153 11 53 288 151 -307 9 148 -67 -193 -51 180 -395 -72 -31 -348 173 296 -321 -192 151 37
4156 37 -199 77 -115 -216 -179 87 16 -358 -51 151 123 76 16 -167 -10 354 190 -75 237 279 14 27 144
4179 144 -54 263 121 -178 -383 -30 5 -78 266 -75 -170 -40 104 -13 -249 59 288 -188 -131 -281 132
4200 132 284 121 -128 -21 4 -104 59 43 -71 -8 -288 41 -16 -25 176 37 81 159 -5 -138 75 93 276
4223 276 125 -31 -32 4 -221 355 198 81 99 263 -323 -302 139 150 6 282 -35 -174 153 140 29 45 157
4246 157 38 -71 91 94 57 113 -179 12 147 -96 95 -194 26 13 -19 -155 108 -38 40 292 -141 180
4268 180 -79 -155 -212 -152 458 -46 -19 -175 -257 102 243 304 113 54 -56 -72 -33 114 126 -101 -79 -103 -160 36
4292 36 218 150 -128 -248 69 105 294 207 -49 -95 140 -66 -70 -185 140 144 196 -130 -291 -93 271 112 -41
4315 -41 -87 214 201 102 -105 -186 300 -84 11 -132 -164 -32 83 75 81 -335 195 201 -230 -44 -13 158 23 26 -111
4340 -111 -165 -31 145 89 -135 48 10 -81 121 -210 -297 -65 272 11 -163 -24 76 -144 -48 -58 39 -46 70
4363 70 -50 -152 -33 112 77 -25 -165 0 113 16 122 -221 -65 6 24 99 -108 -148 -37 167 -51 102
4385 102 178 93 43 17 -290 -66 48 79 -13 139 16 77 286 -23 14 -84 173 209 157 -147 45 170 84 -137
4409 -137 14 78 191 139 159 69 97 127 148 22 -75 155 81 -78 22 8 44 -92 14 189 -106 -76 117 223
4433 223 292 53 79 -247 53 116 -352 66 -437 40 67 134 51 48 -107 -130 136 -207 -146 -96 15 -49 8 -188
4457 -188 -23 -116 -60 -138 93 9 332 56 46 -10 13 12 238 -214 -42 -97 -169 189 149 -58 256 207 -44 -145
4481 -145 -140 -118 190 13 -49 196 -48 -149 80 97 -117 102 28 95 103 -44 260 -112 45 -38 37 -173 172 147
4505 147 -180 152 94 149 150 -77 172 -7 203 269 -75 -152 53 -102 164 119 -130 -82 126 386 -101 -127 275
4528 275 -79 -236 -29 -136 -96 117 218 -62 -16 86 -64 -81 -30 -47 -32 77 20 100 -268 -53 31 -15 87
4551 87 -176 -5 19 -29 -44 1 131 -307 -412 -37 178 8 90 -242 -186 -42 192 56 117 83 89 101 219 274
4575 274 -39 37 121 105 -143 101 181 38 -51 -65 -88 24 59 -111 -146 81 82 -93 -163 -164 -165 -160 12 -108 -299 -37
4601 -37 -71 -211 -42 4 -136 -130 -88 -217 -121 240 274 -126 -151 -99 -280 22 194 348 -2 73 -67 -77 -74 -48 -118
4626 -118 -177 -105 90 -157 -20 36 -40 -45 214 78 -98 -222 -62 54 187 -61 -486 -92 124 -38 140 87
4648 87 228 -156 -55 306 -169 -126 292 407 -286 55 -37 -3 -48 231 -208 -218 28 56 47 73 412 -19 28 -35
4672 -35 -4 48 105 52 -277 -293 -45 131 -160 496 -217 -111 116 162 -134 -14 -13 -13 29 -34 -174 -142 344 147 81
4697 81 5 217 -326 17 163 35 -26 162 -94 -375 90 181 68 274 332 -163 -100 14 416 -225 -128 330
4719 330 -191 -311 -217 216 -153 55 95 -128 35 196 66 -277 48 -154 -178 161 247 -73 1 214 137 -264
4741 -264 7 4 -288 -85 383 -308 -73 -144 -134 -162 348 59 -160 -46 98 -112 -166 273 -221 -45 15 0 -237
4764 -237 99 16 -16 -33 10 20 -150 192 138 -218 -38 202 -50 -233 91 231 64 232 -77 -99 149 39
4786 39 -122 66 117 63 -185 -15 275 -78 62 70 -44 68 -55 121 -172 -116 53 -226 -98 44 89 -232
4808 -232 131 44 -66 58 -22 -16 103 173 334 51 -142 -241 -71 -114 136 -46 -145 33 -118 -122 -93 -15 -109 -66 95
4833 95 91 -59 169 86 -74 -98 10 -124 43 220 -18 -60 89 139 -103 6 85 309 -168 50 -9 34 -342
4856 -342 87 -22 -45 -45 -90 -83 124 63 -218 143 -93 -130 -209 54 65 77 175 77 -93 -60 -10 -120 -138 100 10 40
4882 40 105 -11 15 10 75 210 -318 -119 -9 -137 -68 123 24 163 86 35 135 -75 -150 -208 -50 -8 -77 120 -135
4907 -135 -110 82 -21 81 45 -80 -106 -11 -130 -20 137 -168 -73 77 163 118 18 -250 -2 66 73 -11 -301 -221
4931 -221 -56 -215 128 -24 115 185 -224 -32 -254 -88 -97 143 -14 37 -95 122 -29 216 12 -329 -29
4952 -29 -29 91 113 -24 -217 6 -88 -116 237 376 202 -67 -85 88 165 74 10 174 146 -37 -4 69 55 -24 -13
4977 -13 0 64 15 -246 -103 1 191 -27 -191 -45 56 -11 -76 -37 -35 -343 32 -67 -77 -20 35 -36 -130 154 -10
5002 -10 51 -67 2 -109 93 115 -50 41 58 -87 99 38 67 -59 -19 -235 -62 -14 -76 -280 183 -105 98 -50
5026 -50 -209 212 -31 -172 240 58 79 269 -53 -82 -54 -69 -138 -118 306 34 -129 4 -11 -174 80 35 -139
5049 -139 20 -102 301 41 286 105 -261 189 134 -137 -32 236 -117 -142 231 51 -219 85 -2 -45 1 151
5071 151 -58 -178 89 183 197 -36 42 -144 89 58 399 -145 95 202 -202 170 -24 -257 -10 -157 293
5092 293 -146 -23 -52 -471 -51 244 -29 76 142 -115 -287 -99 105 104 -22 261 291 24 -46 113 -289 255
5114 255 9 -234 19 247 -61 145 193 -62 -338 57 75 -88 -28 123 22 -127 145 -83 220 -38 50
5135 50 -206 -17 339 138 -133 248 111 -65 -117 160 -116 -81 260 -119 -78 25 -8 -150 -52 196 72 -196
5157 -196 -24 14 -58 -130 353 -57 12 254 -105 -6 144 174 -248 109 208 151 11 281 -10 239 -44 40 -57
5180 -57 1 250 -134 -241 158 -209 -252 152 -43 -346 -100 -39 -246 -311 51 141 -205 11 -175 -142 96 156 -116
5203 -116 -110 130 -207 -61 52 113 124 46 354 65 -52 236 -234 -237 217 85 31 -121 72 -8 -189 58 191
5226 191 -55 -27 6 -144 139 335 -13 -44 25 42 -608 -227 72 79 -91 -32 69 -77 124 231 95 -129 135
5249 135 -69 -87 114 -45 -41 -33 -114 -276 -98 -267 -27 48 129 85 -318 -231 459 111 -117 339 -159 -276 -68
5272 -68 183 82 258 131 -133 27 98 69 -121 31 268 -146 -203 51 -30 130 356 197 -144 -86 25 -154
5294 -154 34 217 76 -127 120 53 -303 198 196 91 155 -39 53 117 -97 216 -300 241 49 -124 -59 -107 34
5317 34 108 22 -98 -159 116 -235 177 -314 122 -83 -63 302 -14 71 36 215 -59 -217 20 -25 -186 34 -31
5340 -31 -96 -417 153 -168 156 -117 226 28 259 100 71 -8 322 280 3 137 138 -93 -126 94 83 61 39 129
5364 129 41 -13 -201 -100 -216 -352 2 -169 169 80 -128 216 -37 -130 -162 31 -55 -180 50 70 -153 179
5386 179 20 50 -126 106 16 202 -37 8 -5 202 -2 -34 215 -55 25 55 27 -41 -39 28 -167 -4 145 -57
5410 -57 229 -312 -44 -6 -198 88 -34 117 72 54 -145 -25 -38 -9 -158 -194 27 -53 93 16 -107 -160 -113 -55
5434 -55 -89 42 6 -43 197 146 214 55 274 -1 47 -62 62 -158 49 48 -91 -57 -207 242 -270 -165 -239 90
5458 90 22 -202 37 -26 29 102 -14 -10 -213 -150 -243 82 90 265 95 132 -4 42 18 143 127 171 38 -23 107 13
5484 13 75 -218 56 -126 152 47 123 -72 -155 75 310 -48 33 55 34 3 2 -169 -95 51 -165 -10 0 -107
5508 -107 10 -39 -231 -134 -138 86 51 -288 -119 234 30 -97 149 14 177 -99 -92 -47 -206 145 57 128 -162
5531 -162 -82 180 28 59 16 55 158 -50 -47 16 83 -30 63 155 -79 -67 85 -159 -49 -62 -150 -63 -17 32 8 104
5557 104 53 -95 134 218 -38 32 137 -72 -300 60 172 -6 -15 -76 -123 90 89 318 65 -79 5 -18 73 135
5581 135 4 -48 -77 174 269 184 155 -142 -303 135 57 147 1 442 -51 -211 -12 -122 -48 222 -176 -94 166
5604 166 -74 16 -91 -36 201 45 -162 -63 45 -75 -72 201 76 76 38 -159 42 65 70 76 47 324 -49 5 -101
5629 -101 140 183 -120 -19 -182 46 -20 -264 153 -91 -162 192 162 298 75 163 7 -159 128 -228 -248 -39
5651 -39 147 -109 -72 -5 244 -99 -78 -151 56 -275 111 56 68 227 -234 -148 33 155 -267 -38 211 54 -63
5674 -63 30 251 23 -129 -2 92 74 160 -124 -148 95 32 -117 44 -86 -40 120 -53 178 -82 143 151 -87
5697 -87 -88 71 -144 52 -62 186 -182 103 -39 59 51 -75 87 -236 133 -3 -59 -20 -113 -125 13 -36 13 -12
5721 -12 256 84 -109 23 45 56 -69 63 -38 94 -13 10 -97 -118 -19 -231 74 -368 -38 -193 -233 84
5743 84 -411 101 194 30 -109 45 56 -309 82 201 77 84 53 -236 -208 -1 -36 -29 24 38 -211 -101 55 130
5767 130 -293 -74 46 29 -125 158 80 60 169 123 -70 163 31 102 63 154 15 -191 -34 -59 -15 101 -85
5790 -85 36 9 25 153 -64 103 100 71 -149 -65 -27 -64 -64 -90 76 354 0 167 -42 127 -212 -213 -143 -47 -106 31
5816 31 18 124 117 226 -171 -27 10 13 116 85 -265 -127 -184 -132 79 -194 140 -105 -127 -53 189 108 -247 -142
5840 -142 -25 -226 49 232 -127 57 -15 -115 85 -17 280 -208 -34 -57 -293 -52 -185 115 14 94 -274
5861 -274 -28 43 -54 49 -187 70 60 -65 -95 25 36 -77 202 111 91 28 -18 -74 33 -31 -104 54 52 16 227
5886 227 36 -68 3 239 72 -130 -42 76 -56 -19 -58 72 60 -3 -60 -116 -70 211 -155 76 -57 -82 25
5909 25 -19 -164 -117 -122 1 -20 -144 -102 -91 143 178 253 -7 133 -274 36 70 49 166 16 120 37 -37 -226 -186
5934 -186 341 -313 -93 -1 -147 99 -102 35 149 187 -24 108 -34 12 -68 -55 -27 -63 -167 51 111 -121 79
5957 79 43 80 207 156 27 45 3 68 -36 69 12 -11 -84 -49 165 -3 -331 -83 13 162 -110 88 -6 -66 149
5982 149 -102 -30 21 -29 -235 -29 -8 58 217 -136 25 80 204 31 -171 -51 -129 122 198 38 -59 12 -35 34
6006 34 -23 -89 -48 89 101 14 38 6 27 111 -215 207 -41 43 108 64 -58 -100 66 -84 -206 109 21 -75 -22 -65
6032 -65 82 -30 78 -47 5 19 34 -176 11 -104 -81 -194 72 -19 -82 62 -8 -1 64 93 -30 -5 -104 -169 -146
6057 -146 142 -68 25 -116 -97 -27 0 -47 185 -37 -82 -155 192 117 221 201 -18 -248 -34 -13 -24 60 -67 50
6081 50 -64 -129 31 255 -30 -41 -44 60 174 48 -57 231 209 8 -132 128 25 -32 165 -5 118 -95
6103 -95 -171 156 -15 43 -247 -2 -223 141 277 -68 184 108 221 -398 69 -123 236 162 82 42 113 88 108
6126 108 -57 -40 -164 -10 190 189 109 141 223 132 68 65 40 -38 -258 75 -145 33 140 -231 -29 -61 -16 -296 135
6151 135 -142 -278 -1 8 -43 90 12 173 88 -321 247 -205 78 -31 -7 -217 -55 95 81 26 169 69 94
6174 94 102 78 242 -251 -243 -44 -78 221 158 -104 161 67 -103 -113 71 213 -16 71 -172 -84 -109 51 -119 -29 121
6199 121 221 -55 -17 -105 -109 -69 175 121 177 71 111 49 -207 -205 122 123 66 166 -95 -108 118 1 -76 67 -18 -149
6225 -149 -66 -240 115 147 120 -79 65 88 42 64 -89 -58 244 202 -31 28 -109 131 -53 -23 98 -34 -37 101
6249 101 -204 -160 -142 49 71 -212 -24 33 11 -192 -161 -2 49 -157 283 -178 64 -39 96 -252 215 144 -100
6272 -100 63 -53 41 89 -42 -333 -150 -75 -31 -47 -44 -4 -161 26 42 280 37 92 54 10 -53 -34 -48 -119 -67 238
6298 238 -40 -19 5 5 155 -171 179 -16 12 -31 65 -139 -168 -160 -38 -145 140 -146 40 -107 24 -195 81
6321 81 55 128 218 80 -113 -5 160 161 55 110 240 -55 -135 -91 39 -102 44 130 -56 27 -160 -56 -56 -204
6345 -204 -74 98 30 -60 -146 -6 -149 58 137 18 -93 -163 50 29 135 -46 -45 -4 23 60 -227 -150 -18 226
6369 226 -96 190 173 -3 164 94 86 -108 84 -276 -24 66 142 48 -71 49 -117 142 6 33 -132 -125 48
6392 48 5 -61 48 19 -82 77 -156 -183 77 -168 120 55 121 137 17 -11 194 51 39 -31 117 -68 -18 24
6416 24 -48 23 -219 94 -19 114 -27 -110 -45 51 74 48 3 201 -51 53 235 -121 40 94 -59 14 -68 -11
6440 -11 207 119 -115 -118 -147 -204 -10 39 -22 -89 16 -448 -126 2 -181 -162 122 92 -84 74 83 -12 65 -43 133
6465 133 314 68 -323 -62 10 58 -2 165 93 14 263 83 92 -79 -25 106 -65 -12 -136 6 66 21 66 -269
6489 -269 55 1 138 -274 -174 146 -200 129 -44 386 47 -77 148 125 -55 -291 -265 -144 103 -132 -19
6510 -19 26 -253 295 -205 -92 -29 -51 67 38 58 -49 112 201 184 141 -33 -102 -108 74 -140 21 -22 -246 -5
6534 -5 126 79 8 100 -37 168 -105 -25 -45 -206 13 36 277 -127 -142 85 -24 -259 -126 132 251 54 134
6557 134 4 158 8 -101 63 -81 -95 -93 73 -274 -6 -20 -235 -28 -235 228 241 -176 97 7 44 -143
6579 -143 -12 -220 -96 90 -5 51 47 -82 -66 -244 25 -112 -95 75 -138 262 22 31 48 46 80 97 40 -43 38
6604 38 193 95 61 75 24 98 218 -52 -145 151 -122 -85 -223 27 157 83 -121 22 150 158 44 -119 -11 134
6628 134 219 -86 -232 -19 -80 128 21 137 -225 63 35 116 76 -15 122 -67 151 22 197 112 -201 68
6650 68 17 231 129 -89 -96 -110 -65 -55 80 -103 -40 -76 141 -87 -109 40 119 89 -177 -267 -39 263 121 180 72
6675 72 -107 8 45 -6 24 -189 2 80 -49 43 94 -101 77 178 325 78 -130 211 209 -35 203 -5 -124
6698 -124 98 234 -155 214 104 -55 160 -257 228 -219 -242 230 -276 147 50 -170 -8 256 104 -114 59
6719 59 141 227 35 -54 -73 -325 217 -7 -141 80 23 -175 49 56 142 83 -17 188 35 -55 181 164 63 -163
6743 -163 -223 257 -74 67 -64 5 43 98 18 158 -137 -271 209 -19 -279 32 46 123 -145 158 -41 -166
6765 -166 -39 125 -118 -96 -31 89 -24 86 239 252 70 174 58 -37 235 6 4 236 158 187 -111 -42 -17
6788 -17 30 14 32 -175 92 152 -4 142 -11 -86 110 292 -169 83 -95 114 14 -212 -12 -203 -140 -60 -11
6811 -11 -14 185 158 146 -67 -37 -45 58 64 116 115 -60 -195 65 143 26 128 125 177 310 48 -45 2 12 44 115 -81
6838 -81 -170 75 -201 169 14 -108 186 -144 22 -96 -191 136 -9 -280 -195 -15 -88 -82 114 101 50 -4 -3 25
6862 25 -158 281 97 156 -143 119 -186 -143 78 59 79 70 -11 -47 18 -67 -299 -65 -2 14 227 109 -135 -241
6886 -241 187 -139 -241 -27 -9 -90 13 122 142 68 35 97 -95 62 144 -109 -155 251 -212 -176 -52 -67 -123 22
6910 22 42 -46 -146 88 99 6 56 62 -166 147 19 150 49 -119 139 -126 -31 -84 35 41 -109 43 143 58
6934 58 -98 -99 88 -54 -83 -75 -4 -60 136 54 146 107 68 112 8 43 23 -47 -40 51 -179 32 -45 212 -92 125 181
6961 181 104 57 25 154 -67 -20 149 68 -15 -138 -40 15 26 -64 -140 -205 98 26 29 -187 55 65 161 65 50 23 -131
6988 -131 21 93 -49 -179 -214 18 9 37 -154 155 48 -82 27 29 109 -2 -48 122 -228 -190 -200 49 39 -146
7012 -146 43 150 242 52 9 -3 204 -120 28 10 154 30 -57 -28 -106 -136 140 280 250 59 -34 -150 -131 15
7036 15 -274 121 24 78 -119 101 -3 89 183 -111 192 -155 51 -93 139 -164 153 140 59 133 -82 -72 -81 181
7060 181 21 -144 -15 94 -111 189 138 60 18 -65 87 64 100 -147 -61 25 -49 -55 162 182 240 -63 -23 14 -84
7085 -84 4 131 59 -79 219 67 -17 -157 51 159 -139 -86 142 54 -82 173 71 46 -37 150 -50 -145 -398
7108 -398 -46 47 82 -132 109 -54 -200 106 -82 -369 147 58 -35 -170 130 247 -55 297 -52 -97 110 183
7130 183 -211 17 20 -164 -168 -8 249 -23 65 -150 127 -44 86 96 208 -101 168 -98 -56 92 66 -249 154
7153 154 -54 66 187 76 208 1 -108 66 -75 90 10 -84 45 58 285 -15 -44 30 182 284 200 -120
7175 -120 -166 -107 15 -166 1 87 -122 -77 -170 -114 -90 -241 53 61 94 -130 25 3 18 54 67 91 65 113 -17 -243
7201 -243 20 -84 -338 -14 45 35 -172 83 -13 39 115 -32 266 89 119 -90 -102 87 71 -194 215 -134 95
7224 95 59 122 8 -201 79 256 -75 -68 -27 -11 -36 -53 -142 -60 -20 -83 -61 -35 22 -102 -82 32 -10 78 196 42
7250 42 -3 -76 79 76 80 -71 286 -151 -50 -64 21 2 -224 -72 70 -59 -127 -60 -248 51 46 -177 104 39 -36
7275 -36 105 -89 -39 -62 94 -135 91 125 29 62 -79 -86 -118 107 255 72 127 176 177 17 4 -47 99 108 -4 111
7301 111 -190 -42 109 -105 -129 23 -8 92 1 1 -79 102 -25 -97 -137 25 14 -105 112 25 26 15 -159 40
7325 40 109 83 50 -24 -94 78 -82 -93 80 176 -241 -42 15 28 -24 71 215 52 182 -182 -35 -81 241 -65
7349 -65 127 71 -140 -194 213 -106 -64 67 -143 147 29 11 -260 120 -1 -52 94 -18 -137 149 -25 -14
7371 -14 -33 -58 -96 112 26 157 169 38 -110 172 -105 -59 216 -98 -122 -291 7 -184 -291 206 -8 209 154
7394 154 216 -18 109 -205 58 -1 -93 273 62 -148 -282 -17 -226 -31 272 -125 -193 -61 286 -32 18 22
7416 22 199 -94 -13 -40 -50 79 271 -210 76 -61 -59 -50 -31 0 -32 199 43 58 -47 -11 105 34 -265 149 112
7441 112 134 -80 84 -289 89 -49 76 231 -6 -176 81 -19 90 43 -24 -10 -250 -131 -118 152 51 -49
7463 -49 259 -70 160 158 -125 175 -78 97 -17 167 -261 -138 -154 -303 58 -101 -77 -181 51 -131 160 -107
7485 -107 -143 -69 -74 85 101 -20 -47 -148 -142 -32 -15 168 -55 -44 -129 -89 160 -83 11 -273 -255 137 114 85 178 -97
7511 -97 -229 8 -111 -104 44 -107 -110 -334 199 -59 -215 -74 -142 32 107 181 139 157 204 -31 43 -152 -85 -116 40
7536 40 230 -144 -8 19 154 -61 -84 -262 -36 60 150 30 59 -42 20 93 3 -81 -139 165 16 -78 -40 -109 -128
7561 -128 17 -219 -150 105 162 124 -32 -69 -133 94 106 -286 -112 145 -42 9 38 -7 -153 -61 9 -147 128 232
7585 232 88 172 -147 95 250 -283 163 3 27 -202 -107 -166 -121 251 -3 45 4 32 -205 -163 -144 -83 -102 -168
7609 -168 -133 -119 217 76 30 -27 311 -203 11 102 8 -65 116 118 260 196 235 -162 -65 45 -57 -3 -1 311 -18
7634 -18 82 154 42 -47 128 246 -139 115 -27 -33 11 113 307 91 -22 -145 -79 136 76 107 -26 53 107 23
7658 23 35 -100 -76 87 23 66 -54 66 16 164 -11 149 2 -115 -79 90 -158 115 -17 67 -146 95 -11
7681 -11 -122 28 -150 -62 -100 -4 -63 -120 113 -14 110 -91 -120 -119 130 -169 -252 25 58 -22 -29 -87 -186 57 -173
7706 -173 -15 -64 96 -65 50 -57 112 82 59 -130 -65 -46 -144 -84 -7 -25 -32 -19 90 -120 111 -120 231 109
7730 109 -38 -75 203 135 31 -169 3 18 62 -63 -47 80 20 136 -232 232 -155 -111 -78 -20 -139 -76 -180
7753 -180 -43 -16 -30 -62 -315 -76 239 17 329 -63 -96 194 34 -165 28 -108 167 221 51 79 -359 15
7775 15 -20 56 183 295 -105 -69 11 257 146 18 73 32 24 41 157 -55 49 -93 -58 44 24 26 63 91 -76
7800 -76 174 91 333 165 14 14 -59 -8 -262 181 -53 142 143 178 -70 122 414 31 -97 -117 136 90 68 59 -166
7825 -166 -307 63 -113 18 -3 -170 114 -185 14 57 -163 153 -84 26 -30 99 311 49 52 -218 108 -135
7847 -135 190 -147 86 75 -1 304 -30 64 -244 24 169 36 84 -65 -28 -21 -274 -41 165 -53 96 -54
7869 -54 -93 102 10 247 -25 -49 -108 -67 68 -138 218 128 44 -53 -5 18 10 -180 -30 -128 70 -40 255 128 145
7894 145 -241 -14 18 -145 -29 21 -124 275 -35 104 -165 15 17 75 -131 -130 89 32 -111 -214 250 -145 -7
7917 -7 112 -25 97 213 -118 263 -18 69 97 16 3 -41 154 119 -16 -182 72 22 -108 -312 49 -177 90
7940 90 155 -45 126 -6 -299 90 -277 -109 237 -259 -25 -150 67 254 19 89 127 -52 -148 86 -10 24
7962 24 137 66 -37 -49 115 -217 17 -198 11 -48 27 140 -47 -18 89 -12 -21 -12 56 31 -228 10 85 -33
7986 -33 -4 -69 191 -137 37 -121 109 160 62 -35 252 34 -128 -124 47 -116 -96 91 155 -257 -151 -247 68 -15
8010 -15 192 12 132 56 112 50 115 152 210 41 61 -96 -5 114 15 108 -37 153 -18 82 -49 -73 132 -183
8034 -183 30 -87 -51 121 -27 -200 -41 -277 27 -60 -25 -209 10 -29 12 -122 -179 -2 -107 42 -65 -16
8056 -16 -7 -60 -161 -93 120 228 -96 177 148 83 -17 -131 150 -217 -147 97 13 19 -291 -89 51 63 -256 -143
8080 -143 183 173 70 -149 34 -117 -301 -50 150 -119 149 50 83 9 -7 74 -82 39 -44 107 -23 -152
8102 -152 -111 -138 -83 12 -70 41 16 -138 -47 101 -80 90 -128 183 95 111 84 -171 68 -111 80 72 -75 -129
8126 -129 -235 -56 16 -241 -87 -125 106 106 -63 139 33 45 -108 -26 -104 169 -73 -45 24 -72 -39 90 -171 -175
8150 -175 -117 -15 242 -113 -13 -253 -50 202 356 51 -127 153 -72 181 -67 -157 -90 -64 310 159 -124
8171 -124 62 -48 -102 -123 198 36 113 116 -112 -159 79 30 -91 -28 -128 -190 95 182 39 -24
8191b4
$$ Imaginary data points
##PAGE= N=2
##DATA TABLE= (X++(I..I)), XYDATA
0 0 0 0 0 0 0 0 0 0 0 0 0 -8 8 -8 8 -8 16 -16 16 -24 30 -32 40 -47 53 -64 74 -85 95 -109 125 -144 161 -182
34 -182 204 -229 258 -287 319 -356 397 -439 486 -537 592 -654 722 -793 874 -962 1062 -1171
52 -1171 1290 -1426 1579 -1752 1952 -2183 2453 -2784 3185 -3687 4340 -5220 6474 -8392 11658
67 11658 -18228 36358 -184920 -548951 96276 170021 -147848 191184 289312 -277192 -180296
78 -180296 228046 -113076 -235237 359881 306056 -233183 -112163 20490 -276552 11249
88 11249 480743 65959 -327970 12006 27960 -273229 65766 362704 -31091 -124372 115796
99 115796 -185802 -328281 243659 368800 -95435 -94445 30669 -246507 -113406 343029 131786
110 131786 -195436 67377 80479 -261981 -57771 248869 5116 -62842 165915 -62438
120 -62438 -296724 60380 215983 -84351 -28035 160865 -100458 -187947 109409 52451 -132892
131 -132892 114839 190447 -152782 -154734 90044 -18461 -55809 198977 89548 -207216 -56946
142 -56946 89199 -84318 -218 215448 6037 -183240 7339 33308 -102623 72328
152 72328 181574 -77928 -132762 57233 -16777 -92674 111046 113161 -109936 -58294 64875
163 64875 -57742 -48374 131719 32214 -120409 30153 81984 -86948 -36081 95724 -15434
174 -15434 -45358 96516 10251 -140614 4389 106047 -32703 -27087 73601 -35192 -87363
185 -87363 49856 29226 -68521 44209 97216 -71224 -97706 35712 25826 15 77541
196 77541 2842 -128894 -14988 105404 3459 -40860 36430 -2578 -50801 33482 31227
207 31227 -59773 9358 84286 -29938 -78984 25492 35511 -12424 21129 -2277 -69986 9567
219 9567 90522 -12559 -79955 5930 33298 -543 27468 2021 -72225 -9747 78243 8734
231 8734 -53753 7582 26693 -17349 33 11456 -24882 11102 54888 -21748 -70021 8757
243 8757 51304 12306 -5197 -21753 -46741 8163 69258 6191 -59026 -11135 25193 2005
255 2005 5095 4749 -24587 -4836 30277 -4746 -33925 10491 34595 -2149 -18209 -9875 -6386
268 -6386 23443 37514 -14893 -46120 -2595 32690 15866 -4511 -16041 -23948 806 28786
280 28786 4698 -22939 -4564 9018 -3264 -4563 2447 2747 5659 3269 -13463 -14420 11420 21478
294 21478 1864 -12808 -14132 -3569 18461 19924 -5729 -17414 -4694 5809 8001 7162 -458
307 -458 -10215 -7552 941 2124 4903 4621 -7272 -10109 -2228 2501 6259 6092 -4673 -11079 -1894
322 -1894 6616 3039 1873 4450 -3678 -9777 161 8409 8720 5258 -6787 -13450 -660 14658 12388
337 12388 -3736 -15136 -10451 4981 14783 2846 -13660 -8620 3990 3987 -1346 -4191 -113 5677
351 5677 1718 -7040 -7540 4618 15643 7571 -11524 -16946 1492 23096 13492 -13665 -17864 -1012
365 -1012 13469 14879 -2055 -18832 -7779 14102 10528 -8167 -9284 331 3175 4397 -3942 -15370
379 -15370 2924 22848 -524 -24901 -8212 13052 13390 9520 -5300 -26536 -5985 32411 15324
392 15324 -19597 -8809 6183 -362 5892 5307 -15285 -3432 24932 1251 -29608 -3291 17762
405 17762 10 2193 4312 -23582 -9559 31231 4473 -32572 721 24460 -4310 -6353 5712
418 5712 -19761 -9439 39932 15993 -33123 -6038 16150 -10763 848 25514 -7467 -17282
430 -17282 20322 -1167 -39248 9676 41793 -7845 -17453 7597 -21938 -21987 39438 26284 -33137
443 -33137 -7687 21500 -23045 -17172 34685 7592 -20207 22556 6848 -47087 -1923 45175
455 45175 -2466 -12308 27298 -11863 -44531 18216 29663 -25587 6030 40012 -29433 -45428
467 -45428 23014 12380 -20176 32079 30389 -49349 -30204 30822 -5053 -11550 50226 13232
479 13232 -56221 -8846 22320 -23394 8331 60716 -8521 -52223 10711 7811 -35182 29691
491 29691 60268 -26871 -38621 16684 -19016 -32722 51712 44678 -41388 -18515 18240 -38542
503 -38542 -21340 62130 22566 -35333 12898 2904 -63340 -1255 71760 6568 -24506 24531
515 24531 -20548 -65830 27149 61814 -18006 -2919 38722 -42768 -62613 38036 39444 -17191
527 -17191 27724 24607 -73445 -44341 54212 16579 -16254 44519 5016 -77272 -11434 45250
539 45250 -15405 3100 67055 -13379 -78960 5635 28746 -23139 32392 62500 -45449 -61282
551 -61282 27858 4415 -29994 52010 48673 -54852 -31970 24546 -31942 -17173 79045 25408
563 25408 -64561 -6935 14048 -48196 9495 79827 -7821 -49843 23084 -6332 -60761 32228
575 32228 71249 -24639 -22409 29312 -38744 -49099 58549 46342 -37808 3951 24159 -58673
587 -58673 -27772 64503 12476 -31880 33605 4932 -74075 -2536 59956 -10785 -13235 45284
599 45284 -20142 -67693 24240 41193 -28157 12634 46909 -41162 -47975 37720 12569 -27539
611 -27539 38879 32025 -56813 -22999 39419 -14834 -17669 54261 8172 -58681 3423 26616
623 26616 -34561 1701 56970 -14397 -46510 22182 6936 -40377 24262 47349 -31474 -23156
635 -23156 30817 -16223 -31717 42078 27064 -37845 1482 26197 -34722 -16353 48625 3509
647 3509 -33847 20492 10870 -43149 2360 41275 -15392 -19642 29451 -6622 -39718 18638 27259
660 27259 -25014 -261 28629 -23554 -26589 29685 9221 -26420 15377 20582 -30983 -8804
672 -8804 31066 -9105 -18696 29200 7054 -33572 5980 23208 -18717 -5910 27593 -9922
684 -9922 -26648 18779 11290 -25350 4976 21909 -17001 -10807 21350 -5386 -19577 19416 13562
697 13562 -23868 -1107 21439 -11077 -10326 20854 -1252 -19748 14538 14648 -19776 -4335 19580
710 19580 -5194 -11336 13674 -330 -17530 10102 13000 -18038 -6500 15899 -3362 -10487 10489
723 10489 611 -14747 8000 13567 -13608 -7057 16102 1088 -11012 6251 3425 -9782 6787
736 6787 12442 -11455 -10665 11923 4520 -8177 4265 2482 -10278 3033 9773 -8938 -7301 11212
750 11212 2377 -10757 504 3552 -5641 3500 9324 -8385 -9469 9529 6317 -5902 -343 3262
764 3262 -2959 1731 6818 -4323 -6616 6759 5019 -5627 -916 2539 -2998 602 4328 -4137
778 -4137 -5369 5369 3784 -6490 -3327 3449 -380 161 3068 -3683 -5057 3965 4865 -1912 -1516
793 -1516 853 -1035 102 3065 -132 -1789 2424 765 -3022 498 2738 -722 -948 552 -975
808 -975 -1670 1578 1907 -2393 -2067 449 -718 -547 1795 306 -1274 -1227 -309 1563 2986 456 -2737
825 -2737 -1537 2351 2794 865 -458 -1971 -698 2883 1550 -2195 -1663 499 1059 -1236 -2652 -571
841 -571 2040 2235 -2419 -5069 -835 4131 3520 -1318 -5412 -3400 3703 6242 309 -5798 -3533 3964
857 3964 4923 -307 -3137 -1300 2352 3095 -507 -3850 -1142 4570 3566 -3956 -6545 140 5660 4212
873 4212 -3347 -8573 -3190 7219 6425 -3527 -7185 -901 4606 4009 280 -5102 -4102 5778 6256 -4123
889 -4123 -6090 2312 5546 475 -2389 -3501 -1130 7001 6044 -7834 -9022 4604 8259 920 -4042
904 -4042 -7225 -5207 6875 9983 -5241 -10377 2477 4484 -2613 768 1613 -2741 3584 6032 -7695
919 -7695 -8725 9222 10799 -3922 -4716 -1178 -4380 4806 10736 -5539 -11148 5976 6791 -6319
933 -6319 -2266 3206 -4529 1095 10021 -5510 -13635 6271 8617 -7253 -133 7960 -5139 -5083 7016
948 7016 -2520 -8270 11951 11678 -12040 -8095 5381 -2875 1244 15795 -965 -17270 1105 7282
962 7282 -8079 2483 15441 -6043 -14073 5999 634 -10518 10648 13495 -13200 -8939 9650
975 9650 -4869 -8679 14940 7978 -14065 739 8113 -12936 -2987 18814 -934 -12345 10163
988 10163 4271 -18442 147 16073 -4628 -2439 14495 -9774 -23704 9768 17306 -7169 688
1001 688 9328 -16401 -12995 16637 4895 -10926 13556 10778 -23643 -11254 16198 1609 699
1014 699 18600 -7171 -29221 6378 21970 -7863 -3947 15552 -8386 -15703 12350 1957 -17684
1027 -17684 13803 22512 -18343 -18396 11172 -535 -6675 18726 4180 -24727 2994 19113 -16471
1040 -16471 -12185 23169 6807 -12983 6898 -2435 -24710 10500 33726 -8285 -20862 9235
1052 9235 -1071 -14948 15262 13910 -17958 335 17831 -18757 -20873 22372 15495 -12974 2875
1065 2875 1457 -24501 3350 31990 -6411 -22262 13180 7368 -18072 5674 14009 -15423 -551
1078 -551 24633 -10655 -25705 15999 15276 -14828 3344 12637 -17670 -5850 22814 -6905 -22300
1091 -22300 17649 15923 -19999 -4446 11897 -14070 -2923 27139 -3670 -27064 9298 14798
1103 14798 -15129 1090 18909 -11516 -12577 17701 -869 -19961 14035 17425 -18660 -7469
1115 -7469 15386 -7082 -8758 19796 634 -24016 7047 17600 -14248 -5430 17218 -8156
1127 -8156 -14739 16422 6313 -18957 5013 14945 -14847 -6630 19700 -3023 -15379 12466 6235
1140 6235 -17349 5190 16365 -13063 -8504 16863 -2609 -16101 12311 8946 -17538 -294
1152 -294 14954 -9954 -7331 16025 -3037 -18335 9679 13570 -12559 -3439 10142 -9644 -6146
1165 -6146 18530 1523 -17654 5259 10639 -11477 -1785 14054 -4728 -8350 10857 -1630 -16529
1178 -16529 8760 17293 -9793 -9723 6084 -4088 -3846 14338 1320 -17809 2002 13333 -6980
1191 -6980 -6879 8648 -920 -5540 9476 266 -14915 4461 15441 -5886 -9341 7035 1126
1204 1126 -4759 7132 473 -12779 4200 15529 -5724 -13006 2523 3472 -702 7069 -16 -13960
1218 -13960 -851 12513 -1888 -7850 5073 2805 -4737 1919 603 -7169 4335 12928 -4283
1231 -4283 -12898 1884 7185 872 2820 -417 -9135 235 10912 -737 -8670 1430 4553 -1312
1245 -1312 -116 48 -5851 675 8656 -1778 -8501 1868 5452 -1687 -1271 234 -2681 1839 7217
1260 7217 -1769 -9058 747 6728 1603 -995 -1203 -3465 -206 5930 932 -4755 121 2842 -2050
1275 -2050 -1950 1355 -367 -160 2488 -2104 -5463 1229 4874 -124 -2676 -803 -502 133 3358 1286
1291 1286 -3353 -704 1981 356 -233 977 -284 -1124 498 1011 -428 563 821 -1638 -1561 1754 862
1308 862 -1055 -325 -50 -1288 -357 985 431 -578 472 -599 -1872 491 2683 1075 -873 -1970
1324 -1970 -657 2231 2989 -156 -2839 -1227 1954 2064 17 -1363 -1614 785 1589 -320 -1949 -601
1340 -601 1950 904 -2107 -2531 205 2756 1750 -2185 -3815 -31 3719 2556 -1590 -3756 -712
1355 -712 3469 3289 -1233 -3624 -332 3200 1744 -1488 -2314 42 2528 1717 -2334 -2922 991 3865
1371 3865 1057 -3531 -3384 773 4051 2258 -3160 -4681 654 4724 1858 -2580 -2729 169 2535
1386 2535 2467 -1106 -3279 421 3976 371 -3467 -1398 1907 2399 678 -2601 -3796 1214 4594 638
1402 638 -4324 -2262 1505 2066 1479 -1463 -4055 616 4685 404 -3942 -1061 2170 827 452 -349
1418 -349 -2674 5 4112 -59 -4310 -44 3302 345 -883 -648 -2926 105 5248 645 -5374
1433 -5374 -721 2238 -827 77 2049 -2192 -2370 3208 242 -4283 1235 4751 -1728 -2088 1720 -1392
1449 -1392 -1649 4330 1519 -4452 -416 3578 -2046 -1625 3868 -457 -3400 2953 1478 -5584 255
1464 255 4725 -2392 -2755 3908 -591 -5544 2420 3790 -3836 247 4338 -3738 -4220 5255 2015 -4024
1480 -4024 2697 3649 -5094 -1554 5254 -1452 -2721 6538 510 -8179 1071 5691 -2987 -847 5093
1495 5093 -3266 -5825 5336 2784 -6667 1161 6167 -4456 -3752 4711 -1217 -4083 6599 3236
1509 3236 -8020 -773 6875 -2489 -3084 6039 -714 -5940 5324 3329 -8515 -342 9033 -2289
1523 -2289 -5704 3994 -453 -5700 5332 5506 -8335 -2634 7802 -2136 -5967 5619 1604 -5774
1537 -5774 3579 4608 -8469 -2199 10411 -452 -7082 3935 1889 -6801 4023 7079 -7612
1550 -7612 -4148 8770 -517 -8019 4300 4309 -6776 1248 5768 -7063 -4103 9979 739 -8390
1564 -8390 2830 4048 -6619 980 7652 -5390 -5040 8836 1063 -9318 3244 6930 -5559
1577 -5559 -550 6932 -5087 -5994 8657 3211 -8575 1818 5606 -6731 -1929 8064 -2985 -6004
1591 -6004 7519 1661 -9772 1545 8046 -4837 -2717 7485 -3315 -7928 6806 4909 -7555
1604 -7555 963 7172 -5996 -4616 7708 255 -6060 5887 3949 -9383 -912 8076 -3267 -3653
1618 -3653 7432 -926 -9070 3451 5434 -6471 108 8185 -4231 -6983 6230 1781 -6786 4325
1632 4325 6250 -6985 -3042 6891 -2105 -4588 7355 2802 -8110 951 5237 -5495 -1339 8521
1646 8521 -1582 -7022 4401 1870 -7151 2010 7481 -4418 -4260 5250 -1901 -6401 5727 5045
1660 5045 -6376 -704 4944 -4627 -3108 7313 1248 -5197 3137 2610 -7034 -262 7549 -1621 -3817
1675 -3817 4463 -1017 -6744 3194 5593 -4397 -1301 5115 -3212 -5360 4515 2430 -4478 2527 3748
1690 3748 -5838 -2770 5676 -213 -3022 4218 1172 -5953 858 4507 -3046 -884 5706 -1152 -5212
1705 -5212 2333 2251 -3224 1679 4358 -3824 -3401 3493 -71 -3642 2938 2424 -4309 -677 3062 -2472
1721 -2472 -1905 4345 1007 -4339 921 1821 -3120 471 4301 -1289 -2845 2322 317 -3098 1745
1736 1745 3271 -2320 -1221 2508 -1494 -2167 2835 1036 -2480 337 1377 -2535 -803 2930 -219
1751 -219 -1661 1535 642 -2696 502 2390 -1073 -663 2015 -502 -2227 1019 1596 -1091 323 1412
1767 1412 -1644 -1534 1669 493 -1390 1094 546 -1841 -398 1357 -706 -701 1238 -143 -1638 234
1783 234 855 -700 -68 1178 -524 -1278 545 618 -605 360 902 -452 -398 663 4 -158 718 18
1801 18 -607 23 626 -409 -699 652 -63 -1108 -35 357 -769 271 632 -147 -541 335 162 -145
1819 -145 -189 250 126 82 242 -29 -40 653 367 -294 -93 170 170 226 78 -391 -685 327 734 -527 -691
1840 -691 -384 75 142 40 -669 -330 403 504 -59 -724 -149 353 616 -17 -603 -196 793 811 -98 -610 -203
1861 -203 415 461 160 -719 -489 523 685 -635 -959 -242 799 233 -571 -863 -164 572 735 -429 -1068
1880 -1068 46 729 698 -27 -827 -221 1231 959 -476 -920 394 795 526 -291 -762 -458 707 584
1898 584 -1038 -876 79 561 367 -308 -669 -377 840 939 -1195 -1033 630 554 112 40 -499 -292 969
1917 969 954 -691 -1137 1009 943 -345 -112 -69 -592 548 879 -812 -838 804 341 -529 -219 -90 -584
1936 -584 108 1223 -784 -1301 1032 626 -909 405 809 -654 60 1378 -352 -1300 1223 857 -1087
1953 -1087 33 1020 -793 -254 1201 -190 -1152 883 644 -1319 -333 1408 -1162 -999 1255 -83
1969 -83 -1523 905 956 -1392 225 1961 -849 -1211 1644 1074 -1546 615 880 -1589 8 2128 -846
1986 -846 -1665 1435 915 -2218 -81 1370 -1388 181 2678 -1598 -2973 1843 1524 -1632 -131 1073
2002 1073 -1771 -286 2441 -633 -2491 1841 1924 -2318 -914 1395 -647 -22 2830 -934 -3363 1533
2018 1533 2845 -2128 -971 1950 -996 -1149 2126 -608 -3155 1913 3499 -2215 -2277 1430 -84 -643
2034 -643 2749 -67 -3533 1326 3367 -2245 -1788 2757 474 -1209 1684 -457 -3767 1798 4213
2049 4213 -2010 -2939 1724 201 -1768 2299 688 -3419 702 3502 -2260 -2872 2648 1254 -1689
2064 -1689 1129 168 -3695 913 4633 -1053 -3053 2386 911 -2683 999 1688 -2541 398 3760
2079 3760 -2243 -3810 2470 2174 -1681 699 1238 -3335 -641 3652 -907 -3062 2553 1944 -3301 -263
2095 -263 1905 -1707 78 4010 -914 -4204 1777 2248 -2357 606 3107 -2342 -2217 3117 118 -2754
2111 -2754 2503 2349 -3106 -1033 2295 -1585 -1282 3522 215 -3870 1008 1756 -2688 -194 3429 -1195
2127 -1195 -2518 2544 373 -3044 1392 2834 -2119 -855 2848 -1165 -2621 2482 1789 -2233 380
2142 380 1401 -2709 -851 3555 -156 -2975 1627 1237 -2878 134 2363 -1257 -1119 2871 -986 -3504
2158 -3504 1452 3102 -1649 -411 1480 -1815 -793 3240 181 -2982 1180 2188 -1889 -1070 1740
2173 1740 -737 -641 2794 -365 -3887 893 2949 -1359 -1369 1189 -770 -1053 1900 -37 -3531 952
2189 952 3297 -1189 -1854 961 -215 -78 2560 195 -3287 176 3133 -615 -1764 1291 304 -1025
2205 -1025 1337 -267 -2689 879 3501 -750 -2797 290 595 -411 1555 213 -2908 -173 3006
2220 3006 -439 -1798 1043 840 -615 698 -14 -2093 646 3082 -365 -2346 624 1067 -321 431
2236 431 354 -2100 196 2084 -417 -2174 317 1451 -89 281 -63 -1599 -113 1888 -46 -1628
2252 -1628 459 1035 -542 -201 297 -475 352 1468 -488 -2147 223 1414 256 -304 -10 -847 -46
2269 -46 1293 484 -1077 -74 548 -694 -265 590 -180 -425 677 91 -916 324 952 -239 -180 627
2287 627 -5 -175 598 315 -767 -62 691 -191 -190 298 -55 -707 148 489 -129 -120 -386 -589 169 921 43
2308 43 -823 -286 233 101 34 256 -180 -157 646 150 -459 145 829 262 -37 -497 -217 618 892 38 -1183
2329 -1183 -358 774 627 -270 -665 -710 351 809 78 -1004 -388 687 583 -451 -745 34 331 559
2347 559 -264 -918 59 1095 751 -456 -1154 -248 905 1014 -356 -1223 -281 816 970 -366 -855 -7
2365 -7 821 435 -356 -1081 -91 963 741 -561 -838 360 1238 807 -885 -953 -102 1221 827 -714 -980
2384 -980 -276 851 1059 -418 -938 -115 880 576 -524 -746 345 774 226 -511 -687 169 1077 273 -1092
2403 -1092 -943 240 1013 638 -785 -1049 -56 1201 497 -591 -530 243 485 461 -219 -550 -193 790 74
2422 74 -630 -247 659 301 -354 -513 -446 106 838 90 -826 -222 120 265 158 -99 -586 -374 527 405 -395
2443 -395 -86 440 -304 -238 432 7 -146 194 240 -489 46 506 -317 -343 304 -364 -425 541 354 -422 -204
2464 -204 386 -387 -120 518 -18 -1359 140 448 -34 323 182 -565 -533 851 609 -671 25 366 -392
2483 -392 -161 487 -133 -232 857 55 -1236 -75 550 -209 -7 171 -570 -460 1014 546 -1306 -358 854
2502 854 -30 -48 237 -598 -460 1198 701 -1144 -258 1044 -144 -494 222 -243 -308 852 109 -1744 -336
2521 -336 1367 408 -621 -260 -813 -718 1206 931 -905 -760 1138 -145 -744 299 277 -38 655 431
2539 431 -1782 -648 1673 346 -860 167 287 -675 433 625 -1313 -748 1678 482 -1408 -179
2555 -179 -24 -565 878 918 -1251 -849 965 92 -1207 307 794 -634 -97 504 -892 -551 2014 797
2573 797 -1611 -260 447 -574 -92 1280 -929 -1134 1188 296 -1385 174 1009 -501 -132 816 -514
2590 -514 -1134 1215 823 -1181 211 1190 -589 -882 939 -346 -697 1481 695 -1310 -404 833 -310
2607 -310 -178 1397 155 -1323 336 645 -1131 -18 1137 -567 -1229 722 -171 -930 862 878 -1103
2624 -1103 -252 1164 -664 -679 1064 606 -1081 230 702 -879 -425 1134 -210 -693 1063 152 -1548
2641 -1548 -1 756 -459 -181 917 -542 -1249 776 691 -832 184 1284 -713 -797 798 -148 -634
2658 -634 1349 912 -1096 -382 791 6 -179 1039 55 -993 484 824 -1127 -354 1082 -74 -568
2675 -568 419 -379 -1235 577 910 -652 -461 703 -210 -851 508 138 -472 655 847 -1196 -901 985
2693 985 592 -212 447 -17 -749 184 542 -266 -592 746 160 -1047 -222 508 -205 556 956 -717 -947
2712 -947 834 332 -606 566 338 -410 -266 470 -417 -291 1107 628 -699 -58 55 -644 154 723 -397
2731 -397 -673 426 331 -818 240 851 -308 -28 512 -610 -844 421 557 -331 -248 41 -337 -276 426
2750 426 13 -440 323 168 -752 -301 531 54 8 420 -27 -531 220 566 -187 138 410 28 -229 75
2770 75 -93 -138 40 403 -551 -150 99 -241 61 578 24 -467 137 165 -154 -116 66 -49 -219 146 23
2791 23 -251 16 243 -253 16 -34 -306 -186 57 -71 -315 -199 -62 22 -112 332 -185 -112 -107 19 -237 24
2813 24 136 -128 -255 219 -9 -33 36 136 -19 215 286 -94 31 -67 244 -4 -182 104 12 53 127 79 -1
2836 -1 391 235 -207 -226 169 141 3 -50 33 12 -88 35 49 -153 222 213 1 123 130 -74 88 194 104 50 186
2861 186 -4 -176 115 36 -167 54 8 -29 -172 -197 235 -20 -5 -140 -305 -116 -18 110 -72 65 72 -48 183
2884 183 56 -151 299 145 160 1 42 89 197 -96 -21 -178 25 150 -211 -238 154 1 -34 8 -91 134 25
2907 25 -198 12 11 -143 309 76 46 14 48 74 237 -169 -297 3 98 172 -24 -49 -36 -32 6 25 129 -116 -95
2932 -95 -14 -6 26 -223 62 7 -89 -85 -188 -55 -163 6 139 63 -407 340 -118 -18 126 -103 -100 150 -6 -88
2956 -88 69 244 -234 -226 -114 133 -236 70 120 -11 -125 159 -97 -294 -183 -6 -282 80 509 -49 -219
2977 -219 121 35 -227 61 -12 -32 -46 173 -261 -407 177 295 -102 -65 -144 -490 -254 474 118 -311 272 -36
2999 -36 -319 5 -55 15 280 538 -24 -415 122 486 -74 123 80 -491 48 183 -343 -502 436 350 -646 -624
3021 -624 22 -241 9 681 -274 -720 -8 236 -225 -317 454 92 -56 133 -307 -535 248 685 -8 -315
3041 -315 -134 -94 104 456 188 -277 -16 415 -260 -469 304 291 131 168 -159 -825 -123 591 179 -142 138
3062 138 -124 -351 75 -325 -64 321 593 -44 -869 14 26 -86 328 219 -724 -566 195 -311 -247 282 110
3083 110 -425 -236 -66 -224 86 934 -62 -478 -153 42 -405 368 414 -225 -65 56 -169 -444 683 490
3103 490 -298 -169 429 -589 -336 510 138 -313 -50 139 -493 -259 455 -77 -41 285 -234 -630 3 316
3123 316 -101 212 393 -273 -732 10 213 342 435 379 -576 -372 235 -6 22 456 240 -425 -363 22 -195
3144 -195 428 505 -6 -821 -159 262 -230 151 193 -244 -72 515 -159 -661 33 650 83 216 -82 -239 -125
3165 -125 732 183 -368 241 295 -492 -298 100 367 404 529 -447 -1238 -118 629 518 91 -51 -267 -306 296
3186 296 230 -395 261 700 -191 -378 87 230 67 222 23 -744 110 292 -52 -599 -166 198 196 67 -404
3207 -404 -568 152 948 95 -594 -366 -141 -59 434 324 -423 157 94 -107 -430 174 536 342 37 -250 -625
3228 -625 240 712 188 -697 -154 14 59 277 194 -444 -145 2 115 -537 -48 107 -173 -105 -139 -270 -91
3249 -91 356 -40 -336 48 507 107 -226 -57 -519 92 430 75 -180 -149 -90 -85 -78 5 -87 -311 67 155 99 273
3273 273 208 -6 -291 -28 -201 219 233 -102 -168 3 156 -152 67 93 225 -344 -146 267 232 -214 -42 -40
3295 -40 -84 255 179 -408 -88 -200 4 291 -121 -280 117 -18 2 42 335 272 -61 -132 -160 -130 183 388 -97
3318 -97 -508 -281 357 479 182 -448 -302 43 357 454 95 -392 201 320 -211 -136 69 -84 -16 -104 -465 -112
3340 -112 416 172 -274 -502 -149 225 623 196 -433 -413 186 796 36 -286 -495 164 407 129 -218 -129 180
3361 180 4 -188 -239 170 286 285 -266 -530 -152 405 583 -232 -580 -287 387 260 168 -195 -154 -12 333 -21
3383 -21 145 -34 193 316 -177 -233 -29 356 230 -270 -228 -170 492 205 -95 -317 -169 491 203 -26 -563
3404 -563 -193 -126 166 174 -41 -81 99 -176 -154 41 340 0 -233 -298 -25 295 31 260 -220 -363 56 192
3426 192 212 2 10 -257 109 128 80 -200 -83 -297 -121 -121 237 327 -86 -171 -302 83 17 -103 18 4 -56 -51 23
3451 23 133 60 -150 -165 6 -64 78 -68 -307 -344 -158 298 308 100 -245 -98 276 542 205 -311 -296 -84
3473 -84 70 188 -6 186 211 -108 -206 -381 173 131 -55 -394 -479 182 417 215 -294 -238 87 201 -127 -145
3495 -145 -181 -71 197 107 -115 7 -9 42 20 234 -62 342 296 97 -445 -114 323 395 196 -600 -292 50
3517 50 245 258 -346 -583 -561 6 133 -54 -183 270 243 -322 -250 -117 364 378 68 -193 -184 4 336 -92 -462
3540 -462 1 185 94 47 -268 -357 139 282 78 -231 -529 64 55 183 -103 52 54 -68 -238 -320 271 619 373
3563 373 -298 -408 -88 181 387 414 -308 -295 -88 103 -31 51 42 180 -54 -206 -416 95 148 257 79 -81
3585 -81 5 64 2 143 -56 296 20 -22 -233 -250 166 254 295 81 -337 -276 -211 225 -37 437 256 -388 -470 -91
3609 -91 -83 70 211 112 -286 -150 -130 -50 364 194 -181 -127 -46 -23 421 231 329 97 -50 14 -13 85 163 -138 21
3634 21 28 -138 -114 -19 72 305 220 -73 -300 -155 -136 95 -46 95 335 -171 -409 -302 141 624 217 -7 -528
3657 -528 -277 183 373 93 -123 38 179 -31 -281 32 -97 481 -49 -178 50 -90 411 206 -157 88
3677 88 44 164 208 -439 -51 295 414 68 -370 -333 -216 381 190 -1 -380 -9 42 56 -78 -147 210 132 -284
3700 -284 -111 -158 -1 211 130 -477 12 114 179 -26 -328 -99 -123 63 -3 -96 -128 -64 348 216 -167 79 -172
3723 -172 -140 51 -205 -122 185 -130 -253 -353 -75 138 27 -63 -104 -167 19 -51 48 -41 198 48 -38 140 -161
3746 -161 107 16 43 -234 -77 27 15 35 51 151 7 6 144 -70 -201 -81 84 208 -74 -46 -49 250 -17
3769 -17 163 82 126 -160 -39 176 -45 179 28 440 -123 -51 -100 -98 59 39 -12 -85 -134 -108 -252 83 46 -224
3793 -224 -120 -100 29 -12 -92 165 -171 43 194 -85 -47 8 80 -75 -52 -180 -53 12 81 76 -51 -25 70 -19 -34
3818 -34 -12 127 141 -64 9 -47 84 187 1 -113 -317 -108 169 55 12 -109 -9 65 -192 -79 -89 219 260
3841 260 183 -22 -65 29 402 76 -56 -9 84 55 91 -18 153 -118 155 17 -138 -4 49 -6 -37 -14 -139 -43
3865 -43 -162 -148 -117 -14 26 125 162 -118 178 43 102 -113 -111 27 -119 -136 19 -57 67 224 8 -208 0 -147
3889 -147 42 -49 50 56 -152 135 -36 104 -289 -24 11 -134 -58 6 -56 -63 59 -65 148 -60 124 -43 -36 279
3913 279 -27 63 -44 -291 24 -80 -79 -71 -75 89 -174 -132 -29 114 103 -100 26 63 164 -44 79 -49 103
3936 103 166 -116 -58 -95 -4 10 108 -71 112 258 62 71 117 18 -40 138 254 328 -88 20 -23 33 -55 -7 41 -90
3962 -90 68 -68 -20 -46 -5 -83 -9 80 -162 -172 113 12 -56 -88 -147 -29 162 42 129 -86 -54 -14 66 29 -197
3987 -197 -63 -313 48 125 90 103 115 -155 -103 237 65 220 -7 -31 -166 141 106 21 -179 48 99 -92 -72
4010 -72 -4 -31 0 99 67 -306 118 -194 -77 14 196 112 -267 13 -244 104 187 -72 -35 147 -108 31 -59 378
4034 378 -116 -87 44 -446 97 10 -92 119 103 158 -181 -113 80 92 -20 -186 -140 -43 67 112 79 0 -7 -33 18
4059 18 -147 -132 146 163 102 -126 71 -68 -66 -16 -38 -6 258 -195 -18 -66 -3 228 150 117 -62 22 -10 -233 190
4084 190 -49 -228 -28 -84 -197 18 20 -126 -118 114 -230 -160 162 -99 -79 -76 18 -84 -157 15 87 -138 -56 -82 -116
4109 -116 -80 234 -293 -177 283 3 16 187 43 -193 47 78 -10 -296 301 -74 -245 223 87 43 -20 -67
4131 -67 -84 -150 470 73 -83 28 -185 -76 -41 59 -377 -294 -100 378 125 258 -33 -42 32 89 -106 -82 38
4154 38 -27 -217 50 44 -70 18 187 -28 -52 498 421 -35 -212 151 -129 48 349 183 -505 -113 180 12
4176 12 -211 95 -23 127 329 -44 -162 -42 180 146 -158 171 90 60 231 -179 -88 -109 14 -273 -191 -43
4198 -43 -54 103 320 357 -243 -291 72 -364 -89 78 282 88 -87 -5 -165 245 204 -30 -414 62 -200 -4
4220 -4 -2 -79 -37 -124 287 -173 -215 -61 282 -11 -137 -23 -305 59 221 27 83 -56 -77 -170 -55 -239 83 83
4244 83 189 84 -326 -79 -122 -16 37 -3 -272 -255 -48 188 94 126 -93 -114 53 173 28 70 -7 -66 -287 -171
4268 -171 167 6 -67 -76 -116 -354 400 102 163 61 -157 -39 12 -57 -276 -61 32 -213 257 91 -35 -87 127
4291 127 424 135 130 26 -115 -3 -108 192 -50 111 75 -64 -210 -60 163 87 -171 -204 -220 -40 128 -34
4313 -34 -122 -148 178 -120 5 68 -8 -202 104 -191 -97 -179 -20 -79 -99 -102 193 -84 -26 -115 -204 -39 85 43 -165
4338 -165 -192 -335 163 337 -150 -214 -275 -111 134 227 -33 37 289 28 13 -211 -43 74 -148 67 110 -107
4360 -107 -247 206 21 -278 -33 155 193 -13 -43 -15 25 -40 -49 -57 -100 -42 155 227 -197 -15 63 277 -218 -125 240
4385 240 171 8 -85 -233 -104 224 -55 17 -180 -35 -327 -59 -98 -12 4 167 94 62 23 -127 -160 49 -340
4408 -340 -179 -20 10 -118 -7 60 11 117 -99 -80 -405 -91 107 216 -37 73 -246 312 -63 193 119 72
4430 72 79 130 313 -33 84 246 -20 103 -131 76 167 124 -144 -62 -108 -249 -3 -80 167 -18 -71 -87 -7 62
4454 62 -114 -78 -254 -83 83 19 -76 -135 248 64 3 85 -67 -16 -130 -73 167 139 -154 112 53 86 204 232
4478 232 -47 -35 -13 -206 50 -13 -32 -75 -92 -64 -3 -194 39 -54 99 96 -146 89 158 301 93 -166 -32 129
4502 129 -39 78 -99 44 55 -123 27 81 -20 -41 3 68 -12 -212 233 26 7 -125 -139 -160 166 -59 -21
4525 -21 -19 196 47 -232 -120 -114 -82 159 104 -68 -91 -90 184 -2 38 -44 29 51 195 -87 -89 154 -116 -11 -60 -133
4551 -133 -24 12 21 -147 -133 -80 231 80 165 -275 -93 73 -6 -275 -134 345 -10 -153 272 -71 -82 -13 -197
4574 -197 -185 -24 70 -346 -289 -66 129 111 65 192 -218 -332 -128 -37 -103 76 -126 -296 -136 105 -194 -12
4596 -12 -61 -45 -243 29 144 -115 173 100 -155 -260 122 152 -142 -134 -97 -128 -307 211 -92 -164 -33 105 -99
4619 -99 -160 -18 -364 -267 224 295 -266 -218 -24 38 106 -81 -46 -1 41 88 -321 -4 147 -276 -61 70 -140 0
4643 0 189 78 -85 -38 119 -250 -36 398 -27 57 102 75 -157 206 387 23 -129 277 -304 -110 307 54
4665 54 -246 -68 -105 -175 -180 -260 -153 -213 351 -103 -460 -352 -33 107 -275 107 185 -277 192 -303 -315 -36 291
4688 291 190 126 -62 -162 -198 358 185 -350 -222 -186 -220 40 374 -78 113 19 215 -383 -198 376 224 -362
4710 -362 -1 15 -181 90 -17 95 -23 -270 36 -75 -104 152 -63 7 7 -217 -219 91 54 217 112 16 -143
4733 -143 -132 198 -59 -172 97 -15 -162 78 366 158 -18 51 108 310 70 -38 72 117 178 -315 -118 -99
4755 -99 71 -118 90 77 -146 12 33 -218 -113 61 -47 -138 -56 35 -102 16 151 104 99 95 178 -310 103 136
4779 136 -18 77 65 -114 -37 8 127 75 4 311 -33 82 139 -239 -115 -42 -8 -301 36 110 54 102 103 -167 -56
4804 -56 441 -27 44 -272 187 -243 305 175 56 -40 197 -4 -63 -202 -18 -91 -147 30 -191 -165 -122 338 85
4827 85 21 -195 253 -314 124 -142 -153 -11 181 -108 -47 177 85 -28 95 11 -202 284 -4 -212 8 21
4849 21 190 -61 42 -183 18 -79 123 40 -158 83 -126 -188 38 -66 -115 146 8 -66 -40 -89 71 116 -30
4872 -30 123 34 -27 58 -12 -75 195 -157 -69 144 -17 -122 35 -1 1 -62 57 134 96 -52 265 -94 7 -68 -62
4897 -62 -2 -35 -147 19 -78 130 226 175 12 28 -57 -27 -89 -32 16 -27 -100 27 -42 69 25 -169 -74 -61 -2 -187
4923 -187 -28 -35 -198 16 7 -10 36 105 186 -77 -215 55 -92 -77 -175 128 -14 -2 -29 43 -81 65 -60 296
4947 296 189 54 151 -178 -45 -157 -132 -15 144 -305 327 168 -6 -125 118 -11 -196 286 134 -342 91
4968 91 -2 138 125 63 -209 14 -210 -90 -159 49 -129 246 22 -57 197 -328 -153 113 -97 -51 -206 -83
4990 -83 58 136 164 98 -71 -4 179 111 130 -133 189 -56 -5 -71 83 101 259 -210 -192 70 -4 49 -65 280
5014 280 -128 -155 85 -36 -224 153 91 -91 -139 -95 -27 174 258 -66 -34 55 -29 110 -44 -198 -76 -92 13
5037 13 99 -64 211 -38 -145 36 -68 82 87 -55 226 -238 166 256 -173 169 23 -236 -2 57 42 -52 310
5060 310 198 -6 107 28 -195 -265 206 136 -20 -97 123 -272 -222 351 230 -76 92 175 -74 7 -225 -110
5082 -110 -40 282 -200 -22 257 -5 -53 153 71 -363 -43 -69 -194 25 265 40 132 155 -104 -268 54 67
5104 67 36 31 -274 -108 121 -53 96 -99 -80 -178 61 84 -6 -4 -106 32 -33 -374 27 326 317 41 0 318 -90
5129 -90 178 170 -23 -158 -70 -301 -292 168 43 77 243 33 -177 -47 154 -107 -139 198 -80 -27 132 85 40 117
5153 117 33 27 -175 -35 -23 -126 7 317 -108 -142 -145 -82 0 201 327 -236 -201 109 -102 -198 141 61 -51 134
5177 134 135 -162 -7 214 -55 -233 162 -5 -121 -269 174 -88 -97 123 87 -36 103 88 7 -83 63 24 -15
5200 -15 102 220 -32 -194 143 -234 33 -103 -3 -144 134 86 -350 -108 73 -52 53 138 112 -349 136
5221 136 61 -41 73 145 -342 -145 79 4 -131 77 16 -207 -1 -127 -365 -191 -18 32 41 82 68 105 -12
5244 -12 201 -166 -108 151 -20 -48 -13 251 -135 59 -62 -287 -181 -196 -111 -21 -115 -253 -100 -6 5 69 -92 39
5268 39 -33 -240 -85 174 -94 0 -191 -158 -73 112 -216 51 -106 170 -17 138 270 -33 -148 32 26 -89
5290 -89 113 -58 -61 -116 -22 -324 -175 93 -142 -255 147 184 -201 -4 279 -10 -128 408 131 -173 -55 -356
5312 -356 86 -228 135 -42 37 -42 -125 21 -235 15 128 -41 -31 -43 111 -29 211 40 -10 122 96 174 -87
5335 -87 75 12 45 90 -214 118 250 -190 158 -51 55 -23 -129 220 -60 233 176 -208 -242 -4 115 -19
5357 -19 -193 76 -199 -71 140 -129 -141 120 179 52 -74 -27 101 75 60 162 -35 -151 -80 201 213 89 43
5380 43 -96 -180 54 138 -278 82 27 -78 -112 -97 72 -45 -119 -79 -3 -129 136 46 -44 201 93 -53 -177 114
5404 114 204 118 126 -86 -64 -133 65 -98 105 31 -169 121 86 -11 -3 102 -251 157 -9 99 88 -48 174 82
5428 82 -119 411 -70 82 217 142 -36 -18 38 -18 82 -78 -183 -39 98 -11 213 -179 23 -166 -255 29
5450 29 -141 -205 155 -19 152 1 16 -35 -129 118 -63 119 107 -174 -111 15 3 277 180 -91 -168 151 96 140
5474 140 24 119 53 -153 170 365 -75 102 -11 63 -1 3 38 66 203 126 243 -2 9 -129 160 -88 55
5497 55 -199 -15 57 -83 187 273 214 58 19 45 -88 -12 6 49 183 -38 34 45 3 158 107 -115 -11 -147
5521 -147 10 -164 -15 -7 59 161 -45 38 -105 39 16 174 -77 -6 -108 38 22 -155 118 -171 36 238
5543 238 -39 -57 2 81 282 -145 58 -109 -132 31 21 -212 236 -67 159 80 157 14 21 105 -113 29 23 -116
5567 -116 -78 -49 169 32 -254 99 59 -80 -69 -68 -163 72 27 33 4 19 -18 40 -174 101 -55 -167 -85 79 -298
5592 -298 0 44 -15 149 71 -9 -75 275 53 -94 40 137 -48 308 146 -230 -190 280 202 89 -273 104 -36
5615 -36 -120 172 87 -304 -128 313 -232 -38 121 -231 -119 -102 -169 -172 172 -157 -5 7 -61 8 -247 -244 -26 125
5639 125 153 181 -122 126 -38 -78 -14 92 25 99 204 18 -105 -92 195 -107 -231 246 -117 -284 188 296
5661 296 -35 -241 245 57 -18 17 65 -147 -170 -279 -36 19 -215 42 -257 202 -71 -2 -311 155 -9 121
5683 121 124 -71 37 -4 155 109 -112 3 200 -165 -272 229 94 -92 150 -26 -116 53 90 67 -99 67
5705 67 126 41 60 229 14 -1 68 -57 -146 38 -134 88 267 79 -5 54 -155 -108 103 126 99 -210 23 -52
5729 -52 -93 160 -6 -42 19 -126 -96 -80 55 183 -182 139 25 9 -37 -30 157 -207 19 -12 105 -316 -45 9
5753 9 260 181 -185 124 402 -29 -155 56 36 -144 -26 -30 -121 -161 170 277 -108 -183 133 204 -108 142 -65
5776 -65 -125 57 162 -162 -141 -8 -200 39 -65 -55 86 81 -12 -68 -23 -72 24 139 -225 245 -202 -21 91 -95
5800 -95 107 -250 121 -130 1 155 -14 -56 51 102 -104 67 -126 -91 44 -94 11 175 83 197 -48 118
5822 118 209 158 222 301 -33 -179 22 -148 -39 -23 22 -118 7 -9 34 -81 26 41 -33 61 161 156 -48 8 -194
5847 -194 44 106 -127 -332 -56 18 -196 -71 -115 46 -14 3 34 66 -12 19 -156 190 -9 -1 27 84 -170 -94 106
5872 106 54 -174 -153 -54 153 112 214 255 -86 94 -231 -116 100 -25 -26 66 41 -139 -171 51 168 -29 144
5895 144 -116 -17 89 -10 23 -9 -18 -8 102 114 56 -199 -46 114 -1 38 0 -132 -66 15 135 -113 266 177 -117
5920 -117 -69 33 -104 -75 -144 -134 -11 144 17 98 79 239 -7 -83 176 32 254 -209 39 -275 -41 -46 282
5943 282 105 -25 145 180 -136 24 -33 185 -190 -8 194 166 61 42 228 -7 104 122 169 183 18 43 -86
5966 -86 -209 -35 -15 31 -51 -133 37 384 -23 -12 -167 -112 107 -43 -71 -10 72 -19 -28 -60 34 267 -307 -239 133
5991 133 27 -88 -102 -251 -152 -132 -200 -203 -17 -56 3 178 -63 -77 -108 32 -199 -201 -159 -129 -43 186 -17 77 123 57
6017 57 -297 24 -2 102 73 53 -50 -64 163 -17 23 -87 48 152 -71 75 -232 57 75 87 -202 -61 -72
6040 -72 189 31 21 202 210 110 37 -285 -247 216 -27 94 -312 -246 100 -113 18 110 3 177 328 71 -4
6063 -4 -134 -64 -19 -88 -72 33 -192 255 -22 -201 -33 -63 -14 64 -62 -23 -132 44 -318 14 -69 114 6 -141
6087 -141 108 204 -4 15 -159 118 4 135 111 -298 -23 -1 -145 -148 -26 -38 -116 154 122 73 43 -6 -245 26
6111 26 -26 -20 190 16 -6 -35 29 -273 76 3 36 -69 -175 -71 -50 -115 174 -103 -123 272 133 -154 28 -147
6135 -147 -172 117 -148 -197 203 -121 36 192 11 15 80 27 102 107 43 -87 193 158 20 67 272 -181 199 -63
6159 -63 201 -6 -321 16 -197 -71 135 300 125 -84 38 57 -18 227 207 -204 -28 -2 -233 101 -340 44
6181 44 23 48 127 74 -22 -110 -96 -11 -6 141 -153 191 -119 91 123 -310 74 -3 64 -11 64 6 -197 64 141 -129
6207 -129 22 -107 -238 -110 7 2 58 -118 -115 -22 224 203 -321 123 48 -226 137 -10 116 44 -12 -58 -12 -111
6231 -111 -57 -178 90 19 -57 -179 120 4 -108 -197 -10 30 11 -54 156 -31 63 -196 -177 -45 109 396 -147
6254 -147 242 -62 29 33 46 27 -36 -9 28 -149 12 -287 -250 35 172 102 -38 -40 -56 386 95 251 -124 62
6278 62 -91 -233 -108 41 -192 27 148 -70 -28 21 23 35 -37 -19 -259 263 43 123 -168 145 242 -123 101
6301 101 48 -9 -188 -5 246 -217 81 143 -29 -33 -108 169 -242 -11 177 -8 -42 30 18 78 -38 -320 -15
6324 -15 116 -118 -119 -128 7 126 21 -37 36 -44 124 238 160 -222 -191 34 19 -58 -60 166 -93 45 -207 19 -64
6349 -64 31 -96 30 23 -32 -170 -17 162 -124 197 -14 35 80 13 172 29 142 47 79 62 294 140 -24 -49
6373 -49 0 19 74 143 -55 34 28 105 93 -5 27 70 -44 221 9 -124 212 -156 125 12 309 -68 -182 14
6397 14 -30 156 -217 40 -231 -153 -166 67 -94 183 -131 -20 -185 36 316 -179 2 -116 52 76 9 -41
6419 -41 50 -226 -133 233 14 79 -31 124 35 74 21 209 61 -176 80 -22 -69 87 141 -144 -73 -64 -76 -20 -29
6444 -29 131 30 -221 30 -88 225 46 -210 103 -159 72 -98 -98 103 -2 281 -26 -4 290 -86 -3 66
6466 66 150 -62 13 -32 39 -74 251 185 -220 -39 161 -67 137 -184 33 391 41 -84 75 -111 -122 -196 -4
6489 -4 -39 76 64 106 -166 89 -5 76 -155 -27 -37 -267 60 52 108 47 -192 122 -233 129 -44 -153 -213 -33
6513 -33 -38 19 -44 -130 -97 -12 -7 171 -21 67 177 -159 182 22 48 16 -26 -69 20 -145 -168 -47 -189 -23 13 62
6539 62 -217 78 -1 -100 -79 -6 -127 65 -50 -63 37 186 -118 -17 -176 180 -258 123 120 84 -68 -17 104
6562 104 132 -107 -159 274 -164 -45 -268 -166 71 -79 69 49 -20 -127 -21 54 -88 -125 -212 33 30 122 343
6585 343 58 -28 153 68 116 102 -66 -137 -215 -46 227 -88 -8 -180 -25 -18 75 202 -145 -55 12 35 -62 22 128
6610 128 66 -204 -223 -67 0 -206 -36 -41 121 -218 38 -35 -41 -68 174 -88 -15 150 -58 -26 65 11 131 57 -103
6635 -103 -164 -46 -171 -128 5 73 -16 -17 -148 204 -86 -129 -229 -97 213 -57 -103 -111 -138 -99 -21 -109 41 -77 -205
6660 -205 -135 111 -91 -59 261 -143 4 -1 43 -102 145 135 -42 103 -114 -173 -23 23 -11 209 241 118 63 -26
6684 -26 -169 -183 -48 -40 14 28 179 151 245 -81 -68 138 9 23 21 -176 241 -50 -94 -52 -142 -328 -7 -92 84
6709 84 61 -297 120 109 -28 1 -124 -33 -209 131 82 -333 126 -270 -45 -102 216 17 57 -61 41 -145 -54
6732 -54 101 144 -71 67 95 228 88 -103 -94 9 -16 -162 -162 159 303 187 27 -2 -332 90 237 161 317
6755 317 -3 118 17 -11 -46 18 -146 -68 -246 -112 5 118 142 -78 -108 -113 8 118 -93 98 103 26 -23 171
6779 171 76 219 -106 192 -141 175 161 126 66 -54 75 15 -57 24 -149 -164 373 76 -4 53 203 -128 -28
6802 -28 106 -61 -5 -47 -239 226 131 65 37 -3 31 -308 73 -66 128 108 -2 -43 -35 -54 -29 -153 113 -210 -81
6827 -81 -106 6 201 -75 -32 126 -117 90 18 212 -167 40 43 -80 -119 -126 -41 -155 -39 -9 -102 -62 -95 -134 20
6852 20 -152 -26 -92 148 -28 69 -45 152 110 32 38 74 188 90 15 -110 -208 11 51 -148 -3 335 23 -107
6876 -107 146 14 154 58 34 238 87 66 -240 270 -73 -84 -30 30 -49 -55 200 24 49 -102 97 -218 -61
6899 -61 99 -160 -140 -22 119 -104 -69 211 47 -47 -138 76 198 -149 136 -48 129 -21 -95 43 -63 -158
6921 -158 90 -27 -94 329 -194 -13 16 114 -95 291 -157 86 -49 81 -35 -45 -60 136 -87 2 352 -66
6943 -66 -255 -37 81 87 -343 49 216 5 -49 -113 -11 36 -41 94 -95 -16 113 -293 -195 9 310 117 36
6966 36 -324 16 97 112 -196 189 91 54 97 -243 -114 -123 -217 81 -273 24 145 120 -50 -172 197 126 215 -151
6990 -151 -114 -48 -76 221 128 -113 58 214 67 -77 -108 -210 175 -103 6 -331 54 -27 -31 -126 255 187 -45
7013 -45 34 61 36 -28 158 169 39 83 55 101 0 65 98 80 30 -85 46 60 60 34 -164 6 -154 -203 217 -2
7039 -2 -59 24 -237 -242 -247 -131 68 -208 -98 1 132 -3 -6 151 -79 138 -55 98 95 63 15 22 -118 128 147 -64
7065 -64 -303 -47 9 174 51 104 -156 -138 -300 53 130 -251 -57 -65 209 -126 -81 21 59 151 -127 -295 -22
7088 -22 -73 -134 -172 93 -194 -94 69 86 48 -4 -263 -148 90 170 140 19 -98 -164 134 -32 76 105 11 46
7112 46 -15 -161 181 -162 -18 -96 -238 -158 169 -36 -144 -227 132 -9 -175 135 204 -47 45 -25 44 -73 -82 84
7136 84 13 67 66 13 184 -68 -21 -51 8 -149 85 62 -19 -270 277 -98 359 -49 136 2 45 -7 82 201 -119
7161 -119 311 -162 -29 349 26 146 -303 41 -195 169 59 64 124 -35 122 100 -116 -32 50 -24 -92 -79 20
7184 20 -90 138 -119 4 5 -23 171 -45 -295 110 80 346 -246 -131 92 116 24 2 -168 -179 45 -44 -4 204
7208 204 4 39 375 1 15 -333 112 -41 -72 5 20 -58 -173 -197 -94 -245 -39 -93 -22 5 -63 56 35 49
7232 49 58 -66 209 119 -22 -42 -102 -397 -16 -9 25 -53 9 99 168 26 50 -56 -165 -53 98 57 -80 95 -27
7257 -27 -69 -305 -116 -143 117 -79 -90 117 -33 185 -36 226 23 -94 222 -134 -161 140 42 -229 12 -51
7279 -51 99 -11 72 138 47 -378 92 -15 97 -103 -8 168 93 -329 -88 139 -148 -192 150 12 -172 -82 -40
7302 -40 24 -34 -230 -131 -50 -67 -71 -9 68 -129 75 175 -39 -31 137 -173 122 6 -102 -22 -17 -7 63 -81 -40 243
7328 243 116 14 127 -23 120 -126 200 127 250 135 25 112 -284 -217 -243 -203 -330 98 -7 29 -57 -63 -129
7351 -129 -96 151 -208 -50 143 38 24 155 -11 -15 -38 -6 -110 204 61 -139 -178 -162 15 -6 -83 -157 108 114
7375 114 262 -250 -15 10 341 47 11 289 171 35 210 115 -7 -147 -114 -60 -4 231 9 157 70 -52
7397 -52 -83 -75 49 -193 324 -24 -280 -46 -205 25 -87 -108 352 151 37 33 -20 171 87 22 -61 104 -61 103
7421 103 24 -44 8 -115 46 -3 -33 5 -166 -195 71 -121 20 -205 -165 285 -45 25 39 129 164 -176 -67 123
7445 123 -101 -4 42 -80 -30 -180 141 176 -6 30 6 -12 -170 -149 151 66 -356 -307 33 63 -13 -226 162 129
7469 129 96 -92 -116 -184 119 288 64 280 -77 -92 -127 63 -305 191 -13 -20 164 -96 -97 -297 214 22 -149
7492 -149 -1 1 39 -191 49 16 -70 -66 78 70 -180 12 -33 83 48 -168 36 26 61 -45 -92 125 119 -173 -133 74
7518 74 -84 109 12 5 15 111 186 -122 -61 115 83 74 146 34 57 39 140 3 0 -4 45 79 269 161 -126 40 -217
7545 -217 29 -64 70 167 -44 117 -111 -89 43 -15 104 -84 -81 127 -188 84 36 -112 70 51 -53 -17 -129
7568 -129 -57 95 -72 -265 -3 -43 316 -138 -11 12 -164 -96 -15 54 -90 -83 -79 148 255 44 208 -155 -218 4
7592 4 180 57 -60 113 48 -388 -76 26 77 -131 -165 43 369 -194 -170 57 30 8 155 -141 -115 -118 425 199
7616 199 0 -54 -49 12 -57 -69 -84 98 81 -97 -80 102 -211 -61 22 228 125 136 -198 83 -174 80 97 -143
7640 -143 78 -126 202 -133 18 -25 38 171 187 -224 67 59 74 244 2 131 114 74 -90 22 -162 -67 -67 85
7664 85 74 52 123 39 -57 -82 -27 143 -143 -49 70 -116 130 -10 34 -117 64 -80 14 56 -37 24 205 -29 -104
7689 -104 -51 13 54 -117 -101 -214 -160 -149 -187 183 -282 -143 -119 -60 -140 -140 -29 -49 153 -41 63 -95 30 -276
7713 -276 69 94 123 4 -144 86 99 84 16 39 -80 102 112 -68 -121 38 -162 -178 198 -97 -113 -135 -75 -75 -94
7738 -94 128 35 -221 85 -177 -43 222 -98 195 -64 72 -68 -232 -1 9 75 50 -3 154 229 101 81 -174
7761 -174 -24 129 -15 -76 164 -43 125 284 -190 -239 46 -84 -120 102 35 -9 -121 85 66 -92 8 -67
7783 -67 19 54 37 42 101 112 -10 -14 -64 82 -94 -26 -22 191 117 2 -63 24 17 35 62 -223 154 7 37 73 1 305
7811 305 -252 184 78 -156 -63 61 -76 -25 -101 -20 -9 -24 104 -220 -39 111 -18 -78 34 -1 88 -148 76
7834 76 175 -16 -105 188 277 -192 239 -81 7 -46 -121 74 -32 99 103 228 34 5 235 -3 -94 91 -93 79
7858 79 4 -4 -93 50 78 44 -56 -110 -6 -35 -10 -89 173 -53 -37 74 136 140 -165 144 156 -34 98 -16 -37 -34
7884 -34 75 -73 51 -92 -23 -32 -198 -122 -133 113 16 -116 -8 -75 -81 19 -40 -13 -58 34 -240 202 118 -30 19
7909 19 -137 -117 83 -31 -27 27 -113 47 24 152 136 -116 -220 119 116 -159 155 24 -78 -9 98 84 64 41
7933 41 -66 197 143 -23 -201 -147 5 205 21 207 125 38 -202 -48 -120 64 76 -137 -100 110 -206 67 -89
7956 -89 59 -67 -133 240 12 -220 216 -250 115 2 -136 -87 115 -24 -3 -2 -87 -50 -9 312 -38 73 10
7979 10 25 -6 129 -64 134 54 -102 -52 -104 71 87 -264 154 -125 48 -23 16 167 -70 51 -35 48 158 234
8003 234 -49 162 33 -54 108 96 26 406 35 -38 -78 -118 58 -26 -154 85 -75 -29 94 -171 128 3 -112
8026 -112 -353 11 86 33 -212 -180 143 -244 -312 51 -72 -89 -54 -93 -85 -114 -2 -1 -32 -38 146 116 -131 99 15 -114
8052 -114 -142 58 98 45 240 -15 53 -73 -118 -97 169 -89 -117 74 -73 -73 11 -118 364 169 -32 84 97 -188
8076 -188 -125 77 -142 -104 -105 -216 154 -30 -165 211 -1 -110 114 -185 -142 -234 -141 -137 149 -122 -215 151 58 -30
8100 -30 197 114 -54 226 39 -284 132 20 40 74 132 -58 71 229 -56 43 8 260 208 -130 74 276 -89
8123 -89 -206 53 119 -112 254 -11 -52 -11 87 95 -16 -66 -172 -12 63 -16 26 35 -23 78 214 222 -139 57 -223
8148 -223 -173 61 165 -77 -9 168 -70 -233 -133 34 -233 -196 30 60 238 59 -63 24 -129 43 -46 -68
8170 -68 99 30 -59 82 130 -186 -97 -282 -37 -85 294 -69 -124 149 -49 -116 118 -36 -109 -68 -200
8191b00
##END NTUPLES=NMR FID
##END=
