##TITLE=1H_LR-745-M2-PE-MT
 CDCl3
 8 sc, 
 15.04.2022
##JCAMPDX= 6.0         $$ Bruker NMR JCAMP-DX V2.0
##DATA TYPE= NMR FID
##DATA CLASS= NTUPLES
##ORIGIN= UXNMR, Bruker Analytische Messtechnik GmbH
##OWNER= root
$$ XWIN-NMR		Version 3.5
$$ Fri Apr 15 13:45:10 2022 Russian Standard Time (UT+4h)  she@DPX200
##.OBSERVE FREQUENCY= 200.13135
##.OBSERVE NUCLEUS= ^1H
##.DELAY= (6, 6)
##.ACQUISITION MODE= SIMULTANEOUS
##.ACQUISITION SCHEME= undefined
##.AVERAGES= 8
##.DIGITISER RES= 18
##SPECTROMETER/DATA SYSTEM= spect
##.PULSE SEQUENCE= zg30
##.SOLVENT NAME= CDCl3
##.SHIFT REFERENCE= (INTERNAL, CDCl3, 0, 15.7039)
##AUDIT TRAIL= $$ (NUMBER, WHEN, WHO, WHERE, WHAT)
$$ ##TITLE= Audit trail, XWIN-NMR		Version 3.5
$$ ##JCAMPDX= 5.01
$$ ##ORIGIN= Bruker BioSpin GmbH
$$ ##OWNER= she
$$ F:/spectra/data/she/nmr/H-F/1/audita.txt
$$ ##AUDIT TRAIL=  $$ (NUMBER, WHEN, WHO, WHERE, WHAT)
(   1,<2022-04-15 13:43:50.85 +0400>,<she>,<DPX200>,
      <created by zg, POWCHK disabled, PULCHK disabled
       configuration hash MD5:
       00 E9 B6 7A A2 85 ED C7 34 08 36 98 17 FE 4E 26
       data hash MD5: 16K
       FF 46 48 C1 C7 F5 63 92 3B C6 ED D7 01 E1 AC 27>)
$$ ##END=
$$ 
$$ hash MD5
$$ 2A 5D F4 71 96 E1 3A 65 12 5E C1 80 8A B9 7E 89
##$RELAX= 
##$RELAX= 
##$RELAX= 
##$RELAX= 
##$RELAX= 
##$RELAX= 
$$ Bruker specific parameters
$$ --------------------------
##$DU= <F:/spectra>
##$EXPNO= 1
##$NAME= <H-F>
##$PROCNO= 1
##$TYPE= <nmr>
##$USER= <she>
##$AMP= (0..31)
100 100 100 100 100 100 100 100 100 100 100 100 100 100 100 100 100 100 
100 100 100 100 100 100 100 100 100 100 100 100 100 100 
##$AQSEQ= 0
##$AQ_mod= 1
##$AUNM= <au_zg>
##$AUTOPOS= <>
##$BF1= 200.13
##$BF2= 200.13
##$BF3= 200.13
##$BF4= 200.13
##$BF5= 200.13
##$BF6= 200.13
##$BF7= 200.13
##$BF8= 200.13
##$BYTORDA= 1
##$CFDGTYP= 0
##$CFRGTYP= 5
##$CHEMSTR= <none>
##$CNST= (0..31)
1 1 145 1 1 1 1 1 1 1 1 1 1 1 1 1 1 1 1 1 1 1 1 1 1 1 1 1 1 1 1 1 
##$CPDPRG= <>
##$CPDPRG1= <>
##$CPDPRG2= <>
##$CPDPRG3= <>
##$CPDPRG4= <mlev>
##$CPDPRG5= <mlev>
##$CPDPRG6= <mlev>
##$CPDPRG7= <mlev>
##$CPDPRG8= <mlev>
##$CPDPRGB= <>
##$CPDPRGT= <>
##$D= (0..31)
0 1.2 0 0 0 0 0 0 0 0.06 0 0.03 0 0 0 0 0.0002 0 0 0 0 0 0 0 0 0 0 0 0 
0 0 0 
##$DATE= 1650015830
##$DBL= (0..7)
120 120 120 120 120 120 120 120 
##$DBP= (0..7)
150 150 150 150 150 150 150 150 
##$DBP07= 0
##$DBPNAM0= <>
##$DBPNAM1= <>
##$DBPNAM2= <>
##$DBPNAM3= <>
##$DBPNAM4= <>
##$DBPNAM5= <>
##$DBPNAM6= <>
##$DBPNAM7= <>
##$DBPOAL= (0..7)
0.5 0.5 0.5 0.5 0.5 0.5 0.5 0.5 
##$DBPOFFS= (0..7)
0 0 0 0 0 0 0 0 
##$DE= 6
##$DECBNUC= <off>
##$DECIM= 32
##$DECNUC= <off>
##$DECSTAT= 4
##$DIGMOD= 1
##$DIGTYP= 9
##$DL= (0..7)
0 120 120 120 120 120 120 120 
##$DP= (0..7)
150 150 150 150 150 150 150 150 
##$DP07= 0
##$DPNAME0= <>
##$DPNAME1= <>
##$DPNAME2= <>
##$DPNAME3= <>
##$DPNAME4= <>
##$DPNAME5= <>
##$DPNAME6= <>
##$DPNAME7= <>
##$DPOAL= (0..7)
0.5 0.5 0.5 0.5 0.5 0.5 0.5 0.5 
##$DPOFFS= (0..7)
0 0 0 0 0 0 0 0 
##$DQDMODE= 0
##$DR= 18
##$DS= 0
##$DSLIST= <SSSSSSSSSSSSSSS>
$$ [...]
##$SUBNAM2= <"">
##$SUBNAM3= <"">
##$SUBNAM4= <"">
##$SUBNAM5= <"">
##$SUBNAM6= <"">
##$SUBNAM7= <"">
##$SUBNAM8= <"">
##$SUBNAM9= <"">
##$SW= 18.05172834244
##$SWIBOX= (0..15)
0 0 2 0 0 0 0 0 0 0 0 0 0 0 0 0 
##$SW_h= 3612.71676300578
##$TD= 16384
##$TD0= 1
##$TE= 0
##$TE2= 300
##$TE3= 300
##$TEG= 300
##$TL= (0..7)
0 120 120 120 120 120 120 120 
##$TP= (0..7)
150 150 150 150 150 150 150 150 
##$TP07= 0
##$TPNAME0= <>
##$TPNAME1= <>
##$TPNAME2= <>
##$TPNAME3= <>
##$TPNAME4= <>
##$TPNAME5= <>
##$TPNAME6= <>
##$TPNAME7= <>
##$TPOAL= (0..7)
0.5 0.5 0.5 0.5 0.5 0.5 0.5 0.5 
##$TPOFFS= (0..7)
0 0 0 0 0 0 0 0 
##$TUNHIN= 0
##$TUNHOUT= 0
##$TUNXOUT= 0
##$USERA1= <user>
##$USERA2= <user>
##$USERA3= <user>
##$USERA4= <user>
##$USERA5= <user>
##$V9= 5
##$VALIST= <valist>
##$VCLIST= <CCCCCCCCCCCCCCC>
##$VD= 0
##$VDLIST= <DDDDDDDDDDDDDDD>
##$VPLIST= <PPPPPPPPPPPPPPP>
##$VTLIST= <TTTTTTTTTTTTTTT>
##$WBST= 1024
##$WBSW= 4
##$XGAIN= (0..3)
0 0 0 0 
##$XL= 0
##$YL= 0
##$YMAX_a= 181382
##$YMIN_a= -160011
##$ZGOPTNS= <>
##$ZL1= 120
##$ZL2= 120
##$ZL3= 120
##$ZL4= 120
##$ABSF1= 10
##$ABSF2= 0
##$ABSG= 5
##$ABSL= 3
##$ALPHA= 0
##$AQORDER= 0
##$ASSFAC= 0
##$ASSFACI= 0
##$ASSFACX= 0
##$ASSWID= 0
##$AUNMP= <proc_1d>
##$AZFE= 0.1
##$AZFW= 0.1
##$BCFW= 1
##$BC_mod= 2
##$BYTORDP= 1
##$COROFFS= 0
##$CY= 11.3945322036743
##$DATMOD= 1
##$DC= 2
##$DFILT= <>
##$DTYPP= 0
##$F1P= 2.36226072786647
##$F2P= -0.459571619588291
##$FCOR= 0.5
##$FTSIZE= 0
##$FT_mod= 4
##$GAMMA= 1
##$GB= 0.15
##$INTBC= 1
##$INTSCL= 1
##$ISEN= 128
##$LB= 0.24
##$LEV0= 0
##$LPBIN= 0
##$MAXI= 10000
##$MC2= 0
##$MEAN= 0
##$ME_mod= 0
##$MI= 1.114404
##$NCOEF= 0
##$NC_proc= 0
##$NLEV= 6
##$NOISF1= 3.799351
##$NOISF2= 2.8
##$NSP= 1
##$NTH_PI= 0
##$NZP= 0
##$OFFSET= 15.70392
##$PC= 1
##$PHC0= -18391.54
##$PHC1= 14.40074
##$PH_mod= 1
##$PKNL= yes
##$PPARMOD= 0
##$PSCAL= 0
##$PSIGN= 0
##$REVERSE= no
##$SF= 200.130013532006
##$SI= 16384
##$SIGF1= 3
##$SIGF2= 2
##$SINO= 400
##$SIOLD= 16384
##$SREGLST= <1H.CDCl3>
##$SSB= 0
##$STSI= 0
##$STSR= 0
##$SW_p= 3612.71676300578
##$SYMM= 0
##$S_DEV= 0
##$TDeff= 0
##$TDoff= 0
##$TI= <>
##$TILT= no
##$TM1= 0
##$TM2= 0
##$TOPLEV= 0
##$USERP1= <user>
##$USERP2= <user>
##$USERP3= <user>
##$USERP4= <user>
##$USERP5= <user>
##$WDW= 1
##$XDIM= 8192
##$YMAX_p= 0
##$YMIN_p= 0
$$ End of Bruker specific parameters
$$ ---------------------------------
##NTUPLES= NMR FID
##VAR_NAME=  TIME,          FID/REAL,        FID/IMAG
##SYMBOL=    X,             R,               I
##VAR_TYPE=  INDEPENDENT,   DEPENDENT,       DEPENDENT
##VAR_FORM=  AFFN,          ASDF,            ASDF
##VAR_DIM=   8192,          8192,            8192
##UNITS=     SECONDS,       ARBITRARY UNITS, ARBITRARY UNITS
##FACTOR=    0.0002768,     1,               1
##FIRST=     0,             0,               0
##LAST=      2.2672688,     0,               0
##MIN=       0,             -160011,         0
##MAX=       2.2672688,     181382,          0
$$ Real data points
##PAGE= N=1
##DATA TABLE= (X++(R..R)), XYDATA
$$ [...]
$$ plain form
2213 -2982 -2556 -1720 -370 650 2202 2698 2923 2912 2599 2296 1968 1466 1077 164 -504 -830 -773 -370 36
2232 36 18 -561 -1680 -2520 -3157 -3245 -3067 -1867 -991 149 1040 1402 1918 2094 2284 2044 1855 1439 758 424
2252 424 272 444 755 1074 1093 602 -226 -1307 -2671 -3197 -3664 -3167 -2422 -1568 -900 -302 431 1182 1371 1359
2272 1359 1826 1452 1111 928 1089 1243 1710 2261 2440 2267 1489 366 -1202 -2049 -2727 -3309 -2960 -2577 -2188
2291 -2188 -1576 -1019 -726 -310 -155 139 251 339 61 326 824 1696 2684 3219 3406 3156 1796 1048 -236
2310 -236 -954 -1517 -1978 -1993 -1930 -2109 -1565 -1365 -1229 -774 -1073 -996 -1248 -1257 -1086 -442 438 1537 2522 3468 3312
2331 3312 3090 2288 1753 843 191 -473 -627 -941 -735 -851 -769 -1036 -1002 -1302 -1719 -2021 -2600 -2484 -2233 -1260
2351 -1260 -350 596 1639 2368 2585 2538 2288 1689 1178 748 621 431 154 563 268 301 22 -473 -1069 -1715
$$ packed form
2213b982M26Q36J350J020J552M96K25j1l13l03l28n02l89r13o68l26N7M03M06
2232C6j8n79j119q40o37q8J78J200Q76J140Q91L62N16J76J90k40j89m16o81l34
2252D24j52J72L11L19J9m91q28j081j364n26m67M97P45Q54O68N98P33P51J89j2
2272A359M67l74l41j83J61J54M67N51J79j73p78j123j568q47o78n82L49L83L89
2291b188O12N57K93M16J55K94J12Q8k78K65M98Q72R88N35J87k50j360p48j284
2310b36p18n63m61j5O3j79N44K00J36M55k99P7k52rJ71O44Q80J099R85R46j56
2331C312k22q02n35r10o52o64j54l14K06j16Q2k67L4l00m17l02n79J16K51R73
2351a260R10R46J043P29K17m7k50n99n11m30j27j90k77M09k95L3k79m95n96o46
$$ plain form
2371 -1715 -2217 -2866 -2805 -2609 -2275 -1136 -52 847 1409 1755 1830 1433 1317 914 989 934 1078 1322 1645 1473
2391 1473 1247 886 -12 -926 -1223 -2110 -2779 -2877 -2289 -2165 -1503 -639 163 638 918 764 727 569 578 857 805
2412 805 1409 1920 2141 2111 1972 1504 714 -30 -759 -1527 -2009 -2529 -2461 -2061 -1536 -1030 -282 -27 -349 -340 -463
2433 -463 -644 -271 96 876 1536 1942 2532 2387 2459 1824 1519 950 196 -682 -1634 -1656 -1763 -1645 -1126 -736 -684
2454 -684 -740 -1360 -1587 -1897 -1461 -714 -601 383 1068 1539 2014 2237 2432 2300 2036 1614 921 35 -530 -819
2474 -819 -621 -519 -284 -205 -594 -1361 -1879 -2268 -2556 -2219 -1704 -1205 -678 91 690 1040 1817 1994 2325 2132
2494 2132 1640 1021 500 301 331 679 1023 1092 577 -176 -754 -1521 -2291 -2678 -2420 -2157 -1579 -1359 -849 -306
2514 -306 234 785 1457 1477 1308 795 517 359 768 1069 1604 2349 1762 1269 406 -539 -1130 -1473 -1473 -1902 -2023
$$ packed form
2371a715n02o49O1J96L34J139J084Q99N62L46P5l97j16m03P5n5J44K44L23j72
2391A473k26l61q98r14k97q87o69r8N88J24O62Q64Q02M75K80j54l7j58RK79n2
2412H05O04N11K21l0j39m68p90p44p29p68m82n20O8M00N25N06P48K55l22Rj23
2433d63j81L73L67P80O60M06N90j45P2o35l05n69p54q78r52k2j07J18N19L90N2
2454f84n6o20k27l10M36P47J13R84O85M71M75K23J95j32k64m22o93q86n65k89
2474h19J98J02K35P9l89p67n18l89k88L37N15M99N27P69N99L50P77J77L31j93
2494B132m92o19n21j99L0L48L44O9n15p53n78p67p70l87K58K63N78K20N10N43
2514c06N40N51O72K0j69n13k78j58M09L01N35P45n87m93q63r45n91l43%m29j21
$$ plain form
2535 -2023 -1951 -1912 -1485 -842 -94 216 661 351 -1 -123 76 322 797 1700 2232 2314 2217 1646 1023 448 -62
2556 -62 -569 -1111 -1326 -1645 -1843 -1730 -1456 -776 -373 -334 -436 -845 -1030 -1192 -584 -60 984 1591 2116 2448
2576 2448 1988 1784 1268 1048 862 228 -247 -840 -1219 -1222 -1227 -590 -480 -415 -660 -1336 -1809 -1692 -1658 -1180 -301 653
2598 653 1214 1353 1771 1660 1627 1561 1553 1112 540 31 -336 -369 -279 -70 -73 22 -609 -1073 -1492 -1982 -2444 -1890 -1530
2621 -1530 -784 -232 444 784 870 1169 1439 1609 1322 1063 630 218 375 728 530 699 889 241 -281 -1163
2641 -1163 -1570 -2088 -2287 -1882 -1568 -1344 -860 -202 -172 461 752 809 695 985 904 914 1026 819 1164 1513 1855
2662 1855 1699 901 469 -598 -1295 -1578 -1499 -1613 -1734 -1452 -1122 -1142 -700 -574 -362 84 215 -235 -367 344
2682 344 739 1078 1832 2093 2186 1818 1621 857 231 -19 -621 -1267 -1057 -1263 -1421 -1005 -813 -1040 -742 -666 -877
$$ packed form
2535b023P2L9M27O43P48L10M45l10l52j22J99K46M75R03N32Q2r7n71o23n75n10
2556f2n07n42k15l19j98J13K74O80M03L9j02m09j85j62O08N24J044O07N25L32
2576B448m60k04n16k20j86o34m75n93l79lnO37J10O5k45o76m73J17L4M78Q79R54
2598F53N61J39M18j11l3o6qm41n72n09l67l3R0K09lR5o31m64m19m90m62N54L60
2621a530P46N52O76L40Q6K99K70J70k87k59m33m12J57L53j98J69J90o48n22q82
2641a163m07n18j99M05L14K24M84O58L0O33K91N7j14K90q1J0J12k07L45L49L42
2662A855j56p98m32j067o97k83P9j14j21K82L30k0M42J26K12M46J31m50j32P11
2682C44L95L39P54K61R3l68j97p64o26k50o02o46K10k06j58M16J92k27K98P6k11
$$ plain form
2703 -877 -1153 -892 -629 -433 50 765 1233 1657 1978 1987 1446 1111 867 97 -72 39 -645 -732 -381 -309 -479
2724 -479 -650 -788 -1062 -1276 -1322 -1434 -1338 -772 -425 35 1036 1378 1245 1486 1207 1269 820 465 572 320 197
2745 197 500 -125 104 97 -343 -877 -894 -1161 -1724 -1519 -1281 -1408 -813 -52 334 639 1221 1211 1088 697 596
2766 596 503 598 998 911 1074 704 835 50 325 -415 -862 -1182 -1425 -1852 -1942 -1466 -1229 -824 66 462 444 581
2788 581 451 20 387 436 949 1111 1323 1568 1486 1088 777 584 182 -263 -468 -1363 -1552 -1686 -1575 -1035 -861
2809 -861 -288 -276 -269 -691 -539 -193 -215 245 631 1006 1461 1362 1542 1775 1328 1269 804 339 -135 -790 -1138 -1235
2831 -1235 -872 -824 -629 -549 -824 -1184 -1188 -1271 -791 -577 -438 72 444 916 971 1313 1768 1686 1760 1390 872 246
2853 246 -312 -142 -263 -213 107 -28 -285 -747 -1151 -1491 -1488 -1383 -1063 -579 -506 -245 210 696 1107 1486 1377
$$ packed form
2703h77k76K61K63J96M83P15M68M24L21Rn41l35k44p70j69J11o84q7L51P2j70
2724d79j71j38k74k14m6j12R6N66L47M60J001L42j33K41k79O2m49l55J07k52j23
2745A97L03o25K29pm40n34j7k67n63K05K38j27N95P61L86L05N82j0j23l91j01
2766E96r3R5M00q7J63l70J31p85K75p40m47l20k43m27r0M76K37M05Q90L96j8J37
2788E81j30m31L67M9N13J62K12K45q2l98l11j93m02m45k05q95j89j34J11N40J74
2809h61N73J2Pm22J52L46k2M60L86L75M55r9J80K33m47n9m65m65m74o55l48r7
2831a235L63M8J95Q0k75l60mq3M80K14J39N10L72M72N5L42M55q2P4l70n18o26
2853B46n58J70j21N0L20j35k57m62m04l40LJ05L20M84P3K61M55M86M11L79j09
$$ plain form
2874 1377 1347 1012 792 232 178 414 550 907 558 232 -168 -538 -1079 -1437 -1291 -1440 -1019 -1195 -1101 -714 -298
2895 -298 241 730 854 944 731 690 499 564 473 976 1008 1268 1195 677 240 39 -184 -906 -706 -907 -1450 -1394
2917 -1394 -1401 -893 -579 -240 280 424 115 -97 120 84 137 656 1167 1319 1527 1265 862 707 440 292 -103
2938 -103 -536 -919 -1268 -1261 -1071 -775 -461 -300 -209 -410 -258 -540 -470 -200 178 539 1075 1403 1104 1095 1346 1083
2960 1083 816 627 340 -187 -742 -719 -873 -1035 -661 -457 -568 -674 -999 -1002 -1478 -1011 -793 -214 225 613 1031
2981 1031 1210 1037 1236 1441 1401 784 463 349 0 -190 -95 -45 -137 -278 -571 -819 -1279 -1377 -1488 -1537 -1339 -763
3003 -763 -441 -84 441 624 643 1247 1368 1058 762 781 679 515 650 510 618 627 332 -178 -705 -726 -1449 -1291
3025 -1291 -1369 -1411 -1137 -769 -615 43 245 267 579 493 973 360 213 493 751 994 1187 1440 921 633 579
$$ packed form
2874A377l0l35k20n60n4K36J36L57l49l26m00l70n41l58J46j49M21j76R4L87M16
2895b98N39M89J24R0k13m1j91O5r1N03L2K60p3n18m37k01k23p22K00k01n43N6
2917a394pN08L14L39N20J44l09k12K17l6N3N19N11J52K08k62m03j55k67j48l95
2938a03m33l83l49PJ90K96L14J61R1k01J52k82P0K70L78L61N36L28k99rK51k63
2960A083k67j89k87n27n55K3j54j62L74K04j11j06l25lm76M67K18N79M39L88M18
2981A031J79j73J99K05m0o17l21j14l49j90R5N0r2j41k93k48m60r8j11m9J98N76
3003g63L22L57N25J83J9O04J21l10k96J9j02j64J35j40J08Rk95n10n27k1p23J58
3025a291p8m2K74L68J54O58K02K2L12q6M80o13j47K80K58K43J93K53n19k88n4
$$ plain form
3046 579 -90 -735 -885 -1069 -1064 -1183 -1021 -1116 -648 -509 -350 -49 95 -98 -99 -310 52 569 653 929 1321 1534
3068 1534 1183 1095 652 385 82 -415 -492 -506 -761 -667 -805 -572 -649 -788 -387 -431 -565 -527 -336 -283 98 626
3090 626 661 1215 1161 1308 1087 804 399 251 140 -107 -237 -582 -319 -436 -378 -523 -617 -482 -791 -805 -1244 -816
3112 -816 -539 -275 131 590 800 1008 968 1199 1026 485 480 369 152 139 -55 0 37 -213 -314 -540 -980 -1086
3134 -1086 -1068 -1255 -961 -761 -552 -123 186 284 819 1073 699 831 510 798 713 711 712 756 225 215 301 117 -295
3157 -295 -388 -538 -958 -1367 -1572 -1387 -822 -477 -155 163 4 402 256 348 439 290 495 811 1041 895 898 904
3179 904 984 421 316 243 -318 -675 -982 -1348 -1035 -1086 -799 -358 -579 -449 -607 -377 -370 -100 193 532 661 702
3201 702 1020 1065 1024 1004 1051 912 113 -15 -637 -1017 -890 -665 -392 -386 -355 -774 -693 -989 -871 -717 -293 -245 -269
$$ packed form
3046E79o69o45j50j84Nj19J62r5M68J39J59L01J44j93jk11L62N17Q4K76L92K13
3068A534l51q8m43k67l03m97p7j4k55R4j38K33p7j39M01m4j34L8J91N3L81N28
3090F26L5N54n4J47k21k83m05j48j11k47j30l45K63j17N8j45r4J35l09j4m39M28
3112h16K77K64M06M59K10K08m0K31j73n41nj11k17j3j94N5L7k50j01k26m40j06
3134a086J8j87K94K00K09M29L09R8N35K54l74J32l21K88q5kJM4n31j0Q6j84m12
3157b95r3j50m20m09k05J85N65L45L22L18j59L98j46R2R1j49K05L16K30j46LO
3179I04Q0n63j05p3n61l57l07l66L13n1K87M41k21J30j58K30PK70K93L39J29M1
3201G02L18M5m1k0M7j39p99j28o22l80J27K25K73OL1m19Q1k96J18J54M24M8k4
$$ plain form
3224 -269 136 150 439 775 1085 1417 1145 944 428 -41 -258 -191 -99 -156 -40 -35 -410 -785 -863 -800 -914 -689 -407
3247 -407 -528 -591 -297 -187 249 822 1251 1035 867 907 502 126 237 129 212 457 204 85 -115 -505 -539
3268 -539 -683 -751 -823 -1092 -831 -852 -504 -150 68 441 670 809 468 487 340 312 557 800 769 829 657 188
3290 188 92 35 -357 -430 -763 -826 -866 -1419 -897 -652 -106 -215 172 366 142 112 -48 425 327 859 978 670
3312 670 785 849 636 534 559 257 -71 -532 -924 -862 -1234 -980 -693 -514 -419 -154 -185 -604 -252 -353 241 123
3334 123 579 769 1045 1131 880 1117 770 732 346 370 -185 -351 -570 -741 -722 -621 -445 -561 -718 -562 -623 -894
3356 -894 -620 -429 -166 25 305 763 704 803 819 1045 1167 741 636 291 -27 -133 -156 -5 -61 17 -450 -481
3378 -481 -747 -762 -964 -1089 -846 -358 -490 -9 555 460 646 702 697 766 760 453 394 217 323 403 100 361 400 61
$$ packed form
3224b69M05J4K89L36L10L32k72k01n16m69k17O7R2n7J16Nl75l75p8O3j14K25K82
3247d07j21o3K94J10M36N73M29k16j68M0m05l76J11j08Q3K45k53j19k00l90l4
3268e39j44o8p2k69K61k1L48L54K18L73K29J39l41J9j47k8K45K43l1O0j72m69
3290A88r6n7l92p3l33o3m0n53N22K45N46j09L87J94k24l0j60M73r8N32J19l08
3312F70J15O4k13j02K5l02l28m61l92O2l72K54K87J79R5K65l1m19L52j01N94j18
3334A23M56J90K76Q6k51K37l47l8l86K4n55j66k19j71J9J01J76j16j57J56o1k71
3356h94K74J91K63J91K80M58n9R9J6K26J22m26j05l45l18j06k3J51n6P8m67l1
3378d81k66j5k02j25K43M88j32M81N64r5J86N6nO9ol07n9j77J06Q0l03K61L9l39
$$ plain form
3402 61 -369 -423 -521 -875 -775 -1013 -735 -426 -408 -336 39 209 564 472 328 259 448 302 446 700 356 688
3424 688 543 249 166 159 17 -258 -774 -1184 -774 -583 -884 -465 -358 -149 -107 15 144 271 28 -45 416 378
3446 378 610 435 1136 622 394 340 149 -187 -224 -551 -379 -576 -484 -561 -447 -504 -364 -245 -353 -195 -286 97
3468 97 -214 185 381 590 699 577 830 790 585 456 56 -148 -19 -396 -272 -269 -220 -482 -530 -470 -633 -689 -575
3491 -575 -527 -226 -171 -325 -13 299 708 992 628 681 705 526 513 333 309 201 -153 -42 -201 -126 -574 -286
3513 -286 -526 -722 -737 -705 -980 -594 -541 -264 292 275 583 922 605 498 655 379 665 416 557 467 223 349
3535 349 67 125 158 -163 -497 -713 -782 -1176 -932 -646 -383 -273 11 63 136 401 325 310 352 352 554 612 450 447
3559 447 186 515 514 332 18 -57 -612 -483 -748 -718 -776 -430 -45 -565 -154 -329 -290 -137 141 391 121 168
$$ packed form
3402F1m30n4r8l54J00k38K78L09J8P2L75J70L55r2j44o9J89j46J44K54l44L32
3424F88j45k94q3pj42k75n16m10M10J91l01M19J07K09M2J22J29J27k43p3M61l8
3446C78K32j75P01n14k28n4j91l36l7l27J72j97R2p7J14n7J40J19j08J58r1L83
3468I7l11L99J96K09J09j22K53m0k05j29m00k04J29l77J24LM9k62m8O0j63n6J14
3491e75M8L01N5j54L12L12M09K84l64N3K4j79j3j80k4j08l54J11j59P5m48K88
3513b86k40j96j5L2k75L86N3K77N56j7L08L39l17j07J57k76K86k49J41r0k44J26
3535C49k82N8L3l21l34k16o9l94K44K86K63J10K84N2P3K65p6j5M2%K02N8j62l
3559D47k61L29jj82l14p5n55J29k65L0n8L46L85n20M11j75L9J53K78K50k70M7
$$ plain form
3581 168 423 375 657 793 880 705 372 218 120 -178 -318 -520 -657 -298 -261 -532 -378 -480 -200 -203 -194 -135 -255
3604 -255 -176 134 304 354 425 818 696 755 577 499 -19 185 -311 -260 -180 -206 -103 -407 -364 -513 -251 -469 -419
3627 -419 -98 -496 -321 -250 -48 208 339 560 692 485 359 390 51 156 235 42 65 181 -77 -172 -354 -235
3649 -235 -309 -571 -568 -667 -597 -558 -539 23 -56 646 680 355 375 366 658 453 312 630 417 178 337 249 148 -80
3673 -80 -267 -125 -448 -605 -874 -814 -698 -261 -272 -27 -141 62 94 -10 175 195 585 400 257 393 400 326 528
3696 528 334 316 -134 136 -588 -584 -645 -756 -533 -618 -193 -230 -316 -350 -177 -313 -135 129 394 331 504 568 531 537
3720 537 502 659 477 208 40 71 -437 -385 -555 -468 -420 -437 -262 -369 -312 -364 -123 -448 -172 261 149 170 361
3743 361 384 859 608 879 646 600 310 144 -59 88 120 -119 -557 -210 -170 -175 -579 -435 -459 -728 -446 -414 149
$$ packed form
3581A68K55m8K82J36Q7j75l33j54r8k98j40k02j37L59L7k71J54j02K80lRN9j20
3604b55P9L10J70N0P1L93j22N9j78p8n18K04m96N1Q0k6J03l04M3j49K62k18N0
3627d19L21l98J75P1K02K56J31K21J32k07j26L1l39J05P9j93K3J16k58r5j82J19
3649b35p4k62Lr9P0L9J9N62p9P02L4l25K0rK92k05j41L18k13k39J59q8j01k28
3673h0j87J42l23j57k69O0J16M37j1K45j14K03L2j04J85K0L90j85j43J36Pp4K02
3696E28j94j8m50K70p24Mo1j11K23q5M25l7q6l4J73j36J78K64K65o3J73O4l7O
3720E37l5J57j82k69j68L1n08N2j70Q7M8j7J75j07N7n2K41l25K76M33j12K1J91
3743C61K3M75k51K71k33m6k90j66k03J47L2k39m38L47M0nm04J44k4k69K82L2N63
$$ plain form
3766 149 -62 -1 -70 486 316 560 406 539 321 276 22 232 -75 141 -134 110 -242 -255 -229 -416 -391 -677
3788 -677 -492 -545 -207 -141 -147 229 211 210 391 330 403 264 386 241 227 288 532 372 31 -96 18 -289 -525 -426
3812 -426 -392 -646 -624 -315 -387 -77 -170 56 208 268 39 126 334 426 471 629 513 409 281 291 149 282 -231
3835 -231 -29 -701 -545 -423 -674 -360 -198 -478 -359 -271 10 63 -109 -8 -151 165 247 138 287 636 620
3856 620 668 429 209 118 -15 -255 -218 -341 -473 -425 -574 -365 -161 -471 -244 -361 -326 -350 -278 -259 120 447 364
3879 364 549 602 616 502 376 573 271 122 -112 -68 117 -331 -240 -38 -213 -255 -296 -456 -402 -354 -495 -419 54
3902 54 151 273 166 411 526 312 406 606 554 625 192 294 106 56 -61 95 186 -142 -97 -227 -597 -474 -462
3925 -462 -575 -273 -231 -85 55 218 236 393 356 397 191 288 270 184 268 60 216 243 131 -6 -172 -350 -649
$$ packed form
3766A49k11O1o9N56j70K44j54J33k18m5k54K10l07K16k75K44l52j3K6j87K5k86
3788f77J85n3L38O6oL76j8jJ81o1P3j39J22j45j4O1K44j60l41j27J14l07k36R9
3812d26L4k54K2L09p2L10r3K26J52O0k29Q7K08R2M5J58j16j04j28J0j42J33n13
3835b31K02o72J56J22k51L14J62k80J19Q8K81N3j72J01j43L16Q2j09J49L49j6
3856F20M8k39k20r1j33k40L7j23j32M8j49K09K04l10K27j17L5k4P2J9L79L27q3
3879C64J85N3J4j14j26J97l02j49k34M4J85m48R1K02j75m2m1j60N4M8j41P6M73
3902E4R7J22j07K45J15k14R4K00n2P1m33J02j88n0j17J56R1l28M5j30l70J23J2
3925d62j13L02M2J46J40J63J8J57l7M1k06R7j8q6Q4k08J56K7j12j37j66j78k99
$$ plain form
3948 -649 -478 -311 -393 -365 -187 -273 -62 -233 -68 155 419 350 171 142 332 221 615 591 434 368 287 4 -204
3971 -204 -14 -266 -348 -466 -223 -205 -479 -314 -363 92 -79 -15 52 135 73 276 116 364 575 605 614 406 315 301
3995 301 84 -97 76 -263 -490 -394 -317 -367 -323 -231 -196 -322 -70 -4 -144 -181 -304 -28 235 380 513 460 470
4018 470 428 207 250 305 118 6 -25 5 -175 -474 1 -88 -240 -411 -543 -430 -364 -597 -570 191 270 65 285
4041 285 388 356 448 573 254 292 366 238 67 224 -33 133 -532 -153 -236 -408 -200 -794 -403 -607 -268 18
4063 18 -147 -25 23 106 138 72 118 279 448 290 214 171 142 242 273 545 11 47 2 -273 -323 -493 -668 -512
4087 -512 -256 -444 -286 -345 -16 -10 -8 162 238 -17 224 232 323 350 610 251 27 271 -209 362 -139 -292 -721
4110 -721 -317 -397 -285 -412 -109 -190 -467 -332 -22 -98 -52 -31 108 391 306 421 445 449 310 515 142 162 -160
$$ packed form
3948f49J71J67q2K8J78q6K11j71J65K23K64o9j79k9J90j11L94k4j57o6q1k83k08
3971b04J90k52q2j18K43J8k74J65m9M55j71O4O7Q3o2K03j60K48K11L0Rk08r1j4
3995C01k17j81J73l39k27R6P7n0M4R2L5j26K52O6j40l7j23K76K63J45J33n3J0
4018D70m2k21M3N5j87j12l1L0j80k99M75q9j52j71j32J13O6k33K7P61P9k05K20
4041B85J03l2R2J25l19L8P4j28j71J57k57J66o65L79q3j72K08n94L91k04L39K86
4063A8j65J22M8Q3L2o6M6J61J69j58p6m3k9J00L1K72n34L6m5k75n0j70j75J56
4087e12K56j88J58n9L29OKJ70P6k55K41QR1K7K60l59k24K44m80N71n01j53m29
4110g21M04q0J12j27L03q1k77J35L10p6M6K1J39K83q5J15K4Mj39K05l73K0l22
$$ plain form
4133 -160 -126 9 -49 -83 19 -112 -192 -338 -319 -344 -519 -159 -243 220 45 125 213 205 356 443 240 377 507 69
4157 69 78 123 -49 27 -97 -213 -297 -155 -33 -310 -430 -289 -384 -351 10 -27 309 173 197 426 319 520 205
4180 205 234 137 191 223 -79 312 122 203 -112 -31 -368 -286 -309 -496 -444 -415 -325 -587 -257 -80 168 224 123 133
4204 133 321 346 303 223 394 418 379 300 173 366 10 -191 -235 -326 -413 -185 -373 -236 -200 -289 -184 65 -180 -213
4228 -213 -34 -38 -43 -68 -128 247 408 272 352 322 476 120 241 318 -166 -47 -426 -69 -117 -399 -479 -573 -349 -336
4252 -336 -192 -133 -295 -132 -13 257 386 207 287 287 448 178 228 210 260 262 -199 -104 -29 -115 -108 -93 -389 -225 -210
4277 -210 -380 -445 -132 -196 -191 -330 323 162 68 178 134 50 -71 228 232 171 4 95 113 59 -87 62 -15 -181 -376
4302 -376 -283 -468 -539 -148 -6 -94 -63 -36 211 123 105 274 252 187 407 220 71 230 66 9 381 179 92 -178
$$ packed form
4133a60L4J35n8l4J02j31q0j46J9k5j75L60q4M63j75Q0Q8qJ51Q7k03J37J30m38
4157F9RM5j72P6j24j16q4J42J22k77j20J41r5L3L61l7L36j36K4K29j07K01l15
4180B05K9r7N4L2l02L91j90Q1l15Q1l37Q2k3j87N2K9R0k62L30J77K48N6j01J0
4204A33J88K5m3q0J71K4l9p9j27J93l56k01m4r1q7K28j88J37L6q9J05K49k45l3
4228b13J79mnk5o0L75J61j36Q0l0J54l56J21P7m84J19l79L57m8k82q0r4K24J3
4252c36J44N9j62J63J19K70J29j79Q0%J61k70N0j8N0Km61R5P5q6PJ5k96J64J5
4277b10j70o5L13o4Nj39O53j61r4J10m4q4j21K99Mo1j67R1J8n4j46J49p7j66j95
4302c76R3j85p1L91J42q8L1K7K47q8j8J69k2o5K20j87j49J59j64n7L72k02q7k70
$$ plain form
4326 -178 -355 -170 -515 -279 -310 -145 -208 -143 -123 -148 37 48 388 283 148 357 400 -43 562 381 192 201 286
4349 286 -75 226 3 -225 -287 -769 -357 -229 -520 -391 -293 -304 -407 -108 35 137 90 185 60 63 85 527 469
4372 469 694 293 259 6 -17 -88 -166 -172 -281 -347 -188 -341 -300 -204 -145 -30 -191 -127 -270 -289 164 170 199 287 380 352
4398 352 318 504 37 82 39 183 -166 -5 -116 -247 -257 -172 -232 -222 -266 -318 -310 -331 -229 -190 -211 98 313 46 157
4423 157 383 65 391 323 122 247 209 142 46 185 -116 -41 45 -251 -236 -133 -465 -445 -68 -290 -118 4 75
4446 75 81 -42 113 -7 42 214 146 401 120 235 160 76 113 -262 72 -216 -274 -236 -270 -243 -158 -361 -349 -4 -191
4471 -191 -121 10 62 -36 48 -4 65 138 338 155 79 175 197 -84 33 186 -103 -92 -212 -30 -96 -165 -170 -5 -392
4496 -392 -180 -24 18 79 -338 54 128 103 143 173 203 91 445 203 267 466 -221 127 -265 -99 50 -211 12
$$ packed form
4326a78j77J85l45K36l1J65o3O5K0k5J85J1L40j05j35K09M3m43O05j81j89RQ5
4349B86l61L01k23k28o2m82M12J28k91J29R8j1j03K99J43J02m7R5j25LK2M42n8
4372D69K25m01l4k53k3p1p8oj09o6J59j53M1R6N9J15j61O4j43j9M53OK9Q8R3k8
4398C52l4J86m67M5m3J44l49J61j11j31j0Q5o0J0m4n2Qk1J02L9k1L09K15k67J11
4423A57K26l18L26o8k01J25l8o7r6J39l01P5Q6k96J5J03l32K0L77k22J72J22P1
4446G5Oj23J55j20M9J72o8K55k81J15p5q4L7l75L34k88n8L8l4K7Q5k03J2L45j87
4471a91P0J31N2r8Q4n2O9P3K00j83p6R6K2k81J17J53k89J1j20J82o6o9nJ65l87
4496c92K12J56M2O1m17L92P4k5M0L0L0j12L54k42O4J99o87L48l92J66J49k61K23
$$ plain form
4519 12 -328 -357 -254 -88 -408 -8 56 -15 -65 334 -8 170 275 41 541 250 300 246 42 74 50 -32 -52 -111
4543 -111 -185 -140 -411 -206 -371 -455 -362 -348 -97 -175 169 -44 102 27 149 212 466 -95 74 211 142 213 -36
4566 -36 208 10 127 122 -96 -123 -300 -207 -283 -205 -384 -166 -125 -131 -228 -319 79 38 60 145 284 -87 239 136 163
4591 163 195 90 107 317 82 -136 16 -53 -136 184 -214 -150 -163 -201 121 -188 -184 9 153 -231 -18 78 151 220
4615 220 74 431 504 182 312 216 -38 0 186 12 -111 -154 -219 -452 -167 25 -246 -239 196 -34 115 -132
4637 -132 289 145 65 156 133 67 126 258 82 84 54 -104 34 -120 -271 -155 -78 -331 -224 -175 109 -176 -133 -6
4661 -6 -22 -365 -34 -33 76 271 122 325 133 275 100 47 -97 -34 -125 25 223 -78 -173 -107 6 -301 -53
4684 -53 -308 -209 -249 100 4 -55 155 -43 -40 112 221 343 303 263 -60 -35 71 38 171 97 -1 -68 90 113 -291
$$ packed form
4519A2l40k9J03J66l20M00O4p1n0L99l42J78J05k34N00k91N0n4k04L2k4q2k0n9
4543a11p4M5k71K05j65q4R3J4K51p8L44k13J46p5J22O3K54n61J69J37o9P1k49
4566c6K44j98J17nk18k7j77R3p6P8j79K18M1or7r1L98m1K2Q5J39l71L26j03K7
4591A63L2j05J7K10k35k18J52o9q3L20l98O4j3l8L22l09MJ93J44l84K13R6P3O9
4615B20j46L57P3l22J30r6k54L8J86j74j23m3o5k33K85J92k71PM35k30J49k47
4637a32M21j44q0R1k3o6N9J32j76Kl0j58J38j54j51J16P7k53J07M9K84k85M3J27
4661fj6l43L31JJ09J95j49K03j92J42j75n3j44O3r1J50J98l01r5O6J13l07K48
4684e3k55R9m0L49r6n9K10j98LJ52J09J22m0m0l23K5J06l3J33p4r8o7J58K3m04
$$ plain form
4709 -291 -388 -255 -193 -223 8 -30 -190 -257 -101 191 -46 -7 -15 83 -21 412 -3 164 146 332 -6 190 -48
4732 -48 -194 -113 -134 -177 -31 -142 -91 -458 -331 -122 -348 244 165 -123 -264 75 214 101 110 161 375 183 -42
4755 -42 274 191 -90 -157 -108 -143 195 -218 -395 -215 -304 -256 -68 -194 -218 -263 -135 84 -82 14 44 67 450 271
4779 271 185 -41 486 211 91 132 51 42 -120 -232 -139 -48 67 -111 -35 -67 55 -332 -103 -99 -150 129 91 -111
4803 -111 8 257 248 82 287 107 207 214 205 -90 -69 -192 -106 70 -187 -156 -211 -29 -281 -308 -134 -43 -73 1 15
4828 15 255 62 77 110 -5 121 169 128 40 -16 50 -124 130 59 174 -8 -242 -319 23 67 -115 -256 -53 -110
4852 -110 242 -29 -174 422 126 81 417 94 208 126 76 51 57 157 179 -13 -154 -136 -171 -139 -93 -54 -290 -149
4876 -149 -53 119 -143 -152 -252 -113 8 -118 238 137 182 252 1 3 423 92 183 161 -95 -136 -208 -85 -21 -178
$$ packed form
4709b91r7J33O2l0K31l8j60o7J56K92k37L9qR8j04M33m15J67j8J86l38J96k38
4732d8j46Q1k1m3J46j11N1l67J27K09k26N92p9k88j41L39J39j13RN1K14j92k25
4755d2L16q3k81o7M9l5L38m13j77J80q9M8J88j26k4m5J28K19j66R6L0K3L83j79
4779B71q6k26N27k75j20M1q1rj62j12R3R1J15j78P6l2J22l87K29Mn1K79l8k02
4803a11J19K49rj66K05j80J00Prk95K1j23Q6J76k57L1n5J82k52k7J74R1l0P4J4
4828A5K40j93J5L3j15J26M8m1q8n6O6j74K54p1J15j82k34p7L42M4j82j41K03n7
4852a10L52k71j45N96k96m5L36l23J14q2n0k5OJ00K2j92j41J8l5L2M6L9k36J41
4876a49R6J72k62rj00J39J21j26L56j01M5P0k51KM20l31R1k2k56m1p2J23O4j57
$$ plain form
4900 -178 -167 -208 -259 -83 117 -295 -197 -143 -27 254 142 359 289 88 249 185 230 134 159 -203 32 -184 77
4923 77 -219 -22 -179 -357 -254 -297 -239 -191 -103 -299 38 -233 -67 -156 84 131 243 108 220 219 -38 234 60
4946 60 -119 270 33 285 149 67 -261 -35 -3 -47 -110 -210 -117 -26 -319 -339 -76 35 -115 116 62 184 151
4969 151 258 135 321 -7 137 98 169 224 -53 -123 -192 97 -338 -49 -235 -275 -234 -271 -50 312 175 -260 140
4992 140 11 30 33 283 177 132 178 301 195 -164 -304 -14 174 91 -184 -309 -219 63 -41 -62 346 -54 7
5015 7 102 71 66 113 232 -169 115 170 225 -6 9 166 253 -4 -180 120 -207 -289 27 -275 -290 -122 -194 -231 -83
5040 -83 -208 81 -173 -3 -64 -70 124 143 43 83 77 206 204 330 180 -96 72 -242 93 -90 -134 9 28 -137
5064 -137 -160 -96 -4 47 -198 38 64 -3 -161 13 113 239 381 153 172 206 46 -32 122 -84 -104 76 -55
$$ packed form
4900a78J1m1n1J76K00m12R8N4J16K81j12K17p0k01J61o4M5r6K5l62K35k16K61
4923G7k96J97j57j78J03m3N8M8Q8j96L37k71J66q9K40M7J12j35J12jk57K72j74
4946F0j79L89k37K52j36q2l28K26L2m4o3j00R3R1k93k0K63J11j50K31n4J22l3
4969A51J07j23J86l28J44l9P1N5k77p0o9K89m35K89j86m0M1l7K21L62j37m35M00
4992A40j29J9LK50j06m5M6J23j06l59j40K90J88q3k75j25R0K82j04k1M08m00O1
5015GR5l1nM7J19m01K84N5N5k31J5J57Q7k57j76L00l27q2L16l02j5J68p2l7J48
5040h3j25K89k54J70o1oJ94J9j00M0oJ29kJ26j50k76J68l14L35j83m4J43J9j65
5064a37k3O4R2N1k45K36K6o7j58J74J00J26J42k28J9L4j60p8J54k06k0J80j31
$$ plain form
5087 -55 -80 -146 -147 -148 -51 15 -171 -168 -92 -120 -213 151 313 -64 -131 -27 274 -27 -47 174 -145 168 54 61 -89 6
5113 6 157 78 -41 107 -578 -174 19 -101 -188 -304 -260 -129 -20 172 27 297 202 145 -47 19 -20 -106 228
5136 228 -64 -104 128 -226 50 83 -138 -108 -65 -60 121 -30 -100 179 49 15 -58 -62 -111 81 115 173 -117 182 -13
5161 -13 -16 194 -147 19 117 -118 -79 -102 -219 -171 49 121 20 221 -111 -179 129 -83 58 46 86 81 36 -83 16
5186 16 179 -51 34 238 74 152 -176 -241 -156 121 -98 -318 -79 -157 -281 -179 -16 -27 -6 -175 -59 66 -290
5209 -290 -84 223 107 111 -97 -260 79 72 28 -65 10 -105 -65 24 43 -246 -181 -115 -66 -379 75 -141 0 -69 81
5234 81 129 -30 -35 -124 104 -109 190 46 279 -51 155 -92 115 326 49 -179 -27 -94 36 -76 -215 77
5256 77 192 -235 160 215 -102 163 99 14 -143 -51 6 228 118 113 -18 353 220 281 -79 -25 -26 -182 -87 -104 -196
$$ packed form
5087e5k5o6jjR7O6j86LP6k8r3L64J62l77o7J04L01l01k0K21l19L13j14Pj50R5
5113FJ51p9j19J48o85M04J93j20q7j16M4J31J09J92j45K70r5n7j92O6l9q6L34
5136B28k92m0K32l54K76L3k21L0M3NJ81j51p0K79j30l4p3mm9J92L4N8k90K99j95
5161a3lK10l41J66R8k35L9k3j17M8K20P2j01K01l32o8L08k12J41j2M0nm5j19R9
5186A6J63k30Q5K04j64P8l28o5Q5K77k19k20K39p8j24J02J63j1K1j69J16J25l56
5209b90K06L07j16Mk08j63L39pm4r3P5j15M0Q9J9k89O5O6M9l13M54k16J41o9J50
5234H1M8j59nq9K28k13K99j44K33l30K06k47K07K11k77k28J52o7J30j12j39K92
5256G7J15m27L95N5l17K65o4q5j57R2N7K22j10nj31L71j33O1l60N4jj56R5j7r2
$$ plain form
5281 -196 -28 -203 -37 -164 31 -179 44 18 -20 -310 243 55 188 100 70 110 47 359 199 -260 3 -115
5303 -115 45 -118 -88 90 21 -259 158 49 -237 105 -156 -198 -195 52 6 107 61 64 392 -95 205 199 -65 263
5327 263 38 2 -225 -157 27 -34 -105 -48 -98 -67 -6 -100 -14 -124 -34 -111 15 164 18 -239 348 142 -76 67
5351 67 -101 -5 107 201 164 -149 -128 -46 -151 29 -107 -39 -97 -319 -203 -161 -6 110 79 -45 -99 -103 57 -44
5375 -44 182 168 215 -79 48 152 -18 111 51 92 -194 13 -172 -71 -76 212 193 -9 -245 97 137 83 354
5398 354 41 -197 -16 84 204 153 386 45 226 40 -81 164 -185 -3 -230 -213 -47 -129 -102 -124 17 113
5420 113 6 56 -144 47 80 163 42 137 1 60 38 1 258 -71 276 243 328 107 2 34 -69 29 -119 -112
5444 -112 57 -101 -176 -145 -235 -193 -150 -104 -76 -25 262 164 285 212 211 21 468 119 -226 10 142 -18 -94 -77 136
$$ packed form
5281a96J68j75J66j27J95k10K23k6l8k90N53j88J33q8l0M0o3L12j60m59K63j18
5303a15J60j63L0J78o9k80M17j09k86L42k61m2LK47m6J01m6LL28m87L00ok64L28
5327B63k25l6k27O8J84o1p1N7n0L1O1r4Q6j10R0p7J26J49j46k57N87k06k18J43
5351F7j68R6J12R4l7l13K1Q2j05J80j36O8n8k22J16M2J55J16l1j24n4mJ60j01
5375d4K26j4M7k94J27J04j70J29o0M1k86K07j85J01nK88j9k02k36L42M0n4K71
5398C54l13k38J81J00J20n1K33l41J81j86j21K45l49J82k27J7J66q2K7k2J41R6
5420A13j07N0k00J91L3Q3j21R5j36N9k2l7K57l29L47l3Q5k21j05L2j03R8j48P
5444a12J69j58p5L1r0M2M3M6K8N1K87r8J21p3jj90M47l49l45K36J32j60p6J7K13
$$ plain form
5469 136 -181 86 -190 -204 -43 33 -47 -67 -42 -198 195 -5 -38 -89 163 185 131 180 110 17 -82 122 268 -72
5493 -72 -19 231 -107 -82 112 -212 -53 -70 166 -238 -253 -51 84 130 8 -83 -13 24 -52 236 6 -116 87
5516 87 205 46 88 113 20 -9 -97 104 81 22 -240 -6 146 171 -3 -372 -104 -104 83 -102 -59 -104 -36 138 15
5541 15 60 -31 128 -162 -12 -111 127 70 -284 -96 -18 -125 40 -331 -52 -136 -74 -160 61 44 -97 254 -1
5564 -1 19 -49 106 75 106 182 51 -52 36 -289 86 68 -77 -106 -159 163 -41 -152 -262 57 -191 -91 -242 -130
5588 -130 -32 129 5 -4 210 32 292 206 9 91 251 -54 -37 35 -21 -69 60 -142 1 21 -104 -179 -187 -218 -73
5613 -73 15 -7 51 250 -67 144 169 184 43 -86 134 304 -29 -3 28 154 26 -2 33 -85 -150 -273 -229 -55
5637 -55 -91 92 83 -92 305 -65 71 30 59 99 137 190 -116 192 161 -78 219 199 21 26 -169 171 -166 -169 204
$$ packed form
5469A36l17K67k76j4J61P6q0k0K5j56L93k00l3n1K52K2n4M9p0r3r9K04J46l40
5493g2N3K50l38K5J94l24J59j7K36m04j5K02J35M6j22r1P0L7p6K88k30j22K03
5516H7J18j59M2K5r3k9q8K01k3n9k62K34J52K5j74l69K68%J87j85M3m5O8J74j23
5541A5M5r1J59k90J50r9K38n7l54J88P8j07J65l71K79q4O2q6K21j7j41L51k55
5564aK0o8J55l1L1P6j31j03Q8l25L75j8j45k9n3L22k04j11j10L19k48J00j51J12
5588a30R8J61j24rK14j78K60q6j97Q2J60l05J7P2n6m8J29k02J43K0j25p5ql1J45
5613g3Q8k2N8J99l17K11K5J5j41j29K20J70l33K6L1J26j28k8L5j18o5j23M4J74
5637e5l6J83rj75L97l70J36m1K9M0L8N3l06L08l1k39K97k0j78Nj95L40l37lL73
$$ plain form
5662 204 -60 65 160 -96 -257 28 -70 105 -89 127 39 -93 -116 213 -131 250 118 215 111 231 38 3
5684 3 59 -31 -114 23 53 -179 -15 -64 -8 99 88 -5 -4 -255 -109 -99 259 89 4 -27 -28 110 -74 70 -4 132
5710 132 95 -36 -55 196 4 22 -230 28 -143 21 -123 -14 -67 44 -69 289 -59 -36 -136 -5 187 43
5732 43 134 -104 84 127 -62 -62 136 93 -135 -329 60 -38 -96 -87 -130 -40 -9 -46 170 -5 165 35 134 93 221
5757 221 -23 -95 114 -181 97 109 141 123 -18 24 -62 -149 -141 -180 85 -127 64 -140 -25 -40 -229 221 238 132
5781 132 83 254 -107 128 49 82 -3 -28 1 -29 -130 74 89 -174 -29 -80 16 -13 -185 56 -42 13 41 -224 40
5806 40 -28 106 -55 -98 -96 238 281 192 320 103 -21 121 50 66 -51 -18 -58 -55 -46 -43 -29 -28 -70 -23 -35 -144 49 54
5834 54 97 254 26 -90 -83 153 -34 23 50 -72 62 42 -16 -39 -151 -180 -214 165 10 145 -11 -170 -3 14
$$ packed form
5662B04k64J25R5k56j61K85r8J75j94K16q8j32k3L29l44L81j32R7j04J20j93l5
5684CN6r0q3J37L0k32J64m9N6J07j1r3Jk51J46J0L58j70q5l1jJ38j84J44p4J36
5710A32l7j31j9K51j92J8k52K58j71J64j44J09n3J11j13L58l48K3j00J31J92j44
5732D3R1k38J88M3j89%J98m3k28j94L89r8n8Rm3R0L1l7K16j75J70j30R9m1J28
5757B21k44p2K09k95K78J2L2j8j41M2q6q7Ql9K65k12J91k04J15j5j89M50J7j06
5781A32m9J71l61K35p9L3q5k5K9l0j01K04J5k63J45n1R6k9j72K41r8N5K8k65K64
5806D0o8J34j61m3KL34M3q9J28k17j24J42p1J6j17L3m0LRLJ4Jm2M7j2j09J93N
5834E4M3J57k28j16PK36j87N7K7j22J34k0n8k3j12k9l4L79j55J35j56j59J67J7
$$ plain form
5858 14 -120 -61 -56 103 181 -97 49 -91 -227 204 186 -88 88 45 162 222 -113 66 -114 -40 -212 -101 -117
5881 -117 -13 -69 56 68 131 -58 56 -61 -14 -60 20 -160 -59 378 -41 213 223 -59 11 -41 -64 322 -158
5904 -158 98 -205 -79 118 -87 -67 10 -96 71 55 -23 8 -13 72 -276 40 29 -82 156 211 173 -171 -22
5927 -22 -7 236 -33 -120 20 -25 208 -144 -157 -163 6 -45 68 156 -48 -67 -1 7 103 293 260 255 268 160 -67 -106
5953 -106 17 -173 -112 56 -109 -77 0 116 -105 -70 -173 -213 -83 74 124 -140 -122 -6 186 81 324 60
5975 60 38 -51 -44 1 -51 -88 19 -20 -160 19 91 -25 -33 50 -9 -87 21 101 -42 -156 -198 99 323 -278 288 -15
6001 -15 123 -67 44 13 -128 -38 -262 96 -67 34 204 -45 -217 40 -15 -157 -218 -26 -95 -65 155 -31
6023 -31 -302 -14 -99 58 -14 49 -3 -6 -65 -36 22 -158 223 -56 -200 37 -273 -107 -122 377 -76 -39 -49 310
$$ packed form
5858A4j34N9NJ59P8k78J46j40j36M31j8k74J76m3J17O0l35J79j80P4j72J11j6
5881a17J04n6J25J2O3j89J14j17M7m6Q0j80J01M37m19K54J0k82P0n2k3L86m80
5904a58K56l03J26J97k05K0P7j06J67j6p8L1k1Q5l48L16j1j11K38N5l8l44J49
5927b2J5K43k69q7J40m5K33l52j3oJ69n1J13Q8k04j9O6QR6J90l3nJ3j08k27l9
5953a06J23j90O1J68j65L2P7J16k21L5j03m0J30J57N0k64J8J16J92j05K43k64
5975F0k2q9PM5n2l7J07l9j40J79P2j16qQ3n9p8J08Q0j43j14m2K97K24o01N66l03
6001a5J38j90J11l1j41R0k24L58j63J01J70k49j72K57n5j42o1J92o9L0K20j86
6023c1k71K88q5J57p2O3n2ln9K9N8j80L81k79j44K37l10J66j5M99m53L7j0L59
$$ plain form
6047 310 -26 184 51 -39 -45 -284 6 -234 -15 169 156 93 23 -36 48 -25 -52 18 -73 -192 -34 -183 -174 -79 -103
6072 -103 146 -107 -89 -216 -75 205 -35 -123 1 -45 -26 353 122 -1 -39 -239 -41 24 -37 215 -109 222
6094 222 -65 -171 -33 33 -220 -111 -173 -75 -156 -216 56 -204 178 223 -98 -144 85 10 67 160 -81 -113 71 -90
6118 -90 -85 -26 205 -70 149 -4 76 -200 -320 14 -129 -183 55 50 59 0 225 -144 79 224 9 108 64 6 92
6143 92 124 24 -167 -6 120 -86 -44 -74 16 -80 28 211 -187 25 -41 9 17 84 198 19 15 81 -96 -54 205
6168 205 150 187 56 244 -42 -55 21 -252 57 42 -6 -240 -95 129 11 -41 37 39 -30 14 282 52 -143 -68
6192 -68 19 89 246 55 165 51 -241 39 118 -116 50 12 -26 194 -146 -75 161 40 -220 -32 -143 8
6214 8 -39 169 118 277 105 11 -56 264 31 100 -38 -196 -101 -5 -238 -43 25 272 -232 235 -75 -300 -15
$$ packed form
6047C10l36K10j33r0ok39K90k40K19J84j3o3p0n9Q4p3k7P0r1j19J58j49RR5k4
6072a03K49k53J8j27J41K80k40q8J24m6J9L79k31j23l8k00J98O5o1K52l24L31
6094B22k87j06J38O6k53J09o2R8q1o0K72k60L82M5l21m6K29p5N7R3k41l2J84j61
6118i0NN9K31k75K19j53Q0k76j20L34j43n4K38nRn9K25l69K23J45k15R9m4n8Q6
6143I2L2j00j91J61J26k06M2l0R0r6J08J83l98K12o6N0QO7J14j79mO6j77M2K59
6168B05n5L7j31J88k86j3P6k73L09j5m8k34J45K24j18n2P8Ko9M4K68k30j95P5
6192f8Q7P0J57j91J10j14k92K80P9k34J66l8l8K20l40P1K36j21k60J88j11J51
6214Hm7K08n1J59j72r4o7L20k33O9j38j58R5R6k33J95O8K47n04M67l10k25K85
$$ plain form
6237 -15 -17 9 -63 113 -12 21 140 9 -46 -21 100 94 93 208 -85 112 87 -5 106 -55 -35 -25 -175 -163 98 60
6263 60 -80 -11 -87 -17 -171 76 -12 169 192 -111 -33 157 328 -50 69 184 61 -34 -70 -177 6 78 -96
6286 -96 -147 27 -108 -117 -216 -160 -59 -198 44 250 -222 202 225 46 46 53 126 -17 -32 99 -11 -26 172 280 -62
6311 -62 -180 89 -234 -141 38 0 -171 14 -74 15 90 -88 284 -55 116 209 61 48 -144 -45 -95 72 -28
6334 -28 12 -40 -237 -104 58 -76 21 -10 51 53 -152 21 48 -98 155 -135 232 314 -87 103 -177 -25 -147
6357 -147 133 -202 -40 -177 -66 49 20 -20 -65 101 -25 54 -48 -250 73 -105 -84 124 -12 179 -58 209
6379 209 21 -206 18 154 -13 12 7 -168 -239 24 -21 4 204 104 -29 -42 -67 -18 -82 80 -109 59 -36 -178
6403 -178 66 -160 103 138 95 122 -99 -69 321 -90 74 -207 11 83 -103 -91 -20 7 -92 -88 -23 -83 -127 -65 -170
$$ packed form
6237a5kK6p2J76j25L3J19j31n5K5J21ojJ15k93J97k5r2J11j61K0J0j50J2K61l8
6263F0j40O9p6P0j54K47q8J81K3l03P8J90J71l78J19J15j23r5l6j07J83P2j74
6286i6n1J74j35rr9N6J01j39K42K06m72M24K3j79%PP3j43j5J31j10j5J98J08l42
6311f2j18K69l23R3J79l8j71J85q8Q9P5j78L72l39J71R3j48j3j92R9n0J67j00
6334b8M0n2j97J33J62j34R7l1O1Kk05J73K7j46K53k90L67Q2m01J90k80J52j22
6357a47K80l35J62j37J11J15k9m0m5J66j26P9j02k02L23j78K1K08j36J91k37K67
6379B09j88k27K24J36j67K5nj75p1K63m5K5K00j00j33j3k5M9o4J62j89J68r5j42
6403a78K44k26K63L5m3K7k21L0L90m11J64k81K18P2j86J2P1K7r9MO5o0m4O2j05
$$ plain form
6428 -170 -131 -173 -27 358 9 -69 -9 -46 174 116 23 18 91 98 -90 -128 97 179 45 199 60 -46 178 5 67
6453 67 124 66 -51 50 -4 53 261 -81 94 -149 54 91 94 103 -142 -148 272 200 109 -80 19 146 17 -187 -22
6478 -22 78 68 55 126 7 -79 103 -283 195 32 69 44 129 -90 50 139 -120 31 148 2 133 258 -273
6501 -273 -132 283 -82 -109 79 -78 -211 -110 -12 -60 -57 -123 -66 30 141 109 44 -41 -97 258 81 -100 251 -40
6525 -40 -180 -39 -133 55 89 179 89 114 -296 -161 -39 1 -48 57 -21 19 95 125 -110 -51 376 -49 -64 -19 34
6550 34 152 174 -120 125 -300 -22 99 -242 161 -128 -208 -107 -15 -70 17 140 -106 -63 29 -28 -106 69 -71
6573 -71 29 -16 182 -62 242 -39 -196 -123 208 78 3 7 112 -69 -156 77 111 50 -92 154 -147 -182 187
6596 187 2 9 320 41 25 17 -90 -90 178 -18 80 -11 35 103 83 60 151 78 -87 -215 1 -70 28 -91 -387 -120
$$ packed form
6428a70L9m2J46L85l49p8O0l7K20n8r3nP3Pj88l8K25Q2j34J54j39j06K24j73O2
6453F7N7n8j17J01n4N7K08l42J75k43K03L7LRk45oM20p2r1j89R9J27j29k04J65
6478b2J00j0j3P1j19q6J82l86M78j63L7k5Q5k19J40Q9k59J51J17j46J31J25n31
6501b73J41M15l65k7J88j57j33J01R8m8Lo6N7R6J11l2o5q5n6L55j77j81L51k91
6525d0j40J41r4J88L4R0r0K5m10J35J22M0m9J05p8M0P6L0k35N9M27m25j5M5N3
6550C4J18K2k94K45m25K78J21l41M03k89q0J01R2n5Q7J23k46M3R2n7p8J75j40
6573g1J00m5J98k44L04k81j57P3L31j30p5MJ05j81q7K33L4o1j42K46l01l5L69
6596A87j85PL11k79j6qj07%K68j96R8r1M6O8k0k3R1p3j65j28K16p1R8j19k96K67
$$ plain form
6622 -120 217 -144 164 -78 8 -45 11 -2 -26 -31 -174 140 -121 -115 -189 -91 -70 -89 -173 168 184 32 22 40 -32 -24 186
6649 186 209 77 -10 227 42 5 -61 392 -183 146 79 274 45 -100 40 -5 -44 63 5 -217 -60 -40 -68
6672 -68 15 -147 -74 -48 -181 19 -105 204 126 -253 -63 64 97 -92 -160 31 204 185 -219 168 -116 -41 31
6695 31 131 14 43 -23 3 -67 -122 -154 2 -92 -52 163 130 73 -103 157 162 -14 114 212 -8 -160 23 -47 -78
6720 -78 -71 -90 -5 -358 40 10 -20 30 -182 176 -182 -26 -32 -210 74 -41 -130 8 136 -71 4 -31 -193 -145 -239
6745 -239 57 129 102 -77 -70 -167 -188 147 155 -43 231 -93 7 168 2 -8 124 -28 -16 -146 -46 85 -24
6768 -24 -20 -203 -92 -169 172 -236 31 -3 -59 -59 -100 -302 -23 41 124 -68 -27 68 147 -376 41 90 169 115 49 -71
6794 -71 44 -7 225 -31 -29 102 143 -169 -149 -62 -340 -21 -122 -177 79 -51 -110 151 24 24 -176 33 40 105 112
$$ packed form
6622a20L37l61L08k42Q6n3N6j3k4nj43L14k61Op4R8K1j9q4L41J6j52j0J8p2QK10
6649A86K3j32q7K37j85l7o6M53n75L29o7J95k29j45J40m5l9J07n8k22J57K0k8
6672f8Q3j62P3K6j33K00j24L09p8l79J90J27L3j89o8J91J73j9m04L87k84P5P2
6695C1J00j17K9o6K6p0n5l2J56r4M0K15l3n7j76K60Nj76J28R8k20j52J83p0l1
6720g8Pj9Q5l53L98l0l0N0k12L58l58J56oj78K84j15q9J38J28k07P5l5j62M8r4
6745b39K96P2k7j79Pr7k1L35Qj98K74l24J00J61j66j0J32j52J2j30J00J31j09
6768b4Mj83J11p7L41m08K67l4n6%m1k02K79O4Q3j92M1R5P9n23M17M9P9n4o6j20
6794g1J15n1K32k56KJ31M1l12K0Q7k78L19j01n5K56j30n9K61j27%k00K09PO5P
$$ plain form
6819 112 222 122 72 -13 -210 47 53 -163 -46 -71 138 3 105 -110 -49 127 57 -4 -42 42 229 202 9 81
6843 81 0 -4 385 -86 24 107 149 173 -78 -40 189 64 -246 -87 123 15 -17 -107 181 -125 -313 5 -41 49
6867 49 250 -261 -98 -15 151 148 -77 132 102 -129 -153 -128 -232 100 -203 -115 165 -122 45 20 102 -112 -6
6890 -6 -28 -38 23 25 302 -47 -297 41 -58 74 -108 -49 51 9 -69 -329 -19 -97 42 -36 -78 -183 -49 30 31 121
6916 121 -76 -174 -61 -120 -108 7 -55 2 -14 149 79 -207 209 -121 102 -37 -103 340 69 -217 -121 -229 -256
6939 -256 -174 -209 -65 -78 -106 -159 -199 -90 263 2 -142 187 81 106 6 5 -28 220 72 111 23 95 -119 30
6963 30 -214 59 -89 115 -26 -68 -56 -78 156 -102 -129 -81 -170 14 10 -136 208 -12 -8 205 100 150 173 41
6987 41 -310 -31 -118 14 -30 -194 -36 -44 -10 -63 132 -3 -252 220 -21 98 -120 -47 -20 -7 43 226 -3 -82
$$ packed form
6819A12J10j00n0q5j97K57Ok16J17k5K09j35J02k15O1J76p0o1l8Q4J87k7j93P2
6843H1q1mL89m71J10Q3M2K4k51L8K29j25l10J59K10j08l2r0K88l06j88L18m6R0
6867D9K01n11J63Q3J66lk25K09l0k31k4K5j04L32l03Q8K80k87J67k5Q2k14J06
6890fk2j0O1KK77l49k50L38r9J32j82N9J00m2p8k60L10p8J39p8m2j05J34P9JR0
6916A21j97r8J13n9J2J15o2N7j6J63p0k86M16l30K23j39o6M43k71k86R6j08k7
6939b56Q2l5J44j3k8n3m0J09L53k61j44L29j06K5j00jl3K48j48L9q8P2k14J49
6963C0k44K73j48K04j41m2J2k2K34k58k7M8q9J84mj46L44k20MK13j05N0K3j32
6987D1l51K79q7J32m4j64J58qL4n3J95j35k49M72k41J19k18P3K7J3N0J83k29p9
$$ plain form
7011 -82 123 -187 144 106 45 140 -197 -206 69 43 101 71 -108 74 25 60 -35 173 116 116 -87 132 200 55 6 -219
7037 -219 125 254 40 7 280 -270 -122 -95 -27 -54 15 38 -37 12 49 166 -35 100 -52 224 80 -37 173
7060 173 44 -92 162 -109 42 85 -59 -51 -97 40 -232 -112 161 -37 -38 -16 -173 45 -72 -167 12 -52 139
7083 139 -12 233 104 -146 142 36 -86 26 -114 -28 21 226 38 -42 -43 -30 250 -100 -12 -140 -166 -8 -22
7106 -22 18 -161 -88 140 -270 -489 -20 -60 115 26 -7 27 -128 -40 128 214 -39 -33 81 121 20 -109 109 -52
7130 -52 -23 -26 -66 -169 -85 -168 101 -115 -185 -180 -21 181 -24 54 -68 91 -108 305 -71 36 -89 151 4 111
7154 111 98 -58 52 -173 -179 -45 101 -11 -75 6 114 -97 4 -31 -182 -259 103 136 -25 62 94 154 -219 -51
7178 -51 144 -163 150 32 -179 27 44 -166 -66 -145 -88 -257 -29 -28 108 155 79 -28 46 38 -177 -109 136 -4
$$ packed form
7011h2K05l10L31l8o1R5l37rK75k6N8l0j79J82m9L5r5K08n7%k03K19O8j45m9k25
7037b19L44J29k14l3K73n50J48K7O8k7O9K3p5M9L7J17k01J35j52K76j44j17K10
7060A73j29j36K54k71J51M3j44Qm6J37k72J20K73j98jK2j57K18j17r5J79o4J91
7083A39j51K45j29k50K88j06j22J12j40Q6M9K05j88q0jJ3K80l50Q8j28k6J58j4
7106b2M0j79P3K28m10k19M69m0J75q9l3L4j55Q8J68Q6k53OJ14M0j01j29K18j61
7130e2K9lm0j03Q4q3K69k16p0NJ59K02k05P8j22J59j99M13l76J07j25K40j47J07
7154A11j3j56J10k25oJ34J46j12o4Q1J08k11J01l5j51p7L62L3j61Q7L2O0l73J68
7178e1J95l07L13j18k11K06J7k10J00p9N7j69K28JJ36M7p6j07P4qk15O8K45j40
$$ plain form
7202 -4 13 180 -124 21 -165 -107 91 97 -10 78 -250 -97 105 -32 -59 -90 81 -109 -148 -127 117 -100 165 52
7226 52 28 120 343 -60 130 -211 2 -335 33 11 -130 47 -24 69 40 90 -33 76 -53 -46 -2 -59 4 -197
7250 -197 -69 -16 30 53 -136 166 199 8 -78 3 95 80 119 -37 -110 69 -167 18 69 47 -51 -138 379 64 86
7275 86 52 -307 66 -86 -109 -37 35 114 -34 -75 -33 52 -86 -131 -17 49 11 -48 9 -24 -146 53 59 -62 -34 82
7301 82 -36 98 -109 -32 23 -1 -42 -184 37 -125 -133 72 85 44 -92 -234 -184 72 42 -76 370 -28 -117 121
7325 121 -4 57 -5 -9 -58 -171 73 -110 80 18 81 -35 -68 86 -38 -90 -79 19 -103 -345 49 187 89 -84
7349 -84 -32 -220 -84 -12 -177 7 -83 74 18 146 -7 13 -147 -130 33 130 172 -10 64 119 57 -224 8 -130
7373 -130 -189 -164 -43 -71 -20 -283 -104 -237 84 108 -284 29 -16 -90 102 65 -108 -63 7 -86 33 -111 297 -210
$$ packed form
7202dJ7J67l04J45j86N8J98Oj07Q8l28J53K02j37k7l1J71j90l9K1K44k17K65j13
7226E2k4R2K23m03J90l41K13l37L68k2j41J77p1R3k9N0j23J09j29PM4n7O3k01
7250a97J28N3M6K3j89L02L3j91q6Q1R2j5L9j56p3J79k36J85N1k2r8q7N17l15K2
7275H6l4l59L73j52k3P2P2P9j48m1M2Q5j38m5J14O6l8n9N7l3j22J99Oj21K8J16
7301H2j18J34k07P7N5k4m1j42K21j62qK05J3m1j36j42N0K56l0j18M46l98q9K38
7325A21j25O1o2mm9j13K44j83J90o2O3j16l3J54j24n2J1R8j22k42L94J38r8j73
7349h4N2j88J36P2j65J84r0J57n6J28j53K0j60J7J63R7M2j82P4N5o2k81K32j38
7373a30n9K5J21k8N1k63J79j33L21K4l92L13m5p4J92l7j73M5P0r3J19j44M08n07
$$ plain form
7397 -210 94 53 -7 -158 66 -147 142 -22 -234 94 -137 86 -12 8 51 138 -104 4 121 286 43 -14
7419 -14 -52 -113 3 -47 7 -76 36 -43 -34 152 141 184 -261 -31 -178 84 31 33 91 146 -211 -40 21 93 -195 308
7445 308 138 -2 273 44 258 70 282 173 -22 298 -232 -145 66 -134 12 134 41 170 97 150 -63
7466 -63 106 -149 -53 -308 -154 102 -336 99 7 6 -28 5 5 -154 -294 49 75 30 109 87 133 -31 -161 -81 -273
7491 -273 76 202 -86 180 -18 141 28 58 178 126 -54 7 -283 30 -86 104 81 110 49 279 -132 -182
7513 -182 140 -24 91 52 186 -110 -144 31 -60 -17 -220 -48 82 158 -57 47 -97 -235 211 -7 368 -61
7535 -61 4 260 210 -216 -14 -366 -203 -43 140 59 -81 -231 -101 -11 180 -64 151 -78 148 -47 40 -163
7557 -163 104 -268 55 140 -87 -30 -211 196 131 -308 -175 -54 -153 -118 4 113 -209 -261 24 -100 -171 227
$$ packed form
7397b10L04m1o0j51K24k13K89j64k12L28k31K23r8K0M3Q7k42J08J17J65k43n7
7419a4l8o1J16n0N4q3J12p9RJ86j1M3m45K30j47K62n3KN8N5l57J71O1P2k88N03
7445C08j70j40K75k29K14j88K12j09j95L20n30Q7K11k00J46J22r3J29p3N3k13
7466f3J69k55R6k55J54K56m38M35r2jl4L3%j59j40L43K6m5P9k2M6j64j30Q0j92
7491b73L49J26k88K66j98J59j13L0J20n2j80O1k90L13j16J90k3K9o1K30m11n0
7513a82L22j64J15l9J34k96l4J75r1M3k03J72J30P6k15J04j44j38M46k18L75m29
7535f1O5K56n0m26K02l52J63J60J83q1j40j50J30R0J91k44K15k29K26j95Q7k03
7557a63K67l72L23Q5k27N7j81M07o5m39J33J21r9L5J22J09l22n2K85j24p1L98
$$ plain form
7579 227 -53 82 -76 -54 192 -52 193 -82 -143 -2 -153 -101 132 -39 -110 259 274 159 -189 -96 15 110
7601 110 -209 120 -136 -142 -109 17 -224 221 110 -118 27 123 -70 -238 -161 23 334 -131 80 9 -168 -33
7623 -33 -122 34 101 -23 60 164 34 103 32 -100 44 -148 95 233 -65 -152 350 -75 -291 -21 -98 -82 51
7646 51 -89 -34 -73 -128 -83 -200 -68 48 191 81 -77 41 0 45 76 -141 142 -22 196 105 -108 -51 -116 21
7670 21 -17 74 -124 331 93 -90 -106 -87 55 164 -215 -90 43 176 98 171 205 -102 29 -19 -59 62 313
7693 313 60 -15 -181 57 -32 -29 73 19 -62 153 -119 -50 -311 -120 -57 76 -109 70 13 105 36 14 -104 -89
7717 -89 10 -22 -167 -45 114 -91 235 -130 -55 40 126 21 -95 -102 -31 -62 -40 165 159 3 -83 -89 -43 219 118 112
7743 112 -104 -36 263 -26 99 152 99 -49 42 -12 -117 -40 -80 27 -114 32 10 -9 -7 -106 66 119 103 -30 -11
$$ packed form
7579B27k80J35j58K2K46k44K45k75o1J41j51N2K33j71p1L69J5j15l48R3J11R5
7601A10l19L29k56oL3J26k41M45j11k28J45R6j93j68P7J84L11m65K11p1j77J35
7623c3q9J56O7j24Q3J04j30O9p1j32J44j92K43J38k98q7N02m25k16K70p7J6J33
7646E1j40N5l9n5M5j17J32J16J43j10j58J18m1M5L1k17K83j64K18r1k13N7o5J37
7670B1l8R1j98M55k38j83j6J9J42J09l79J25J33J33p8P3L4l07J31m8m0J21K51
7693C13k53p5j66K38q9LJ02n4q1K15k72O9k61J91O3J33j85J79n7R2o9k2j18J5
7717h9R9l2j45J22J59k05L26l65P5R5Q6j05j16pP1l1K2K05oj56q6oM6K62j01o
7743A12k16O8K99k89J25N3n3j48R1n4j05P7m0J07j41J46k2j9Kr9J72N3j6j33J9
$$ plain form
7768 -11 -36 -36 -14 -178 -195 -200 -3 -63 -14 -256 -57 24 42 -160 252 -94 172 -23 113 46 -164 -33 -163 -11
7792 -11 50 -79 -59 15 184 25 -132 84 53 -202 19 208 214 239 -11 -117 -34 -245 64 108 -125 -85 -194 -14
7816 -14 261 160 8 123 91 -4 280 57 -2 -218 -81 -66 -139 42 91 122 108 81 81 -55 -98 47 120 10 -74
7841 -74 119 17 -126 -14 88 49 175 -48 -175 61 -2 217 -234 -50 75 -93 45 64 74 149 -195 -116
7863 -116 -420 -3 -19 -430 59 -63 -57 72 -334 -181 -85 -176 -27 -142 140 -102 -114 139 -196 211 56 -78
7885 -78 -106 110 -74 -232 387 43 -133 55 93 -124 105 21 -59 50 -45 264 245 99 141 22 270 -46 -8
7908 -8 95 70 -81 101 -146 -118 -279 -67 -10 -187 -208 -108 124 -126 -49 4 164 -8 143 41 79 103 422
7931 422 33 68 -70 -371 -30 -23 -229 -151 84 -238 -185 -91 -14 -87 183 -147 -377 215 360 152 -136 28 70
$$ packed form
7768a1k5%K2j64j7nJ97o0M9k42J99Q1J8k02M12l46K66j95J36o7k10J31j30J52
7792a1O1j29K0P4J69j59j57K16l1k55K21J89OK5k50j06Q3k11L09M4k33M0j09J80
7816a4K75j01j52J15l2r5K84k23n9k16J37J5p3J81M9L1j4k7%j36m3J45P3j10q4
7841g4J93j02j43J12J02l9J26k23j27K36o3K19m51J84J25j68J38J9J0P5l44P9
7863a16l04M17j6m11M89j22OJ29m06J53R6r1J49j15K82k42j2K53l35M07j55j34
7885g8k8K16j84j58O19l44j76J88L8k17K29q4q0J09r5L09j9j46M2j19K48l16L8
7908hJ03k5j51J82k47K8j61K12N7j77k1J00K32k50P7N3J60j72J51j02L8K4L19
7931D22l89L5j38l01L41Pk06P8K35l22N3R4P7p3K70l30k30N92J45k08k88J64M2
$$ plain form
7954 70 18 -185 2 56 -110 -21 -26 163 -35 -59 -102 -45 -28 129 99 -64 107 -20 -157 -131 -168 -95 -253 -90 -142
7979 -142 -81 -191 -34 74 76 184 -248 230 -88 -124 73 181 -137 0 62 -193 -74 -208 181 -30 -4 -73
8001 -73 118 -170 11 118 -77 -45 166 -83 -58 -77 -251 32 95 258 70 -21 116 123 78 -2 18 -72 -99 -90 -12
8026 -12 82 -155 -96 -57 -26 132 58 189 146 -162 79 -116 71 211 11 9 159 241 152 -3 -33 -107 68 -12 24
8051 24 -4 90 165 162 -136 72 5 6 -171 -20 -89 -175 -48 -157 1 -147 -133 158 28 -93 -91 -5 0 20 17 127 27
8078 27 -175 -58 -42 46 -38 210 118 -5 226 -70 -81 -23 93 -77 -103 -345 22 199 435 125 231 -5 16
8101 16 280 -125 120 -128 210 -101 155 44 -471 -112 -100 -184 96 -370 42 -9 -2 -49 -13 61 -62 -83 123
8124 123 -27 -84 282 60 -90 74 -89 -5 25 37 -191 225 30 -26 -226 83 93 -147 200 -211 184 30
$$ packed form
7954G0n2k03J87N4j66Q9nJ89j98k4m3N7J7J57l0j63J71j27j37K6l7P3j58J63n2
7979a42O1j10J57J08KJ08m32M78l18l6J97J08l18J37O2k55J19j34L89k11K6o9
8001g3J91k88J81J07j95L2K11k49K5j9j74K83O3J63j88r1J37Pm5q0K0r0k7RP8
8026a2R4k37N9L9L1J58p4J31m3l08K41j95J87J40k00kJ50Q2q9j55l0p4J75q0L6
8051B4k8R4P5lk98K08o7Jj77J51o9q6J27j09J58j48J4K91j30j21KQ6NK0lJ10j00
8078B7k02J17J6Q8q4K48r2j23K31k96j1N8J16j70k6k42L67J77K36l10J06k36K1
8101A6K64m05K45k48L38l11K56j11n15L59J2q4K80m66M12n1Pm7L6P4j23k1K06
8124A23j50n7L66k22j50J64j63Q4L0J2k28M16j95n6k00L09J0k40L47m11L95j54
$$ plain form
8146 30 94 -116 118 -152 157 118 -18 -145 247 -12 -12 14 47 -34 -152 -67 65 -203 -122 74 -115 23 67 -108
8170 -108 -146 -118 134 -147 157 -133 65 64 70 2 8 253 -9 -290 105 118 -130 185 -58 -205 -25
$$ packed form
8146C0O4k10K34k70L09l9j36j27L92k59%K6L3q1j18Q5J32k68Q1J96j89J38M4j75
8170a08l8K8K52k81L04k90J98jOo8OK45k62k81L95J3k48L15k43j47J80
8191b5
$$ Imaginary data points
##PAGE= N=2
##DATA TABLE= (X++(I..I)), XYDATA
$$ plain form
0 0 0 0 0 0 0 0 0 0 0 0 0 0 0 0 0 -4 8 -8 8 -8 8 -10 16 -16 16 -24 24 -32 32 -40 46 -50 58 -65 74 -83 92 -106
38 -106 116 -130 145 -161 177 -198 216 -238 263 -292 321 -353 391 -430 474 -522 579 -639 712 -793
58 -793 891 -1005 1142 -1313 1531 -1819 2218 -2811 3789 -5676 10652 -52249 -109776 14746
72 14746 42306 28940 91061 127798 69368 90934 148119 117338 86719 104811 36986 -49959
84 -49959 -35285 -22069 -66121 -41681 -603 -54620 -101982 -74865 -86071 -114157 -65486 -27514
96 -27514 -59004 -50240 -5573 -7820 10877 90923 120480 99135 114276 111101 50400 31046 50094
109 50094 20027 -6299 19206 12070 -27953 -22551 -18058 -60949 -76300 -60068 -82239 -103184 -78193
122 -78193 -68567 -75165 -33660 20463 36688 59877 93432 80029 49677 51620 47428 26816 36526
$$ packed form
0@%%%%%%%%%%%%%%%mJ2j6J6j6J6j8K6l2L2m0M8n6O4p2Q6r6J08j23J39j57J75j98
38a06K22k46K75l06L38l75M14m54N01n55O13o74P44q21R04r96J101j218J351j505
58g93J684j896K147k455K844l350M037n029O600r465J6328o2901n7527J24522
72A4746K7560j3366O2121L6737n8430K1566N7185l0781l0619J8092o7825q6945
84d9959J4674J3216m4052K4440M1078n4017m7362K7117j1206k8086M8671L7972
96b7514l1490Q764M4667k247J8697Q0046K9557k1345J5141l175o0701j9354J9048
109E0094l0067k6326K5505p136m0023N402M493m2891j5351J6232k2171k0945K4991
122g8193R626o598M1505N4123J6225K3189L3555j3403l0352J943m192k0612R710
$$ plain form
135 36526 56020 41657 29555 37532 21029 -9367 -15140 -28030 -64478 -81512 -81673 -95201 -94063
148 -94063 -60872 -34894 -19356 13216 35829 28491 25792 32283 22294 18242 37991 50453 51576
161 51576 63660 70081 52753 38938 32264 9032 -18918 -33205 -52487 -77181 -80659 -69479 -60077
174 -60077 -41626 -16107 -7824 -10867 -7516 -8085 -12985 -3662 14525 24314 35736 54256 62674 61688
188 61688 65867 62555 45409 28115 11125 -13994 -34865 -43141 -49323 -50889 -41000 -30987 -29365
201 -29365 -27656 -26763 -33253 -37532 -32020 -24205 -14302 3765 22475 35682 48909 61259 64823 62479
215 62479 56317 42882 23719 7333 -6408 -17394 -21061 -19243 -18958 -19797 -20738 -26552 -35966 -42850
229 -42850 -46995 -49390 -44926 -33439 -19503 -2849 16362 33100 44494 52692 54804 50058 41726
$$ packed form
135C6526J9494j4363j2102P977j6503l0396n773j2890l6448j7034j61j3528J138
148i4063L3191K5978J5538L2572K2613p338k699O491r989m052J9749J2462J123
161E1576J2084O421j7328j3815o674k3232k7950j4287j9282k4694l478J1180R402
174f0077J8451K5519Q283l043L351n69m900R323J8187R789J1422J8520Q418r86
188F1688M179l312j7146j7294j6990k5119k0871q276o182j566R889J0013J622
201b9365J709Q93o490m279N512P815R903J8067J8710J3207J3227J2350L564k344
215F2479o162j3435j9163j6386j3741j0986l667J818K85q39r41n814r414o884
229d2850m145k395M464J1487J3936J6654J9211J6738J1394Q198K112m746q332
$$ plain form
242 41726 32085 20967 12042 8036 6277 5146 5223 2443 -5473 -16216 -28165 -41267 -51610 -56426
256 -56426 -55897 -48958 -35844 -19377 -2323 13740 25970 32783 35034 34000 30237 26523 23206 22299
270 22299 22780 24496 26528 27100 23530 15415 2270 -14069 -31436 -45485 -53632 -54755 -49545 -38696
284 -38696 -26490 -14667 -4507 3127 8356 11472 13436 14397 15133 17022 20359 25865 33360 40170 43057
299 43057 40739 31987 16560 -1811 -19374 -33028 -41194 -42191 -38726 -32870 -26158 -20498 -16565 -13294
313 -13294 -9788 -7644 -5787 -3494 -866 2509 10259 21721 33560 45068 51565 49714 39507 24666
327 24666 7751 -7213 -16381 -20936 -22893 -22375 -21490 -21711 -22052 -21336 -20227 -20190 -19923 -20921 -21624 -19686 -12717
344 -12717 -1259 14408 30957 43577 48599 46681 38176 25552 14159 5625 604 -1915 -3730
$$ packed form
242D1726r641j1118q925m006j759j131P7k780p916j0743j1949j3102j0343m816
256e6426N29O939J3114J6467J7054J6063J2230O813K251j034l763l714l317r07
270B2299M81J716K032N72l570q115j3145j6339j7367j4049q147j123N210J0849
284c8696J2206J1823J0160P634N229L116J964R61P36J889L337N506P495O810K887
299D3057k318q752j5427j8371j7563j3654q166r97L465N856O712N660L933L271
313a3294L506K144J857K293K628L375P750J1462J1839J1508O497j851j0207j4841
327B4666j6915j4964r168m555j957N18Q85k21l41P16J109L7K67r98p03J938O969
344a2717J1458J5667J6549J2620N022j918q505j2624j1393q534n021k519j815
$$ plain form
357 -3730 -6308 -9412 -11578 -14574 -17128 -18881 -22279 -28144 -34047 -36713 -35389 -26871 -11394 6302 22526
372 22526 34254 37983 34537 28495 23209 18112 15506 16070 14362 10797 7841 4764 842 -1058 -4090
387 -4090 -11566 -21152 -30655 -41193 -46786 -42937 -32598 -19046 -2839 10975 17108 18975 18536 15871
401 15871 14390 17248 20308 20717 22314 22521 19384 17951 18651 16049 8952 406 -13213 -29918 -40975
416 -40975 -43917 -41643 -32323 -18132 -8543 -4360 -694 -617 -2027 1088 7394 10467 13359 18732 20416
431 20416 20954 26094 31335 31391 29050 23701 9121 -7873 -19755 -28976 -33852 -29140 -21002 -17290 -14202
446 -14202 -11666 -14318 -17077 -13653 -9399 -7137 -1604 4291 5133 9264 19785 28273 34127 40365 38656
461 38656 26441 12946 1617 -10068 -16066 -13096 -11343 -12763 -11581 -12449 -18394 -20000 -17277 -18814
$$ packed form
357c730k578l104k166k996k554j753l398n865n903k666J324Q518J5477J7696J6224
372B2526J1728L729l446o042n286n097k606N64j708l565k956l077l922j900l032
387d090p476r586r503j0538n593L849J0339J3552J6207J3814O133J867m39k665
401A5871j481K858L060M09J597K07l137j433P00k602p097q546j3619j6705j1057
416d0975k942K274R320J4191R589M183L666P7j410L115O306L073K892N373J684
431B0416N38N140N241N6k341n349j4580j6994j1882r221m876M712Q138L712L088
446a4202K536k652k759L424M254K262N533N895Q42M131J0521Q488N854O238j709
461C8656j2215j3495j1329j1685n998K970J753j420J182q68n945j606K723j537
$$ plain form
475 -18814 -20398 -16955 -15084 -14728 -6516 5075 13681 24024 34702 36403 31846 27175 18144 6062
489 6062 650 840 -1063 -904 1909 -1857 -9204 -11753 -14418 -20228 -21777 -21779 -26633 -28679 -23288 -16222
505 -16222 -7375 8271 21654 25870 27516 26660 19062 11752 11623 11718 9429 11555 12278 7667 4413 3867
521 3867 -1260 -8249 -12323 -19431 -29363 -32497 -31124 -29521 -22338 -9178 1163 7595 14538 16431 12508
536 12508 10890 11489 10468 12025 16865 18026 17353 18845 18862 14271 9564 3392 -7330 -18736 -25258
551 -25258 -30322 -32354 -27463 -20727 -14702 -7923 -1427 1238 1461 2023 1405 861 3704 8555 13799 20242
567 20242 25830 27498 26211 23541 17720 9263 895 -7747 -16029 -22051 -24294 -22923 -18816 -13542 -9614
582 -9614 -7806 -8934 -11211 -12718 -12277 -9315 -3927 2560 8831 15840 22782 27380 29545 29360 24056 15273
$$ packed form
475a8814j584L443J871L56Q212J1591Q606J0343J0678J701m557m671r031j2082
489F062n412J90j903J59K813l766p347k549k665n810j549km854k046N391P066
505a6222Q847J5646J3383M216J646q56p598p310j29R5k289K126P23m611l254n46
521C867n127o989m074p108r932l134J373J603P183J3160J0341O432O943J893l923
536A2508j618N99j021J557M840J161o73J492J7m591m707o172j0722j1406o522
551b5258n064k032M891O736O025O779O496K665K23N62o18n44K843M851N244O443
567B0242N588J668j287k670n821q457q368q642q282o022k243J371M107N274L928
582i614J808j128k277j507M41K962N388O487O271P009O942M598K165j85n304q783
$$ plain form
598 15273 7107 164 -6673 -9839 -10031 -10074 -10536 -8597 -8606 -11156 -13787 -16904 -21245 -22457 -19377 -14638 -8274
615 -8274 1444 10976 16919 22156 26006 24611 20867 17717 12833 6797 4112 2913 476 520 2035 241
631 241 -3451 -6178 -12012 -19832 -24449 -25857 -26370 -22100 -13346 -5747 1412 9289 13634 14628 16154 16883
647 16883 14396 12168 11201 9187 7610 9305 11755 11657 10388 7231 -782 -9476 -16499 -22556 -26188 -25332
663 -25332 -21451 -16903 -11426 -4924 260 2884 5964 7821 7753 8051 9026 8421 8663 11530 15081 17434
679 17434 19644 19650 14070 5669 -2877 -11288 -18890 -21149 -19836 -18581 -15929 -11790 -9775 -8618 -5344 -2464
695 -2464 -1439 106 1276 338 822 5721 11434 16936 23552 26967 23576 17777 10923 1588 -6040 -8977
711 -8977 -10659 -12476 -12304 -11999 -13470 -13429 -10383 -9575 -8693 -7468 -8079 -10767 -9557 -5893 -430 7987 18053
$$ packed form
598A5273q166o943o837l166j92m3m62J939rk550k631l117m341j212L080M739O364
615h274R718R532N943N237L850j395l744l150m884o036k685j199k437M4J515j794
631B41l692k727n834p820m617j408n13M270Q754P599P159P877M345R94J526P29
647A6883k487k228r67k014j577J695K450r8j269l157q013q694p023o057l632Q56
663b5332L881M548N477O502N184K624L080J857o8K98R75o05K42K867L551K353
679A7434K210On580q401q546q411p602k259J313J255K652M139K015J157L274K880
695b464J025J545J170r38M84M899N713N502O616L415l391n799o854r335p628k937
711h977j682j817J72L05j471M1L046Q08Q82J225o11k688J210L664N463Q417J0066
$$ plain form
728 18053 24071 25044 23860 18932 11658 6529 4007 1091 -1169 -2574 -4998 -8377 -9165 -8508 -9314 -9053
744 -9053 -9650 -13871 -18384 -19302 -18505 -14298 -4799 5410 12965 17833 20007 17952 14731 13095 11076 9400
760 9400 8753 6924 3882 1668 636 -96 -691 -1444 -4527 -10493 -17018 -22087 -25086 -22953 -16500 -8690
776 -8690 -990 5486 8645 9288 9265 9599 9763 10545 11045 10550 9308 8878 9000 9583 10318 10100 6459 -25
794 -25 -7947 -16296 -22217 -23663 -20798 -16013 -9988 -5071 -2307 -687 64 893 2701 4450 5747 6469
810 6469 7370 8231 10493 13642 16925 18220 16892 11676 4028 -4659 -11904 -16229 -16943 -15276 -11814 -9044
826 -9044 -7380 -6851 -6683 -6420 -5422 -3953 -2771 -1656 -323 1553 5294 10696 15989 19968 21644 19092
842 19092 13607 6033 -789 -5894 -8125 -8538 -7519 -6666 -6649 -7254 -8081 -8502 -9074 -9406 -9617 -9698 -9300 -7483
$$ packed form
728A8053O018R73j184m928p274n129k522k916k260j405k424l379p88O57q06K61
744i053n97m221m513r18P97M207R499J0209P555M868K174k055l221j636k019j676
760I400o47j829l042k214j032p32n95p53l083n966o525n069k999K133O453P810
776h690P700O476L159O43k3L34J64P82N00m95j242m30J22N83P35k18l641o484
794b5p922q349n921j446K865M785O025M917K764J620P51Q29J808J749J297P22
810F469R01Q61K262L149L283J295j328n216p648q687p245m325p14J667L462K770
826i044J664N29J68K63R98J469J182J115J333J876L741N402N293L979J676k552
842A9092n485p574o822n105k231m13J019Q53J7o05q27m21n72l32k11q1L98J817
$$ plain form
860 -7483 -3603 1954 8934 15073 19216 19939 17750 13289 7614 3444 889 -198 -559 -226 -1210 -2165
876 -2165 -4098 -5885 -7666 -9409 -11626 -14069 -15500 -15312 -13336 -8232 -1592 5377 11000 14527 14728 12965
892 12965 10554 7988 6339 5619 5870 5907 5897 5387 4186 2142 -301 -3414 -7591 -11979 -15584 -17998 -18261
909 -18261 -15817 -11111 -5759 97 4391 6523 6916 7216 6095 5363 6134 6997 8133 9579 11311 11530
925 11530 10618 9239 6166 1683 -3547 -8723 -13511 -16178 -16240 -14773 -11944 -7697 -4354 -2356 -651 75
941 75 -636 -323 169 1135 3222 6916 10459 13077 15340 15576 13539 10480 6451 998 -4101 -7307 -10360
958 -10360 -11948 -10941 -9533 -8013 -5948 -4757 -4923 -6131 -6692 -6922 -6986 -4257 -383 3740 8417 12518
974 12518 14324 15121 14829 12670 8934 4904 1675 -2130 -4760 -5299 -5301 -4768 -3924 -3500 -4579 -6679 -8814
$$ packed form
860g483L880N557O980O139M143P23k189m461n675m170k555j087l61L33r84r55
876b165j933j787j781j743k217k443j431J88J976N104O640O969N623L527K01j763
892A2965k411k566j649p20K51L7j0n10j201k044k443l113m177m388l605k414k63
909a8261K444M706N352N856M294K132L93L00j121p32P71Q63J136J446J732K19
925A1530r12j379l073m483n230n176m788k667o2J467K829M247L343J998J705P26
941G5p11L13M92R66K087L694L543K618K263K36k037l059m029n453n099l206l053
958a0360j588J007J408J520K065J191j66j208n61k30o4K729L874M123M677M101
974A2518J806P97k92k159l736m030l229l805k630n39kN33Q44M24j079k100k135
$$ plain form
991 -8814 -11201 -12500 -11748 -8943 -5092 -119 4785 8550 11105 12591 12735 11413 9683 7218 4605 1847
1007 1847 681 70 -12 1125 1374 251 -2022 -5552 -9668 -13331 -15005 -14235 -11796 -7917 -3491 425
1023 425 3499 6481 8308 8724 8854 8222 6458 4873 4188 3816 4402 6270 7658 6622 4930 1564 -3877
1040 -3877 -9573 -12929 -14271 -14663 -12289 -8697 -6223 -3786 -433 1440 2606 4654 5332 4312 3844 4002
1056 4002 3394 5020 8724 11027 12248 12397 9792 3233 -2260 -5981 -9996 -11826 -10616 -9910 -9742 -8029
1072 -8029 -5715 -4775 -2758 -412 -482 -1079 -763 -725 -975 1818 6483 9741 13345 16377 14927 10166 6147
1089 6147 1998 -2882 -4820 -4715 -6163 -7069 -6472 -6740 -7456 -5783 -4346 -4876 -5448 -5422 -7199 -8481 -5230
1106 -5230 -926 3809 9665 14272 14668 12317 10312 7100 3747 2917 2246 121 -1242 -1663 -3455 -4514
$$ packed form
991h814k387j299P52K805L851M973M904L765K555J486J44j322j730k465k613k758
1007A847j166o11q2J137K49j123k273l530m116l663j674P70K439L879M426L916
1023D25L074K982J827M16J30o32j764j585o85l72N86J868J388j036j692l366n441
1040c877n696l356j342l92K374L592K474K437L353J873J166K048O78j020m68J58
1056D002o08J626L704K303J221J49k605o559n493l721m015j830J210P06J68J713
1072h029K314R40K017K346p0n97L16L8k50K793M665L258L604L032j450m761m019
1089F147m149m880j938J05j448r06N97k68p16J673J437n30n72K6j777j282L251
1106e230M304M735N856M607L96k351k005l212l353q30o71k125j363m21j792j059
$$ plain form
1122 -4514 -3114 -2847 -4501 -5580 -7697 -11385 -13348 -11471 -8223 -3908 2486 7482 8680 9329 9696 7131
1138 7131 5653 6236 6049 3919 3961 3120 868 770 2447 2027 128 -927 -5162 -10803 -13440 -13276 -13227 -9776
1156 -9776 -3610 -519 1154 3847 4445 3148 4236 5946 4834 4645 5743 4578 3353 5339 7183
1171 7183 6459 6458 5534 182 -5229 -8049 -11421 -13398 -10548 -7459 -5896 -2791 -531 -1626 -1217 592
1187 592 1460 1038 2261 3284 2216 3528 6362 7865 9447 11575 10273 6047 2229 -1817 -6742 -8754
1203 -8754 -7720 -7926 -7040 -4718 -3849 -4496 -3718 -2810 -3293 -2831 -1827 -2102 -2203 493 2895 5293 9120
1220 9120 12095 12124 10302 8192 3888 -470 -2584 -3617 -4598 -4122 -3029 -3980 -4260 -4046 -4424 -5159 -5595
1237 -5595 -5641 -6631 -6816 -5100 -2847 622 4796 8573 10592 11512 10188 7442 5220 3120 868 65
$$ packed form
1122d514J400K67j654j079k117l688j963J877L248M315O394M996J198O49L67k565
1138G131j478N83j87k130M2q41k252r8J677m20j899j055m235n641k637J64M9L451
1156i776O166L091J673K693N98j297J088J710j112j89J098j165j225J986J844
1171G183p24jr24n352n411k820l372j977K850L089J563L105K260j095M09J809
1187E92Q68m22J223J023j068J312K834J503J582K128j302m226l818m046m925k012
1203h754J034k06Q86K322Q69o47P78R08m83M62J004k75j01K696K402K398L827
1220I120K975K9j822k110m304m358k114j033r81M76J093r51k80K14l78p35m36
1237e595m6r90j85J716K253L469M174L777K019R20j324k746k222k100k252q03
$$ plain form
1253 65 -210 -75 -512 -634 -1036 -2119 -3582 -5000 -7034 -8887 -9799 -9603 -8387 -5696 -1620 2191 5355
1270 5355 7814 8296 7632 6133 4873 3514 2954 3402 3747 3812 3898 3619 2638 1205 -1021 -3820 -6670 -9240
1288 -9240 -10953 -10947 -9666 -6932 -3749 -704 1688 3333 3881 3636 3101 2621 2311 3108 4091 5496 6907
1305 6907 7531 7500 6665 4518 1879 -1611 -5008 -7405 -9203 -9583 -8872 -7014 -4789 -2589 -1079 -114 76
1322 76 -560 -904 -984 -466 1027 3200 5617 7791 9468 9328 8509 6371 4020 678 -2186 -4326 -5825
1339 -5825 -6319 -6208 -5165 -3950 -3160 -1940 -2373 -3256 -4056 -4793 -4773 -3432 -1054 1754 4986 7342 8358
1356 8358 9208 8416 6908 5206 2942 856 -1520 -2656 -3501 -3307 -2868 -1688 -1523 -2023 -3229 -5353 -7033
1373 -7033 -8137 -7627 -5946 -3147 270 3266 5258 6869 7525 7236 6891 5808 4288 2330 1123 -146
$$ packed form
1253F5k75J35m37j22m02j083j463j418k034j853r12J96J216K691M076L811L164
1270E355K459M82o64j499j260j359n60M48L45O5Q6k79r81j433k226k799k850k570
1288i240j713OJ281K734L183L045K392J645N48k45n35m80l10P97R83J405J411
1305F907O24l1q35k147k639l490l397k397j798l80P11J858K225K200J510R65J90
1322G6o36l44q0N18J493K173K417K174J677j40q19k138k351l342k864k140j499
1339e825m94J11J043J215P90J220m33q83q00p37K0J341K378K808L232K356J016
1356H358Q50p92j508j702k264k086k376j136q45J94M39J180J65n00j206k124j680
1373g033j104N10J681K799L417K996J992J611O56k89l45j083j520j958j207j269
$$ plain form
1389 -146 -248 127 883 1363 760 -1135 -3553 -6454 -8518 -9608 -8863 -6680 -4344 -1996 510 2135 3621
1406 3621 4862 5865 5689 5130 4205 3103 2220 2123 2875 3972 5008 5219 3423 113 -2738 -6208 -8342
1423 -8342 -9197 -8674 -7436 -5866 -3799 -2550 -1507 767 2220 2925 3522 2911 1893 1517 2048 3188 5363
1440 5363 7938 8674 7565 5613 2456 -1280 -3947 -5204 -6467 -6885 -6205 -6111 -5744 -4738 -2956 -1855
1456 -1855 -646 28 -636 -1467 -1530 -549 781 3775 7107 8940 9552 8981 6812 3586 1403 -389 -2304
1473 -2304 -3080 -3189 -4361 -4981 -4222 -4039 -3501 -2174 -2145 -3592 -4835 -5334 -5326 -4097 -118 2926 5554 7870
1491 7870 8766 7293 6130 5416 3518 1839 1701 699 -1653 -1843 -1499 -2058 -1970 -1142 -1555 -3721 -5051
1508 -5051 -6742 -8792 -7458 -4972 -2258 733 4216 5652 5326 5561 5056 3859 3798 4286 2654 1563
$$ packed form
1389a46j02L75P56M80o03j895k418k901k064j090P45K183K336K348K506J625J486
1406C621J241J003j76n59r25j102q83r7P52J097J036K11j796l310k851l470k134
1423h342q55N23J238J570K067J249J043K274J453P05N97o11j018l76N31J140K175
1440E363K575P36j109j952l157l736k667j257j263m18O80R4L67J006J782J101
1456a855J209O74o64q31o3R81J330K994L332J833O12n71k169l226k183j792j915
1473b304p76j09j172o20P59J83N38J327K9j447j243m99QJ229L979L044K628K316
1491G870Q96j473j163p14j898j679j38j002k352j90L44n59Q8Q28m13k166j330
1508e051j691k050J334K486K714K991L483J436l26K35n05j197o1M88j632j091
$$ plain form
1524 1563 1333 744 453 1643 2674 1142 -1015 -3294 -6515 -9058 -8701 -7804 -5972 -2741 149 696
1540 696 1823 3201 3033 2917 3751 3711 2388 2493 3008 2699 3399 4685 5142 4338 3053 435 -3449 -6198
1558 -6198 -6871 -8124 -7518 -5010 -3580 -2314 -1165 -178 -3 178 1354 1144 890 1721 1942 1854 4135 6031
1576 6031 6778 7188 6807 4292 733 -1465 -3830 -5596 -5761 -4835 -4794 -4349 -2715 -2511 -2781 -1908 -1714 -2440
1594 -2440 -2321 -1245 -1041 -243 2290 4407 5753 8064 8875 6956 5123 3303 501 -1790 -2026 -2345
1610 -2345 -3018 -2184 -2216 -2609 -3008 -2617 -3551 -4487 -4558 -4976 -5220 -3915 -1618 371 3039 6004 6993 6618 6575
1629 6575 5374 3405 2439 1824 26 -90 678 330 -93 -45 -686 -2464 -3693 -4595 -6625 -6809 -6432 -5648
1647 -5648 -4113 -1006 1350 2658 4123 5072 4133 3740 3682 2300 1969 2342 2631 2512 3244 3546 2290 979
$$ packed form
1524A563k30n89k91J190J031j532k157k279l221k543L57Q97J832L231K890N47
1540F96J127J378j68j16Q34m0j323J05N15l09P00J286M57q04j285k618l884k749
1558f198o73j253O06K508J430J266J149R87J75J81J176k10k54Q31K21q8K281J896
1576F031P47M10l81k515l559k198k365j766j65R26M1M45J634K04k70Q73J94p26
1594b440J19J076K04P98K533K117J346K311Q11j919j833j820k802k291k36l19
1610b345o73Q34l2l93l99L91r34r36p1m18k44J305K297J989K668K965R89l75m3
1629F575j201j969r66o15j798j16P68l48m23M8o41j778j229r02k030j84L77P84
1647e648J535L107K356J308J465R49r39l93n8j382l31L73K89j19P32L02j256j311
$$ plain form
1665 979 -17 -2386 -4419 -5648 -6449 -6914 -5997 -4212 -3090 -959 1151 1676 1892 2014 1315 1091 1439 1767
1683 1767 2261 3500 4645 4979 4749 4453 2609 845 -641 -2764 -4801 -5295 -5668 -5241 -4262 -2768 -1910
1700 -1910 -928 69 81 -468 -683 -851 -685 304 2231 3688 5141 6332 6141 5000 3993 2536 367
1717 367 -1109 -2354 -3607 -4289 -3751 -3637 -2769 -1805 -1317 -1615 -1925 -2666 -3553 -3636 -2261 -849 1072 3400
1735 3400 4741 5500 5516 5999 4185 3495 2490 966 -657 -1502 -2287 -2484 -1846 -855 -820 -1493 -2006 -3574
1753 -3574 -5221 -5492 -5194 -4012 -1860 312 1791 3156 4132 4816 4513 4793 4388 3186 1907 917 -92
1770 -92 -20 549 1170 1123 944 -258 -2611 -4648 -5965 -6429 -6041 -4693 -3223 -1723 -459 888 1932 2939
1788 2939 3685 3886 3521 2754 1936 1381 1466 2581 3323 4166 4043 2730 574 -1863 -3709 -5263 -5503 -5194
$$ packed form
1665I79r96k369k033j229q01m65R17J785J122K131K110N25K16J22o99k24L48L28
1683A767M94J239J145L34k30k96j844j764j486k123k037m94l73M27R79J494Q58
1700a910R82R97J2n49k15j68J66R89J927J457J453J191j91j141j007j457k169
1717C67j476j245j253o82N38J14Q68R64M88k98l10p41q87q3J375J412J921K328
1735C400J341P59J6M83j814o90j005j524j623q45p85j97O38R91L5o73n13j568
1753c574j647k71K98J182K152K172J479J365R76O84l03K80m05j202j279r90j009
1770i2P2N69O21m7j79j202k353k037j317m64L88J348J470J500J264J347J044J007
1788B939P46K01l65p67q18n55Q5J115P42Q43j23j313k156k437j846j554k40L09
$$ plain form
1806 -5194 -4805 -4185 -2802 -1829 -1179 206 1141 1509 1489 1060 598 331 984 2311 4456 5479 6103 5432
1824 5432 3707 2068 -430 -2113 -2939 -3439 -3973 -3814 -3657 -3561 -2673 -1951 -971 -496 -542 -1050 -1711 -1926 -1530
1843 -1530 198 2368 4445 5879 6102 5389 3920 2550 1075 191 -809 -1508 -1734 -2457 -2598 -2285 -1896
1860 -1896 -1458 -1358 -1644 -2653 -3714 -4147 -4077 -2540 -456 1693 3755 4786 4842 4466 3854 2603 2074 1489
1878 1489 882 312 -486 -675 -815 -515 -483 -549 -1094 -2202 -3660 -4855 -5574 -4733 -3302 -1249 734 2324
1896 2324 2956 3413 3179 2874 2617 2342 2432 1396 1392 1023 989 1350 1411 1421 732 -847 -2554 -4231 -5473 -5578
1916 -5578 -4663 -3340 -2002 -638 466 1243 1523 1782 1925 1984 2083 1880 1617 1734 2129 2486 3376 3661 3238
1935 3238 1980 389 -1961 -3934 -4530 -4715 -4407 -3334 -2573 -1987 -1437 -657 -450 -6 142 394 338 535
$$ packed form
1806e194L89O20J383R73O50J385R35L68k0m29m62k67O53J327K145J023O24o71
1824E432j725j639k498j683q26n00n34J59J57R6Q88P22R80M75m6n08o61k15L96
1843a530J728K170K077J434K23p13j469j370j475q84j000o99k26p23j41L13L89
1860a896M38J00k86j009j061m33P0J537K084K149K062J031N6l76o12j251n29n85
1878A489o07n70p98j89j40L00L2o6n45j108j458j195p19Q41J431K053J983J590
1896B324O32M57k34l05k57k75R0j036ml69l4L61O1J0o89j579j707j677j242j05
1916e578R15J323J338J364J104P77K80K59J43N9R9k03k63J17L95L57Q90K85m23
1935C238j258j591k350j973n96j85L08J073P61N86N50P80K07M44J48K52n6J97
$$ plain form
1953 535 1129 1902 2691 3937 4902 4829 4481 2811 1222 -468 -2020 -2843 -3342 -3076 -2886 -2549 -1892 -1773 -1603
1972 -1603 -1650 -1661 -1673 -1811 -1497 -1225 -442 1304 2934 4042 4719 5150 4687 3373 2079 891 48 -988
1990 -988 -1293 -1438 -1598 -1261 -1180 -1340 -1505 -2185 -2819 -3451 -3547 -3382 -2781 -1685 -28 1218 2661 3952 4274
2009 4274 3848 3292 2397 1415 596 463 589 686 498 696 456 -271 -861 -1823 -2991 -3809 -4320 -4226 -3656 -2557
2029 -2557 -1114 -3 1495 2454 2547 2623 2622 1858 1407 1030 1229 1409 1829 2490 2281 2046 1123 28 -1445
2048 -1445 -2622 -3398 -3949 -4212 -3503 -2859 -2055 -909 517 1047 1262 1373 724 578 541 638 1410 2276 3303
2067 3303 3238 3318 3076 1743 411 -476 -1592 -2588 -3037 -3447 -3510 -3127 -2105 -1066 -764 253 115 -764 -736
2086 -736 -898 -653 171 1519 2809 3342 3804 4215 3395 2867 2156 634 -545 -1186 -2427 -2803 -2521 -1744
$$ packed form
1953E35N94P73P89J246R65p3l48j670j589j690j552q23m99K66J90L37O57J19J70
1972a603m7j1j2j38L14K72P83J746J630J108O77M31m63j314j294j188q43j036
1990i88l05j45j60L37Q1j60j65o80o34o32r6J65O01J096J657J246J443J291L22
2009D274m26n56q95r82q19j33J26R7j88J98k40p27n90r62j168q18n11R4N70J099
2029b557J443J111J498R59R3P6jp64m51l77J99J80M20O61k09k35r23j095j473
2048a445j177p76n51k63P09O44Q04J146J426N30K15J11o49j46l7R7P72Q66J027
2067C303o5Q0k42j333j332q87j116r96m49m10o3L83J022J039L02J017j38q79K8
2086g36j62K45Q24J348J290N33M62M11q20n28p11j522j179o41j241l76K82P77
$$ plain form
2104 -1744 -1478 -1367 -700 -1216 -1919 -1955 -2479 -2673 -1579 -574 676 1841 3348 3385 3480 3508 3382 2434 1726
2123 1726 1208 -205 -1045 -1171 -1201 -1170 -275 -112 -1070 -1677 -2344 -3762 -4062 -3190 -2564 -1565 51 1142 1530
2142 1530 2149 2572 2904 3143 3191 2336 1274 535 405 256 492 1666 1521 758 -55 -1604 -3163 -3677 -3593
2161 -3593 -3849 -3027 -2144 -1538 -1058 4 827 1504 2173 2326 1758 1220 1105 653 1057 1817 2701 2564 2421
2180 2421 2152 635 -849 -1987 -2922 -3278 -2962 -2694 -2582 -1962 -1359 -1350 -392 654 886 557 574 113 -612
2199 -612 345 1562 2451 3206 4019 3182 2037 1009 -127 -930 -1223 -1481 -2053 -2530 -2409 -2380 -1976 -961 -387
2218 -387 -142 -390 -817 -1372 -1571 -1058 196 1532 2493 3439 3600 3073 2538 1645 809 349 -145 -852 -1235
2237 -1235 -1816 -1924 -1596 -1029 -799 -604 -978 -1503 -2247 -2688 -2331 -1167 -192 1109 2204 2734 2869 2901 2624
$$ packed form
2104a744K66J11O67n16p03l6n24j94J094J005J250J165J507L7R5K8j26r48p08
2123A726n18j413q40j26l0L1Q95J63r58o07o67j418l00Q72O26R99J616J091L88
2142A530O19M23L32K39M8q55j062p39j30j49K36J174j45p63q13j549j559n14Q4
2161c593k56Q22Q83O06M80J062Q23O77O69J53n68n38j15m52M04P60Q84j37j43
2180B421k69j517j484j138r35l56L16K68J12O20O03RR58J046K32l29J7m61p25
2199f12R57J217Q89P55Q13q37j145j028j136q03k93k58n72m77J21K9M04J015N74
2218c87K45k48m27n55j99N13J254J336R61R46J61n27n35q93q36m60m94p07l83
2237a235n81j08L28N67K30J95l74n25p44m41L57J164R75J301J095N30J35L2k77
$$ plain form
2256 2624 1997 1648 1285 564 -112 -409 -547 -638 -466 -168 -351 -876 -1706 -2507 -3162 -3240 -3033 -2212 -995 426
2276 426 1051 1687 2063 2282 2309 2138 1759 1357 900 703 654 431 957 1097 755 586 -447 -1497 -2863 -3427
2296 -3427 -3624 -3268 -2542 -1731 -1101 8 536 877 1021 1450 1446 1117 1264 912 1043 1363 2085 2497 2685 2151
2316 2151 1427 465 -927 -1954 -2514 -3295 -2650 -2552 -1819 -1283 -1141 -851 -297 -270 -26 -91 -149 2 389 1086
2336 1086 1850 2545 3007 2887 2829 2181 849 114 -984 -1310 -1769 -1620 -1750 -1457 -1394 -1308 -1008 -1015 -1235 -1349 -1587
2357 -1587 -1240 -1088 -372 312 1492 2485 2680 3208 2986 2340 1581 870 296 -583 -732 -689 -668 -706 -472 -786
2377 -786 -1243 -1434 -1776 -2122 -2320 -2051 -1617 -936 -237 705 1632 2183 2667 2474 2134 1542 883 552 303 233
2397 233 359 344 538 265 -73 -456 -1480 -1649 -2145 -2443 -2241 -2156 -1411 -833 -333 709 1499 1723 1822 1615
$$ packed form
2256B624o27l49l63p21o76k97j38r1J72K98j83n25q30q01o55p8K07Q21J217J421
2276D26O25O36L76K19K7j71l79m02m57j97m9k23N26J40l42j69j033j050j366n64
2296c427j97L56P26Q11O30J109N28L41J44M29ml29J47l52J31L20P22M12J88n34
2316B151p24r62j392j027n60p81O45R8P33N36J42K90N54K7K44o5n8J51L87O97
2336A086P64O95M62j20n8o48j332p35j098l26m59J49j30K93O3Q6L00pk20j14k38
2357a587L47J52P16O84J180R93J95N28k22o46p59p11n74q79j49M3K1l8K34l14
2377g86m57j91l42l46j98K69M34O81O99R42R27N51M84j93l40n92o59l31k49p0
2397B33J26j5J94k73l38l83j024j69m96k98K02Q5P45N78N00J042P90K24R9k07
$$ plain form
2417 1615 1281 815 613 808 1041 1632 1610 1443 1018 489 0 -855 -1529 -2059 -2376 -2631 -2240 -2069 -1645 -826
2437 -826 33 618 463 598 423 188 292 750 1293 1755 1787 2578 2273 1907 1223 526 1 -733 -1582 -1895
2457 -1895 -2197 -2412 -2161 -2035 -1211 -813 -251 -482 -668 -792 -572 -495 482 1171 1714 2155 2402 2570 2413 1997
2477 1997 1692 1054 210 -383 -978 -1753 -1477 -1514 -1180 -780 -555 -742 -1290 -1789 -2091 -1689 -1156 -139 407 707
2497 707 1654 1493 1892 2402 2433 2346 1543 830 174 -366 -796 -292 -342 288 -269 -536 -1035 -1572 -2273 -2389 -2471
2518 -2471 -1604 -1113 -572 -118 585 1296 1731 1914 1960 2065 1524 898 559 464 569 863 1138 991 417 -156
2538 -156 -741 -1673 -2127 -2291 -2416 -1998 -1547 -1135 -857 -362 212 904 1207 1215 1460 811 575 31 453 1192 1772
2559 1772 1945 1743 1228 355 -270 -1309 -1232 -1734 -1771 -1840 -1488 -1756 -1405 -811 11 387 431 335 88 -128 95
$$ packed form
2417A615l34m66k02J95K33N91k2j67m25n29m89q55o74n30l17k55L91J71M24Q19
2437h26Q59N85j55J35j75k35J04M58N43M62L2P91l05l66o84o97n25p34q49l13
2457a895l02k15K51J26Q24L98N62k31j86j24K20P7R77O89N43M41K47J68j57m16
2477A997l05o38q44n93n95p75K76l7L34M00K25j87n48m99l02M02N33J017N46L00
2497G07R47j61L99N10L1q7q03p13o56n40m30N04n0O30n57k67m99n37p01j16q2
2518b471Q67M91N41M54P03P11M35J83M6J05n41o26l39r5J05K94K75j47n74n73
2538a56n85r32m54j64j25M18M51M12K78M95N74O92L03QK45o49k36n44M22P39N80
2559A772J73k02n15q73o25j039P7n02l7o9L52k68L51N94Q22L76M4r6k47k16K23
$$ plain form
2580 95 199 865 1683 2205 2172 2027 1486 615 425 -61 -585 -1195 -1228 -1704 -1635 -1637 -707 -951 -566 -257 -264 -622 -719
2603 -719 -779 -605 255 1067 1795 2057 2182 2049 1758 1443 1037 457 -118 -328 -696 -1326 -1130 -1002 -1165 -1002
2623 -1002 -707 -1225 -1340 -1506 -1529 -1782 -1403 -298 630 982 1671 1646 1599 1810 1807 1484 1038 939 323 -170 -312
2644 -312 -116 -335 195 -13 -712 -1135 -1749 -2211 -2157 -1890 -1300 -1006 -402 239 565 1162 1492 1532 1356 1248 1080
2665 1080 669 858 830 886 835 1220 621 402 -261 -746 -1602 -1978 -1927 -2339 -1986 -1283 -814 -278 -74 12 605
2686 605 678 960 583 476 899 1145 997 1448 1924 1641 1450 1317 292 -350 -904 -1191 -1771 -1596 -1256 -1312
2706 -1312 -1178 -638 -414 -354 -111 -140 -535 -231 35 140 433 1024 1330 1608 1744 1849 1376 1021 667 -561
2726 -561 -716 -718 -1006 -1320 -899 -720 -580 -681 -502 -751 -1041 -825 -709 -614 -200 9 605 1415 1545 1772 1846
$$ packed form
2580I5J04O66Q18N22l3j45n41q71j90m86n24o10l3m76O9kR30k44L85L09pl58r7
2603g19o0J74Q60Q12P28K62J25j33k91l15m06n80n75k10l68o30J96J28j63J63
2623a002K95n18j15j66k3k53L79J105R28L52O89k5m7K11ll23m46r9o16m93j42
2644c12J96k19N30k08o99m23o14m62N4K67N90K94O04O41L26N97L30M0j76j08j68
2665A080m11J89k8N6n1L85n99k19o63m85q56l76N1m12L53P03M69N36K04Q6N93
2686F05P3K82l77j07M23K46j48M51M76k83j91j33j025o42n54k87n80J75L40n6
2706a312J34N40K24O0K43k9l95L04K66J05K93N91L06K78J36J05m73l55l54j228
2726e61j55kk88l14M21J79J40j01J79k49k90K16J16R5M14K09N96Q10J30K27P4
$$ plain form
2747 1846 1694 1148 695 188 -103 -122 -620 -358 -599 -243 -262 -447 -1153 -1246 -1412 -1466 -1127 -881 -808 -271 385
2768 385 775 1367 1764 1511 1480 1359 826 398 352 -21 331 453 315 123 -201 -678 -1071 -1218 -1328 -1658 -1509
2789 -1509 -1721 -1093 -861 -324 266 1025 1100 1276 1147 664 507 492 709 742 1129 1126 944 844 508 -139 -548
2810 -548 -835 -1247 -1614 -1690 -1923 -1589 -1016 -677 -383 268 548 340 116 89 404 130 749 1166 1443 1523 1278
2831 1278 1143 906 729 293 -177 -626 -1060 -1633 -1429 -1503 -1138 -799 -535 -189 -553 -466 -666 -532 -361 90
2851 90 723 1138 1053 1604 1418 1443 1503 1096 1053 529 -124 -535 -1037 -992 -1011 -628 -460 -582 -620 -885 -1247 -1400 -1217
2874 -1217 -592 -349 224 375 869 1344 1286 1473 1687 1686 1228 445 25 74 -389 75 -142 -24 -19 -296 -836 -1233
2896 -1233 -1368 -1419 -1443 -1103 -578 -533 -350 212 487 907 1173 1424 1280 739 523 103 315 533 388 618 547
$$ packed form
2747A846j52n46m53n07k91j9m98K62k41L56j9j85p06r3j66n4L39K46P3N37O56
2768C85L90N92L97k53l1j21n33m28m6l73L52J22j38j92l24m77l93j47j10l30J49
2789a509k12O28K32N37N90P59P5J76j29m83j57j5K17L3L87lj82j00l36o47m09
2810e48k87m12l67p6k33L34N73L39K94O51K80k08k24k7L15k74O19M17K77Q0k45
2831A278j35k37j77m36m70m49m34n73K04p4L65L39K64L46l64Q7k00J34J71M51
2851I0O33M15q5N51j86K5O0m07m3n24o53m11n02M5j9L83J68j22l8k65l62j53J83
2874a217O25K43N73J51M94M75n8J87K14jm58p83m20M9m63M64k17J18Nk77n40l97
2896a233j35n1k4L40N25M5J83N62K75M20K66K51j44n41k16m20K12K18j45K30p1
$$ plain form
2917 547 521 -241 -438 -1139 -1153 -1110 -1278 -1166 -1362 -1104 -747 -169 249 603 1014 975 738 319 368 347 412 971
2939 971 1141 1287 991 523 131 -180 -736 -843 -848 -1174 -1220 -1404 -1161 -856 -538 -75 -2 280 219 65 -28 105
2961 105 363 691 1102 1483 1590 1224 1009 844 306 -36 78 -791 -927 -1435 -1502 -1273 -978 -761 -353 -273 -376
2982 -376 -747 -695 -445 -122 272 921 912 1430 1522 1479 1009 1018 803 764 171 -250 -349 -961 -574 -534 -731 -604 -463
3005 -463 -610 -1283 -1298 -1177 -1021 -694 -316 100 490 1003 1179 1373 1216 1163 1060 970 660 578 221 -100 78
3026 78 65 -12 4 -551 -1048 -1087 -1406 -1388 -1390 -1017 -734 -175 -82 261 799 861 901 902 1091 948 270 622 661 249 767
3051 767 592 460 334 82 -300 -952 -1102 -1419 -1537 -1060 -751 -793 -696 -189 70 371 669 242 582 641 485
3072 485 586 671 937 862 848 1036 745 382 34 -341 -751 -997 -1121 -1006 -824 -544 -409 -364 -134 -155 -33 -162
$$ packed form
2917E47k6p62j97p01j4M3j68J12j96K58L57N78M18L54M11l9k37m19M9k1O5N59
2939I71J70J46k96m68l92l11n56j07nl26m6j84K43L05L18M63P3K82o1j54r3J33
2961A05K58L28M11L81J07l66k15j65n38l42J14q69j36n08o7K29K95K17M08Q0j03
2982c76l71N2K50L23L94O49rN18R2m3m70Rk15l9n93m21r9o12L87M0j97J27J41
3005d63j47o73j5J21J56L27L78M16L90N13J76J94j57n3j03r0l10q2l57l21J78
3026G8j3p7J6n55m97l9l19J8kL73K83N59R3L43N38O2M0JJ89j43o78L52L9m12N18
3051G67j75j32j26k52l82o52j50l17j18M77L09m2R7N07K59L01K98m27L40N9j56
3072D85J01Q5K66p5j4J88k91l63l48l75m10k46j24J15J82K80J35M5K30k1J22j29
$$ plain form
3094 -162 -102 -99 158 596 474 979 1243 1226 1115 931 634 445 -22 -589 -590 -636 -854 -709 -801 -703 -328 -576 -714
3117 -714 -476 -598 -597 -540 -14 175 654 712 1349 1222 1329 1265 732 272 -41 -89 -141 -190 -204 -336 -451 -694 -908
3140 -908 -809 -943 -932 -1105 -744 -626 -599 -184 461 632 913 1280 1282 1012 1042 951 437 154 383 287 418 191 -142
3163 -142 -371 -606 -512 -958 -899 -1180 -976 -1300 -1027 -712 -774 255 498 809 735 710 735 448 455 675 803 684
3185 684 776 831 617 275 -117 -189 -336 -800 -1253 -1054 -1208 -1205 -1141 -546 -198 -88 204 49 94 -26 437 446 874
3208 874 1091 1207 1033 928 743 598 685 215 -80 -433 -817 -1156 -1034 -881 -947 -629 -100 -143 -455 -531 -368
3229 -368 -401 148 233 548 497 778 1010 926 974 1040 1058 620 423 81 -470 -517 -776 -479 -345 -372 -408 -297 -1064
3252 -1064 -777 -853 -659 -203 -167 52 262 339 561 721 1069 939 970 704 310 281 -258 -331 -207 -34 98 -14
$$ packed form
3094a62O0LK57M38j22N05K64j7j11j84k97j89m67n67jm6k18J45r2R8L75k48j38
3117g14K38j22JN7N26J89M79N8O37j27J07o4n33m60l13m8n2m9j4j32j15k43k14
3140i08R9j34J1j73L61J18K7M15O45J71K81L67Kk70L0r1n14k83K29r6J31k27l33
3163a42k29k35R4m46N9k81K04l24K73L15o2J029K43L11p4k5K5k87PK20J28j19
3185F84R2N5k14l42l92p2j47m64m53J99j54LO4N95L48J10K92j55M5j20M63RM28
3208H74K17J16j74j05j85j45Q7m70k95l53l84l39J22J53o6L18N29m3l12p6J63
3229c68l3N49Q5L15n1K81K32q4M8O6J8m38j97l42n51m7k59K97J34k7l6J11p67
3252a064K87p6J94M56L6K19K10P7K22J60L48j30L1k66l94k9n39p3J24J73J32j12
$$ plain form
3274 -14 -189 -520 -926 -919 -794 -862 -760 -449 -197 -199 360 390 853 752 1140 814 568 463 429 40 312 360 225
3297 225 325 159 -144 -732 -612 -958 -920 -1106 -817 -731 -472 -328 -115 251 565 754 837 682 644 94 513
3318 513 459 553 841 865 313 273 288 -144 -790 -482 -695 -899 -1008 -1093 -1124 -572 -450 -57 -39 -40 153 34 233
3341 233 465 609 765 852 853 783 897 750 522 247 35 -211 -448 -758 -732 -828 -1062 -827 -596 -395 -150 -401
3363 -401 -512 -369 -421 -171 166 453 506 695 901 919 994 1070 778 455 219 -158 -385 -214 -757 -589 -424 -387
3385 -387 -533 -435 -659 -674 -784 -886 -421 24 2 273 552 908 710 955 850 631 470 283 290 96 217 -66
3407 -66 -97 -62 -130 -51 -364 -769 -933 -802 -756 -807 -572 -172 -17 284 259 509 496 839 417 437 402 191 457 518
3431 518 301 219 323 -77 0 -251 -358 -670 -727 -868 -691 -451 -654 -224 -335 17 246 214 305 298 546 233
$$ packed form
3274a4j75l31m06PJ25o8J02L11K52kN59L0M63j01L88l26k46j05l4l89K72M8j35
3297B25J00j66l03n88J20l46L8j86K89Q6K59J44K13L66L14J89Q3j55l8n50M19
3318E13n4R4K88K4n52m0J5m32o46L08k13k04j09q5l1N52J22L93J8jJ93j19J99
3341B33K32J44J56Q7Jp0J14j47k28k75k12k46k37l10K6r6k34K35K31K01K45k51
3363d01j11J43n2K50L37K87N3J89K06J8P5P6k92l23k36l77k27J71n43J68J65L7
3385c87j46R8k24j5j10j02M65M45k2K71K79L56j98K45j05k19j61j87Pj94J21k83
3407f6l1L5o8P9l13m05j64J31M6n1K35M00J55L01k5K50j3L43m22K0l5k11K66O1
3431E18k17q2J04m00P7k51j07l12n7j41J77K40k03M30j11L52K29l2R1pK48l13
$$ plain form
3453 233 575 445 435 551 388 483 469 212 -305 -376 -523 -791 -752 -679 -849 -395 -173 -601 -106 -17 150 89 155
3476 155 85 241 268 276 553 661 795 809 806 280 363 -50 -256 -569 -567 -591 -507 -809 -568 -743 -454 -472 -282 -112
3500 -112 -200 -174 -77 267 377 384 583 951 1075 1031 659 369 349 103 -193 67 -286 -266 -301 -160 -491 -421 -419 -401
3524 -401 -550 -475 -447 -433 -344 132 -13 532 846 803 748 605 489 274 315 517 219 -145 194 -183 -273 -252 -353
3547 -353 -215 -696 -538 -562 -832 -612 -676 -88 -43 269 506 701 374 520 253 577 233 295 576 364 170
3568 170 172 113 178 71 -279 -232 -554 -718 -861 -612 -493 -448 -318 -77 -7 267 430 68 217 216 379 257 426
3591 426 513 368 298 161 344 137 81 -178 -508 -637 -665 -798 -458 -280 -203 -241 -55 -157 -101 194 135 270 396
3614 396 469 448 505 365 626 672 534 418 59 -203 -278 -450 -374 -432 -312 -300 -250 -434 -513 -538 -255 -544 80 -169
$$ packed form
3453B33L42j30j0J16j63R5j4k57n17p1j47k68L9P3j70M54K22m28M95Q9J67o1O6
3476A55p0J56K7QK77J08J34J4ln26Q3m13k06l13Kk4Q4l02K41j75K89j8J90J70
3500a12q8K6R7L44J10PJ99L68J24m4l72k90k0k46k96K60l53K0l5J41l31P0KJ8
3524d01j49P5K8J4Q9M76j45N45L14m3n5j43j16k15M1K02k98l64L39l77r0K1j01
3547c53J38m81J58k4k70K20o4N88M5L12K37J95l27J46k67L24l44O2K81k12j94
3568A70Kn9O5j07l50M7l22j64j43K49J19M5J30K41P0K74J63l62J49jJ63j22J69
3591D26Q7j45p0j37J83k07n6k59l30j29k8j33L40J78P7l8J86j02N6K95n9J35J26
3614C96P3k1N7j40K61M6j38j16l59k62p5j72P6n8J20J2N0j84p9k5K83k89O24k49
$$ plain form
3638 -169 166 330 220 571 657 492 989 426 500 230 109 -349 -212 -112 -196 -379 -402 -360 -488 -495 -446 -490 -334
3661 -334 -292 -216 -426 -246 40 369 353 858 678 627 428 242 491 147 301 76 269 -89 53 -224 -374
3682 -374 -384 -338 -598 -395 -422 -710 -694 -109 -65 45 461 575 686 277 552 519 693 430 332 309 378 323 270 -162
3706 -162 49 -43 -118 -426 -523 -792 -843 -798 -558 -310 -169 15 135 293 293 133 84 267 292 389 615 655 471 441
3730 441 482 196 170 -59 -468 -602 -762 -760 -476 -283 -245 -198 -246 31 -187 -166 -159 183 -3 496 246 396 434 633
3754 633 536 505 384 471 322 -156 -184 -409 -596 -491 -426 -385 -316 -156 -361 -401 -383 -250 -234 -50 20 34 221 347
3778 347 534 597 605 570 417 121 -47 -157 -56 27 -147 -163 -229 -412 -224 -311 -201 -429 -693 -153 -159 -175 150 280
3802 280 367 418 417 506 372 566 580 219 172 156 128 -57 -270 -330 -217 -204 -255 -345 -458 -579 -531 -252 -377 -91 -113
$$ packed form
3638a69L35J64j10L51Q6j65M97n63P4k70j21m58J37J00q4j83k3M2j28pM9m4J56
3661c34M2P6k10J80K86L29j6N05j80n1j99j86K49l44J54k25J93l58J42k77j50
3682c74j0M6k60K03k7k88J6N85M4J10M16J14J11m09K75l3J74k63r8k3O9n5n3m32
3706a62K11r2p5l08r7k69n1M5K40K48J41J84J20J58%j60m9J83K5R7K26M0j84l0
3730D41M1k86k6k29m09j34j60KK84J93L8M7m8K77k18K1PL42j86M99k50J50L8J99
3754F33r7l1j21Q7j49m78k8k25j87J05O5M1O9J60k05m0J8J33J6J84P0J4J87J26
3778C47J87O3Ql5j53k96j68j10J01Q3j74j6o6j83J88q7J10k28k64N40oj6L25J30
3802B80Q7N1jQ9j34J94J4l61m7j6k8j85k13o0J13J3n1r0j13j21M8K79j25K86k2
$$ plain form
3827 -113 121 142 125 399 524 674 327 345 181 385 183 308 357 78 187 -120 -288 -719 -555 -508 -674 -572
3849 -572 -424 -274 -334 -321 28 -105 317 216 259 285 52 549 553 442 392 447 480 319 -59 121 -237 -382 -325
3872 -325 -534 -333 -467 -294 -513 -281 -499 -192 -170 163 -40 183 66 317 298 380 729 698 631 323 309 200
3894 200 110 -98 -84 4 -339 -636 -436 -573 -366 -89 -279 -424 -449 -284 -205 -87 153 -99 460 197 499 537
3916 537 253 479 223 398 181 39 -25 164 -481 -47 -183 -129 -239 -238 -209 -640 -470 -386 -291 -112 159 241 284
3939 284 454 536 150 399 252 400 416 284 -11 -59 113 50 -79 -78 -276 -558 -204 -568 -591 -542 -304 -335 -132
3962 -132 -37 -46 58 36 93 156 460 459 290 412 63 435 395 405 137 14 -56 -554 -80 -466 -737 -504 -440 -315
3986 -315 -339 -75 -33 -10 -2 294 214 259 477 155 154 381 275 573 527 298 297 -90 21 -322 -412 -477 -264 -343 -272
$$ packed form
3827a13K34K1j7K74J25J50l47J8j64K04k02J25M9k79J09l07j68m31J64M7j66J02
3849e72J48J50o0J3L49j33M22j01M3K6k33M97Mj11n0N5L3j61l78J80l58j45N7
3872c25k09K01j34J73k19K32k18L07K2L33k03K23j17K51j9Q2L49l1o7l08j4j09
3894B00r0k08J4Q8l43k97K00j37K07K77j90j45k5J65P9J18K40k52N59k63L02L8
3916E37k84K26k56J75k17j42o4J89o45M34j36N4j10JK9m31J70Q4R5J79K71Q2M3
3939B84J70Q2l86K49j47J48J6j32k95m8J72o3j29Jj98k82L54l64k3M9K38l1K03
3962a32R5rJ04k2N7O3L04jj69J22l49L72m0J0k68j23p0m98M74l86k71K33O4J25
3986c15k4K64M2K3QK96q0M5K18l22jK27j06K98m6k29jl87J11l43r0o5K13p9P1
$$ plain form
4011 -272 -365 -367 -417 -491 -140 -79 40 -104 -123 180 124 514 514 301 537 687 537 105 196 20 -135 -69 -128 -262
4035 -262 -292 -348 -273 -312 -275 -183 -441 -255 -57 -136 -193 -25 442 369 471 326 327 426 427 523 -38 50 183 -48 -76 -123
4061 -123 -24 -105 -210 -250 -409 -384 -296 -675 -499 -125 -4 123 379 328 425 438 206 354 248 128 309 273 294
4084 294 207 123 79 84 -125 -375 -177 -431 -501 -410 -509 -277 -363 -157 76 84 308 132 248 375 398 371 148 305
4108 305 301 229 299 78 22 180 27 -250 -419 -390 -416 -641 -172 -174 -91 -42 -218 -20 157 -87 84 28 113 96 42
4133 42 682 375 429 146 268 164 60 39 -5 -428 -455 -188 -72 -256 -354 -165 -159 -41 -188 104 13 100 -131
4156 -131 26 297 224 513 595 382 356 460 132 217 -60 -164 -128 -169 -47 -270 -160 -294 -446 -232 -269 -127
4178 -127 -269 -148 -200 174 -39 89 438 190 329 245 414 247 72 126 -54 74 -53 -26 -293 -31 -77 -334
$$ packed form
4011b72r3kn0p4L51O1J19j44j9L03n6L90%k13K36J50j50m32R1j76j55O6n9j34
4035b62l0n6P5l9L7R2k58J86J98p9n7J68M67p3J02j45JR9JR6n61Q8J33k31k8m7
4061a23R9q1j05m0j59K5Q8l79J76L74J21J27K56n1R7J3k32J48j06j20J81l6K1
4084B94q7q4m4Nk09k50J98k54p0R1r9K32q6K06K33QK24j76J16J27K3k7k23J57
4108C05mp2P0k21n6J58j53k77j69K9k6k25M69kQ3M9j76J98J77k44J71n6Q5j7n4
4133D2O40l07N4k83J22j04j04k1m4m23k7K67J16j84r8J89OJ18j47K92r1Q7k31
4156a31J57K71p3K89Q2k13k6J04l28Q5k77j04L6m1J22k23J10j34j52K14l7J42
4178a27j42J21n2L74k13J28L49k48J39q4J69j67j75N4j80J28j27K7k67K62m6k57
$$ plain form
4200 -334 -412 -380 -515 -486 -386 -182 -370 130 133 66 71 181 173 461 285 129 -5 133 218 436 171 81 137 -126
4224 -126 -55 -233 -203 -521 -562 -563 -305 -288 -320 -167 -233 111 386 171 216 231 236 240 167 181 258 408 383 108 273 -217
4250 -217 -144 -359 -333 -312 -150 -396 -452 -175 -288 -119 -192 -108 -178 -225 192 -44 167 269 301 287 429 426 166 151
4274 151 79 211 -30 82 -350 -336 -266 -360 -81 15 -8 -2 -74 -240 45 -255 -186 37 108 266 50 445 196 247
4298 247 493 298 197 183 -144 -249 -165 -123 -280 97 -90 -122 -154 -154 -281 -243 -185 -275 -82 80 156 128 293 412
4322 412 535 402 275 265 335 112 173 64 35 8 -71 -91 -62 -344 -453 -321 -540 -531 -332 -128 -77 -35 63 110 48
4347 48 121 156 262 290 124 144 81 41 171 139 20 259 -396 -106 -129 -391 -413 -505 -332 -286 -406 -205 -267 -82
4371 -82 194 -5 254 343 292 310 174 180 232 192 159 101 -94 82 101 -109 -140 -302 -268 -502 -318 -102 -181 -388 104
$$ packed form
4200c34p8L2j35K9J00K04j88N00Lo7NJ10qK88j76j56j34J38Q5K18k65r0N6k63
4224a26P1j78L0l18m1jK58J7l2J53o6L44K75k15M5J5NMp3J4P7J50k5k75J65m90
4250b17P3k15K6K1J62k46n6K77j13J69p3Q4p0m7M17k36K11J02L2j4J42lk60j5
4274A51p2J32k41J12m32J4P0r4K79R6k3Op2j66K85l00O9K23P1J58k16L95k49N1
4298B47K46j95j01j4l27j05Q4M2j57L77j87l2l2%j27L8N8r0J93J62P6k8J65J19
4322D12J23j33j27j0P0k23O1j09k9k7p9k0K9k82j09J32k19RJ99K04N1M2R8M7o2
4347D8P3L5J06K8j66K0o3m0J30l2j19K39o55K90k3k62k2r2J73M6j20K01o2J85
4371h2K76j99K59Q9n1J8j36ON2m0l3n8j95J76J9k10l1j62L4k34J84K16p9k07M92
$$ plain form
4396 104 113 -54 -4 -192 22 45 55 -3 356 183 270 519 449 197 207 90 -183 -191 -277 -246 -131 -177 -282 -334 -134
4421 -134 -198 -206 31 -232 -206 59 -48 171 44 335 314 346 494 265 279 -158 27 -16 32 105 -159 -188 -312 -266
4445 -266 -371 18 -73 -219 -189 -38 -291 176 -85 125 256 175 177 220 282 149 263 215 45 137 161 -104 142
4468 142 67 -263 -76 -291 -362 -200 -353 -122 -247 34 -12 -47 82 325 207 326 70 221 328 78 97 196
4490 196 11 129 75 185 102 -311 -192 -326 -395 -491 -280 -181 -338 -94 -129 19 -21 49 515 82 515 135 276
4513 276 35 -42 249 342 316 256 10 -74 -291 93 -295 -222 -238 -616 -396 -128 -249 -208 -364 46 49 -227 177
4536 177 65 3 426 169 140 330 369 313 202 21 31 197 -116 -195 -273 -244 -58 -506 73 39 -229 -299 -392 -162
4560 -162 -357 77 104 134 211 367 228 362 318 412 454 -18 395 40 10 -198 21 -170 -262 -137 -254 -59 -155
$$ packed form
4396A04Rj67N0j88K14K3J0n8L59j73Q7K49p0k52J0j17k73qq6L1J15m6j05n2K00
4421a34o4qK37k63K6K65j07K19j27K91k1L2J48k29J4m37J85m3M8P3k64k9j24M6
4445b66j05L89r1j46L0J51k53M67k61K10J31q1KM3O2j33J14m8j70R2K4k65K46
4468A42p5l30J87k15p1J62j53K31j25K81m6l5J29K43j18J19k56J51J07k50J9R9
4490A96j85J18n4J10q3m13J19j34o9r6K11R9j57K44l5J48m0P0M66m33M33l80J41
4513B76k41p7K91R3k6o0k46q4k17L84l88P3j6l78K20K68j21M1j56M10Lk76M04
4536A77j12o2M23k57k9J90L9n6j11j81J0J66l13p9p8K9J86m48N79l4k68p0r3K30
4560a62j95M34K7L0P7J56j39J34m4R4M2m72M13l55l0k08K19j91r2J25j17J95r6
$$ plain form
4583 -155 -391 -188 -38 -67 -117 -238 -132 -197 270 56 327 225 140 237 95 220 124 9 255 296 -14 -104 -72
4606 -72 -359 -298 -170 -477 -233 -412 -243 -112 -199 -60 60 312 420 161 37 123 511 117 221 320 45 207
4628 207 19 41 -55 -79 -143 -393 -144 -146 -120 -396 -117 94 36 107 54 86 -164 -95 -24 90 237 210 -197 273 298
4653 298 292 -105 243 116 -340 -71 -244 -195 -38 -243 -286 -196 -80 42 -26 -152 -203 -89 -57 -83 18 -74 -42 289
4677 289 188 366 441 188 -297 -189 20 -152 -232 -327 -372 -257 -57 -213 -287 -132 -150 -230 -220 145 -104 54 327
4700 327 114 133 445 411 164 287 272 133 -101 -89 -26 -62 -67 -37 69 -128 -210 -300 -342 -244 -229 -276 -91 -186 -185 -105
4726 -105 189 -39 179 153 24 155 406 236 390 76 133 151 52 32 59 -115 -135 55 -450 -336 108 -321
4748 -321 -154 8 -217 3 209 56 47 55 169 -234 282 -29 232 -76 218 233 115 155 -16 -74 -99 -207 3
$$ packed form
4583a55k36K03J50k9n0j21J06o5M67k14K71j02q5R7j42J25r6j15K46M1l10r0L2
4606g2k87O1J28l07K44j79J69J31q7J39J20K52J08k59j24Q6L88l94J04R9k75J62
4628B07j88K2r6k4o4k50K49kK6k76K79K11n8P1n3L2k50O9P1J14J47k7m07M70K5
4653B98ol97L48j27m56K69j73M9J57k05m3R0J16J22o8j26n1J14L2k6J01r2L2L31
4677B89j01J78P5k53m85J08K09j72q0r5m5J15K00j56p4J55j8q0J0L65k49J58K73
4700C27k13J9L12l4k47J23j5j39k34J2O3l6nL0J06j97q2r0m2R8J5m7J85r5JQ0
4726a05K94k28K18k6j29J31K51j70J54l14N7J8r9k0K7j74k0J90n05J14M44m29
4748c21J67J62k25K20K06j53rQJ14m03N16l11K61l08K94J5j18M0j71n8k5j08K10
$$ plain form
4771 3 -223 -296 -219 -280 -72 -110 59 1 -55 -126 137 47 156 356 81 101 280 66 173 34 174 66 -207 41
4795 41 -88 -228 -85 -245 -98 -131 -3 -118 -307 -35 -115 -153 105 198 155 3 179 316 151 159 229 -178 15
4818 15 -80 -22 -121 -250 -46 -142 -25 23 -64 87 -219 -395 -389 -26 -217 46 244 188 50 208 -36 292 213 -134
4842 -134 144 -197 237 -129 118 160 -187 -257 -114 -65 63 -152 -371 54 -258 -272 96 56 149 -91 145 -64
4864 -64 303 23 39 125 322 -66 -4 341 105 -116 -211 -57 165 -107 -44 -245 -239 -345 -236 -67 -204 -98 19
4887 19 97 194 170 294 -17 28 54 84 27 -14 217 -109 -112 -160 -42 98 -35 -171 -170 -366 -291 -161 -238 -71 20 -39
4913 -39 -124 -186 190 -2 169 116 158 259 138 -154 8 219 8 102 53 297 -25 -87 -176 -38 117 -179 -265
4936 -265 -308 -263 -114 -148 -240 -151 209 37 -6 -22 133 276 271 -98 -41 464 174 -186 -28 -161 49 -63 40
$$ packed form
4771Ck26p3P7o1K08l8J69n8n6p1K63r0J09K00k75K0J79k14J07j39J40j08k73K48
4795D1j29j40J43j60J47l3J28j15j89K72q0l8K58R3m3j52J76J37j65QP0m07J93
4818A5r5N8r9j29K04r6J17M8q7J51l06j76OL63j91K63J98n6j38J58k44L28p9l47
4842a34K78l41M34l66K47M2l47p0J43M9J28k15k19M25l12j4L68m0R3k40K36k09
4864f4L67k80J6Q6J97l88O2L45k36k21r5J54K22k72O3k01Oj06J09J69j37J06J17
4887A9P8R7k4J24l11M5K6L0n7m1K31l26lm8J18J40j33j36Jj96P5J30p7J67R1n9
4913c9q5o2L76j92J71n3M2J01j21k92J62K11k11R4m9K44l22o2q9J38J55k96q6
4936b65m3M5J49l4r2Q9L60j72m3j6J55J43nl69N7N05k90l60J58j33K10j12J03
$$ plain form
4959 40 -39 -98 45 -179 -31 45 -69 55 198 -126 -46 -63 -6 214 207 245 174 132 92 124 -9 -313 -89 27 -121
4984 -121 227 -120 -332 -157 -221 -203 106 132 -411 -314 -18 30 -3 222 14 73 113 95 182 91 -113 -73 65 199
5008 199 119 -20 -212 61 -31 -326 86 -20 -326 -266 18 -95 1 -138 57 73 316 36 -104 108 96 -51
5030 -51 280 3 53 104 10 79 199 197 38 -139 -90 -18 -446 -170 71 -86 109 76 -214 -165 -34 74 -6 355
5054 355 245 95 -38 36 126 -75 56 115 177 198 -165 92 -82 -30 49 -92 45 -303 -380 -342 -26 156 -162
5077 -162 34 87 25 111 -152 -126 234 26 183 132 -38 41 -76 -84 -139 -255 -32 -147 -122 70 29 131 -284 -209
5101 -209 -131 -71 -106 -210 -184 -89 191 119 292 0 210 127 150 98 -85 -219 110 138 -6 161 -13 -13 10 -174
5125 -174 -146 -125 -100 4 -119 22 -88 70 195 -153 -230 66 83 -210 34 163 330 -7 32 94 64 112 -63
$$ packed form
4959D0p9n9J43k24J48P6j14J24J43l24Q0j7N7K20pL8p1m2m0L2j33l04K24J16j48
4984a21L48l47k12J75o4J8L09K6n43R7K96M8l3K25k08N9M0j8Q7r1k04M0J38J34
5008A99q0j39j92K73r2k95M12j06l06O0K84j13R6j39J95J6K43k80j40K12j2j47
5030e1L31k77N0N1r4O9J20kj59j77M9P2m28K76K41j57J95l3k90M9J31J08q0L61
5054C55j10j50j33P4R0k01J31N9O2K1l63K57j74N2P9j41J37l48p7L8L16J82l18
5077a62J96N3o2Q6k63K6L60k08J57n1j70P9j17qn5j16K23j15K5J92m1J02m15P5
5101b09P8O0l5j04K6R5K80p2J73k92K10q3K3n2j83j34L29K8j44J67j74%K3j84
5125a74K8K1K5J04j23J41j10J58J25l48p7K96J7k93K44J29J67l37L9O2l0M8j75
$$ plain form
5148 -63 34 -122 -219 -52 -34 27 20 234 -3 -6 83 166 134 28 277 40 98 205 -134 -112 192 316 31 196 97
5173 97 15 -184 -69 -180 -20 154 -47 -80 -229 131 -102 164 -123 120 29 67 -65 23 151 -76 52 -150
5195 -150 248 29 -70 49 63 -144 -249 -96 -203 71 -179 -93 -212 -215 65 -101 -31 -201 292 118 30 -152
5217 -152 144 271 14 304 77 165 -110 284 155 -61 -97 114 -108 -56 -183 193 206 -226 76 -311 -45
5238 -45 -80 -26 105 -268 -112 244 123 -127 129 182 255 29 75 -1 225 156 -20 -10 40 64 -293 -119 -29 -110
5262 -110 -223 -25 123 -72 -282 -22 155 -83 198 -81 -33 55 28 131 180 110 -141 -221 138 130 74 75 -139 -50
5286 -50 -51 38 -67 -90 149 95 17 120 -188 99 -10 -175 121 325 85 38 92 130 91 192 306 -147 -68 -183
5310 -183 14 -77 -65 -138 -90 3 -129 -107 16 -73 112 -218 3 -162 -53 -179 32 -1 24 109 88 181 -21 121
$$ packed form
5148f3R7j56r7J67J8O1pK14k37lQ9Q3l2j06K49k37N8J07l39K2L04J24k85J65r9
5173I7q2j99J15j11J60J74k01l3j49L60k33K66k87K43r1L8j32Q8J28k27J28k02
5195a50L98k19r9J19J4k07j05J53j07K74k50Q6j19lK80j66P0j70M93j74q8j82
5217a52K96J27k57K90k27Q8k75L94j29k16l6K11k22N2j27L76J3m32L02l87K66
5238d5l5N4J31l73J56L56j21k50K56N3P3k26M6p6K26o9j76J0N0K4l57J74R0q1
5262a10j13J98J48j95k10K60J77k38K81k79M8Q8k7J03M9p0k51q0L59qn6Jk14Q9
5286e0jQ9j05k3K39n4p8J03l08K87j09j65K96K04k40m7N4L8l9J01J14m53P9j15
5310a83J97r1J2p3M8R3j32K2J23q9J85l30K21j65J09j26K11l3K5Q5k1R3k02J42
$$ plain form
5334 121 57 31 -402 124 125 -213 -138 14 -329 -153 -222 -226 42 -169 52 -22 47 -87 202 170 194 174 -34 -26 -17 -21
5360 -21 133 -232 -81 40 -95 56 200 94 0 29 -49 -29 -369 24 -195 -14 -148 97 64 -42 -41 -64 281
5383 281 151 -120 103 -104 246 187 100 64 -197 -34 22 -1 -78 55 -10 -52 -292 -25 78 146 78 -20 -107 137
5407 137 -170 67 -28 143 94 -95 78 37 39 79 125 -48 257 -250 -137 38 -168 -82 -32 -32 -370 -274 -68 -2
5431 -2 -102 10 218 3 96 249 172 225 -11 -86 64 325 -161 18 -100 -77 -49 -1 -156 -14 7 -72 98 28
5455 28 -1 -222 -141 32 109 50 101 -79 226 164 350 59 139 -18 35 -56 -170 -27 -30 -51 -117 -204 91 193 -129
5480 -129 83 -217 -112 -202 -195 -60 0 -137 247 256 -2 -63 153 88 199 -165 297 16 100 27 39 -260 233 -103
5504 -103 -329 -161 -32 -169 -91 -48 -61 -40 -91 182 -84 336 152 -38 -7 -60 21 -46 40 170 -87 34 357
$$ packed form
5334A21o4k6m33N26Jl38P5J52l43J76o9mK68k11K21p4O9j34K89l2K4k0k08QRm
5360b1J54l65J51J21j35J51J44j06r4K9p8K0l40L93k19J81j34K45l3j06Jk3L45
5383B81j30k71K23k07L50n9q7l6k61J63N6k3p7J33o5m2k40K67J03O8o8r8q7K44
5407A37l07K37r5J71m9j89J73m1KM0M6j73L05n07J13J75k06Q6N0%l38R6K06O6
5431bj00J12K08k15R3J53p7N3k36p5J50K61m86J79j18K3K8M8j55J42K1p9J70p0
5455B8k9k21Q1J73P7n9N1j80L05o2J86k91Q0j57N3r1j14J43lk1o6q7K95J02l22
5480a29K12l00J05r0PJ35O0j37L84Rk58o1K16o5J11l64M62k81Q4p3J2k99M93l36
5504a03k26J68J29j37P8M3j3K1n1K73k66M20j84j90L1n3Q1o7Q6J30k57J21L23
$$ plain form
5527 357 348 -111 26 -62 -186 135 53 -17 -279 38 -34 -52 99 64 158 -74 136 193 75 138 -17 -130 231 -122
5551 -122 300 236 -142 -47 -124 74 -135 157 -322 -66 -209 -33 -21 -171 231 7 69 22 -135 99 -126 383
$$ packed form
5527C57rm59J37q8j24L21q2p0k62L17p2j8J51l5R4k32K10N7j18O3j55j13L61l53
5551a22M22o4l78R5p7J98k09K92m79K56j43J76J2j50M02k24O2m7j57K34k25N09
$$ [...]
8191a64
##END NTUPLES=NMR FID
##END=
