##TITLE=1H_LR-745-M1-PE-MT
 CDCl3
 8 sc, 
 15.04.2022
##JCAMPDX= 6.0         $$ Bruker NMR JCAMP-DX V2.0
##DATA TYPE= NMR FID
##DATA CLASS= NTUPLES
##ORIGIN= UXNMR, Bruker Analytische Messtechnik GmbH
##OWNER= root
$$ XWIN-NMR		Version 3.5
$$ Fri Apr 15 13:54:14 2022 Russian Standard Time (UT+4h)  she@DPX200
##.OBSERVE FREQUENCY= 200.13135
##.OBSERVE NUCLEUS= ^1H
##.DELAY= (6, 6)
##.ACQUISITION MODE= SIMULTANEOUS
##.ACQUISITION SCHEME= undefined
##.AVERAGES= 8
##.DIGITISER RES= 18
##SPECTROMETER/DATA SYSTEM= spect
##.PULSE SEQUENCE= zg30
##.SOLVENT NAME= CDCl3
##.SHIFT REFERENCE= (INTERNAL, CDCl3, 0, 15.7039)
##AUDIT TRAIL= $$ (NUMBER, WHEN, WHO, WHERE, WHAT)
$$ ##TITLE= Audit trail, XWIN-NMR		Version 3.5
$$ ##JCAMPDX= 5.01
$$ ##ORIGIN= Bruker BioSpin GmbH
$$ ##OWNER= she
$$ F:/spectra/data/she/nmr/H-F/1/audita.txt
$$ ##AUDIT TRAIL=  $$ (NUMBER, WHEN, WHO, WHERE, WHAT)
(   1,<2022-04-15 13:52:35.53 +0400>,<she>,<DPX200>,
      <created by zg, POWCHK disabled, PULCHK disabled
       configuration hash MD5:
       00 E9 B6 7A A2 85 ED C7 34 08 36 98 17 FE 4E 26
       data hash MD5: 16K
       CD 9F B9 3C 5F CC 5D 69 74 63 48 D5 6C 18 C8 CC>)
$$ ##END=
$$ 
$$ hash MD5
$$ 6F 09 43 6A 81 5C 21 98 5F 20 A6 26 29 F1 BE B6
##$RELAX= 
##$RELAX= 
##$RELAX= 
##$RELAX= 
##$RELAX= 
##$RELAX= 
$$ Bruker specific parameters
$$ --------------------------
##$DU= <F:/spectra>
##$EXPNO= 1
##$NAME= <H-F>
##$PROCNO= 1
##$TYPE= <nmr>
##$USER= <she>
##$AMP= (0..31)
100 100 100 100 100 100 100 100 100 100 100 100 100 100 100 100 100 100 
100 100 100 100 100 100 100 100 100 100 100 100 100 100 
##$AQSEQ= 0
##$AQ_mod= 1
##$AUNM= <au_zg>
##$AUTOPOS= <>
##$BF1= 200.13
##$BF2= 200.13
##$BF3= 200.13
##$BF4= 200.13
##$BF5= 200.13
##$BF6= 200.13
##$BF7= 200.13
##$BF8= 200.13
##$BYTORDA= 1
##$CFDGTYP= 0
##$CFRGTYP= 5
##$CHEMSTR= <none>
##$CNST= (0..31)
1 1 145 1 1 1 1 1 1 1 1 1 1 1 1 1 1 1 1 1 1 1 1 1 1 1 1 1 1 1 1 1 
##$CPDPRG= <>
##$CPDPRG1= <>
##$CPDPRG2= <>
##$CPDPRG3= <>
##$CPDPRG4= <mlev>
##$CPDPRG5= <mlev>
##$CPDPRG6= <mlev>
##$CPDPRG7= <mlev>
##$CPDPRG8= <mlev>
##$CPDPRGB= <>
##$CPDPRGT= <>
##$D= (0..31)
0 1.2 0 0 0 0 0 0 0 0.06 0 0.03 0 0 0 0 0.0002 0 0 0 0 0 0 0 0 0 0 0 0 
0 0 0 
##$DATE= 1650016354
##$DBL= (0..7)
120 120 120 120 120 120 120 120 
##$DBP= (0..7)
150 150 150 150 150 150 150 150 
##$DBP07= 0
##$DBPNAM0= <>
##$DBPNAM1= <>
##$DBPNAM2= <>
##$DBPNAM3= <>
##$DBPNAM4= <>
##$DBPNAM5= <>
##$DBPNAM6= <>
##$DBPNAM7= <>
##$DBPOAL= (0..7)
0.5 0.5 0.5 0.5 0.5 0.5 0.5 0.5 
##$DBPOFFS= (0..7)
0 0 0 0 0 0 0 0 
##$DE= 6
##$DECBNUC= <off>
##$DECIM= 32
##$DECNUC= <off>
##$DECSTAT= 4
##$DIGMOD= 1
##$DIGTYP= 9
##$DL= (0..7)
0 120 120 120 120 120 120 120 
##$DP= (0..7)
150 150 150 150 150 150 150 150 
##$DP07= 0
##$DPNAME0= <>
##$DPNAME1= <>
##$DPNAME2= <>
##$DPNAME3= <>
##$DPNAME4= <>
##$DPNAME5= <>
##$DPNAME6= <>
##$DPNAME7= <>
##$DPOAL= (0..7)
0.5 0.5 0.5 0.5 0.5 0.5 0.5 0.5 
##$DPOFFS= (0..7)
0 0 0 0 0 0 0 0 
##$DQDMODE= 0
##$DR= 18
##$DS= 0
##$DSLIST= <SSSSSSSSSSSSSSS>
$$ [...]
##$SUBNAM2= <"">
##$SUBNAM3= <"">
##$SUBNAM4= <"">
##$SUBNAM5= <"">
##$SUBNAM6= <"">
##$SUBNAM7= <"">
##$SUBNAM8= <"">
##$SUBNAM9= <"">
##$SW= 18.05172834244
##$SWIBOX= (0..15)
0 0 2 0 0 0 0 0 0 0 0 0 0 0 0 0 
##$SW_h= 3612.71676300578
##$TD= 16384
##$TD0= 1
##$TE= 0
##$TE2= 300
##$TE3= 300
##$TEG= 300
##$TL= (0..7)
0 120 120 120 120 120 120 120 
##$TP= (0..7)
150 150 150 150 150 150 150 150 
##$TP07= 0
##$TPNAME0= <>
##$TPNAME1= <>
##$TPNAME2= <>
##$TPNAME3= <>
##$TPNAME4= <>
##$TPNAME5= <>
##$TPNAME6= <>
##$TPNAME7= <>
##$TPOAL= (0..7)
0.5 0.5 0.5 0.5 0.5 0.5 0.5 0.5 
##$TPOFFS= (0..7)
0 0 0 0 0 0 0 0 
##$TUNHIN= 0
##$TUNHOUT= 0
##$TUNXOUT= 0
##$USERA1= <user>
##$USERA2= <user>
##$USERA3= <user>
##$USERA4= <user>
##$USERA5= <user>
##$V9= 5
##$VALIST= <valist>
##$VCLIST= <CCCCCCCCCCCCCCC>
##$VD= 0
##$VDLIST= <DDDDDDDDDDDDDDD>
##$VPLIST= <PPPPPPPPPPPPPPP>
##$VTLIST= <TTTTTTTTTTTTTTT>
##$WBST= 1024
##$WBSW= 4
##$XGAIN= (0..3)
0 0 0 0 
##$XL= 0
##$YL= 0
##$YMAX_a= 343566
##$YMIN_a= -417021
##$ZGOPTNS= <>
##$ZL1= 120
##$ZL2= 120
##$ZL3= 120
##$ZL4= 120
##$ABSF1= 10
##$ABSF2= 0
##$ABSG= 5
##$ABSL= 3
##$ALPHA= 0
##$AQORDER= 0
##$ASSFAC= 0
##$ASSFACI= 0
##$ASSFACX= 0
##$ASSWID= 0
##$AUNMP= <proc_1d>
##$AZFE= 0.1
##$AZFW= 0.1
##$BCFW= 1
##$BC_mod= 2
##$BYTORDP= 1
##$COROFFS= 0
##$CY= 11.3945322036743
##$DATMOD= 1
##$DC= 2
##$DFILT= <>
##$DTYPP= 0
##$F1P= 2.36226072786647
##$F2P= -0.459571619588291
##$FCOR= 0.5
##$FTSIZE= 0
##$FT_mod= 4
##$GAMMA= 1
##$GB= 0.15
##$INTBC= 1
##$INTSCL= 1
##$ISEN= 128
##$LB= 0.24
##$LEV0= 0
##$LPBIN= 0
##$MAXI= 10000
##$MC2= 0
##$MEAN= 0
##$ME_mod= 0
##$MI= 1.114404
##$NCOEF= 0
##$NC_proc= 0
##$NLEV= 6
##$NOISF1= 3.799351
##$NOISF2= 2.8
##$NSP= 1
##$NTH_PI= 0
##$NZP= 0
##$OFFSET= 15.70392
##$PC= 1
##$PHC0= -18391.66
##$PHC1= 12.00074
##$PH_mod= 1
##$PKNL= yes
##$PPARMOD= 0
##$PSCAL= 0
##$PSIGN= 0
##$REVERSE= no
##$SF= 200.130013532006
##$SI= 16384
##$SIGF1= 3
##$SIGF2= 2
##$SINO= 400
##$SIOLD= 16384
##$SREGLST= <1H.CDCl3>
##$SSB= 0
##$STSI= 0
##$STSR= 0
##$SW_p= 3612.71676300578
##$SYMM= 0
##$S_DEV= 0
##$TDeff= 0
##$TDoff= 0
##$TI= <>
##$TILT= no
##$TM1= 0
##$TM2= 0
##$TOPLEV= 0
##$USERP1= <user>
##$USERP2= <user>
##$USERP3= <user>
##$USERP4= <user>
##$USERP5= <user>
##$WDW= 1
##$XDIM= 8192
##$YMAX_p= 0
##$YMIN_p= 0
$$ End of Bruker specific parameters
$$ ---------------------------------
##NTUPLES= NMR FID
##VAR_NAME=  TIME,          FID/REAL,        FID/IMAG
##SYMBOL=    X,             R,               I
##VAR_TYPE=  INDEPENDENT,   DEPENDENT,       DEPENDENT
##VAR_FORM=  AFFN,          ASDF,            ASDF
##VAR_DIM=   8192,          8192,            8192
##UNITS=     SECONDS,       ARBITRARY UNITS, ARBITRARY UNITS
##FACTOR=    0.0002768,     1,               1
##FIRST=     0,             0,               0
##LAST=      2.2672688,     0,               0
##MIN=       0,             -417021,         0
##MAX=       2.2672688,     343566,          0
$$ Real data points
##PAGE= N=1
##DATA TABLE= (X++(R..R)), XYDATA
0@%%%%%%%%%Qj6J6j6K4l2M0m8N6p2Q8j04J28j53J81k15K51k95L42l92M50n18N91
32C14o73P66q65R75j098J230j376J535j710J905k115K345k597K870l167L494l853
49b020M245m674N148n676O261o912P643q471R420j0516J1794j3312J5156j7446
63i360K0381k4296K9814l8237N2838q5279K90402o3749k85172K85057k04074q4730
75a16405L42918J5692l98741J04809J31740k23128O9861K75090k96268k57588
85c52020K20430j0279j99415L12846K31449k72872l0560K40331j52773r1963K98754
96A93928L023k61835J12919R3995j97832J15761K83607j80827k00286J20887j02915
107a9575k09009K07439J38950k44635l2665J53849j37126m7652K58486p279k08499
$$ y = [0, 0, 0, 0, 0, 0, 0, 0, 0, 0, 8, -8, 8, -8, 16, -16, 24, -24, 32, -40, 48, -56, 72, -81, 100, -115, 136, -159, 183, -209, 241, -277, 314, -359, 407, -458, 517, -581, 649, -727, 808, -902, 1003, -1112, 1233, -1364, 1506, -1661, 1833, -2020, 2225, -2449, 2699, -2977, 3284, -3628, 4015, -4456, 4964, -5552, 6242, -7070, 8086, -9360, 11021, -13275, 16539, -21698, 31140, -54139, 236263, 172514, -112658, 172399, -31675, -116405, 226513, 242205, -156536, -51727, 80013, -143115, -73254, 201836, -94432, -352020, -131590, -141869, -341284, -28438, 203011, -69861, -100421, 139910, -12863, -104826, 193928, 196951, -64884, 48035, 142030, -55802, 59959, 343566, 162739, -37547, 83340, -19575, -228584, -21145, 117805, -126830, -159495, -5646, -142772, -190424, 68062, 60783, -147716]
118a47716Q2420N9256j65672Q4773K28250p9504o5353J61493l6428j42322J36169
129A15366Q3101j78340j9030J00413j28160p2602J70680J4508j37089M0686J6711
140F244j54218O967J30054o0101o2203R8619j3078q0545J22242J10926q5631j0465
152H811P8673p1558n5151J20063L6916q0897L3051L7114r2153o542Q5010n2505
164D0832q1084M0017k2230r5257M3531P3001o2536k3213O5929k9233m2006Q2207
176a0042L2430o7171K2278N3543m8647M354R7205m014n1106N1458J6034p4566
188B1756P756M5564n7920l8846L9569k7011m7936M9676J7523o4426Q772L5801
200i722n9691k7521O3870M01l6798N0950L7180l4055K4997N7116k3565j8029L2861
$$ y = [-147716, -65296, -6040, -171712, -86939, 141311, 61807, -3546, 157947, 121519, -20803, 115366, 198467, 20127, 1097, 101510, -26650, -99252, 71428, 85936, -51153, -10467, 6244, -147974, -141007, -10953, -71054, -133257, -34638, -47716, -128261, -6019, 104907, 19276, 8811, 87484, 15926, -39225, 80838, 117754, 36857, 69908, 107022, 14869, 8327, 93337, 40832, -40252, -235, -22465, -117722, -74191, -1190, -63726, -86939, -21010, -50243, -92249, -10042, 22388, -44783, -22505, 31038, -17609, -13255, 83950, 79936, 28830, 80288, 96322, 21756, 29512, 75076, 17156, -21690, 17879, -9132, -57068, -7392, 10131, -54295, -45523, -9722, -69413, -96934, -33064, -32663, -69461, -18511, 18669, -15386, 9611, 66727, 43162, 25133, 57994]
213E7994k1712l4181M2702J5063m7976J3435L5618m5183k8670L4198k1085n3615
225e3412J1673O056l7993J2665L8211j4423q9L8268p419j8374L2324O951l3256
238a8818J8287L6326j5805O12M1178P14k2008J1368m900l8570q748L770k5567
251b2161r741J7974m596p033J7305k833k4851K186N080k0416j747K4894R051O863
265a0025K8992J7968l578M166L832j2991r200J71n848k07R794o10m446P388l361
280B2045k3642j6595o438j4950j3326L823R540O723J1309J3874Q848L431l018
293A624o499m0M715K267O562J6474J4102K338Q36K566o031j6987j7174j1088q911
308a5246p478j815N445O249K352q09j540m075q605q823k663O124J1255J2522J4896
$$ y = [57994, 36282, 2101, 44803, 59866, 11890, 25325, 60943, 15760, -12910, 21288, 203, -53412, -41739, -35683, -73676, -61011, -22800, -37223, -37312, 956, -6463, -24837, 7487, 14438, -18818, -531, 35795, 19990, 20602, 61780, 62494, 40486, 51854, 46954, 8384, -364, 3406, -22161, -31902, -13928, -18524, -25557, -8252, -11085, -35936, -33750, -28670, -49086, -50833, -25939, -16888, -10025, 18967, 36935, 33357, 37523, 41355, 28364, 19164, 19335, 13487, 13280, 23074, 22464, 18018, 25406, 22045, -1597, -18192, -24630, -39580, -52906, -49083, -39543, -32820, -21511, -7637, 1211, 4642, 1624, -4875, -4915, -200, 2067, 8629, 25103, 39205, 41543, 42379, 44945, 38914, 21927, 4753, -6335, -15246, -22724, -24539, -19094, -12845, -10493, -11302, -12842, -16917, -25522, -34345, -37008, -30884, -19629, -7107, 7789]
323G789J5273P775J75j307k409o190p640m812j244K017K430K138J651m49o508
338H689j1491j1264r758q788n570J090Q578J2654J0234N667K747N71l726l946
352d313J574L757K679O255Q611N802L247J681l166n670o564j0456j1416l928j332
367a3239n174N02J0205N184j837r68m479r031k875K486K23P867J4150M807K082
382I903R033K678p788Q05K429j0895o250M962j054k680P407L08p374L642Q19j6217
398a0272n960O361j0060q669J4368Q708l174J0917R043j2191k408R725p433m515
412e560J4874l91j1780J3645J0414j3504M229J5383j6039j6809O258q020j4684
425b1984J5014R476j6693M375J5035j4151m801J9283p170j9277J2392O213j3499
$$ y = [7789, 23062, 30837, 31012, 29705, 27296, 21106, 13466, 8654, 7410, 9427, 11857, 13995, 15646, 15197, 8689, -2802, -14066, -23824, -32612, -38182, -37092, -28514, -15860, -5626, 41, 2788, 3359, -367, -4313, -2739, 1018, 3697, 9952, 18563, 24365, 27612, 29293, 26127, 20457, 13893, 3437, -7979, -11907, -13239, -18413, -17911, -7706, -2522, -4359, -5327, -9806, -18837, -21712, -19226, -19003, -11136, 3014, 7821, 9903, 18936, 21614, 13826, 14631, 17060, 6165, -85, 4877, 3823, 1143, 8550, 8858, 1484, 5126, 5945, -10272, -16232, -9871, -19931, -28600, -14232, -5524, -8698, 2219, 11262, -929, -3337, 6388, -1045, -5560, 9314, 8923, -2857, 10788, 21202, 7698, 11927, 27310, 11271, -5538, 720, -7300, -21984, -6970, 2506, -14187, -9812, 5223, -8928, -13729, 5554, -1616, -20893, -8501, -2288, -15787]
438a5787J5962K2763j3849n145J8184j0485j5510K0128K175k8334J661J2602j5545
451a1180L542K7503q130j8646R206q585k1974J7930J6992k2943k341K2180q669
464e115n673L0172N198k5348J049M410j7398O147K0938r441o256J7377o268j6438
478f646J8083Q921k5243o933P940j6484o320K5170J1204o497L494m992j6513P875
492f941J5619p526p283L245r159k649K6518J9149r568j1300o912j1703j952J2475
506B013K763q160m220L16K925R484R214m770j2309p803k739l367K694J1905Q576
521F522j776N76K738o579j424J2167j756j7007l031K060n465J4728K5396p513
535A9636k0187J475l720j0521J5332Q610k4407q236J6576k33M863K7269p210l3811
$$ y = [-15787, 175, 22938, 9089, 3944, 22128, 11643, -3867, 16261, 18436, -9898, -8237, 4365, -11180, -7638, 19865, 11735, -6911, 2295, -6290, -28264, -10334, 6658, -16285, -18626, 3554, -5115, -10788, 19384, 24582, -766, 283, 4693, -12705, -6558, 14380, 4939, -1317, 16060, 9792, -6646, 11437, 20358, -4885, -11818, -3878, -20362, -26682, -1512, 9692, 3195, 6689, 1697, -14816, -6941, 8678, 1152, -6131, -2886, -12045, -14694, 11824, 30973, 21405, 10105, 3193, -8510, -10462, 2013, 4776, -3384, -7604, -7288, -4363, 5121, 14335, 9565, -2744, -10547, -13286, -16653, -13959, -2054, 6522, 4746, 5322, 8060, 1481, 57, 12224, 10468, -6539, -9570, -7510, -12975, 1753, 27149, 19636, -551, 924, -2796, -13317, 2015, 10625, -13782, -22018, -5442, -5675, -812, 26457, 19247, -14564]
549a4564M765J1624j8127O464K4430j5915j3454K7068K953j8211J7997P766l3767
562a0971k742J9629k0476n742L7626m21k7727J6730O875l0556J1504K8120k7984
575f135j9154K5212p630j5041M0519J6398l9467k168J8653k4328j605L7222j2830
588I646l1853K0914P721k1656K5621K7257l6644j8008K4267j5413j9011L6495
600I336J2343l4108M010J8407k0197L538L2284j4723k7096J3685n324k2508K9054
613a299L0396k5796j0912K0222j4830j6156K9708R872k8451k549R040j4020R896
626d879L0998p952j9826P577q008k1202J9272K3130j9442j2001J4201p507j0700
639a6339K2909J3783j9080p157L278j2544J45K2809L057j2518N476R84j5009Q059
$$ y = [-14564, -9799, 1825, -16302, -9838, 14592, -1323, -14777, 12291, 15244, -2967, 15030, 22796, -10971, -13713, 5916, -14560, -20302, 17324, 16903, -10824, 5906, 12781, -17775, -6271, 21849, -6135, -25289, -77, -7707, -22748, 17771, 34169, -5298, -7466, 11187, -13141, -14746, 22476, 9646, -22207, -1293, 6428, -15228, 10393, 37650, 1006, -17002, 7265, -8148, -27159, 9336, 21679, -12429, -8419, 9988, -10209, -6671, 25613, 10890, -16206, -2521, -7845, -30353, -1299, 29097, 3301, -7611, 12611, -2219, -18375, 11333, 21205, -7246, -9795, -755, -14775, -4879, 26119, 18167, -1659, 5918, -2090, -23292, -4020, 19110, -332, -12333, 1868, -5639, -16339, 6570, 20353, 1273, -5884, -2606, -15150, -15005, 7804, 10861, -1657, 3819, 4803, -10206, -2147]
653b147K0585q806j4440P359k785j5296J2663J9176j1073r432R250n137j0704
666a0787J3765P128j6518k966O686j1152J669K3173k43j4819J0013J722k2052
679a4381M504K2127j0696j1089J7753Q87j6408J2938J2908j6573k893R555j6970
692h338q363K1629k384j6203J6805R336k4227K341K2620j4185j5249J8153j44
705A791j6886J4333J3389j4472L862J4687j6251q669K0449n025j9524J4007Q804
718A0495k1668L326K1076j0088r502J6076m911j8084R792N496j6374O051J6070
731G755j1917l849K0036l813j5293R830L837j7200M106J3193r882r14J7231l482
745I638j1105J0835P32j7209K083Q812j1289l005J4073j399o574R199N34j2201
$$ y = [-2147, 18438, 9632, -4808, 2551, -234, -15530, -2867, 16309, 5236, -4196, 5054, -83, -10787, 2978, 10106, -6412, -9378, -2692, -13844, -12175, 10998, 10755, -4064, 5949, 7671, -14381, -9877, 12250, 1554, -9535, 8218, 9105, -7303, 5635, 18543, 1970, -923, 8632, -8338, -16701, 4928, 2544, -13659, 3146, 12482, -11745, -9404, 13216, -969, -16218, 1935, 1791, -15095, -762, 12627, -1845, 2017, 16704, 453, -8216, 12233, 7208, -12316, 1691, 10495, -11173, -7847, 13229, 3141, -6361, 9715, 4804, -13280, -3488, 2008, -14366, -8315, 7755, -4162, -8011, 12025, 8212, -7081, 2749, 6586, -10614, -6508, 6685, -3197, -4111, 13120, 9638, -1467, 9368, 10100, -7109, -5026, 3786, -7503, -10508, 3565, 2166, -4408, 4791, 5325, -6876]
759f876K638M763j0513K41J2162k238m852J1409L569q214J744M568q103l000N238
774B536k626l433N698R85m012L624K023p765j977L872m039l640M648J942j983
789d147L903M788j467n00K188k344l344N24k00l93K171J773O28J863Q87l957k810
806d37m22k817l752J459L263L77L28L224J525j740k149j084K36r76r30K144M600
823B849J401q77J775K303k590m399j207J355o61k968R98L047M75k742l45J704
839A18q41l379p64J954q7j783J299M387J570j205L51K917n3l376j097J614K45
856A870j112M79J519J011j112k155l7R0k766k569J168M59j965M65L536O19j506
873b006J616J276p46l42N47j177R60L281k59l08L047m8l378P84K06m784m08L346
$$ y = [-6876, -4238, 525, -9988, -9747, 2415, 177, -4675, 6734, 10303, 2089, 3833, 8401, 298, -2702, 2536, -90, -3523, 2175, 3160, -852, 2772, 4795, -2970, -4947, -1075, -5114, -8754, -4106, -2164, -4147, -244, 4544, 3077, 2577, 4765, 2421, -923, -399, -599, -992, 1179, 2952, 3580, 5443, 6330, 2373, -437, -859, -3676, -7428, -5969, -2706, -2329, -2001, 1223, 2748, 1008, -1141, -2225, -1989, -2965, -3895, -1751, 2849, 4250, 3373, 5148, 7451, 4861, 462, -745, 610, -51, -3019, -2021, 1026, 1501, -1241, -1586, 118, -723, -4102, -4866, -2912, -2999, -4782, -3483, 904, 2474, 1269, 1620, 4537, 4484, 1108, 11, 1625, 1870, 758, 1237, 2756, 3767, 2655, 500, 463, 553, -2213, -4782, -3614, -3155, -5120, -4655, -1119, -500, -2006, -390, 886, 140, -202, 345, -832, 128, 3409, 3150, 2842, 5889, 5841, 2463, 3247, 3453, -1331, -1739, 1607]
891A607l686k672M178O10m642K537K272n300m15M796k106k590N557M61m106N881
907B382L368n801K708P397p048n274P557m51p767M744M258q494Q24O969p161l950
923e739Q421m421j0035P500M464r760N290J2058r487n373J1856j018q717R341
937D380L393j3102M104J0903q864j713J4327n756j4101Q635K927j4317M689J1627
951G132j2112m788J3252m911r039J4009L047j7065M837R871j2752k23J9804m083
965F979j2608J1040K514j3283R183J1430j6210n571J2952p909p750J8630L057
978A2454j9196L140R082j4964j358J6847o678j2328J2911J768j3557J1272J3573
991A2966j4255l633J3514r477j1388J7767P472j4225M210Q661j4547k695J7251
$$ y = [1607, -2079, -4751, -573, 37, -4605, -2068, 204, -5096, -5511, -715, -2821, -5411, 146, 607, -3499, 2382, 5750, -51, 2657, 10054, 3006, -2268, 5289, 4838, -2929, 1815, 6073, -2421, -1597, 5372, -1789, -5739, 2682, -1739, -11774, -4274, 190, -9570, -4280, 7778, -1709, -7082, 4774, 3756, -4961, 4380, 7773, -5329, -1225, 9678, 814, -899, 13428, 7672, -6429, 2206, 5133, -9184, -4495, 7132, -4980, -9768, 3484, -1427, -10466, 3543, 6590, -10475, -5638, 4233, -8519, -8742, 11062, 6979, -5629, 5411, 7925, -5358, 3825, 15255, -955, -6526, 6426, -1483, -9233, 9397, 12454, -6742, -3602, 5480, -9484, -10842, 6005, -673, -13001, -90, 1678, -11879, -607, 12966, -1289, -4922, 8592, -885, -12273, 5494, 12966, -1259, 2951, 11612, -2935, -5630, 11621]
1004A1621m776j3560P981p98j6305R196J7498j0713p468J1431p080j2580J5340
1017b13R502j4832J072J1174j1440l115K0117r80j4856R809M296k0218K683J9722
1031A2721r074r903J4285m156j7869J2748J2146j6875o94J3646j5847j0442K3358
1044D044M302j7260J1202Q779k2657J192K6009r349j4321J7209k196k0704J7072
1057C322J6718k2442k627K0197j6867j5224K4205J226k4252J3813J3085k5554
1069a4400R47K6642j4787j5030K5702k357k6704J8218J7847k4395L724K6643k0148
1082A902j6832K8092j003k3970J9406J0374l2259M513K9038k0129j4869K7675
1094A1938p000k8088K2155J4692k9546M904K4954k1918r951L1225p097k4270K3971
$$ y = [11621, 6845, -6715, 1266, 468, -15837, -6641, 10857, 144, -7324, 4107, -2973, -15553, -213, 9289, -5543, -4471, 6703, -4737, -7852, 12265, 11285, -3571, 6238, 10534, -9684, -7001, 12721, 3647, -6256, 8029, 3873, -13996, -1248, 10898, -5977, -6671, 6975, -8872, -19314, 4044, 8346, -8914, 2288, 11067, -11590, -10398, 15611, 6262, -8059, 9150, 6954, -13750, 3322, 20040, -2402, -5029, 15168, -1699, -16923, 7282, 8508, -15744, -1931, 11154, -14400, -13453, 13189, -1598, -16628, 9074, 6717, -19987, -1769, 16078, -8317, -4593, 22050, 1902, -14930, 13162, 12159, -11811, 7595, 17969, -14290, -9777, 19261, -868, -15737, 11938, 4938, -23150, -995, 13697, -15849, -10945, 14009, -7909, -17860, 13365, 6268, -18002, 5969]
1107E969J0990k9234R003K5465k4534r963L0449p509k3957K0966O695k8476J0822
1120c314K1072k5249q092K6258j1253j9955K4538N042k7738J0967K0591k1409
1132h542l287K4883j0856j6297K3749L757k3618J1959J5697k1317j361K3914j2751
1145E930j6674J8235Q38k0235J0649J1531k0040n81J8381j1700j1295J8206k7
1158C218j7979J1221J1551j5433L19J6727p579q107J4643J41j2996Q756P379j2901
1172a040K88J1512r369p826J2576p2j2554M562N717j0930j396R084m559n431Q677
1187g61Q63p739N281N753o160P04Q031m532m837Q756K570p098K808M885o045k609
1203a30O260k537p061L126J724n811L78M710l721l241M087q87l695M307K619o243
$$ y = [5969, 16959, -12275, -3272, 22193, -2341, -12304, 18145, 10636, -13321, 7645, 14340, -14136, -3314, 17758, -7491, -15583, 10675, -578, -20533, 4005, 9047, -18691, -7724, 12867, -8542, -11829, 13054, 2198, -14099, 9650, 13407, -10211, 1748, 17445, -3872, -5233, 18681, 5930, -10744, 7491, 8329, -11906, -1257, 10274, -9766, -10347, 8034, -3666, -14961, 3245, 3218, -14761, -3540, 8011, -7422, -7103, 9624, 2045, -6062, 8581, 8722, -4274, 4482, 11861, -1040, -752, 10760, 1391, -6435, 6141, 6069, -6485, -1923, 3794, -7136, -8532, 552, -4007, -9438, -761, 102, -7637, -2356, 3397, -2763, -2059, 5972, 1440, -3397, 5359, 7929, 831, 3639, 8524, 2479, -130, 6130, 3593, -3468, -342, 1382, -4429, -4051, 659, -3062, -6303, -2216, -3103, -6798, -2491, 128, -6115]
1219f115J356Q161j326l535N832J609n929K452N317m334l378L958p01k325K653
1234C695o16n358J642K192o700j339O299k538n356N372L181n073M08M975j840
1249a056j427M265p5j963M037O17k995L547K192o051j157N668k143n210K502J199
1265A950m902o5K674k499j691K414j463j277L024j64k449K976K972k708M62M390
1281C644p58k291K927J268k697N90J301k000j77J202j612j904N05j110k001M60
1297b653L13j871M97J851q56k98J692K83j452J249J761J72N42J657M88k45P10
1314C840m52o41l77m47j188Q00n1j211n94l0j007j676q03J86K19j99Q19M50J193
1333a169O57k11N99M54K46K62R93Q58L62N60J41j36l81r54q54n53q11r39m39j51
$$ y = [-6115, -4759, 3402, 2076, -1459, 4373, 5982, 53, 2505, 7822, 3488, 110, 4068, 3367, 1042, 3695, 3079, -2279, -637, 1555, -5145, -6484, -185, -2723, -8079, -2707, 474, -4599, -4191, 784, -1056, -2483, 1782, 1707, -256, 3781, 4398, 1403, 4950, 7142, 1091, -66, 5602, 3459, -1751, 751, 1950, -2952, -3017, -343, -2842, -4533, -2119, -3582, -4859, -1835, -1999, -4448, -1472, 1500, -1208, -746, 3644, 2886, 595, 3522, 4790, 2093, 2683, 3984, 1984, 1807, 3009, 1397, -507, -2, -1112, -3113, -2653, -2340, -4211, -3714, -1863, -2719, -3017, -1325, -1042, -2494, -1245, 516, 688, 1230, 2887, 3375, 3130, 3840, 3388, 2747, 2370, 1923, 735, 1535, 1484, 273, -321, -351, -1358, -3034, -3837, -3651, -3432, -3631, -2812, -2362, -1169, -512, -723, -124, 330, 576, 838, 1831, 2689, 3051, 3611, 3752, 3616, 3235, 2281, 1427, 874, 63, -876, -1315, -1466]
1353a466J88j036p73l03O74K7p61k3R50J666L5Q5J604J286J42K53P91P08j274
1372B773n76N82N3j423o79M38O27j853j445L23J12j732j542k98J412P87m78P40
1390b179K285L33j436O68J631q46q42K364J478o44J72J283Qj325q24j742m72P64
1408F76j565j518J878M04k555k56J514j890j642K310O81j662K118K083n16P62
1424H22J870j513J1K817j297j940K901N55l402Q01J820l637j299L418j501l997
1440c571J700O53l429O44L040k476J69L437j909j687M409O93l687K572L737m322
1456b7l2N748j467l133K592M04m379R41J864l662P2K479l471k495M714l84n026
1473e262L104K806n185n13N054p62j394M111Q6l170K009J728k270K097L475m139
$$ y = [-1466, -1278, -2314, -3087, -3390, -2716, -2689, -3450, -3473, -2523, -857, -822, -737, 867, 2153, 2295, 2548, 3339, 4047, 2773, 2197, 2779, 2832, 1409, 730, 1168, 1795, -58, -1503, -1180, -1068, -2800, -4342, -4640, -3228, -2441, -2919, -2179, 106, 439, -997, -329, 1302, 456, -386, 1978, 3456, 2812, 2984, 4267, 4275, 2950, 2126, 384, -88, 676, -889, -2407, -529, -125, -2680, -2936, -1422, -3312, -4954, -2644, -1963, -3625, -1507, 576, 60, 822, 2692, 1179, 1190, 4007, 2710, 770, 3671, 4226, 824, 1625, 3445, -192, -1491, 1927, 426, -3571, -1871, -1218, -4647, -4003, -963, -3439, -3270, 167, -1742, -3429, 980, 1673, -2014, 558, 4295, -27, -59, 5689, 4222, 1089, 3681, 4085, -294, 647, 2511, -1151, -1079, 1400, -2071, -4566, 148, -236, -5262, -2158, 648, -4537, -5050, 4, -758, -2152, 1959, 2045, -1125, 884, 2612, 342, 2439, 5914, 1775]
1489A775k789L954m67k486K337J120n240j223K827r18m71J764j639l414J609J740
1505a521j378J472K939j430j525J517J013p47J076J696j155j264O56J51R2K199
1521C791K66l009k657L16p1l33K204J121m158k026K257J303l07J951q48m359J423
1538c136M035p75J47L822k277l468L776K280m713J020L980m242k312M520j847
1553H10l723M699J897o553M46L316o198m46Q719j908o260M676J549n667N718O371
1569G446q053l471O700k388l621R218Q18r742L350O174p860o29P697n811o311
1584f483P988lq621O286N837r166N35Q713p399o478J0443J061p540O577L781r459
1600c928K204J0087o754m129Q358m186q985Q866N144r843J677P649q116l733R970
$$ y = [1775, -1014, 2940, 2473, -13, 2324, 3444, -1796, -3019, -192, -1110, -1581, 183, -1456, -4870, -3261, -1521, -2899, -1427, 1512, 82, -1443, 74, 1087, 340, 1416, 3112, 1957, 693, 1349, 1500, 1592, 3791, 4057, 1048, -1609, -1293, -1364, -1697, 507, 1628, -2530, -4556, -2299, -996, -1303, 648, -200, -4559, -3136, 899, 124, 271, 4093, 1816, -1652, 2124, 4404, -309, 711, 4691, 449, -1863, 2657, 810, -2913, 1786, 3683, -2870, -2424, 892, -5306, -5752, 2967, 1059, -5201, -525, 1024, -4643, 1075, 7446, -607, -4078, 2622, 234, -3387, 5831, 6649, -3093, 257, 6431, -1429, -2058, 5639, -172, -6483, 1505, 1502, -7119, -833, 5004, -4162, -3627, 5086, -2313, -8791, 1652, 2713, -4827, 1750, 5531, -3928, -1724, 8363, 1609, -2520, 5838, 1652, -7333, 1533, 6677, -3166, -1489, 6160, -1956, -5689, 4281]
1615D281l310q077P288J932r397M507Q339p780j780R783m370p402Q016K119q167
1630d018M462N959p741o80Q572m147n444P311n99q883L576M949p092m74P892l730
1646h7m686O227m56o684M878L820o387P5O434l319k618P438J47o488K687K759
1662C740m916P69M287l460l430N186r6m417K919J856n702m0M509k786k829L663
1678g47J006k844K503K073l405k17L313q27k075K921K27l299J838L601j962j967
1694A39K390j577k545K098J229l598l18K888k014j180L326n69l837J686K563k498
1710a817l06L105j527j586L611J223l107J556K126l197l53L472k058l108L618
1725A652P89l463J077K129l214j076L443j658l134K750J07l259K716K937l172
$$ y = [4281, 971, -7106, 182, 2114, -7283, -2776, 5563, -2217, -3997, 5786, 1416, -5986, 2030, 4149, -4018, 444, 6403, -1338, -2018, 6554, 2407, -3037, 4274, 3675, -5208, -1632, 3317, -3775, -4249, 3643, -87, -4773, 1454, 998, -5686, -808, 3012, -3375, -3300, 3134, -185, -2803, 4635, 4782, -1706, 981, 3740, -1176, -407, 3880, 420, -3010, 2176, 2080, -2337, 582, 2438, -3264, -3304, 1205, -1581, -4410, -747, 259, -2585, -82, 1991, -1414, -1631, 1682, 855, -1220, 1701, 1928, -1371, 467, 4068, 2106, 139, 2529, 952, -1593, 505, 1734, -1864, -2182, 706, -1308, -2488, 838, 269, -3568, -1882, 681, -1817, -2123, 982, -545, -2131, 1480, 2703, -404, 1152, 3278, 81, -272, 3200, 1142, -1966, 1652, 2441, -1022, 55, 2184, -1030, -2106, 1337, -321, -3455, -705, -598, -3857, -1141, 1796, -1376]
1740a376o33L571j181k179L603J99l641J568K708k506K11L398k206k511K951q1
1756A895l941J846J788l404l86L139j843j652L191j5k994J822J077l460N46L549
1772A158j270j494L085M46k157J478J220k451R5J399k043n03L054p25k176K066
1788A182R14l219j35J708j577j402J282N23q51J311N35p43Q06L89j914o7K078
1805H20q58q37J641J113j368M33J046n34j093K19p37p24L90M5m13J044N66j196
1823d43l2N62q44r89L97M34n86P55J236K08P6L71j28o11m0m22r4L87K92j80Q19
1844A168jl40m27O3l78j452k5L99j62J15O91M13K96l84k84L67n33m58o5M73R48
1865D24j34M04R30J45r40m39J61k83q92k83K87O20O6n5M74o2m95n95q9jl36m12
$$ y = [-1376, -2009, 1562, 381, -1798, 1805, 2004, -1637, -69, 2639, 133, 344, 3742, 1536, -975, 1976, 1895, -2046, -200, 1588, -1816, -2202, 937, -906, -2558, 633, 618, -2376, -554, 523, -2937, -2391, 1158, -112, -1606, 1479, 1925, -232, 1246, 2466, 15, 110, 1509, -534, -1037, 2017, 1292, -884, 1182, 2096, -1123, -1258, 450, -1127, -2529, -1247, -724, -1575, -264, 271, -472, 334, 723, -1191, -1258, 820, -38, -875, 766, 1879, 511, 944, 1990, 1456, 363, 582, -155, -879, -489, -444, -857, 187, 753, -443, -475, 87, -757, -1746, -1349, -915, -1501, -746, 490, 698, 774, 1145, 1017, 406, 366, -56, -150, 237, 529, 349, 1168, 1167, 827, 400, 463, 85, -1367, -1392, -993, -1155, -1040, -349, 64, 360, -24, -308, 59, -474, -932, -997, -524, 424, 290, 694, 1624, 1769, 829, 390, 551, 268, -624, -907, -620, 0, 66, 11, 485, 423, -72, -667, -756, -757, -1093, -1505]
1887a505Q00J041L9l89Q35K93o32k67N7l22O0K76l94P48P65o64n96M53l12j038
1907g52j47M08o46j93J050L48k43N07J66q91N62L11j347o6J467l6j193J593N40
1926A438r51O7O99j268l45R70j068p67J752l5j690J085J451k026o47J942q43k091
1944b327J757Q84j460J539J103j706O2K205j492j814K606k28k921K003K144l064
1960g09j77L089j695k115K608o53l298K075J829k670K65K843k256j274M302q51
1976A313l503K453J761m017Q47M001k309k129L525j55k814K318R66l732K31K779
1992A535l200n29L914j376l127M026J354n544J012L670l126j078M175r26l302
2007b522L158K262l280J552J363m149o57M633j448k765L619M40m014J070L633
$$ y = [-1505, -705, 336, 375, -14, 821, 1114, 482, 215, 272, -50, 10, 286, -108, 640, 1405, 741, 145, 598, 286, -752, -899, -491, -1137, -1330, -280, 68, -175, 332, 498, -393, 169, 480, -867, -933, 534, 498, -695, 898, 1438, 487, 554, 1253, -15, -360, 610, -458, -1225, 527, 492, -1198, -113, 1338, -688, -1335, 607, -236, -2327, -570, 314, -1146, 393, 1496, -210, -148, 2057, 565, -1249, 1357, 1129, -1792, 211, 2355, -709, -886, 2203, 508, -1607, 1001, 348, -2950, -875, 954, -1716, -1451, 1392, -864, -2138, 2164, 1313, -2190, 263, 2024, -1993, -1146, 2855, 546, -1583, 1942, 1787, -1027, 1291, 2257, -1475, -1244, 1535, -1665, -2194, 1720, 344, -2783, 1243, 2597, -2947, -1935, 1735, -1391, -2469, 1706, 780, -2522, 636, 2898, -382, 1170, 2533, -1616, -2273, 2360, 912, -1853, 1766, 2206, -1808, -738, 2895]
2022B895k791k141K473j096k190K646R07k784J574K393k619o37L238j897k522
2037b551L064J757l468K61K816j073n30K459o91l336J152Q26j802O61J947k000
2053e08j782K781M50j992J360P81l161p75K800j8j623K486J187k720P56K478k396
2070A04j307K539m62k656K029J768k719J139K801l168k072K812m66l580K629K393
2086A784l764n3M138j971k382L824k94m006K061K077l691J181M518l042k169M467
2102B678n71m290L077K033m822M41L686k944j566M848j086m318L299J785n050
2117b800R05M069m063j540N551q31l781L533J871n220K146L761m909j408M930
2132B214j472l623N104J068n579J728L699m074j110L917k399l060M826N69m358
$$ y = [2895, 104, -2037, 436, -660, -2850, -204, 703, -2081, -507, 1886, -733, -1370, 1868, -29, -2551, 513, 2270, -1198, -937, 1879, 806, 276, 2735, 2044, -1292, -140, 686, -1116, -455, 1492, -508, -2290, 491, 941, -1051, 309, 1090, -2071, -2846, -46, -64, -1687, 799, 1986, -734, 22, 2500, 104, -1203, 1336, 874, -1782, 247, 2015, -704, 435, 3236, 68, -2004, 808, 342, -3238, -609, 1784, -1980, -2033, 2105, 134, -2248, 1576, 1282, -2724, -663, 1414, -2277, -1096, 3422, 380, -1789, 2678, 2107, -2183, 894, 2927, -1895, -1454, 2232, -712, -2278, 2570, 1484, -2834, 465, 2250, -2800, -1895, 2174, -1889, -3429, 2122, 1291, -2490, 1043, 2914, -2306, -160, 3601, -1308, -2716, 2214, 742, -2881, 2223, 3291, -2288, -560, 3139, -935, -2045, 1872, -527, -3587, 1239, 1808, -2550]
2147b550K601K920m762n30M471k236k961M217M37l585K635K180m114N54L724k554
2163D47k059L364j271l663L533K202l754N4K686k391r20L430j122k955K261N41
2179C83k297J785K369k477n97K738j590j809K078O38k184Q75J180j818K17K116
2195A607j147j262J340l15j590N94J020r86K47J125r41n73J526j95p80M23%j241
2213a148J055R98k73k62K18M2n76K59j00m00L51j62r46K99Q77m31L8J31k68K76
2233b2k96k26q6M25k46J79O56m6n6R28j55q06n8l0l53N91P1q20J0Q22n21j14M03
2256B50l02j027q7L49n9J08R98l12m95R09j18k66M76J4q72L1J072j37k37R82l29
2277I48p21O95o79q88M66k14m45K3P29k29l38N80M7o86J56q1n11M11J034k78q0
$$ y = [-2550, 51, 2971, -1791, -2321, 2150, -86, -3047, 1170, 1607, -1978, 657, 2837, -1277, -723, 3001, 447, -1612, 1752, 481, -3182, 351, 2553, -1201, -1147, 1539, -852, -1772, 1658, 536, -2419, -158, 383, -1914, -129, 2240, -237, -834, 1904, 314, -1495, 583, 1221, -963, -88, 1092, -726, -509, 1607, 460, -802, 538, 223, -1367, -773, 247, -739, -492, 633, -308, -881, 645, 450, -330, 93, 93, -1148, -93, 905, 632, 370, 588, 630, 54, 313, 213, -187, 164, 2, -944, -645, 232, -199, -161, -30, -298, -22, -318, -544, -630, -205, -451, -272, 384, 338, 282, 1210, 1055, 249, 191, 161, -192, 399, 470, -350, -340, 482, -39, -153, 250, -52, -1079, -1166, -817, -876, -768, 230, -82, -577, 332, 214, -52, 424, 438, -434, -403, 669, 532, 295, 1277, 948, 227, 922, 243, -645, -179, -393, -838, -815, -86, -315, -653, -73, -26, -712, -556, -637, -1148, -737, 297, 19, -61]
2298f1J031K02l24J88J34j082O8K61n18J78M28j6l82M08l88p74J71j68o56j57
2318a457M99K35M7K98N68O3J71j65k25l2L29j73P7O39r0k4J72M38o98n99l44j23
2340c94M1k47k99N92Q3J47k85m7j43j83j97n7N19R5M20L82L32n8O5RM2l13j71
2363C33k50M35j43j04K30o1j07k49m15r6k33j58j11J99nL28J56L52m01M32K71
2384D03k7k98P2K97j36J65J39K67k40k23Q4j46m33l62o6J54Jk21J5N09n0n28K13
2407d11J60j44j54J16L61J40N4L28O89m16l38O1L32l57m20J73l9k65k49M54m2
2428C3K81n52l74j65J60r3p3M29K32p30P31P13j94j71K96m16QK46r4j22M79K04
2450H28n69j2O01r35o52O96l95p64M02M51n67K36J029r87n4J014l41o87Q79P47
$$ y = [-61, 970, 1172, 848, 1036, 1170, 88, 156, 417, -101, 77, 505, 489, 107, 515, 127, -647, -476, -644, -1300, -1457, -958, -723, -676, -378, 190, 253, 424, 259, 34, 2, 331, 158, 235, 874, 784, 760, 932, 1370, 672, 73, -271, -394, -353, -600, -899, -307, -224, -77, -362, -409, -552, -735, -932, -989, -470, -375, 45, 427, 759, 701, 766, 775, 817, 504, 333, 83, 518, 375, 271, 501, 440, 333, 84, -331, -427, -660, -818, -929, -730, -735, -407, -251, 101, -300, 132, 403, 376, 78, 150, 447, 311, 476, 615, 882, 642, 419, 503, 357, -76, -438, -504, -350, -349, -570, -555, -46, -96, -624, -411, -251, -395, -549, -433, -72, 68, 122, 450, 1139, 723, 385, 446, 778, 421, 1, 174, 135, -130, -379, 75, 33, 314, -238, -612, -777, -617, -710, -783, -354, -122, -852, -121, 592, 398, 227, 523, 107, 115, 361, 267, 145, 624, 828, 259, 247, 848, -87, -739, -43, -438, -1202, -800, -349, -916, -680, 349, -638, -692, 322, -19, -706, 173, 920]
2470I20j256O47O83o34L44R38n67j297O49O3j057K35P92j046l86J175o03o79J056
2489b3k98j054O30Q48j341O65J552r13q2J287k15j241J025L91j457L03J066j243
2507a00m34J646k62j308O87N6j724O58Q88j380j17R85L7o48J266K47j354Q58P10
2526G11o99m69J630l25m74R41m9n36M7K69j044l83N81n88m53M98J10o62L51O75
2546A31p82o56N93L85m55J8O87J54J80N16j77L74lk32l82j63N52k97k20O19J50
2567I92j063r8O00n88j405Q35L4q92M91P27l37k26J013j56o99R81L76j374J296
2586E07J111j518k07K003p11j457J509N45k440N59R91j390l27J557j305j151J800
2603G6q1j941J695P96k321J88K438j444n50K667l0k464J704J273k401N36K083
$$ y = [920, -336, 311, 994, 360, 704, 1642, 1075, -222, 427, 490, -567, -332, 460, -586, -972, 203, -400, -1079, -23, -321, -1375, -745, 103, -1238, -573, 979, 66, -16, 1271, 1056, -185, 840, 1231, -226, 77, 1143, -100, -534, 1112, 850, -458, 229, 285, -1439, -781, 107, -1273, -1390, -405, -368, -1016, 250, 497, -857, 1, 711, 12, -457, 1173, 848, 374, 1315, 1266, 730, 777, 1046, 2, -381, 200, -388, -841, -343, -233, -895, -544, 131, -651, -1307, -714, -329, -784, -766, -79, 75, 255, 771, 594, 968, 965, 733, 351, 188, 740, 443, 223, 842, 992, -71, -169, 431, -157, -1562, -727, -693, -1585, -1094, -367, -704, -930, 83, -73, -772, 209, 585, -789, 507, 1618, 100, -107, 1896, 1185, -272, 1237, 1782, -658, -99, 892, -498, -825, 732, -573, -1724, 76, -5, -1946, -251, 545, -1776, -1588, 850, -594, -1144, 1523, 1493, -971, 733, 2006, -395, 141, 2224]
2620B224j966j158K666j164j457K074J83l190P30K157k468o46L137j427k161K148
2636c18R09k218J450J974k617q1K430j375j099K916K81l172J488J820k808K2K747
2653B349j756k209J935k15j658J562J051k681N59J802j718p24K872n09k403J590
2669a53R97k107J265K147j474q66J688j056j501J819P09j906M07Q65j760j1J933
2686I96n30j551N62j56j237J513J013j285k10J208o00l71J239K38r83L94N89r94
2704a65J68J201m13o14Q43n70j169P28N01p84k40N47q24p25J052N04R7j28l16
2723c07m40J02R66M8j5K6q4J5J91O38j29n89k75Q7l38j67L23p7l35K23k61l42
2745g40J31K07l58J64K90j03j25K37O44j95N10J87p56r7O85K84n94K46qn00M2
$$ y = [2224, 258, -900, 1766, 602, -855, 1219, 1402, -1788, -1058, 1099, -1369, -2015, 1122, -305, -2466, -318, 591, -1627, -177, 1797, -820, -901, 1529, 154, -945, 1971, 2252, -920, 568, 2388, -420, -398, 2349, 593, -1616, 319, 104, -1554, 8, 1059, -1622, -1063, 739, -979, -1703, 1169, 660, -1743, -153, 844, -1263, 2, 2149, 675, -191, 1497, 441, -1060, 759, 1468, -438, -31, 834, -926, -937, 996, 466, -1085, -523, -679, -1916, -403, 610, -675, -885, 323, -277, -648, 591, 829, -154, 240, 829, -165, 3, 1204, 791, 177, 1020, 450, -719, 9, 510, -274, -514, 33, -791, -1516, -464, 40, 137, 9, -307, -747, -645, 321, 369, 354, 380, 296, 311, 502, 1140, 1011, 422, 147, 234, -104, -271, 52, -25, -360, -137, -398, -740, -609, -402, -760, -596, -306, -409, -534, -297, 347, 152, 662, 849, 93, -4, 681, 965, 371, 617, 609, 109, 151]
2766A51O20m45m75K2l13m59N85j30n48N59L94n07J50P13m28p61P87O45o92L46
2786B14K66K66j20K54l44k50L94j45n86J56J54n93j42O14k41p40O04l02n45M93
2806e93J7o3K29M07K5P4N10k19l67M86q5k69J76L77m41K84Q1R4p36K28j26m65
2828c76j69J22m61J16L54pr3K18r3LJ8M95l70K11K09o3N4L98J14j58K43k47k75
2851B43J27k95j31n1j9j86o9J83m6l08k33M33l3l03J01M98n9l5L97j74K2L19k89
2874I2QL21j08j8J04j68J83j48q5j79m8R2k73j59J47k22M8J05K90m31K45mK39
2897C1k17O6K7O9K45o6j13O09k29k80M05k96n3P2J39n35N3O9K1j49J71k92M5j36
2921c44K10j27J8l09M49J20k19J77K28K20l55L91j85K19l77L7O6p4K66k40l26
$$ y = [151, 771, 326, -149, -127, -440, -899, -314, -444, -992, -433, -39, -546, -396, 317, -111, -872, -85, 560, -132, 214, 480, 746, 626, 880, 536, 286, 680, 535, -51, 105, 259, -334, -476, 138, -103, -843, -239, -541, -1086, -593, -576, -639, -410, -3, 22, 96, 606, 387, 20, 506, 421, 152, 328, 705, 264, 548, 629, 723, -13, 215, 89, -376, -545, -423, -884, -768, -414, -421, -514, -296, -389, -386, -368, 127, -243, -32, 177, 114, 168, 566, 680, 522, 765, 518, 243, 370, 75, -56, -107, -126, -312, -381, -198, -244, -552, -785, -352, -385, -688, -587, -89, -148, -183, 214, 40, 62, 381, 92, 100, 421, 313, 295, 399, 231, 414, 266, 181, 2, -46, 46, -227, -386, -239, -461, -413, -308, -18, -449, -204, -208, 31, -186, -120, -93, -24, 221, 155, 42, 651, 422, 142, 547, 251, 198, 270, 409, -126, -73, -4, 17, -132, 39, -253, -208, -344, -134, -261, -243, -552, -103, 17, -202, -25, 203, 423, 68, 459, 274, 493, 116, 153, 219, 145, 411, 171, -155]
2942a55K65n4o5m13K47lj74nJ94K46l7J70m35K21K20m40L89M1O9m52M69K75m46
2965A27L26k59k34j80J55O8j49K42j03j97J06j1N3k93M70K7o87M25K06n64P74
2986C02M5l28J0N13o60j99O27Q2o93L50K05l01N1M64n45k4K4j08n90Q37o2o49
3008f49Q44K33p26M1P22m35l51O94o5p76P28K56m70Q0P54j089l83J127k30n76
3028b71K16j4o51N00N62n35r5P95p89l15P74K03j028M79Q51n49j92P06m56k25
3048c4O05j49o82M14R4m59O1P55o31o06Q77N7m17K48r1n70K39M33m73J80O56o48
3070a41j43N48k42m01M19K31m08l8P57o58K92Q9k30Qj63J77m32M36Lj72j09L49
3092A72m53K01N0j13n3P5Q5k84L49K6l1N0J36j12j8K83l61P0K45j71k25L06k1
$$ y = [-155, 110, 56, -9, -422, -175, -178, -352, -357, -163, 83, 46, 216, -219, 2, 222, -218, 171, 212, 281, -171, 298, 573, 127, 453, 194, -40, -220, -65, 3, -146, 96, -7, -204, -98, -109, -56, -349, 121, 148, -539, -114, 92, -472, 302, 347, 19, 29, 542, -118, -317, 310, 392, -301, 49, 254, -47, 4, 468, -77, -101, -77, -185, -775, 62, 0, -649, 195, 428, -298, -257, 465, 30, -321, 373, 308, -468, 260, 516, 46, 126, 880, -209, -592, 535, 305, -271, -55, -69, -720, -220, 342, -193, -288, 507, -282, -597, 177, 380, -648, -169, 682, 133, -59, 647, 191, -34, 571, 422, -260, 154, 248, -211, -150, 605, -26, -632, 245, 302, -115, 133, 42, -528, -289, 144, -329, -149, 507, -141, -284, 264, 22, -379, 40, 271, -137, -175, 582, -76, 216, 305, 75, 83, -80, 97, -335, 101, 104, -68, -177, 172, -281, -80, -30, -143, -196, -121, -36, -320, 29, 55, 24, 74, 210, 98, 80, 363, 2, 72, 317, 146, -79, 227, 206]
3115B06q6J09j6m60PL93l01q9M66m00j28M94j41n86Q33j04o35K74M83n28k96Q58
3137C53N4n59N42O0n65R3N57p67j0N01k54n47P80J28o55j7N26q51K87P57n03o95
3159g85N38J62j64O77l08n12K94M30k00j39N78m35q42J179K97j098N69M10q68
3178b17L7O93m17l99K71k89k79P32K02j074M31O36o40r5N70n18o20J126O99q49
3198@N14l39n31L88N62n19m10L86j78m84J056K44m97l84L00m64L03J27k07k73
3218d06L66M9m37O54J50n23J0N33n12l42O29J64j90L97k69n11M25L11l45L2L75
3239E60p45j67M42R1k58K47k03m54L32K84l68QL65m21K2K55J87m64K57K33m62
3260b59j0O75o51J25N89m69l73N07l28R0l3J86l22pL08j27P4K07k71l58N78q3
$$ y = [206, 120, 229, 213, -247, -240, 153, -148, -237, 229, -171, -299, 195, 54, -532, 301, 197, -438, -164, 319, -209, -505, 353, 407, -152, 390, 450, -115, -22, 535, -232, -242, 259, 5, -542, 238, 366, -289, -306, 220, -631, -344, 413, -90, -785, -247, -85, -249, 428, 120, -392, -98, 332, 132, -7, 571, 136, -706, 473, 770, -328, 241, 651, -217, -180, 513, 96, -303, -32, -321, -600, 132, 334, -740, -309, 327, -313, -408, 162, -356, -976, 150, 849, 0, 514, 175, -356, 32, 594, 75, -335, 51, -127, -611, 445, 689, 192, -192, 108, -356, -53, 74, -133, -406, -40, 9, -428, 226, 376, -147, -137, 396, -116, -458, 171, 335, 145, 542, 273, -238, 187, 498, 153, 185, 560, -185, -352, 90, 181, -77, 170, -33, -487, -155, 129, -239, -231, 134, -287, -265, -10, 177, -287, -30, 203, -259, -269, 406, -245, -120, 469, 0, -373, 134, -194, -104, -137, 49, -273, -280, 28, -99, -25, 182, -89, -447, 131, 48]
3282D8k85K52M88p06J31L20k10l5N67q1n23J01O0m08m2J69Jj66L36J40m67L52
3304D2Ol0Q6n6l44K28L94m16J69K72r3r0j85K7j44J60m1j20n1L44l37o0K57P2
3328I0L6n52N99k84j7K7j02K1M52o09M04R5j5k86R2P1O3p7J74J85l22j45J56k19
3352a63L42k55k7j34J79k00R1n7J99mr2K77k94O9J08K80j64j6p0Q5J06j75OJ66
3376B57k14J35l19K55p0m0r4P1k69J23P9J67l98j77J78K73n8k20K36J1J45R5j4
3399A52J03k93J53j48J42p9L9p0J50j94K3L7J56l66j12Q7J19k19q8K96k69L54
3421b7p3J18K31q2j09J41L7J11j81m6J52K7k71J65Jk44J84p9n5j22J6j34l2J82
3445i0M8l8R1L2l9n05O47k35K33l2J3K0J1J28j10K16L8l30K36J6l66j5K02k95
$$ y = [48, -237, 15, 503, -203, -72, 248, 38, 3, 570, 489, -34, 67, 127, -281, -323, -154, -153, -319, 17, 157, -310, 42, 48, 18, 104, 48, -296, -68, 326, -90, 79, 351, 258, 168, -17, 10, -134, 26, -15, -135, -186, 158, -179, -239, 18, 90, 126, -426, 173, -111, -128, -101, -203, -182, 270, -339, 65, 160, 145, -141, -49, 22, 85, 8, 182, 367, 45, -100, 56, -163, 179, -76, -103, -237, -58, -258, -167, -224, -25, -29, -121, 156, -138, -69, 39, 319, 155, 139, 69, 154, 260, 85, 91, 257, 43, 178, -141, 114, 44, 4, -90, -19, -288, -165, -86, 81, -317, -494, -316, -43, -101, -321, -85, -74, 71, 166, 152, 255, -38, 115, -33, 109, 30, 69, -1, 149, -45, -22, 15, 171, -195, -307, -220, -101, -320, -408, -112, -381, -27, -100, 18, 249, 167, 58, 199, 236, 347, 166, 120, 272, 299, 28, 193, 194, -50, 134, 55, 0, -122, -106, -240, -272, -90, -42, -80, 11, 43, 4, -501, 146, -89, 144, 112, 125, 145, 156, 284, 174, 390, 428, 98, 334, 350, -16, -31, 171, -124]
3469a24j26J20K31l64o8lO8Q7K83q8j24J25M0k17Q4J11j5K39k72Q8Q1J4O3j43
3493I0L4j02N6j74J53j24N4j09rk1m5n0j09L70k8l25M02L65p71M87K5k78M6J02
3517C9O3k39L30M9k39K71j27j23J15j96Q8j98J63l5l51L21N22n33k04M04k33n5
3539a68J55P7l12L83O8j86k04K11q5k3L42k63q7L85l64r8L64o5j58k28M00m99
3561c55J79N00j84m31N35r0k21K25J59l81J83J16l92J0M11j30l89L42J34l92J92
3582B1K59m60k6M43k01k93M47l09j64L72J16o39P17On68M00J99k1o87N51P3l90
3604a54M24jp44J76O20l12k39O03k55p88N38K21k13k7J59k42j75P35p4m16K60
3625I6l6m12N55L65n95k51O75j89n25L86q7m26O75K52p15k02N04m57L72M91m90
$$ y = [-124, -250, -130, 101, -263, -331, -334, -266, -179, 104, 16, -108, 17, 57, -160, -76, 35, 20, 259, -13, 75, 156, 170, 233, 90, 124, 22, 78, -96, 57, -67, -13, -122, -131, -152, -197, -247, -356, 14, -14, -339, 63, 428, -343, 144, 169, -109, -63, 39, 102, -137, 193, 242, 3, 274, 147, 24, 139, -57, 31, -167, -4, -39, -390, -69, 453, -80, -284, 120, -113, -168, -13, 64, -248, 135, 203, 17, -187, 24, -61, -84, 258, -5, -92, 293, -71, -169, 195, 130, -28, -256, 144, -355, -176, 324, 140, -291, 244, 154, -67, 158, 317, -64, 119, 235, -157, -147, 264, 134, -255, 87, 221, -171, 21, 280, -180, -206, 237, 36, -257, 190, -119, -283, 89, 205, -434, 283, 289, -279, 121, 320, 299, -388, 163, 236, -154, 270, 269, -475, -299, 321, 9, -230, 373, 118, -670, -132, 89, -124, -151, 8, -234, -409, 326, 252, -164, 96, 60, -352, 203, 568, -27, -278, 397, 208, -317, 69, -18, -444, 231, 483, -232, -434, 70, -387, -15, 476, -14]
3646a4m59K53L23l20L10J39l14n8K02kmM31p8p23J99L84m65M98J7l95j41K11l34
3669c40K43L00k5k95P7N1n21M20J29L5p1o4l37J46L86j8L33j26l97j25L77q4K67
3692C61k06J50m04k48N53j79P2K1j06m99J19O42k99p1P4k65j85L72P4J25L36l29
3714A08l01j71M33M4J03Qnn34O85j91j38K00J46o06j26M38j59m56R31l85m37J19
3736b94L12j23N6J61m41J64M6q1J41K72O6p51L95P7j09K8P03n33q5R2l1k68M23
3759B20q5l13K17j38p5%N88o63p0L73J98o90L31L80l40p0K04m8k84K14L04l96
3781a43K03J99o14M09J79l3j53j42j4J07J4M3J33k01K70j35k21K2L66l99L96k71
3803A5j71rJ90J87K1M6j83j84J87J2J18m12K32j64K7j70j9K92M0K1j08p7R2K66
$$ y = [-14, -473, -220, 103, -217, 93, 232, -82, -140, 62, 60, 56, 487, 409, -314, -115, 269, -196, 302, 319, -76, -217, -6, -340, -97, 203, 178, -117, -40, 11, -510, -90, 39, 74, 3, -61, -398, -252, 134, 116, 449, 323, -74, -199, 178, 94, 361, 155, 305, -99, -347, 206, 27, 99, 120, 14, -485, -366, 276, -23, -94, -20, -285, -470, -98, -24, 101, 437, 108, -193, -364, 69, 113, 216, 224, 219, -315, 370, 179, 41, 241, 387, -219, -345, 93, -66, -522, 409, 24, -413, -294, 18, -105, -49, 112, -329, -165, -119, -200, -59, 213, 279, -472, -77, 0, -109, -81, 622, 89, 4, 96, 65, -203, 220, 135, -178, 39, -99, -174, -174, 414, -249, -319, 54, 252, -438, -107, 273, -67, -137, 67, 19, -265, -51, 253, -143, 60, 259, -355, 54, 233, 200, 47, -95, -109, -2, 12, 55, 188, -13, 257, 122, -99, -77, 289, -110, 286, 15, -156, -165, 25, 212, 233, 279, 96, -88, 99, 111, 229, -183, 49, -115, -88, -258, -277, 15, 55, 76, -32, -109, -17, 249]
3827B49k92o0n2M9J05M0j08K04j39J01k88Q6J50N6j12j18J40j68L22k11J5L9j
3850GJ90m15J94P5MJ41k52j5j79K12p8K65K30l04j64J18P4J08m18K48q1r0K2K42
3874A34j22J05J79n80J54J88j2m2R3R4l79R2L37j48o0r9K04qj28M6NL9K3j88m4
3899a17K4J66k21l1O8J83k88J21J62j34R7q6j10M13k16o2K09k59O3K9L45k08R8
3922B46M6l77J51j81K06j28L00m03K3j04M51k69K8p3k07J39J90J19j21r2p9J02
3944c3j14m0L19j13J83k55kK51j08r9M9OJ06l22L22j69J37j41O4J00n43K63P0
3967f9Rj07J50O9j49L09m25j23L26O1L0K89l14j26J40J90k68N1Q4r1j69K68m9
3990H6j33r3K1j11J27R9j29j81L36k10l5K68l16K53j86M42k68KR8j25%m9qp4J95
$$ y = [249, -43, -103, -155, -106, -1, 39, -69, 135, -4, 97, -191, -105, 45, 101, -11, -129, 11, -157, 165, -46, -31, 8, 7, 197, -218, -24, 51, 55, 196, -56, -71, -250, -38, -116, 149, 379, 75, -89, 29, 103, 211, -207, 41, -40, -130, -108, 134, 12, 117, 296, -284, -130, 58, 46, 4, 97, 191, -188, -96, 241, 93, 33, -66, 138, 130, 2, 48, 53, 92, 115, -73, -117, -93, 73, -148, -179, -111, 72, -216, -95, 67, -67, 30, -56, -166, 247, 31, -31, 178, -81, -18, 11, 356, 148, 246, 292, -85, 66, -115, 91, -37, 263, -140, -117, -221, 230, -39, -11, -84, -291, -152, 38, 157, 36, -56, -135, -33, -147, -187, 132, 19, 202, -53, -55, 196, 88, -11, 38, 44, 150, -172, 150, -19, 118, -23, 41, 141, -402, -139, -69, -60, -167, -17, 52, -97, 212, -213, -336, -10, 51, 81, 370, 56, -70, 70, 260, -8, 43, 127, 36, -133, 135, 86, -47, -140, -119, -230, -103, -4, -133, -314, 22, -188, -223, 45, -271, -18, -204, 238, -30, -28, 70, -55, -55, -104, -112, -186, 9]
4015Ij24Q9J43m05J49L3M5J7J7M5j80M0j01r3L31O2k22N8R0mJ11k03m4n6K25J98
4041B30k3m69N20k67Q3Pq0j37L32J39p19K67P9o2M12o6k21n50M27J82j10L55j94
4064A35l08K45p5rr4O21m64j10L9NJ9o3N30l66k20J92K67o52N99j39o13L39K44
4087A22k08O9L51l73k13M03Q6p82Q15L7l88j32M84l55j55O07O2p24q6M19l12R7
4109a76M88m08j60L39j27j97K92N00p80J1K95l9j88O70l57m31K4L05m65M00L72
4130C68m46j26M21k02l43O78k5n32J25K35l95j58P18j12k30K15j19l43K05J59
4150I3kk31K90l05M2J24K04j04k66J34k33J69J76j29o9k3J23m37N78j1l27L26
4172A22j86k6m6J23R7L1J15k5k46N6O7N0o8n2P3j46r5r0N47k53j53K8j12l3L96
$$ y = [9, -115, -26, 117, -288, -139, -106, -61, -44, -27, 18, -162, -122, -223, -316, 15, 77, -145, -87, 3, -1, 110, -93, -137, -193, 32, 230, 207, -262, 258, -9, 74, 81, 1, -136, 196, 335, -384, -117, -38, -100, 312, 246, 25, -525, -98, 84, -26, 329, 135, -173, 72, -3, -12, -106, 515, 51, -59, -20, -15, 4, -59, 471, 105, -115, 77, 344, -308, 291, 152, -461, -122, 122, -86, -17, 334, -39, -252, 151, 237, -545, 270, 307, -81, -213, 271, -84, -239, 368, 430, -294, -380, 39, -273, -176, 312, -96, -256, 83, -44, -241, 51, 551, -229, -218, 77, 38, -150, 520, 163, -268, -244, 61, -404, -4, 368, -78, -204, 217, 15, -328, 350, 325, -207, -82, 153, -242, -400, 318, 206, -24, 191, 72, -271, -66, 93, 91, -140, 150, -155, -113, 11, 215, 111, -155, -21, -254, -85, 91, -38, -107, -130, -7, -444, 134, 123, -204, 122, -64, -90, -136, -13, 84, 115, 230, 205, -41, 15, 82, 132, 64, 12, 85, -61, -156, -246, 301, 48, -105, -77, -189, -222, 174]
4197A74r2j92J7j68L5K73K85l11k75O5M18j62J38j48k77K50K05j33j06J85k21
4218d0j66L75l26K00k87M34k34l12L95j04j34J29L57k66k35M41l00J5J22M2l79
4239b73M26P8j78J77K49n36j34M37l32j2J55k29j77K5M58m36K84J5j49k00L38
4260a4K37l06m2L81m58J86K75k43k20M32J23j14q3O3l75J14K58q1l03L74l62J2
4282a46Q1ok95Q9J97l0k05M78K0l29K77j99K28r6K70m79L21J93l30q8J76j33k68
4305b74M67O8m12N7J83n8j56L38j73j59nJ32k50N4J6J22o3K77j82Q3Q0j08j33
4328i6L8J62k80J78R8O1k3j16m6P0O7k47Q1p6L8K5PL09k96Lo7K13j5j30j06J53
4354EM0k8K15j24P6j81k13K24J40j36P2j08k94K79K3J20q7j03L6J90r8m7J57j37
$$ y = [174, 82, -110, -93, -261, -226, 47, 332, 21, -254, -189, 229, 67, 205, 57, -220, 30, 235, 102, -4, 181, -40, -206, 169, -157, 43, -244, 190, -44, -356, 39, -65, -199, -70, 287, 21, -214, 227, -73, -58, 64, 106, -273, 153, 231, 53, 230, 479, -57, -191, 246, -86, -98, 57, -172, -349, -324, 134, -302, -18, -3, -152, -352, -14, 223, -83, -125, 256, -202, -16, 259, 16, -204, 228, 351, 237, 154, 217, -158, -44, 214, 133, -170, 204, -158, -146, -65, -71, -366, -277, -80, -110, -315, 163, 183, -146, 131, -68, 160, 64, 334, -145, 176, 369, 39, -49, 127, -6, -274, 193, 261, -151, -94, 89, 31, -125, 213, 40, -119, -124, 8, -242, -188, -172, -50, -113, 164, -18, 65, 145, 37, -96, -58, 104, -176, 2, 100, 161, 138, 22, -24, 46, 113, -134, -53, -129, -91, -66, -59, 250, -46, -43, -110, 103, 88, -42, -148, 5, 45, 17, 232, 108, 184, 3, -210, 14, 154, 18, 90, -18, -312, -33, -10, 110, 23, -80, -44, 146, 48, 1, 158, 21]
4378B1K9jk23K08j48J20n7o8K38P1l28J49NJ43rJ7o6k04j0L69l54J26R8J40l20
4403e4j81K57J22k29NK05j1r4j72L85k56J89k57J65j61o8J44O7j04j24O2K8k0
4426a02l0R5K8K75k27J06k35K8J70q1J42q2J13j71j77J72M1q9J16k15L07j91J16
4449A09j53l3L5P6m4kk1RQ2k21N5K40P5j62j2j16K42k21J77j42J55k00K0j21K3
4474a50K02j00j08K87j83K6j84P2J0J02R7j63K05ql6k8r1j02K76k03P3K01n1j69
4498b5O7n6J21l25Q7J55k34L02J25o8p6J20j63j77J03m1L1j6J76j00J4K77k31
4521F6l36K46O6j63J05K09j23m10M24L5j39kj0j14J16j04Q9o4j1R5J9m5Jj90j14
4546c54N51k02P8j89J84K5o7O5J02l57K02m7j41K64P0Kk78M92n10m3J03M27m26
$$ y = [21, 50, 49, -174, 34, -114, 6, -51, -119, 119, 190, -138, 11, 16, 159, 150, 167, 101, -103, -113, 256, -98, 28, 126, 266, -54, -235, 22, 144, -85, -80, 125, 114, 20, -152, 233, -23, 166, -91, 74, -87, -155, -11, 56, -48, -172, -110, -82, -102, -132, -37, -9, 266, 39, 145, -90, -62, 108, 27, 169, 87, 200, 29, -148, 24, 65, -24, 92, -123, 184, -7, 109, -44, -77, -42, 34, -10, -12, -33, -24, 58, -163, -108, 132, 207, 45, 33, -83, 159, -62, 115, -27, 128, -72, -52, -173, -150, 52, -48, -156, 131, -52, -26, -210, -138, -128, -26, 71, -92, 113, 105, 69, 41, -50, -152, 124, -79, -6, 195, 144, -25, 42, -14, 107, -218, -131, 24, -210, 92, 217, 149, 73, 193, 30, -147, -44, -85, -54, -70, 106, 6, 20, 297, 66, -270, -24, 42, -121, -16, 193, 70, -340, 84, 119, -20, -22, -32, -146, -30, -134, -45, -109, -120, -25, -6, -51, -50, -240, -354, 197, -5, 73, -116, 68, 93, 26, 91, 193, -164, 38, -9, -150, 114, 184, 186, -92, 400, -110, -153, -50, 377, -49]
4569d9j0P3k17K21J53k04l17J42J36O2J19Lj01m38N64m64J69M77m8n19J23L13
4591A88k51M0M53l75j96o7R3n6K40L08m03O8L14m61j12M19J01m73J69K42m83J44
4613i8K86k12r4J89l07LM20K53l23j57Q4k15q0N20Q2o52J33M4k23K37O61n94k74
4636c17M12nm48N71L49m38l51K20j53l2O41k52m34J97r6j59K13M90m57J41J62
4657B54k48n32L71N16j92j72R9m62P2O04j34k23K66k56m59P82J42k90l13J02Q0
4678Gk66L12J32k15J64J22k85k38J83K02j98K33J00m44k89O28n2p9L24p2m13j5
4700a59K80k70J56K38k87J1k50M56p4J1j99j35k54P76k67j92L58M6k17k54L10
4721H4M0j80K80J8o77K09L84r7L5k5j18j86J52N4r3K45j97j24j23L54r6k21L26
$$ y = [-49, -59, 14, -203, 18, 171, -33, -350, -208, -72, -10, 109, 112, 11, -427, 137, -327, -158, 319, 271, -248, -125, 188, -63, -23, 430, 55, -141, -208, -115, -171, 69, 377, -26, 42, 356, -105, -217, 202, 303, -170, -1, 241, -242, -98, 188, -24, -118, 71, -236, -233, 187, 440, 117, -40, 44, -171, -251, 269, 351, -301, -168, -124, -347, -110, 551, -43, -317, 95, 90, -358, 213, 562, 124, -227, -7, -160, -192, 449, 197, -237, -40, -136, -295, -82, 408, -49, 92, 254, 6, -526, -155, 361, 169, -3, 96, -366, -294, 310, 176, -47, 219, -37, -496, 286, 428, 138, -175, -73, 7, -259, 53, 185, -30, 134, 256, -29, -267, -84, 118, -80, 153, 253, -191, -480, 148, 96, 17, 341, 269, -144, -159, 121, -149, 7, 245, -42, -31, -281, 175, 101, 112, -87, -222, -476, 300, 33, -159, 199, 245, 28, -226, 84, 124, -56, 224, 242, -435, -226, 158, 61, 96, 71, -47, -233, -81, -27, -120, 125, -72, -196, -319, 35, -61, -282, 44]
4744D4j00k12J68J94j93p1M92m28k31N04Q1l37J28J25k67r7K45L0k69K76J05m66
4766b79L03J11l40Q5K38k77J53K16j57l4K9Q3k61K21j17P8j97J34J36j46Q3k0
4788D2q9M1J29P9j67L09l78k42K82Q0j41m0J68M1k64K98k21q0L57k59p9L7J02
4811ER8j18K78n6m50M26l12J23J76N6j11J61j07K4k48MK42j37lnL3k16k7J7O3
4836h4J9J71O0k69J38j95j19L55J6n0k49K94L2j57L49l53j07K15M0k00O6J37J2
4859A21R6l52L48l59J13N4j35No7J62j54J74JJK64m90J23K01j21k26M73P7m99
4882a90K43j12r2K60r9R0J13j86J26k13j78L7N3r9M78k27J34l93K23L3j5K71j72
4905H5k10K42q2L0rq6p9J28k45L42K9k5K2j48K97n45J99O0j13j16J63j22N7R1
$$ y = [44, -56, -268, -100, 94, -99, -170, 322, -106, -337, 167, 248, -89, 39, 164, -103, -200, 45, 75, -194, 82, 187, -279, 24, 135, -205, -120, 118, -159, -6, 210, 53, 19, 48, 131, -130, 91, -26, 52, -145, -11, 125, -21, 62, 42, -47, -6, 123, 202, 35, 344, -34, -276, 6, 86, -55, -95, 73, 114, -150, 148, -73, -153, 204, -55, -134, -97, 5, 103, -15, 263, 207, -243, 183, -129, -6, 170, 226, 115, 276, 169, 193, -55, -51, 191, 54, 51, 46, 79, -137, -164, -147, -84, -65, 106, 166, -103, 35, -160, -279, 76, 92, 42, -207, 87, 119, -38, 311, -42, -149, 66, 106, -94, -28, 109, 121, 217, -135, 213, -146, -33, 21, -114, -109, -176, -14, -168, 6, 7, 8, 272, -218, -95, 106, -15, -241, 232, 309, -190, 53, -59, -151, 109, 10, 100, 213, 27, 153, -60, -238, -201, -148, -247, 231, 4, 138, -255, -32, 1, -14, 257, 85, -125, 117, 35, 65, 56, -30, -109, 19, -226, 116, 145, 120, 142, -6, 291, -254, -55, 5, -108, -224, -61, -183, -126, -35]
4929c5L6O2k69J59n8L3K03j27J37l30J33R9pk28M84l71Q3j86M66k10l35L21K48
4952C08o15K42j35n7K27j60R3k2K54j43J69j22N4m1j40K53q7k60M57j74j62q2
4974a43L65q1j10n3K6M8J38j11k87M13j03j31P6J17l32L34jj91J63k12P8j35O9
4997f3N08o49K67Q5J47n25K59OL1M5l09K20n9J38m1n1K31k26j81K45Lq8J11j13
5021io1J25o8J3L7N0j40J79j11j4P3j48J4j22K66j16K53k94J36j03q9j5j8J75
5045A3k1K17l28J17k81L26J55j97O2q1l98K78J03j1j32J91l20Q2L02j43J14k88
5067b40K64j28k0j2J63q2K5Q5J15p8L4k8l6N8o9p6j72N49l45j47J66q6j5J15J79
5092B19k83K49P1l70Q3j52R8n3K89m6L9k62K50o9m34N18l8l55M94%j83r1M23l33
$$ y = [-35, 1, 63, -206, -47, -105, -72, 131, 4, 141, -189, -56, 43, 36, -192, 292, -79, 4, -182, 284, 74, -261, 60, 308, -307, -65, -200, -257, -30, -190, -97, -119, 135, -8, 161, 39, 93, 52, -88, 165, 78, -182, 275, 101, -61, -143, 222, 141, 31, -22, 4, 52, 190, 79, -208, 205, 102, -29, 47, 164, -168, 166, 165, -26, 137, -75, 3, -132, -63, 445, -204, 63, 148, 295, -230, 29, 35, 66, 111, -198, 22, -37, 101, 60, 9, 240, 14, -167, 78, 81, -7, 104, -9, -70, 55, -13, 0, 37, 87, -53, 126, 15, 1, 74, -74, -60, -182, 84, -32, 221, -73, 63, -40, -129, -144, -162, 13, -8, 209, -119, -2, -283, 43, 198, 1, 63, -18, -416, -138, -35, -46, -178, 13, -307, -225, 77, -66, 48, -240, 24, -104, -124, -136, 27, -55, -30, 55, 170, 92, 126, 98, 62, 120, 51, -25, -197, 352, 7, -140, 26, -60, -75, 40, 219, -64, 185, 256, -114, -31, -183, -85, -138, 151, 105, 144, -118, 132, 63, -371, 147, 109, -246, 248, 248, 65, -26, 397, 64]
5116F4J16N9m55lN01q4l77P0L19l69j18L46j0k81J77K09m60R4M75q3j44K76j84
5139A38k16L12N7m15K52L13o60P3L42j72j95M84m16m7J77J17j66j76L71l15o0
5160b02J58J54l75L77r5j09M3M13k52k39L38j77j57J54J29r5k21M73k17j01j01
5181a02J10m7J92K09l34j7j8M8l32K95K34m06L4K63j43j0m3Mk3J0J0J09q5K03
5205A61n2k49J22j9k3J95j65k3Q0J89k72k36K97J55j95J00M2k4m6J08j19n0K69
5228B45p9k74J24O6l60L2M55m6l91K62j9R3o5K02l41j02L22L0m73N51m31J40K75
5251B16j00k63P5k9J03k46J8M84k43M1Pl01J00J57j98J33N5L01k61k06N82o60
5273b35Q6M08j59k53L82N8l90j44M63j69l2K13l9k77M9K38n22L69j53k74J11M41
$$ y = [64, 180, 239, -216, -219, 282, 198, -179, -109, 210, -159, -277, 69, 59, -222, -45, 164, -296, -202, 273, 190, 46, 322, 138, -78, 234, 291, -124, 128, 441, -219, -146, 196, 24, -171, 313, -103, -150, 27, 144, -22, -198, 173, -142, -202, -44, 110, -265, 112, 17, -92, -49, 364, 112, -127, 211, 34, -123, 31, 160, 65, -156, 317, 100, -1, -102, 8, -39, 153, 362, 28, 11, -7, 41, -291, 4, 238, -168, -134, 129, -14, -24, -67, -63, -86, -76, -66, 43, -42, 161, 109, -140, -18, -37, -60, 135, -30, -53, 27, 216, -56, -292, 5, 160, -35, 65, 107, 83, 37, 145, 26, -24, 245, 166, -108, 16, 82, -278, -246, 209, 163, -228, 34, 15, 108, 43, 245, -96, -198, 124, 154, -319, 232, -199, -59, 216, 116, -147, -72, -101, 2, -244, -226, 258, 15, 56, 63, -238, -138, 19, -179, -46, 9, 310, 49, -157, 425, -235, -149, 259, 100, -153, 229, 287, -103, -247, 216, 47, 15, 228, 189, -88, -39, 199, -323, 46, -107, -381, -270, 171]
5295A71k86l24P27l02q9P2J99Ok99J80j17N1J80Mk2Q8j42q9m5K46j72l12K74J33
5319A32k86l2M73l07K7L4N7l18L64lL6q5R7k49R3Q9j49Q6r6J70k49K87l3k79J1
5344a30K98M9n87L11j77J23Q6LJ11j63J93m11L06r2P3L4n4L36j38j90K31j27N3
5367A38k33O5j15K14P5r7n6k37J60OJ01j05k22K42m9M9n4J40Q1k17J71l5j00O2
5391a6J05j27N4M7k12J17J71K2N3m41K48Q2M6j83K05k12J9J1QK53l19P5j82J6
5415a60j8J23l8M2j97M17m1J95k74K72l26j54K22K65j76j94j12M0j69M00k03O6
5437b0Lq1J55j67K21k43P5L5J74Q2p6q0r8j8r0K09q2M0J26M3j08j1k20R8O4j34
5463a03k46N14J1m70j04M24p6J89k07J31k25J80p5o4J56K0o3p6J91j91J60m4O3
$$ y = [171, -115, -439, 288, -14, -103, -31, 168, 174, -125, 55, -62, -11, 169, 173, 151, 239, 97, 8, -37, 209, 37, -275, -1, 132, -154, -186, 287, -20, 7, 41, 98, -220, 144, 141, 177, 92, 189, -60, 33, 122, -27, 59, -37, 133, -116, 171, 138, -141, -130, 168, 217, -370, -59, -236, -113, -27, -24, 87, -76, 117, -294, 12, -80, -7, 27, -27, 309, 171, -19, 212, 85, 138, -95, -30, -145, 69, 144, 47, -9, -246, -86, -80, 21, -84, -306, -64, -113, -64, -118, 22, 103, -114, 57, 22, -78, -16, 89, -38, 16, 63, -149, -32, 139, 161, 214, -227, 21, 103, 149, -34, 171, -41, -22, -11, -3, 250, -69, 6, -176, -160, -178, -55, -93, -51, -248, 169, 128, 323, 49, 321, -5, -159, 63, 328, 152, -42, -154, -114, -283, 117, -86, -20, -17, -98, 57, -110, 111, -132, -57, -22, 152, 234, 158, 78, -20, -38, -128, 81, -1, 39, 165, 208, 100, 89, -131, -33, 31, -103, -349, 165, 176, -294, -398, 26, -50, 139, -68, 63, -162, 18, -57, -121, 35, 55, -8, -84, 107, -84, 76, 32, 95]
5486I5q3J45k58Q8j11K26j67J0J06k47R6Q2O7j83J73J9k15J07o9K37q5K02N7j04
5510A88N3n4k82N7P1j66K11J11j01m9j99L11l7j12r2J44k13qJ19K60k71o7K31
5533A05j01k1R2k06J88J18k62j76K97L2Nj40L25k03k8n5j14J66j05K2L2m4M5p9
5557a07K38j96k72L44L7L7l2j59J96k22K98j57j33K37Mr6j04J43j59j75K63K86
5579B71j77pp9M6r4K64k44j23J75J35j79J98l9j9k17M09k72O1l67K23O7p5J01
5602E8j17k42L46j9k30K56K31m68o2L81l38J73j51J20j16M5L45p9P6j20r9j13
5624a23O5J46l68K82J40j43o1J32%j20J12j6k30p9L99k9l7K7o9l46M46j44l8K02
5648A48rn08M08K24p3m83J82M62p22M07O5l34L93j01r5r5K18J81m61L68j69k32
$$ y = [95, 12, 157, -101, -13, -124, 102, -65, -55, 51, -196, -100, -18, 49, -134, 39, 58, -157, -50, -119, 118, 33, 235, 292, 188, 241, 187, -95, -38, 33, -133, 78, 189, 88, 39, -160, 151, 114, 2, -90, 54, -159, -167, -48, 212, -59, -126, 105, 4, -17, 75, -131, 57, 175, -87, -263, 34, 66, 71, -69, 256, 53, 25, -30, -144, 22, -83, -61, -29, -73, -28, -107, 131, -65, -337, 7, 44, 81, 49, -110, 86, -136, 162, 5, -128, 109, 113, 17, -87, 56, -103, -278, -15, 271, 94, 87, 8, 54, -40, 224, -20, -143, 32, 167, -12, 186, 147, 128, -89, 320, 48, 109, -258, -35, 32, -43, 58, -59, -301, 45, 26, -204, 52, 283, -185, -247, 134, -204, -31, -182, -62, -178, -133, 212, 133, 209, 89, -10, -123, -58, 88, -280, 2, 142, -1, -62, 70, 70, -50, 62, 46, -184, -263, 136, 107, 70, 97, 28, -318, 128, -16, -54, 148, 139, -369, 39, 263, 190, -293, -111, 351, -371, 36, 101, -233, 160, 59, -36, -131, 87, 268, -193, 175, 6, -226]
5670b26j24K64j24K55J54k63k62N20J15o62J52L29k99j50L43K02m58K51k4j92
5690a99r3M30j71j01K12O8l36L82k9J2l65K59k5p5J51r5j96K95p1jj92L02ol82
5714b26M11p2j75Q9J24r6p2J77k17mr8L14o0K2j54j14J41P5m1j47J42P4K0j93
5738h0l4O9Q8J67rl73P2J22J8J4J18k63p8K81J06k60p0N6p5P0m9J19o3q4K63k34
5764a09j8J78j38K1J24l10K22J20O1j24J6J31j01k38M72l33j32p1L54l44L23R0
5786A94l54J31J87j72j72J73J64k07j54J01j5N8R4R1k69J10J11j57J22J83k36
5807a7r0J11M2j84n2K89j90J88p5Nj43M9J01M8rJ65m03J90j05N1K2j10O0j14K90
5832A19j1k28p2K87l36L67m4j47p7Q4J73k23J30J84Kk07K11l8k66J73j46Q4K38
$$ y = [-226, -350, -86, -210, 45, 199, -64, -326, 194, 309, -353, -201, 128, -171, -321, 22, 224, -234, 17, -7, -199, -292, 138, -33, -134, 78, 146, -190, 192, 163, 175, -190, 69, 44, -31, 120, 25, -171, 124, 53, 52, -140, 162, 156, -226, 185, 113, -62, 27, 151, 55, -17, 160, -57, -61, -159, 155, 95, 117, -37, -151, -10, 65, 24, -123, 19, 93, 113, -80, -114, -45, 43, 210, 201, -172, -100, 22, 40, 54, 172, -91, -169, 112, 218, -42, -112, -56, -131, -61, -110, 9, -54, -138, 125, -109, -127, 51, -87, -66, 58, -252, -30, 90, 151, 27, 43, 174, 73, -165, 307, -26, -158, -229, 125, -219, 104, 194, -160, -29, 158, -14, -186, -13, 151, -56, -210, -109, -124, -66, 28, 119, -150, -40, 71, -86, 36, 219, -17, -107, 4, 46, -138, -190, 99, -91, 97, 22, 27, -116, -67, 34, 82, 73, 238, -165, 25, -80, -29, -7, -117, -57, -171, 119, 108, -120, -192, 95, -241, 126, 82, -65, -142, -58, 115, -108, 22, 206, 208, 1, 212, 174, -92, 81, -65, 19, 257]
5855B57k59pJ14j60j13j38L90k0K8k95Q1q2L41l60O5K91j71j40Q2R9m1Q8l77L20
5879gM1Q0j79j2K12l37K47j65N9K92k43M3j82P2P3j14O1J82j13j3M2q0j27J72
5903Dj54K29j80J27o8q4j95K67L08l53J09kJ14p2k02m4L48k54K21J48l39J18n5
5926ir8l3K7J14j84J94K58k23j5j15K1j17J16K33Kk01J14j6P1p0j6l4L5j07r7
5951a50LJ68jj96K81J17j12j80k1m3j38M3M55k78j91K42K39k23m1L1j27J19j89
5974a92K07Q6j24J66k8K8m44M54j15lp3J3K66k16j62J22J13l6o5LJ65l9j38k17
5998b29J97O0l05R9K91j35j36k2L67k36J95p5j99J78J35q8j06L3J40k26J11j28
6020g9N0n1NJ49k63L19o0j36K92J29j34j85J66j61n9J01mK7M5k57J24Q9J79k74
$$ y = [257, -2, -9, 105, -55, -168, -306, 84, 64, 92, -203, -122, -204, 137, -223, -158, 133, -38, -178, -96, 3, -38, 50, -327, -7, 34, 114, -65, -77, 135, -202, 45, -120, -61, 231, -12, 31, -151, -79, -6, -120, -59, 123, 10, -3, 39, -41, -168, 4, -150, 79, -101, 26, -42, -126, -321, -54, 254, -99, 10, 8, 122, 50, -152, -196, 152, -102, 119, 267, -72, 46, -9, -107, -140, -113, 1, -183, 11, 269, 46, 31, -84, -63, -180, -64, 169, 171, -30, 84, 68, 139, 69, 53, 19, 54, -53, -150, -147, 21, 20, -176, 105, 222, 110, -70, -91, -134, -272, -229, 226, -52, -243, -1, 238, 15, -26, 5, -122, -3, -192, 15, 101, -23, 143, 115, 143, -301, 153, 38, 35, -38, -25, 241, 25, -137, -15, 98, 62, -3, 0, 165, 126, -12, -229, -32, 28, -277, -178, 113, -22, -158, -180, 187, -49, 146, 71, -128, 50, 185, 97, -9, 24, 164, -62, 49, -79, -29, -80, -75, 74, -189, 130, 70, -66, 226, 355, 221, 36, 202, 41, -18, 83, 79, 106, 151, -106, 18, 107, 286, 12]
6044A2j35J31j62m8K97j91J60o7p2l4J42J09M0q5l8k6j63J0M1R4l5K47j18J37
6068B46j66l4J54k75P7k2m5J95j05m3J8J16k51K08n5Lk20R3J80n0K51l15k10J39
6092a11L04l15n3J75O2j90J47j24M37l06m09O01m14O5K29k78L77j61l15K68J89
6113A78j29n5K75k42r7M8J24k31J46m9j33K99j57J53k0m69Q17p50K45K54n3l15
6135a61J12O2l84O40j58k36K32J35j44l2J51J2l78J77J02r1l3K42m97K46K75m29
6157a57J69Q0n7j38R9K68n75K13K36j19m9jJ07j62O7K52l75Q3J68j81J8J88l0
6180A04l76M17pj87l6J06l57J38L36k42j5K1K05k23L00j61K84m00M11l97J3j3
6202g9K69l09R8R5m7j94J65L1M9j8Mpm1J53l15L20l43J91j31M01l73l43N87p7
$$ y = [12, -123, 8, -154, -202, 95, -96, 64, -3, -75, -109, 33, 142, 182, 97, 59, 33, -130, -120, -79, 15, -20, 227, 109, 246, 80, 46, 200, -75, 2, -20, -65, 130, 25, -18, 0, 116, -135, 73, 18, 21, -199, -106, 74, 24, 275, -40, -250, -111, 193, -122, -175, 0, 62, -128, 19, -105, 332, 26, -383, 218, -196, -131, 98, -180, 197, 36, -279, -11, 178, 49, -6, 269, 27, -70, -22, 102, -129, 17, -32, -165, 134, -23, 130, 110, -359, 458, -292, -47, 207, 154, -161, -49, 13, -371, 269, 111, -125, 107, 242, 98, 66, 217, 229, -149, 28, 130, 39, 6, 248, -249, -3, 272, -157, 12, 92, 35, -103, -4, 264, -311, -98, 138, 19, -30, -31, 76, -86, -19, 233, -142, -59, 109, -72, -54, 134, 104, -272, 145, 138, -49, -85, 21, -336, -198, 138, -104, -119, -98, 107, -116, 184, 23, 307, -93, 318, -79, -66, -79, 190, -119, -21, 74, 27, -167, -2, 29, 78, 60, 64, 57, 16, 169, -146, 174, -169, 22, -109, 292, -81, -424, 163, 86]
6226H6n7N6j70J99k37K54k3kk07o8K87k85K23P7k43K22nm9j60JJ02j43K33N6k13
6251f6j9J50j16k8J60j65r4J9J88k85J19K82k05m4K30N0k68K4K67l47L31j89J82
6274A76j87K28q1l7o6p1p2J59K2k39M4j7K63k31J4K6K6l5Q4j90K49J89j67j03
6298a6k67K30J9j59M6N0K8J24J03j54R0j27j03L2K99k89P8J39l64K80k57K03j9
6321c4J55j12j10m5J40LJ40k82M15m51J42J41R8l53Q4J59k64K78J75n82M04p5
6343B6l8q2K0j0r7K43m9l12K97K5k02J72P0k21q3L46j6k01J3J22p2j5K36j0l03
6368a41p5J95M5k1K12j73k71M1J65p0K57j81J92k08J75m4l27L95l53L04j11K8
6390C4j27J53K15j59j18n0j15J53N0j06K18j93nj6n2m2J47J05p5j9k58L95k18
$$ y = [86, 29, 85, -85, 114, -123, 131, 108, 106, -101, -169, 118, -167, 56, 133, -110, 112, 107, 58, -102, -101, 1, -142, 91, 147, -66, -85, 65, -51, -79, 81, -84, -178, -159, 29, -256, -137, 145, -60, -104, 126, 176, -92, -68, 199, -148, 183, -6, 176, -11, 217, 136, 99, 33, -38, -110, 49, 71, -168, -124, -141, 122, -109, -95, -69, -43, -78, 6, -184, 65, 254, 87, -16, -283, -53, -34, -193, -147, -97, -69, 55, 158, 4, 94, -33, -136, -104, 195, -94, -16, 123, -241, 39, -218, -15, -34, 121, 9, -101, -146, -6, -3, 137, -145, 270, -181, -39, 102, 200, -153, -69, 90, -174, 104, 279, -303, 101, 26, -12, -94, -74, -84, -181, 62, 13, -299, -2, 23, -179, -7, 63, -158, -241, 105, 89, -112, -99, 23, -49, -64, 172, 162, -141, -216, -21, 24, 3, 215, 42, -229, -188, -23, -93, 164, -17, 175, -33, 142, 98, -229, 166, -187, 117, 6, 34, -93, 60, 275, 116, -2, -52, -167, -14, 36, -70, 148, -45, -50, -66, -118, -160, -13, 92, 17, -2, -260, 135, -83]
6413h3j85L02j10Q0q3p0L8p0L74j45l1r0m2j83J99J64k08N8l9J88rk53K87P8j0
6438A57k03O1P0m7q3j5J2K22k02j1P4K1K16k39J8j82J04J04k29K04j69J81k79
6461b15j0J18M4j0J57m6q6LM4J45j69J84L7m08K99J98j73p7q4q4J89j76L8qJ08
6486A8Q1p5k18J08K6J10j40M28l55n4K01j58L9q3j6j59K75m7j84K17J05k76R7
6509f0P7j40L6OK72l40M3Q7j55O2J98j75J13R4N7k20O1j08R3O0k2jl43K94K48
6534B37k95Q6l5rk89J94K23n9L4P8k47K3m2j04M22o31M69j50J31J37k86L00j98
6557a1J6K09k08J99k21M6j1Jk0p2OK06r7j02K8r7J33q6K6L53k40k00k8pK08m7
6583a6L12o00J31O9j2j83L57j89r3J51O9j5J30j80K11O4l02K42n1j40J86j34J14
$$ y = [-83, -268, 34, -76, 4, -79, -149, -111, -181, 193, 48, 17, -73, -115, -298, -99, 65, -143, -85, -124, 64, 55, -198, 89, 167, 157, -46, 15, 85, 38, -45, -60, -48, 174, -28, -39, 35, 56, 272, 33, 51, -131, -27, 77, -152, 52, -117, 64, -215, -225, -107, -63, -73, 84, 38, -48, -45, -1, 144, -25, 159, 196, -212, 87, 285, 112, 35, -49, -133, 56, -120, -82, -90, 18, 99, 24, -194, -86, -60, 50, -90, 338, -17, -71, 130, -28, 11, -72, -88, -247, 28, -19, -203, 14, 119, -157, -60, 17, -123, -87, -81, 191, -149, -106, -19, -174, -112, 86, -89, 24, 118, 175, -45, 16, -92, 1, 61, 39, 38, -305, -11, 237, -58, 28, -7, -16, -305, -111, 112, 53, 87, 165, -82, -59, -101, -205, 217, -414, 55, -95, 36, 173, -113, 187, -11, 5, 214, 6, 205, -16, 30, 19, 20, 0, -72, -66, 140, 43, -59, -31, -128, 5, -81, -55, 298, 58, -142, -170, -177, 31, -16, 296, -304, -173, -104, -116, -299, 58, -131, -224, -73, -4, -19, 111, -69, 142, 206, -96, 146, 95, -45, 141, 7, 121]
6606A21PQ5l27j23M0L03N4J04l51J58N4p7j47J05J17q9o1J90k55Q0L29l39kJ04
6630H0o2j90L90j69j5k1J41P3j87m0k49J20J23J13m03J52L2Nj70K98N6o7J31j83
6654d2O1j93K84m5o9l5K75l17K98k56J5o4J12Q4N5n4P8k80J56p1n5P2L7j32j76
6679b62L22k18K21n0R3l18L00R0k49J6k6K40k06L21k75J4M4j1M6l0L6k05J79J70
6703B42k27K22j87K5o1mk65K72J13q9j18m8M33j09m90L18P0j58P6m4o4j14K97
6726I0r8J33l0j04m5J0k06K03k25K48R1J66j55q3o3K40J11k48L3pK68m17R0P5
6750G7j59M0Q4Oj73O4L17m95K04m2L11k63K3k3j86K05J07J08k36L87k91P4m6k95
6774b02OK88J3j99K0NJK00j86J54k78p0O4l0K08k03J56r0K70j90N9r2J08k22J0
$$ y = [121, 128, 213, -114, -237, -197, 106, 160, 264, -87, 71, 125, 48, -99, 6, 123, 34, -27, 163, -92, -12, 317, -22, -24, 80, 18, -172, 218, 49, 34, 13, 154, 227, 40, 0, -249, -129, -6, 107, -296, -144, -112, -107, -277, 21, 77, 10, 141, -42, 19, -174, 110, 65, -4, -39, 236, -81, 217, -39, -24, -88, 24, 108, 163, 109, 187, -93, 63, -8, -63, 9, 46, -86, -262, 60, -158, 63, 13, 106, -212, 88, 178, -71, -55, -81, 159, -47, 274, -1, 13, 57, 46, 92, 62, 98, -107, 72, 242, 15, 237, 50, 75, 14, 10, -255, 17, 130, 41, -77, -125, 308, 199, -291, 27, 97, -61, 15, -29, -93, -207, 90, -8, 125, 95, -9, -54, -44, -250, -47, -272, -24, 67, 233, 78, -5, -68, 172, 283, 35, 68, 61, 329, -88, 2, 77, -82, -42, 42, 48, -125, -61, 256, -239, -35, -77, 234, -29, -6, -29, -215, -10, 97, 205, -31, 356, 65, 139, 93, -202, -196, 92, 105, -94, -74, -69, -68, 132, -54, 100, -178, -248, -184, -214, -6, -209, -53, -143, 127, -63, -4, -96, 12, -210, -200]
6799b00J93N1q4K34l10mn8M29k59j8J26n4J4P1j20M3k38L88r7j16n0N2J01j94
6823a00k3J82j68K86nq6k05J35L2O4k47R7O2L7j20J09M9k37P4J11J0j34J15N6
6847I4k7m9Q1l3l42J84O4j80J00R2No1J30n9R3j16m4k20L44q9n3K13j15k6j26
6872a40L3K66k86J89J0j30P3j52N2Q1qk6j27L33j89L9p1J02J51Q2m75K75k32L18
6896A68l14J21J65mj32r6K2l54L76P2j40K29j5M5l3l26K77p4M6N7l98K57O8J11
6920A28j21j37J20O8k18J35J19O3j80j21L63l9l67J76l5j71K13j1R4j61R8j38
6942a22J16p7R8j77M48m78K24J23j06p3m1J61j06qN0J38j91J49J13p5l93K72k9
6965A6j34L4N8R4K01n66L01l2J2n1J95N3j83j55ON1K33j87L2J38l16K82j79M09
$$ y = [-200, -7, 44, -40, 194, -116, -120, -178, 251, -8, -26, 100, 46, 60, 131, 11, 54, -184, 204, 107, -9, -59, -7, 94, -100, -123, 59, -109, 177, 172, 86, -119, 16, 48, 112, -135, -38, 24, 61, -59, 50, 99, -138, -64, 47, 57, -77, 38, 94, 67, 18, 99, 66, -276, -92, -28, -208, -108, -16, -11, -72, 58, -1, 92, -24, -68, -288, 56, -33, -86, 127, 12, -14, -140, -107, 159, -127, 62, 72, -58, 15, -137, -85, -4, -12, -38, -165, 168, -21, 18, -53, 49, 200, 282, -193, 82, -150, 168, -146, -25, 140, 136, 4, -92, -70, -424, -48, 24, -116, 113, 98, 143, 110, -216, 61, -13, 33, 90, -308, -51, 17, 128, 7, -130, -10, 58, -160, -25, 94, 157, -23, -144, 219, 180, -187, -11, -46, -217, -4, -15, 79, -82, 16, -122, -6, -83, 15, -162, 286, -192, 32, 155, 49, -24, -65, 96, -10, -18, 32, 170, -21, 128, 241, 166, -227, 45, 16, -118, -84, -26, 68, 269, -297, 4, -28, -16, -67, 128, 181, -2, -157, -151, -100, 133, -54, -22, 116, -200, 82, -97, 312]
6989C12j57j19Q8o7j7j94O6K34r1Q1k59o2R8J18Kj42J17J96l31K67m3k34L3q9
7013a93M03M6k60n5Q1l5K9k26K76l72L62j90K21J8j56n2O2l5J05j78L12k34J52
7036H1J61j85j75K39R4k50J36k82L93k36N2k03R2m7J09j53q1J73J82K37m32O7
7058b8k88J40J63j99J01K65r5j15M3P0k91L86k69M3o8K40j92J49l3k87P4O15n91
7081a67J46j91L84j64j59K85o4K42j71J5j27j77K06r8L6J70l08J54q3J46l59K99
7103A5L9k01P8J31l8j99K70j45j8J88l4k55L75p7j01O0N5k21M9J73k51p4K71N2
7127A42l39J40Q1j87j03K19J0Kj32J68r8M8Q7L1m00M65j76O5Q8k2r3j86J82J4
7151Fj58J35J11J22k51J51P4l66K24j67j4O0J70m9o7J2q1M7J52p9jn7J21o0j23
$$ y = [312, 155, 36, 124, 57, 40, -154, -88, 146, 55, 136, -123, -185, -87, 31, 33, -109, 8, 204, -127, 140, 97, -137, -104, -193, 210, 256, -4, -59, 22, -13, 16, -210, 66, -306, 56, -134, 87, 105, -51, -103, -41, -76, 29, -149, 163, -71, 81, 242, 57, -118, 121, 215, -35, 101, -181, 212, -24, 28, -175, -83, -130, -21, -174, -255, -82, 100, 337, -95, -28, -316, -176, -13, -212, -111, 154, 59, -56, -13, 57, -234, 152, -117, -74, -142, 98, -94, 55, 22, -265, -191, 424, -167, -21, -212, 172, 8, -151, 134, 70, 312, 141, 156, 29, -148, 58, -40, -4, 166, -142, 12, -71, 75, -284, 15, 54, -147, -69, 62, 24, -175, 95, -50, -68, 120, 86, -169, 206, 129, 28, 88, 143, -78, -29, 144, -107, -181, 90, 142, -197, -57, 24, -163, -266, -47, -37, -35, -167, 1, -97, -49, 38, 69, -331, 134, -42, 23, 111, 89, -4, -190, -8, 6, -152, -17, 94, 216, -35, 116, 190, -176, 48, -119, -133, -73, 97, 48, -19, -7, -88, -41, 111, 32, 31, -26, 95, 35, -88]
7176h8J99k28j06K35j6N4o6O4J36j71R4Mj5K6k47p5R9J98L09m39J64j92j01L08
7200A46R7j26j52J46M6j31J40j21j45L57j83PlO7l5m90J40M35m32L88k67N8k4
7223h2k9j4J51L00n54J30n5J53k1q1J66k17J98q9J34l35M15M2o2j7N4p2kp4Q6
7248A25k9p6j37J12L1j09mn7L02k04J06j40J41J02j60O2j77k4J01J22k93J9M6
7271a41p9L21k83j2J08K22j99p1J27J58j05p1P0l4J95k42K0J34j32j21L14k04
7293b5q5J67j09p1R0j42J43p6K44M0J8m40M50j70k18M90l45P8J9o4L7j49K6K23
7317A31J5l20O8K01k32K94r8K5P7l93K73K4q3J10j35j02J06N7k02K67J23l45K04
7340F5l2o4L8Q8j0j28K96J2k19k77J10jo5L80j64p8j18J67k1j73P5J84j35r5J50
$$ y = [-88, 111, -117, -223, 12, -4, 50, -16, 48, 184, 13, 107, 111, 96, 122, -125, -200, -101, 97, 406, -33, 131, -61, -162, 146, 243, 117, -35, 111, 157, 26, 166, 45, -100, 257, 74, 81, 78, 145, 110, -380, -240, 195, -237, 151, -116, -58, -82, -111, -125, 26, 326, -228, -98, -153, 0, -21, -102, 64, -153, 45, -44, 90, -245, 170, 212, 150, 133, 187, 115, 113, 39, 125, 96, 20, -117, -5, 26, -83, -87, -144, 158, -46, 60, -80, 61, 163, 3, 65, -112, -136, -35, 87, -206, -187, -141, -220, 101, -182, -194, -86, 136, -63, -134, -7, 151, 46, -25, 45, 11, 206, -36, -16, 118, -14, -135, 179, -25, -110, 57, -52, -123, -33, -175, -32, -108, 136, 176, 194, -246, 204, 34, -184, 306, -39, 39, 58, -6, 31, -118, -92, 131, 146, -174, -106, 95, -137, 157, 59, 84, 161, -232, 41, 65, -18, 92, -43, -145, -39, 18, -184, 83, 206, -139, 65, 33, -31, 7, 95, 85, -43, 253, 265, 46, -231, -121, -122, -187, 193, 29, -49, -167, 0, -21, -194, -119, 65, -70, -165, -15]
7365a5j0J17j36k41J26K68L4k05L9P0j64Q4j72J31j22P9M7n7L11l85K75L72k66
7388A80l11L20l31J89K05j80l59K60K56k18j68J81P0l5M4j25Q3r2J6q9P1m9K9
7411e3q5J22n4J31j05o8J10j74j66K66j63J42P1n6J88J58k22k11P0K86n21N12
7433A78l35K7K4O3M8Q4n8J3k05K81j34Q%l8L38l90L07k29k08J11j5K64l39R2r2
7458b05Q1l0J39n7pJ95k35L27k21m07M22k72K03N7o5O6k01K50j85J54K03J06k68
7481E0jj24O5J4J07j55K35l45Q1K83l89J61L76m82J91p9j15O1J41l2Q2J17j15
7504A27r7K7J8J67j54l8j74L36k56l44K12L38j08J16n8l34K46K01k59J50k45J33
7526Dk36K93r3j54K29N7J2j09K85k51J21j20L7j29J94j34M0r9MJ15m9k73J1J72
$$ y = [-15, -25, 92, -44, -285, -159, 109, 143, -62, -23, 47, -117, -33, -205, -74, -196, -117, -70, -127, 184, -201, 74, 446, 180, -131, 189, -142, 47, 252, 72, -287, -27, 229, 11, -157, 24, 94, 59, 103, -22, 61, -31, -15, -104, -33, -82, -53, -138, -16, -70, 61, -44, -112, -2, -176, -342, -76, -239, -97, -26, -82, 106, 264, 42, -169, -99, 187, -334, 178, -157, -130, -106, -43, 5, 89, 31, 44, -161, 120, -14, -6, -6, -44, 294, -96, 211, -18, -226, -115, -130, 134, -205, -113, -205, -124, -154, -15, -72, -79, 116, -119, 208, -13, -420, 2, -270, -67, -10, -75, -9, -210, 40, -145, 9, 212, 318, 50, 49, -75, -10, 4, 111, -44, 191, -154, -73, 210, -179, -18, 358, -124, 67, -12, -127, -66, 75, 43, 125, 242, 127, 30, 57, 75, 242, 88, 50, -124, 212, -44, -388, -176, 162, 54, 170, 112, -222, 24, 225, -34, 116, -129, 4, -232, 61, -32, -186, 43, 100, 112, 3, 288, 37, 158, 38, 75, -54, 140, 6, 46, -53, -49, 66, 17, -256, -245, -73]
7550g3P1j19J43m7q6J61j51L68j23l97J57J88m01L59L9k2K12q6k79M1r4L80k55
7573a4Q3n1j00l2N3rQ5J04q1N8p4o0K02m4r4j06ML03j51O2j06J03j9r1L5j82K63
7600A41k34k38K06K12J25l11k11J44J00J23j76J76J75j59k19Q8K29j15j60P3L4
7621Cj97K05R7O6j89o1J31k3k04J71J31Q9j59k75J90P7r0j48L09j17J50k42l7
7644a23L80l81J05J70k48J00j70L58q8Qrj62j39N6J55n8J11k70Q3L41j06k00J96
7667A09j83L82n57M27k3K2j61k08L6J46j63K53J01j67R4p8J24k18M4j92M05k37
7689d4N7O9j2l14K23k9O0k0J77mL6j97j12kJ33j82K28k02J63k05K81n7p7n0J02
7714B2j00MJ06on0j85K74j09K4R8j12j61K19k3j00nK40j99o1L13k24j90J67J20
$$ y = [-73, -2, -121, 22, -25, -111, 50, -101, 267, 144, -253, -96, 92, -309, 50, 89, 67, 279, 193, -86, -45, -139, 241, -14, 69, 18, -82, -114, -61, -70, 15, 119, 38, 96, 22, -38, 164, 120, 26, -80, -76, 227, 76, 138, 32, 135, 116, 25, 60, -122, 141, -93, -331, -125, 87, 212, -99, -310, -166, -66, 57, -119, 57, 232, 73, -146, -58, 171, 56, -104, -31, 3, -194, 11, 108, 174, -15, -76, 55, 32, -172, -1, 130, 219, 60, -215, -25, 52, -38, -186, 123, 6, 156, -86, -123, 257, -124, -19, 151, -97, 3, -167, 191, 103, 111, 102, -60, -199, -143, 12, -46, 65, -205, -122, 219, 113, -87, 109, -74, 308, -249, 178, 155, 177, 16, -192, -156, -10, -173, 80, 181, 14, 108, 30, 154, -64, -20, -212, 193, -44, 13, 82, 70, -244, -21, -50, 10, -10, 167, 163, 199, 2, -110, -112, 21, -161, 67, -135, 28, -177, 104, 47, -30, -80, 22, -78, -74, 32, 26, -24, -209, 65, -44, -20, 78, -34, -195, 24, 1, -99, -104, 136, -63, -124, 189, -35, -225, -58, 62]
7738F2l4J9k30k5K94m4J83j57r5P1j12O7j03J11j33J25P5j2K6R1j75K04Qm08J53
7763c9J99k69m9K59j08j00J10K0n6J96k47K95k63o9J94M0L06m70P9j53j8M10n43
7786b76J70L7L8L12l00k3o3K59k99M4K29O0j09J84k62K03q2n9j96J09O9k58N7
7809a56K06r2Jl10L09K1J11k87J69r6J22l1p8K93j38m0k29J42j87J37Q7q3PJ4
7833a08o7J75j16K76p2J66l19N3Pj55K53o3l41N13j37n8K4n6J09j82J82o5l39
7856c20K40K60r6l7O5j52J10k9n1j29R7O2K75J38l22l31K42P3R9l43J72l3k08
7879b18K39r5J1j15K8l0K03j11K16n9q3L83k39K0J4k7mk41J24j06K17l2k35K46
7903A06j7k03R6J9N0k17K07p5J66p0k39R9Q0j11j28M74l70p0M84m22K6K28k30
$$ y = [62, 28, 47, -183, -208, 86, 42, 225, 68, -27, 44, -68, -1, -104, 7, -126, -1, 74, 62, 88, 179, 4, 208, 216, -192, -39, 160, -109, -158, 101, -7, -107, 3, 23, -33, 163, -84, 211, -52, -121, 73, 113, 419, -51, 28, -125, -143, 267, -276, -106, -69, -31, 281, -19, -42, -105, 154, -145, -101, 128, 188, 79, 263, 1, 204, 122, 63, -133, -24, 45, -213, -156, 50, -42, -41, -351, -42, -21, 90, -197, -28, -124, -2, -33, -111, 182, 44, 4, -225, -83, -270, -133, -46, -129, -122, -108, -175, 0, -116, 160, 88, 254, -65, -12, -5, -160, 93, 30, -311, 202, 65, 7, 31, -25, 84, -98, 84, 19, -320, -80, 180, 84, 47, 112, -40, 70, 41, -10, -139, -42, 20, 295, 433, 111, -220, 22, 95, 194, -149, 23, -10, -218, 21, -74, -63, -178, -150, -180, 23, -88, 128, 69, -14, 369, 130, 150, 164, 137, 133, -108, 16, -90, 127, 95, -140, 106, 89, -114, -18, 1, 51, -166, 41, -34, 132, 62, -177, -78, 2, -109, -237, 237, -133, -203, 281, -141, -115, 113, -117]
7926a17J57k8j8J5r8K14J38l32L00k28j7K35J57o79K14J85m3kk1ll09M51J94k92
7950G3l10MK32R3O3l26J87q6N5j41K27n5R1r7n4k2o4O5O8p1k02K31Oop2q6L45
7977A48k85L7qn0K30j12j56J83q8J78O8l00L40p3k07O3p5qK31r2o2O5j64K39j56
8002e4J10q8K28k47K68j34L3J7n0j04J32m6K76m20Q8J63j33J02k3N3k93rK51j96
8026g6J58k61K32K4Kq3Q7L7J3j70J00j01J97N4k67J75J32k63J4m5l0K37n4j75
8050f3L52m20M61j87n5j6J46k01m4j84K31j27J12O6j29k7L56k65J6k05K92Mk2
8073I1j25j5j84J77J44M5j38q5j3K4N0Q4k34K60p1joo7K5r3K97j63J17q2Q5k8
8099I4j30R7O0Nk62K18P6l36L50l45K24k33M49l21m7J88j97J79j01j06j36K21
$$ y = [-117, 40, 12, -6, 9, -89, 125, 263, -69, 231, 3, -14, 221, 378, -301, -87, 98, 55, 53, 32, 29, -280, 171, 365, 73, -237, -233, -1, 92, 155, -171, 16, -70, -15, -156, 71, 16, 107, 10, -44, -66, -130, -65, 3, -68, -270, -39, -33, -39, -111, -197, 148, -137, -100, -108, -158, 72, -40, -196, -13, -101, 77, 145, -155, 185, 112, -95, -32, -107, -115, 116, 24, -38, 27, -137, 102, -54, 56, -32, 196, -51, 217, 83, 116, 133, 83, -21, 111, 65, 341, -79, 9, 172, 39, 141, 118, 171, -122, -131, 120, -76, 82, -179, 53, 77, 79, -4, 83, 120, 133, -37, 63, -38, 159, 213, -54, 121, 253, -10, 4, -41, -71, 166, 112, -63, 289, -131, 330, 143, 88, 72, 218, 17, -27, -211, 20, -107, 5, 71, -58, -85, 271, 6, 22, -183, 109, 113, 91, -34, -49, -233, -56, 88, 133, -5, -90, -103, -79, -29, 55, -179, 81, 10, 9, 3, -64, -39, -132, 165, 2, 119, 37, 122, 94, -36, 61, 121, 126, -136, 82, 158, -178, 172, -173, 51, -182, 267, -54, -101, 87, -110, 69, -32, -138, -274, -53]
8121e3j16J97m8R0Nl5J93k87J25N8o7R3k10J06n0j24K02q7J14r1k78J30J28J06
8145A01l7k2p0J09o3pJ01k31M9J38j17J24j92K49l42J24R8M5q6j12M2j18L13k73
8169a77J30qJ66Kj71J27J27l72L14L6j66J53j81m8J5j30O5N0L9j2JQ9
$$ y = [-53, -169, 28, -20, 70, 75, 40, 233, -54, 71, 129, 62, 155, -55, 51, 1, -123, 79, -8, 106, 15, -263, -133, -5, 101, 64, 42, -28, 81, 18, 11, 112, -119, -70, 68, -49, 75, -117, 132, -210, -86, 12, 57, -29, -141, -99, -217, 96, -177, -47, -55, 111, 113, -58, 69, 196, -176, 138, 174, 8, 161, -20, -68, -53, -183, -118, -68, -29, -41, -40, 49]
8191D9
$$ Imaginary data points
##PAGE= N=2
##DATA TABLE= (X++(I..I)), XYDATA
0@%%%%%%%%%%%qJ6j6J6j6K0k8L2l8M6n6P0p8Q8j04J23j44J63j86K16k46K77l14
34a67L53l96M46n00N58o23O93p69Q52r43J041j149J270j400J542j698J870k061
52a081K273k507K770l070L412l804M261m804N460o266P290q639J0496j3224J7623
67A0190k5835M6092j83318k64150M28884N0042j23872L08642R2881l82078O4395
78B1873K65137j87279o2137K43993k21087l02613K38933J02655k47108J56336
88H703K08436l26842j66418K43498q0307j63082K63404P8150k76115P3855K04896
99F8178j30334N5135K91998j40007k56994J49194N2571j55436J86049J88941k54890
110E4405j21208J80163p2006j10841J96539q770k87776Q743J19684j29364K7895
$$ y = [0, 0, 0, 0, 0, 0, 0, 0, 0, 0, 0, 0, -8, 8, -8, 8, -8, 12, -16, 16, -22, 24, -32, 38, -40, 48, -56, 67, -77, 86, -100, 116, -130, 147, -167, 186, -210, 236, -264, 294, -329, 364, -405, 447, -496, 545, -604, 666, -734, 808, -890, 980, -1081, 1192, -1315, 1455, -1615, 1797, -2007, 2254, -2550, 2910, -3356, 3934, -4705, 5791, -7433, 10190, -15645, 30447, -152871, -417021, 11863, 61905, -61967, 246675, 339556, -42522, 21873, 287010, 99731, 37594, 281587, 60500, -242113, -3180, 99475, -147633, 8703, 217139, -109703, -276121, -32623, -112930, -276012, -12608, 65542, -210573, -136718, 68178, -62156, -7021, 284977, 144970, -112024, 37170, 89741, -65695, 120354, 309295, 54405, -66803, 113360, 41354, -69487, 127052, 118282, -169494, -160751, -41067, -170431, -142536]
121a42536K17993q5862j55553J33332L3990j32747J15331J33030j56854m1263
131h1139J66606k9902o3728J71550M4068j71442J785O8062j15896k2454J26206
142I3716o0096j20919O9665J6015j03153O0800Q8579j18588o7527Q7749k6064
153g9823n7695J18142O8896q0952K2650Q0498n1817j2304J01573j7920q4321M6999
165E3926K4693p8015K8218Q1673o4786o3882M7422k5003p5551M3489K7596q7472
177h7692j2520O0123l3465j4307R1435J0129o6174L6823M2832n4862R688P8102
189F0112k2601l5184N9275J2278m1736M1151K7566p3663k2241L4497n1456m5303
201e7305N4439M340o1438K0609L4549m6664p185M6890k6001l6545L8098J0291
$$ y = [-142536, 75457, -10405, -165958, -32626, 1364, -131383, -16052, 116978, -39876, -81139, 85467, 55565, -8163, 163387, 207455, 36013, 37798, 105860, -10036, -32490, 93716, 33620, -87299, -17634, -1619, -104772, -43972, 44607, -73981, -141508, -53759, -79823, -137518, -19376, 49520, -31432, -8782, 71716, 19899, 7595, 109168, 91248, 6927, 53926, 78619, 604, 28822, 110495, 45709, -18173, 29249, 4246, -71305, -27816, -220, -87692, -100212, -40089, -73554, -87861, 3574, 13703, -52471, -15648, 27184, -27678, -17990, 60112, 37511, 2327, 61602, 73880, 32144, 73295, 100861, 27198, 4957, 39454, -12002, -57305, -2866, 1474, -59964, -39355, -4806, -51470, -58655, -11765, -37766, -74311, -36213, -25922]
213b5922j9981M9961M1822l3771J1173N2567k5881l2684L8798j062n1011J2129
225A6138K5164l3412l870L1050k4592l0671J5809j6184m1265J3372J0562l2212
237g0111J2254M4540q306p453M0874J0634k5234J1997J3076k1974N175K9772k233
250C3011k336K4156n9j8766L375r761l5914j2221K533k0323p026K2703N399j0099
264b5328R446M512j6889n892N857o137j23J7572J5441J4667K1211Q605l393N067
278D4616p18j9359j1993K485n364q706P035R916k909n796o980j3061j6301j3551
292d0686r747L12P605P525J0478J8755J5214P25j869K824j96o030m65P977Q375
307B0797N106O730Q121K674p167j4118j5293j4754j3778r055l88N997O472L953
$$ y = [-25922, -45903, 4058, 45880, 12109, 23282, 75849, 49968, 17284, 56082, 55020, 4009, 16138, 41302, 7890, 4020, 35070, 10478, -20193, -4384, -20568, -61833, -48461, -37899, -70111, -57857, -13317, -21623, -29076, 11798, 22432, -2802, 9195, 22271, 297, 5472, 35244, 33011, 30675, 54831, 54772, 36006, 39381, 29620, -6294, -18515, -15982, -36305, -43331, -20628, -15229, -25328, -15882, -11370, -28259, -34151, -28294, -34431, -34554, -16982, -1541, 13126, 34337, 42942, 39549, 44616, 43898, 24539, 12546, 15031, 9667, 961, 7996, 17912, 15003, 9207, 2227, -10834, -27135, -40686, -50433, -50121, -42516, -34991, -24513, -5758, 9456, 10181, 8312, 11136, 10940, 4910, 4445, 12422, 20797, 25903, 32633, 40754, 43428, 36261, 22143, 6850, -7904, -21682, -30737, -31125, -25128, -18656, -14703]
321a4703L736K744k978q441n323l40K037N786J1065J3330J1726Q134N338K905
335C5016j176p208j1223q679m154j605J425L985M815Q82n078r867j0629q839q668
350c1003n502K596Q018P819Q313R796M564R57J565N32j001N17j123j309N896Q337
366A8972J921J530N470l275j3510j0382p658j0058l810L035R97M040R135J99o168
381i562J812m10p600K013Q882k616r06J2547P406Q63Q000K831q719j492J335j2877
397A507n725R455m145r480J1532Q499j0434j548K906j7312q940J0438j999n333
411b0579J4442M741j1441J1300J5683j0428j447J5765j0630j7247J2633O821r703
424i0J3337J2642j8171m577J4065j3648j4852J2997n034k3211R800J4618j2449
$$ y = [-14703, -10967, -8223, -11201, -19642, -24965, -25305, -23268, -17482, -6417, 6913, 18639, 26773, 32111, 35016, 33840, 26632, 15409, 6730, 2576, 971, 2396, 6381, 11196, 12078, 7000, -2867, -13496, -22335, -31003, -36505, -33909, -25891, -18072, -9759, 37, 4601, 5558, 7123, 7655, 6654, 7171, 6048, 4739, 10635, 18972, 20893, 22423, 27893, 24618, 11108, 726, -6932, -16990, -20800, -17765, -16768, -12728, -3593, -3394, -9562, -7750, -8160, -15760, -13747, -4865, -7481, -8387, 4160, 11566, 12429, 20429, 23260, 14541, 13049, 14384, 1507, -4218, 5237, 1092, -8388, 3144, 11643, 1209, -339, 2567, -14745, -23685, -13247, -15246, -20579, -6137, -1396, -12837, -1537, 14146, 3718, 2271, 18036, 7406, -9841, 2792, 9613, -90, 13247, 25889, 7718, 3141, 17206, 3558, -11294, 1703, -3331, -26542, -16742, -2124, -14573]
437a4573O276K0542j4396j3916J7901j954j6422J7404J1288k3059K412K4736o152
450A0087k988K3027q090k7625N128K525j8867J3170J9980k1715j1069K3317l450
463C430j5306J9959L761l1294m278J5819p339M408K4847m869j2801J5296P57j7544
477e154J2562J2462k4229r628J6509l972m918K3767Q876j9557q021l052j3523
490a7878N998J6058q471j2389O543J812Q32K1477J2393k0005j8302o06O0M970
504g508J5618M698r543k852N248M429M209R53j1075j4841m859L954L703M985R755
519F874M332p830n488O42m826k584R230l22j4921L33J2817L228R919J7087j2694
534A5797k6356J853P563n618J0144J0637k0684q792K3220N555o452J2716r896
$$ y = [-14573, -8297, 12245, -2151, -16067, 1834, -120, -16542, 862, 12150, -10909, -8497, 16239, 10087, 7099, 30126, 22036, -5589, -461, 2064, -16803, -3633, 16347, -5368, -16437, 6880, 3430, -11876, 8083, 11844, -19450, -23728, -7909, -15248, -10840, 14007, 9138, -3663, 11633, 12390, -5154, 7408, 19870, -4359, -13987, 2522, -1450, -6368, 17399, 26275, 6718, -1303, -4355, -17878, -11880, 4178, -4293, -16682, -10139, -8327, -7495, 13982, 26375, 6370, -11932, -12538, -12478, -7508, 8110, 12808, 3265, 413, 5661, 10090, 14299, 15252, 4177, -10664, -15523, -11569, -7866, -2881, 6874, 11206, 3376, -2112, -1470, -6296, -8880, 350, 28, -14893, -14560, -1743, 1485, 11404, 28491, 15797, -10559, -8706, -1143, -6761, 3383, 14020, -6664, -15456, 7764, 13319, 6867, 19583, 9687]
547I687l6116L807K3504j0559k48K3820j0348j8915K3295R583k4457O545J2272
560A1870k8512n397K9683o141j0454L2466K637l5470O746J6234k5655J433K9357
573A8797k1526k5270K8907Q002j9018K6140J5083m4722j2382K9738j1392r445
585a7088L3808m997l6151J8979K2244k0265R887K4100l4817k6089L0962K532k0443
598a7338K9362J6878l7568m867K7075j2617p773K6530j1534l3414J3598J2828
610A160j6894K0766K8939k9414k4139K1897k970j8695K4146J3365l1143o257K0718
623A479l680L278K5074j0212k9193O307N563j4145J6509K4452k0040j9365J6593
636B620L213j2380J5840J1272k4367j3566J0452k458J89K0432J623j8811K52O477
$$ y = [9687, -26429, -22622, 882, -9677, -9925, 13895, 3547, -15368, 7927, 17510, -6947, -402, 11870, -16642, -22039, 7644, 1503, -8951, 23515, 26152, -9318, -2572, 13662, -11993, -10560, 18797, -2729, -27999, 908, 8910, -10108, 16032, 31115, -13607, -25989, 3749, -7643, -17088, 16720, 11723, -24428, -5449, 16795, -3470, 6417, 30517, -4300, -30389, 573, 3105, -17338, 12024, 28902, -8666, -13533, 13542, 925, -6848, 19682, 8148, -25266, -11668, 1160, -15734, 5032, 33971, 4557, -19582, 2315, -655, -19350, 4796, 18161, -12982, -19239, 1479, -2201, 1077, 26151, 15939, -13254, -6947, -1384, -15529, 980, 25432, 5392, -13973, 2620, 5833, -6547, 9293, 20565, -3802, -17368, -6916, -9374, -9185, 11247, 12870, -5941, -5689, 788]
650G88j0326M721J9327r300j9075Q367O556r768J0831J8926j2501j5391R754J473
664D382j0434R739Q465j6675n913J1894l678j543J8387j593k2182L074O931j7525
678a6671J646K4701o542j6554J5848P403j6872P107J5415j5268q827J3500p215
691b329q346K1687M906k0216R197J2117k3078n377K2675r573k1058J6214Q096
704D915j7502Q176J7375j5123n287J5256j0780j2164J9989K531j9983J0742J6060
717A4205j7871j553K2856p434j6700J2327J151j9546P574J2683j3746O39J7744
730A2329r523j0686J5637j245k0144O480R360j4168J176J7612n775o614J5417
743I856j058j5156P048N507j4799J431J4826n643n098J4634N80j1658M392J589
$$ y = [788, -9538, -4817, 14510, 5210, -13865, -5498, 1058, -8710, 2121, 21047, 8546, -6845, 2909, 4382, -6052, 3687, 12152, -4523, -10436, 1458, -2220, -3763, 14624, 13031, -9151, -6077, 854, -16671, -15025, 9676, 3134, -13420, 2428, 9831, -7041, 66, 15481, 213, -8614, 4886, -2329, -10675, 11012, 15918, -4298, 4899, 17016, -6062, -11439, 11236, 1663, -19395, -3181, 4915, -12587, -4411, 12964, -2159, -7446, 7810, -2970, -15134, 4855, 7386, -12597, -1855, 14205, -3666, -5219, 17637, 10203, -6497, 5830, 6981, -12565, -4991, 7692, -6054, -5415, 12329, 2806, -7880, 7757, 6512, -13632, -7152, 2208, -11960, -10784, 6828, 1053, -5561, 9856, 8798, -6358, 690, 6197, -8602, -7171, 7655, 2012, -3086, 11548, 12128, 470, 4862, 6451]
757F451j3522m3P253o816k231J2080m13q567P186M029j0429j194O619m618k977
772g192Q474J901k926N720K645n032N34K267p125l155M963j607m361M184L184
787B474l386M84L357l849l345J209j328k814K550K597J366L058K686o29L5J40
803D605l779k433J422l11j428K829L936m39j400j1n15l928l740m21N13Q9K30K689
821b092L943P48k082m41J091j837l396J525L790Q97j050J826L367l35l202j118
837A634J209j741l587o59K037J18j967L55L021L49l083j095J883n80k882K03L446
854a339K213m90J102K356J029j218j290j9K43j296j644J828J117k010p13K411
870B280p39l308o20O24k616j021R11m92J265L299N30j227K601Q08k757R96K013
$$ y = [6451, -7071, -7114, 139, -6677, -8908, 3172, 2759, -5808, 1378, 5407, -5022, -6216, 403, -4215, -7192, 1282, 3183, 257, 5977, 8622, 3590, 4124, 6391, -734, -3889, 1074, -533, -4894, -710, 2474, -912, -428, 2929, -920, -4265, -3056, -4384, -7198, -4648, -2051, -685, 2373, 5059, 4430, 4465, 4605, 826, -1607, -185, -496, -1924, 905, 4841, 4402, 3002, 2991, 2476, -1452, -5192, -5613, -5100, -5011, -4781, -2092, 1851, 2599, 517, 76, 1167, -670, -4066, -2541, 1249, 2146, 1096, 2922, 6289, 5954, 2752, 1634, 2843, 1102, -2485, -3144, -1107, -989, -2956, -2601, 420, 769, -2314, -3409, -1526, -2106, -4988, -4785, -1339, 874, 384, 1486, 3842, 4871, 3653, 2363, 2344, 2587, 1291, -353, 1475, 2592, 582, -131, 2280, 1541, -1767, -2387, -1763, -4379, -5400, -4489, -4981, -3716, -417, 113, -1114, 1487, 2295, -462, 534, 2547]
887B547k264L11M910j172l112L908J529n443k56K387m707k822M337j678m530M060
903a995J359m894K522M015n812J62P146m330o029Q600L993o772L807P317o869
918B220j259P747m310o200P099r01j0967N648P275r566L06R826q837j0076J0602
933a393K112j0390N761O417j1006J375J4539n226n989J2753k364j4805Q037R437
947I258j1499J195J3561r134q862J3009r30j2750Q664M911j7507J93J3640q995
961e246m907J7535j829j7376Q011Q125j2062M177J3481j2616q249J6316J05r675
975d210J4889N982k1013p73J4162j0108n674J6517l107j6474R528O534j4243M375
989c615J3621j4220r919J3610k626j1699J6014J1040j5705j581J2522r005n253
$$ y = [2547, 283, 594, 5504, 4332, 1220, 5128, 6657, 1214, 958, 3345, -1362, -4184, 153, -1525, -6055, -1995, -636, -5530, -3008, 1007, -4805, -4643, 2503, -1827, -7856, 744, 4737, -2035, 1772, 9089, 2220, 961, 8708, 4398, -1802, 5297, 4396, -6571, -923, 6352, -3214, -2908, 6918, -1919, -11995, -1393, 719, -9671, -3910, 2507, -8499, -7124, 7415, 2189, -3800, 8953, 6589, -8216, -179, 9258, -2241, -1046, 12515, 3381, -5481, 7528, 6598, -6152, 2512, 7423, -10084, -9891, 3749, -5246, -10153, 7382, 5553, -11823, -3812, 4313, -7749, -3572, 9909, -2707, -10956, 5360, 5465, -4210, 10679, 16661, -4352, -5125, 9037, -1071, -6745, 9772, 6665, -9809, -281, 6253, -7990, -3615, 10006, -4214, -14133, -523, -3149, -14848, 1166, 12206, -3499, -5080, 7442, -1563, -6816]
1002f816J7673q25j6654O640O746j2054O013J7626j1504j5241R847r90j2695J1336
1016h98J0905j6382m749J3544o003p015J7390J372j7930N163J0251j4602P36K1757
1030A3539m626j4891J2302K815j7165Q650J5793j6343p853J4946q698j2711K0563
1043F321P699k2165K422J2237j8293l908K6186n041k0702J4053O926j8635J1340
1056a560K1235k0056r899K1800p051j8333K2518R319k5734N610J8694k1369p049
1069a1875K6934r377k3258K0058N830k8195J1010K3741k1926p220K6764j2156
1081C30k1869K6207R641k6420J0978J9204k6373k613L3123j2610k3512K5024L156
1094A4266k9839J5044K1458k8339n750K7716j5045j9208K7488O83k9984J6733
$$ y = [-6816, 10857, 10032, -6622, 18, 6764, -5290, 723, 18349, 6845, -8396, 1451, 461, -12234, -898, 10007, -6375, -11124, 2420, -3583, -10598, 6792, 8164, -9766, -4603, 5648, -8954, -8218, 13539, 8913, -5978, 6324, 9139, -8026, 624, 16417, 74, -7779, 7167, -1531, -14242, 6321, 14020, -8145, -5723, 6514, -11779, -15687, 10499, 5458, -15244, -1191, 5735, -12900, -1560, 19675, -381, -10280, 11520, 4469, -13864, 8654, 17973, -7761, -2151, 16543, -4826, -11875, 15059, 5682, -17576, 2482, 8312, -19883, -8873, 14868, -7058, -14278, 12486, 330, -21539, 4668, 14309, -12111, -1133, 18071, -8302, -10915, 22208, 9598, -13914, 11110, 14266, -15573, -529, 20929, -7410, -13160, 14556, -489, -19697, 7791, 8474, -21510, -4777]
1106d777J9136k7903l31K8766j6782j7699L0379K657k7926J5860J6683k5226K955
1119d208K6065j9126j6165K6607k229k4655J8115J2124k9041J759K4428j7590
1131c916j2732K3575m673k1855J8792J0939k4229N011K1779j6658p677K4950m724
1144H582k1000J6930R653k0006O003J6861j6536p010J9040o613j6363J4916M404
1157H861k0487N219J4436j4477o039J6810m341j3143J1950M866j3653N945J1562
1170G509j0814k091J3820m004q661J2128M316j3449J823R374q432m512R367k710
1184C664q678O180K273r725J209O243o518l169P850k497o301P686M898o933J094
1199b724P269l671k777O752Q58o150L188M889m822q61M891k881m830K768j54n614
$$ y = [-4777, 14359, -13544, -13875, 14891, -1891, -19590, 10789, 13446, -14480, 1380, 18063, -7163, -4208, 21857, 2731, -13434, 13173, 10944, -13711, 4404, 16528, -12513, -10754, 13674, -3916, -16648, 6927, 2254, -19601, -809, 10130, -14099, -9088, 12691, -3967, -11644, 13306, 8582, -12418, 4512, 14165, -5841, 162, 17023, 487, -6523, 12517, 5904, -10459, 4457, 8861, -11626, -6407, 8029, -6448, -12487, 4323, -18, -13161, -1211, 3655, -9998, -4053, 7509, -3305, -5396, 8424, 4420, -4241, 7887, 12203, -1246, 577, 9951, 1519, -2993, 6374, 3664, -5014, 1166, 3439, -6286, -5077, 1166, -5352, -8521, -671, -3168, -9469, -1783, 3115, -3818, -2724, 4545, 874, -1903, 4849, 5707, -443, 2745, 7634, 2812, 1951, 6842, 3961, -869, 1899, 1745, -3869]
1215c869K069K250o169p39P077j633n958L746K866n770J364O779k632l146N383
1230A618K598k397K466J232l934J220L711n034k209N988j274o612L312L144o713
1245b884k760M773j633l693L039O05l019K808K113k506K111L468m268q20P355
1260D689L61n147K896L447l919l65L719k233k933J589j211k575J466k90l532O52
1276c386K600l384j188M129r36k591K079K420j785Q63K981k54l48K441j09j512
1292B020J488J49j730O49N93j944o04R01j862j448J70n63j862J40J334n24J03
1309b990J130N04m00O16P2M25J428L84N68J135J329r86k92O31r32j355n79M22
1327A110j88l97m18p29m40j121j187o89M47r4J23R31Q15J165K44Q05J83J34O96
$$ y = [-3869, -1800, 450, -5719, -6458, 619, -1014, -6972, -3226, -360, -6130, -4766, 2013, -619, -3765, 1618, 4216, 1819, 4285, 5517, 1583, 2803, 6514, 1480, -729, 5259, 3985, -2627, 685, 3829, -2884, -5644, -871, -2504, -6197, -3158, -2553, -5572, -2764, -651, -3157, -1046, 2422, -1846, -2666, 4689, 5050, -97, 2799, 6246, 2327, 1962, 5681, 3448, 515, 2104, 893, -1682, -216, -506, -4038, -3386, -786, -4170, -5358, -1229, -2165, -4756, -2677, -257, -2042, -1179, 1802, 1548, 1200, 3641, 3532, 2020, 3508, 3657, 1927, 2576, 3169, 1225, 621, 1522, -340, -1788, -1618, -2181, -4043, -3903, -2569, -3093, -2990, -1860, -1356, -1756, -1140, -1068, -643, 785, 1169, 1737, 2872, 4201, 3215, 2923, 3554, 2622, 1267, 688, 1110, 922, 525, 107, -622, -1062, -2183, -3370, -4059, -3612, -3706, -3583, -2652, -1837, -672, -428, 377, 560, 694, 1390]
1346A390L24O19P19N1l21P01J48n88j512n20j13j200j127j065L28K12r06o43O22
1365b881O60j71m99Q63Q63j02M85J164J464j20J87J882N36j138j114P44J56j690
1383A289j233L6J066k18j367q86M01n25k457n38J647p01p80K122K318j079N3J539
1401F87M35n37R3J95J026J299J74r31J552M81k651j318J222j546k537J348O16
1418c92k545K81J722j756q39J378j051q70K907N4j413K823J938k421R06L436j443
1435B715j688L708k07m304J596K174l803o08K959k189k179K007j708l320K975
1450a872Q78m201J349L817l201j048N594K39m110K827K627l436P55M106j952j065
1466A307L557k037l423M234N98n626Q93L223n146j998N112o28l694K168M59m108
$$ y = [1390, 1714, 2333, 3052, 3103, 2782, 3483, 3631, 3043, 1531, 1011, 898, -302, -1429, -2494, -2166, -1954, -2860, -3503, -2881, -2221, -2392, -2891, -2028, -1165, -1267, -782, 382, 1846, 1726, 1913, 3795, 4331, 3193, 2079, 2823, 2979, 1289, 56, 92, 1158, 940, -427, -1313, -912, -1437, -3894, -4432, -2785, -3486, -4266, -2144, 174, -905, -852, 687, 1122, 585, 678, 873, 1899, 3198, 3372, 2441, 3993, 4474, 1823, 505, 1727, 181, -2356, -1008, -392, -2937, -2656, -934, -2690, -3529, -2151, -3202, -4072, -1165, -1111, -2524, 299, 2237, -184, 722, 4158, 2715, 1027, 4735, 4528, 224, 1820, 3994, 191, -417, 2542, 353, -1826, 181, -1527, -4847, -1872, -994, -5195, -3846, -29, -3230, -4278, 1316, 1555, -2555, 272, 2899, -537, 218, 4324, 2372, 1307, 4864, 2827, -596, 3638, 4236, -1390, -497, 2726, -2420, -4418, 694, 66, -3628, -1460, -1001, -5109]
1482e109J496L254j962O05L658k817k757M944J923k847J958K213l983j074M093
1497C595J34k246J226j394l591J416K112j928o71J804k261k255J234J377j252
1512b700O81J933j409r16J554J675K14J282M27k465j515K139J665j6J086K41l855
1529B1k323K926J769j811m57j542l529R26M921j053k151K509j322l499L431L317
1545B133m014QM685k232k791N195M70l922L521K767o672r51M844l918j953P509
1561D679j331q608L374L878n650K092N771p537n243Q281P98m718P179K872r929
1576d092J250Q435n332l452Q316k460p327P409L182q763L234P086q607l696Q681
1591C864m383q218R251L737r515L016O166q662k58J0631m473p761Q113N80q656
$$ y = [-5109, -3613, -359, -2321, -1716, 1942, -875, -3632, 1312, 3235, 388, 2346, 4559, 576, -498, 3595, 3729, 1483, 2709, 1315, -2276, -860, 1252, -676, -1347, 457, -1804, -4059, -2825, -1448, -2700, -2019, -86, -1495, -2411, -857, 818, 1032, 2314, 2741, 276, -1239, 900, 2565, 2549, 3635, 3876, 21, -2302, 624, 2393, 582, 125, -1417, -4946, -4020, 901, -152, -2303, 206, -1116, -4615, -1184, 2133, -1881, -1873, 2812, 580, -2211, 2984, 3454, -468, 3053, 5820, -852, -1803, 3041, -877, -2830, 4679, 3348, -5260, -1886, 1992, -3658, -1566, 4205, -3332, -8575, -294, 504, -4214, 2965, 5837, -4092, -2842, 5593, 261, -3191, 5125, 2665, -4662, 2747, 5929, -2834, 400, 7486, -1121, -4817, 3864, -519, -8737, 514, 4251, -5264, -2248, 3918, -4744, -5002, 5629, 1156, -6605, 1508, 2088, -6568]
1606f568P486Q405r812j787R130n453o198R358k40r468M894N217r026J078R298
1621F314o749n388Q552j868r172O675N184q239J493P905n536l732R188j271p550
1636d194O395K562q407K173P959n748l005Q064k166p423N110J536p141K104N269
1651C088n755k377P048k108m442N963J269p302J321N547l564p92N606j853l642
1666a993M788J540m767J576K770m402j669N018j586l811L053J411l398M59K274
1681A263l425j693L669l17k513J807J575k649J268M174k125k737K589N43k457
1696a028K276K013l186n99K982m72k120K230k98m411J096L069k514j569K265m97
1712g63k156K478J690l351L75K208j941j101M017m35k881L096K404l503M12K832
$$ y = [-6568, 918, 9323, -489, -2276, 6854, 1401, -4797, 4561, 4321, -5147, -253, 4964, -4062, -2984, 6314, -435, -5823, 2729, 861, -8311, -1636, 3548, -4691, -3198, 4707, -829, -4561, 4627, 3356, -4194, 2201, 4763, -3644, -1471, 6488, 740, -2265, 5799, 3633, -3790, 1320, 2856, -4285, -2181, 3088, -2667, -5044, 2004, -104, -4546, 1417, 2686, -4616, -3295, 2252, -1312, -2104, 3502, 1649, -1993, 2795, 4335, -432, 1144, 3914, -488, -2157, 2861, 1275, -2536, 517, 1928, -1470, -1011, 1263, -2162, -3855, -186, -503, -3016, -1209, 366, -2283, -1015, 3159, 1034, -1703, 886, 1429, -1028, 1248, 3261, 75, -524, 2458, 1986, -134, 2096, 1798, -2613, -1517, 1552, -962, -2531, -266, -763, -2919, -441, 1249, -2102, -1727, 481, -1460, -2561, 1456, 1021, -1860, 1236, 3640, 137, 549, 3381]
1728C381k237j961L302q05l511K007J380l185J056L209l203k340L460o23l362
1743c432K542J431l614P56L953k133q40L386q33l177K578J785l528J113L085k652
1759D20r00L115q79k325K107M32l879M02K243l111m42M087j034k548K321P77k904
1776b118R65J793j955l63K308q25n25L237m8k812J533J395k839o95K485p79j867
1793a110J490Q10j131K87O02j809M1M39j853j86J952k5j185J632J410j703k35
1810e74J434n18j001M91K19j78R24O48k57N50j1r46p96M04r53j042P01N70n79
1829i14M76P44j07o78j80j81n34K10J95J58P35P86J74J0N17o10n71LKp04L26Q60
1851G17J48n30J38M98o32p40k25l32m1l26R7P45O04j69J13K32L45p81n51N04K7
$$ y = [3381, 1144, -817, 2485, 1680, -1831, 176, 1556, -1629, -573, 2636, -567, -2907, 553, -70, -3432, -890, 541, -3073, -2317, 1636, -497, -1337, 2049, 1216, -1961, 617, 2402, -1126, -13, 3072, 420, -480, 2635, 1756, -569, 1538, 1970, -1909, -1507, 736, -2375, -2817, 1270, 236, -2312, 9, 786, -2118, -1153, 640, -1315, -1678, 630, -195, -720, 2517, 2469, -343, 1190, 2585, -254, -949, 1536, 757, -1110, 380, 1190, 59, 346, 948, -861, -820, -381, -2234, -2420, -468, -493, -1678, -46, 1364, -339, -574, 860, 342, -659, -168, 51, -127, 797, 1445, 1188, 1738, 1727, 781, -15, 389, -564, -1606, -905, -335, -914, -438, 306, 199, -479, -659, -840, -1374, -1164, -969, -811, -76, 710, 884, 894, 1411, 801, 230, 233, 235, -469, -143, 717, 865, 335, 473, 971, 339, -401, -626, -958, -999, -1325, -1228, -483, 121, -48, 65, 297, 642, -139, -690, -186, -159]
1872a59m46N49J187J44j32p9N5l83p12o51R6L01l65J23K99O63l02p12N71m12o77
1893a042m47P39J39L25M00J26M73N70m89o87J21L05r72J29R76p15m5Q89L06r25
1913A76O4l72q51J14N62j020lJ323M26j174O85J080j115n54J060o48n53J516k63
1932D53q65J422Q41j941M88J470j932j457J969m74k107J676J163j329K07J665
1948A249k051p56K321j013k120K416J085k585J226L018k617j215L348r65k740
1963a399J932J001l251J490K605k554j134K868j677k195L204M76m349J474K806
1978A297l166j09M353j860k720L291Q98l685J771K455l977j49L720j665j984M538
1994C008p95m097K683K074n251m20M689k094k409L563L22m169K378K675k919o62
$$ y = [-159, -605, -56, 1131, 1275, 1143, 1064, 1119, 736, 24, -627, -531, -230, -595, -472, -173, 490, 188, -524, 47, -365, -1042, -1489, -750, -611, -286, 114, 240, 713, 1283, 794, 107, 228, 533, -439, -310, 666, -49, -94, 795, 1101, 176, 240, -132, -983, -869, -307, -1327, -1330, -7, 419, -755, -70, 1010, -105, -659, 401, -247, -800, 716, 453, -412, 1010, 1851, -90, 398, 1868, -64, -1521, 448, -26, -2133, -457, 706, -623, -416, 1249, -802, -1558, 763, -250, -2370, 46, 1131, -1454, -228, 2790, 173, -1042, 2306, 1341, -1399, 533, 1534, -1717, -227, 2378, -176, -1310, 1558, -119, -2314, 890, 1366, -2983, -1509, 1297, -1869, -1978, 2375, 515, -2205, 1086, 1984, -1701, 70, 2525, -1452, -1601, 2119, 454, -1530, 3008, 2213, -1884, 799, 2873, -2378, -2798, 1891, -203, -2612, 951, 1273, -2896, -518, 2157, -762, -1424]
2010a424K418l091q20M767j87l315K806K093m353M35M137k176l608K852L92k373
2026a447K268J349k788J15K335k276j988L096q12k904K566J969l090k06L200n52
2042H35j361J715j11k974R73K338j300n7K192j433j932K379Q26k510K04J276k604
2059a544r86L017L52j986J303J207k748P3K243j475j957K553O55k454J615K318
2075B186j966M8K609k542k803K918P19k715J793K770l695r38M074j326l301K823
2091F54M10m327J355L275k917j37M005j672l649L964O48m424K250L481m297o47
2107b028M970j716k790L972M05m987J771L501m671n90M634k449l078N186M36m987
2123b421K026K817m708r6M743l456k730N239P51m509L743K109n658K08M864k885
$$ y = [-1424, 994, -2097, -2917, 1850, 1663, -1652, 1154, 3247, -1106, -671, 3466, 1290, -2318, 534, 926, -1447, 821, 2170, -618, -503, 1832, -444, -2432, 664, -148, -3052, -486, 1483, -1607, -1813, 1387, 835, -526, 1189, 1078, -1896, -923, 1415, 115, 58, 2250, 817, -1115, 1264, 2090, -420, -216, 1060, -1544, -2530, 487, 839, -1147, 156, 1363, -1385, -1312, 931, -544, -2501, 52, 707, -1747, -132, 2186, 220, 268, 2877, 335, -2468, 450, 1169, -1546, 247, 3017, -678, -1616, 2458, 1132, -2169, 654, 1064, -3263, -1908, 1367, -1550, -1687, 2318, 646, -3003, 961, 1609, -2815, -565, 2916, -1381, -2028, 2942, 1226, -1564, 2408, 2813, -2174, -403, 3098, -1573, -2163, 2471, 22, -3056, 2130, 2566, -2421, -395, 2422, -2286, -2382, 2361, -1095, -3825, 1414, 2165, -2344, 1399, 3508, -2150, -1942, 2922, 37]
2139C7k434M227o42l897L726K340m973Q82L625m185j848M717j020l786L686J929
2155B384m489J422L125l348j135M148j987k633L388L45l362K774K949l941j125
2170a485L613j876j969L220l33l404J519K188k342L93K563k398j780K770n24k178
2186b023J784J686k516M07K166j393n16J764n37j674J135L92j801O77J672r44
2202B79n13R41p42r21J189L05j704M38J03n99P47J100j41o56K61J50l20N4M12
2221C83n78M91l64K5N07N75n1o52l65p8Qk94l55J55K57j98J05O16j64l94L73j25
2243a23n84kL96J49M56M14l48j76Q05j84q30L37J69j193L41M59o5j48P87o09p53
2264g02N15K8j010L21N10q56L89J109j55k55P31L6n59K14K9l80M13M62l00l75
$$ y = [37, -2397, 1830, 1188, -2709, 1017, 3357, -1616, -734, 2891, -1294, -3142, 1575, 555, -3231, 455, 2384, -2105, -683, 2442, -906, -2041, 2107, 120, -2513, 875, 1220, -2142, 632, 3581, -360, -1485, 2128, 252, -1717, 1503, 1170, -2234, -715, 1473, -869, -476, 2087, -311, -2091, 679, 155, -2023, -239, 1447, -1069, -662, 1504, 111, -405, 1359, 822, -852, 283, 675, -1126, -449, 1223, 279, -234, 707, -35, -956, 233, 538, -1166, -728, -625, -1224, -477, 623, 482, -174, 87, 237, -83, -29, 383, -195, 296, -68, -43, 464, 1039, 988, 336, -29, -107, -99, -393, -748, -593, -336, -534, -429, 187, 23, -371, 2, -123, -707, -709, -313, -164, 292, 706, 358, 182, 987, 803, -27, 310, 479, -714, -373, 86, 21, -127, 660, 51, -702, -187, -159, -1169, -848, -338, -1194, -805, 304, 149, -106, 625, 661, 102, 316, 345, -35, 378, 840, 540, 165]
2284A65J073p9q60L5K31j124m45M99l69K68N42l91l79P01k5p50N47R1m04J04Q72
2305C02q4J7O77L70m74nJ08o05l72N19p47j40P05K30m01k74J53n18j37l51j97
2326a224J41M93j24M47N86J62k44jL42l76k78L26L54J63n7N5K32m6l61o09N0J07
2348A38p60j66N8K74k37K59j8K45l35l52K81R7L8j1N48M69J45j06J83K77l42q6
2370E99m74J36r9R6rj58L2N5j98P3o51R7j52j02o8L01J45K48m8N84P8p7j78J82
2394D12j7M2l93M21L27k53n2k5Q4o54j20j1k12j46k16N7K00J3K82l90N17j44l88
2417f66K72O36k18Rj49J064k36l45L28n7J27m77k06l0K34l44n71N93J96r02M11
2438c31K73l18n79M63j06j00M98K06rP06K30p36K77Q18n86o93L42L19p69N3O17
$$ y = [165, 1238, 1159, 299, 334, 565, -559, -1004, -505, -874, -606, -64, -455, -834, -133, -158, -908, -361, -270, -674, -570, 302, 218, 235, 912, 1282, 808, 803, 911, 306, -66, 453, -294, -434, 271, 501, 100, -174, -21, -539, -676, -1027, -1224, -1083, -590, -714, -267, 319, 481, 237, 236, 578, 202, -76, 250, 604, 767, 710, 765, 997, 951, 590, -19, 31, 138, -622, -788, -730, -456, -693, -434, -452, -207, -542, -894, -613, -516, -478, -489, 59, 528, 673, 567, 750, 1027, 685, 599, 125, 261, 162, 258, 249, 91, 123, 178, -20, 53, -598, -501, -653, -755, -823, -522, -377, -129, -177, 407, 485, 408, 230, 412, 395, 437, 44, 465, 792, 539, 487, 462, 546, -108, -228, -239, -451, -597, -813, -756, -556, -543, -261, -651, -134, -278, -666, -394, 242, 24, 33, -116, 948, 712, 367, 695, 638, 765, 288, 82, 52, 286, -58, -629, -36, 160, -742, -331, -58, -376, -955, -492, -598, -698, -200, 6, -3, 703, 933, 197, 474, 1292, 706, 13, 355, 674, -95, -42, 575]
$$ [...]
8191B42
##END NTUPLES=NMR FID
##END=
