##TITLE=1H_LR-744-CK1
 CDCl3
 8 sc, 
 8.02.2022
##JCAMPDX= 6.0         $$ Bruker NMR JCAMP-DX V2.0
##DATA TYPE= NMR FID
##DATA CLASS= NTUPLES
##ORIGIN= UXNMR, Bruker Analytische Messtechnik GmbH
##OWNER= root
$$ XWIN-NMR		Version 3.5
$$ Tue Feb  8 12:12:47 2022 Russian Standard Time (UT+4h)  she@DPX200
##.OBSERVE FREQUENCY= 200.131346
##.OBSERVE NUCLEUS= ^1H
##.DELAY= (6, 6)
##.ACQUISITION MODE= SIMULTANEOUS
##.ACQUISITION SCHEME= undefined
##.AVERAGES= 8
##.DIGITISER RES= 18
##SPECTROMETER/DATA SYSTEM= spect
##.PULSE SEQUENCE= zg30
##.SOLVENT NAME= CDCl3
##.SHIFT REFERENCE= (INTERNAL, CDCl3, 0, 15.7039)
##AUDIT TRAIL= $$ (NUMBER, WHEN, WHO, WHERE, WHAT)
$$ ##TITLE= Audit trail, XWIN-NMR		Version 3.5
$$ ##JCAMPDX= 5.01
$$ ##ORIGIN= Bruker BioSpin GmbH
$$ ##OWNER= she
$$ F:/spectra/data/she/nmr/H-F/1/audita.txt
$$ ##AUDIT TRAIL=  $$ (NUMBER, WHEN, WHO, WHERE, WHAT)
(   1,<2022-02-08 12:10:23.67 +0400>,<she>,<DPX200>,
      <created by zg, POWCHK disabled, PULCHK disabled
       configuration hash MD5:
       00 E9 B6 7A A2 85 ED C7 34 08 36 98 17 FE 4E 26
       data hash MD5: 16K
       57 32 10 EC 3F 32 B7 C2 83 3D DE 35 4C C8 5B 18>)
$$ ##END=
$$ 
$$ hash MD5
$$ 47 ED BC FC 77 83 5C 1E 4B 48 4C 20 3B DB 17 C5
##$RELAX= 
##$RELAX= 
##$RELAX= 
##$RELAX= 
##$RELAX= 
##$RELAX= 
$$ Bruker specific parameters
$$ --------------------------
##$DU= <F:/spectra>
##$EXPNO= 1
##$NAME= <H-F>
##$PROCNO= 1
##$TYPE= <nmr>
##$USER= <she>
##$AMP= (0..31)
100 100 100 100 100 100 100 100 100 100 100 100 100 100 100 100 100 100 
100 100 100 100 100 100 100 100 100 100 100 100 100 100 
##$AQSEQ= 0
##$AQ_mod= 1
##$AUNM= <au_zg>
##$AUTOPOS= <>
##$BF1= 200.13
##$BF2= 200.13
##$BF3= 200.13
##$BF4= 200.13
##$BF5= 200.13
##$BF6= 200.13
##$BF7= 200.13
##$BF8= 200.13
##$BYTORDA= 1
##$CFDGTYP= 0
##$CFRGTYP= 5
##$CHEMSTR= <none>
##$CNST= (0..31)
1 1 145 1 1 1 1 1 1 1 1 1 1 1 1 1 1 1 1 1 1 1 1 1 1 1 1 1 1 1 1 1 
##$CPDPRG= <>
##$CPDPRG1= <>
##$CPDPRG2= <>
##$CPDPRG3= <>
##$CPDPRG4= <mlev>
##$CPDPRG5= <mlev>
##$CPDPRG6= <mlev>
##$CPDPRG7= <mlev>
##$CPDPRG8= <mlev>
##$CPDPRGB= <>
##$CPDPRGT= <>
##$D= (0..31)
0 1.2 0 0 0 0 0 0 0 0.06 0 0.03 0 0 0 0 0.0002 0 0 0 0 0 0 0 0 0 0 0 0 
0 0 0 
##$DATE= 1644307823
##$DBL= (0..7)
120 120 120 120 120 120 120 120 
##$DBP= (0..7)
150 150 150 150 150 150 150 150 
##$DBP07= 0
##$DBPNAM0= <>
##$DBPNAM1= <>
##$DBPNAM2= <>
##$DBPNAM3= <>
##$DBPNAM4= <>
##$DBPNAM5= <>
##$DBPNAM6= <>
##$DBPNAM7= <>
##$DBPOAL= (0..7)
0.5 0.5 0.5 0.5 0.5 0.5 0.5 0.5 
##$DBPOFFS= (0..7)
0 0 0 0 0 0 0 0 
##$DE= 6
##$DECBNUC= <off>
##$DECIM= 32
##$DECNUC= <off>
##$DECSTAT= 4
##$DIGMOD= 1
##$DIGTYP= 9
##$DL= (0..7)
0 120 120 120 120 120 120 120 
##$DP= (0..7)
150 150 150 150 150 150 150 150 
##$DP07= 0
##$DPNAME0= <>
##$DPNAME1= <>
##$DPNAME2= <>
##$DPNAME3= <>
##$DPNAME4= <>
##$DPNAME5= <>
##$DPNAME6= <>
##$DPNAME7= <>
##$DPOAL= (0..7)
0.5 0.5 0.5 0.5 0.5 0.5 0.5 0.5 
##$DPOFFS= (0..7)
0 0 0 0 0 0 0 0 
##$DQDMODE= 0
##$DR= 18
##$DS= 0
##$DSLIST= <SSSSSSSSSSSSSSS>
$$ [...]
##$SUBNAM2= <"">
##$SUBNAM3= <"">
##$SUBNAM4= <"">
##$SUBNAM5= <"">
##$SUBNAM6= <"">
##$SUBNAM7= <"">
##$SUBNAM8= <"">
##$SUBNAM9= <"">
##$SW= 18.0517287032376
##$SWIBOX= (0..15)
0 0 2 0 0 0 0 0 0 0 0 0 0 0 0 0 
##$SW_h= 3612.71676300578
##$TD= 16384
##$TD0= 1
##$TE= 0
##$TE2= 300
##$TE3= 300
##$TEG= 300
##$TL= (0..7)
0 120 120 120 120 120 120 120 
##$TP= (0..7)
150 150 150 150 150 150 150 150 
##$TP07= 0
##$TPNAME0= <>
##$TPNAME1= <>
##$TPNAME2= <>
##$TPNAME3= <>
##$TPNAME4= <>
##$TPNAME5= <>
##$TPNAME6= <>
##$TPNAME7= <>
##$TPOAL= (0..7)
0.5 0.5 0.5 0.5 0.5 0.5 0.5 0.5 
##$TPOFFS= (0..7)
0 0 0 0 0 0 0 0 
##$TUNHIN= 0
##$TUNHOUT= 0
##$TUNXOUT= 0
##$USERA1= <user>
##$USERA2= <user>
##$USERA3= <user>
##$USERA4= <user>
##$USERA5= <user>
##$V9= 5
##$VALIST= <valist>
##$VCLIST= <CCCCCCCCCCCCCCC>
##$VD= 0
##$VDLIST= <DDDDDDDDDDDDDDD>
##$VPLIST= <PPPPPPPPPPPPPPP>
##$VTLIST= <TTTTTTTTTTTTTTT>
##$WBST= 1024
##$WBSW= 4
##$XGAIN= (0..3)
0 0 0 0 
##$XL= 0
##$YL= 0
##$YMAX_a= 133227
##$YMIN_a= -131027
##$ZGOPTNS= <>
##$ZL1= 120
##$ZL2= 120
##$ZL3= 120
##$ZL4= 120
##$ABSF1= 10
##$ABSF2= 0
##$ABSG= 5
##$ABSL= 3
##$ALPHA= 0
##$AQORDER= 0
##$ASSFAC= 0
##$ASSFACI= 0
##$ASSFACX= 0
##$ASSWID= 0
##$AUNMP= <proc_1d>
##$AZFE= 0.1
##$AZFW= 0.1
##$BCFW= 1
##$BC_mod= 2
##$BYTORDP= 1
##$COROFFS= 0
##$CY= 11.3945322036743
##$DATMOD= 1
##$DC= 2
##$DFILT= <>
##$DTYPP= 0
##$F1P= 2.36226072786647
##$F2P= -0.459571619588291
##$FCOR= 0.5
##$FTSIZE= 0
##$FT_mod= 4
##$GAMMA= 1
##$GB= 0.15
##$INTBC= 1
##$INTSCL= 1
##$ISEN= 128
##$LB= 0.24
##$LEV0= 0
##$LPBIN= 0
##$MAXI= 10000
##$MC2= 0
##$MEAN= 0
##$ME_mod= 0
##$MI= 1.114404
##$NCOEF= 0
##$NC_proc= 0
##$NLEV= 6
##$NOISF1= 3.799351
##$NOISF2= 2.8
##$NSP= 1
##$NTH_PI= 0
##$NZP= 0
##$OFFSET= 15.70392
##$PC= 1
##$PHC0= -15866.98
##$PHC1= 7.00078
##$PH_mod= 1
##$PKNL= yes
##$PPARMOD= 0
##$PSCAL= 0
##$PSIGN= 0
##$REVERSE= no
##$SF= 200.130013532006
##$SI= 16384
##$SIGF1= 3
##$SIGF2= 2
##$SINO= 400
##$SIOLD= 16384
##$SREGLST= <1H.CDCl3>
##$SSB= 0
##$STSI= 0
##$STSR= 0
##$SW_p= 3612.71676300578
##$SYMM= 0
##$S_DEV= 0
##$TDeff= 0
##$TDoff= 0
##$TI= <>
##$TILT= no
##$TM1= 0
##$TM2= 0
##$TOPLEV= 0
##$USERP1= <user>
##$USERP2= <user>
##$USERP3= <user>
##$USERP4= <user>
##$USERP5= <user>
##$WDW= 1
##$XDIM= 8192
##$YMAX_p= 0
##$YMIN_p= 0
$$ End of Bruker specific parameters
$$ ---------------------------------
##NTUPLES= NMR FID
##VAR_NAME=  TIME,          FID/REAL,        FID/IMAG
##SYMBOL=    X,             R,               I
##VAR_TYPE=  INDEPENDENT,   DEPENDENT,       DEPENDENT
##VAR_FORM=  AFFN,          ASDF,            ASDF
##VAR_DIM=   8192,          8192,            8192
##UNITS=     SECONDS,       ARBITRARY UNITS, ARBITRARY UNITS
##FACTOR=    0.0002768,     1,               1
##FIRST=     0,             0,               0
##LAST=      2.2672688,     0,               0
##MIN=       0,             -131027,         0
##MAX=       2.2672688,     133227,          0
$$ Real data points
##PAGE= N=1
##DATA TABLE= (X++(R..R)), XYDATA
0@%%%%%%%%%%%%oJ4j6J6j6K4l2L2m0M8n6P0p9R0j06J22j43J67j91K17k48K83l17
35a67L58m06M54n05N64o30P01p79Q63r54J054j163J284j417J560j719J894k087
53a095K304k544K812l117L469l874M343m904N587o435P526q986J1050j4222J9785
68A1699l2418J18213J3843j04851P5141m5191m6366M4722K4463q0184n276L206
80b2999m3694K1666O8829p4200q0629N0121K3443n6710O0130J02365k1711l2620
92f009N1348M691j6146M9473J322p5757P731L6695n4116q616R1678l806q8594
105a0106m742J2844n7530r254L7245k7022k0826L6701j4385k2375Q1403N6453
117E8406n5537q370N3699k8900m2595N3960L6895k9199L847J1061l2059R695L5409
$$ y = [0, 0, 0, 0, 0, 0, 0, 0, 0, 0, 0, 0, 0, -6, 8, -8, 8, -8, 16, -16, 16, -24, 24, -32, 38, -41, 49, -57, 65, -78, 89, -102, 115, -133, 150, -167, 191, -215, 239, -266, 298, -332, 369, -410, 453, -501, 553, -610, 674, -743, 817, -902, 992, -1095, 1209, -1335, 1477, -1640, 1829, -2045, 2298, -2606, 2981, -3454, 4072, -4914, 6136, -8086, 11699, -20719, 97494, 111337, 6486, 81627, 36436, -9930, 34792, 59255, -20929, -26205, -22999, -66693, -45027, 23802, -50398, -131027, -80906, -57463, -114173, -54043, 48322, 26611, -6009, 45339, 50030, 33884, 83357, 84679, 8922, 16653, 53348, -768, -9384, 82294, 78488, -10106, -14848, -2004, -59534, -68788, -31543, -58565, -79391, -42690, -57075, -79450, 1953, 58406, 2869, -5501, 48198, 19298, -23297, 30663, 67558, 38359, 42206, 53267, 21208, 30903, 66312]
130F6312m5543m9859K4052j9670o8539K3421O4139k0961k5241L2699L387j6113
142c1916L0378J3885k4337J5505J6658l7135Q316P2125O253m0312J9622J6678
154F5720m6461k1523J7642j7064k1694N746j7577j6121L6882J5557l6780M970
166c0703L2988k9475l2518L4775K7358j3921J1039K5099N88J2323K0628j6337
178D1844j1218J8333k2151m8139J0876K8755k4085j7844K3092Q72k4087l02J699
191b2355j0780M620m12k0365J2805M0874K079r669L2526K1997k3674j1010J5920
204C2556k698j4572k114n494k661J2888k985j9211O892R644l0832k7038J2849
217c2776O255j7945J007K1032J0958O956R597L744R297J1337j2190j6411J4866
$$ y = [66312, 20769, -29090, -5038, -24708, -93247, -69826, -5687, -26648, -51889, -19190, -15803, -31916, -1538, 12347, -11990, 3515, 20173, -16962, -8646, 63479, 69732, 29420, 49042, 65720, 19259, -2264, 15378, -1686, -23380, -17634, -35211, -51332, -14450, 1107, -35673, -30703, 2285, -27190, -59708, -24933, 2425, -11496, -457, 24642, 25230, 37553, 58181, 41844, 30626, 48959, 26808, -21331, -10455, 18300, -5785, -23629, -537, 335, -23752, -24054, -22355, -33135, -28515, -28927, -49292, -36487, 4387, 6466, -3203, 29323, 51320, 27646, 16636, 32556, 29858, 15286, 13172, 7678, 5017, 17905, 14920, -4291, 2601, 12245, -18587, -45625, -32776, -26521, -44466, -43459, -22427, -11469, -4513, 5084, 8828, 18125, 29462, 17272, 861, 15727]
230A5727J3483j5565m709K1501N145j6362q358k35q629j2508j5964j2525N511
243c3488Q735q209m97K4631J3199j1871k602J5146L580r896j829R091J1206N973
257B3169j341K959J2713N70k0648j3523L638p311k2184p517J0163M774m552j297
271b0387P652Q331l129j0829n34J1394K113p810O948K2091J0267m122J818J0009
285C3812L43j4509j4039k802O76q687j0862M035J2156j059j1393k058P230l575
299a0732j3792m207J0162Q278j512L127J6619J5846o5o272L106N068q543j5673
313A410l042P738L93p578l3R777J406j3003j1534O62J093r866p797P599J3525
328i250L899j036Q922J4435K355r595l374N991j39j0314m441R506R143l418o349
$$ y = [15727, 29210, 13645, 8936, 30437, 35582, 19220, 10862, 10627, 1998, -10510, -26474, -38999, -33488, -24753, -32962, -33459, -8828, 4371, -7500, -10102, 5044, 8624, -1272, -3101, 5990, 17196, 23169, 21828, 24787, 37500, 38070, 17422, 3899, 7537, 226, -21958, -29475, -19312, -14538, -19090, -20387, -12735, -4404, -7533, -18362, -18896, -7502, -5389, -13199, -6251, 15840, 26107, 21985, 23803, 33812, 34155, 19646, 5607, 2805, 3481, -5206, -16068, -12033, 123, -936, -12329, -14387, -7157, -10732, -24524, -28731, -18569, -10291, -11803, -8676, 7943, 23789, 23724, 17452, 20558, 25626, 17083, 1410, -1632, 6106, 6499, -1079, -1112, 8665, 10071, -2932, -14466, -13804, -12711, -22577, -30374, -22775, -9250, -5351, -6387, 2535, 16970, 19325, 9730, 6356, 12347, 12208, 1894, -2547, 6959, 16102, 12684, 6335]
343F335M189L041j0838j6510m365M498l266p623K784J3562Q254k772q81R435N766
358A1609q095q114N787P705l316m301Q253J1830M81p967l703R04o006j4954j0360
373b0247M724N504n496l122J0983R969m888o483M477N543k977n791J391R939P366
388A0892k468R77J1950O087j1449j0480K147k085j2822p968L922N511n4k588J335
403g093O367J769j1338p738Q926N278q193L45J4922P589k304K044O934L097l253
418A7352j0094q035L140J237j0195j823J3392L236j2121l027O984k852r774m114
432a6694N61L039L828J08L662J5131O790j0500k030J1344k040j3051j42O932k813
447D125l711K085L274M964N80j2345q982N215k669j4308K389J5883j078p595P965
$$ y = [6335, 10524, 13565, 2727, -13783, -18148, -13650, -16916, -24539, -21755, -8193, 61, -2711, -3592, 5843, 11609, 3514, -4600, 1187, 8892, 5576, 1275, 9528, 21358, 21839, 13872, 10169, 11073, 5067, -9887, -20247, -15523, -10019, -15515, -18637, -7654, 2315, -2573, -9056, -4579, 964, -2013, -7804, -6413, 3526, 10892, 8424, 9401, 21351, 27438, 15989, 5509, 7656, 5571, -7251, -15219, -11297, -5786, -5840, -8428, -7093, -726, 1043, -10295, -18033, -9107, -3829, -12022, -11677, 3245, 10834, 8530, 10574, 17508, 20605, 17352, 7258, -777, 2363, 3600, -6595, -8418, 4974, 8210, -3911, -6938, 46, -2806, -12580, -16694, -16133, -13094, -9266, -9158, -5496, 9635, 16425, 5925, 3895, 15239, 13199, 148, 6, 6938, 4125, 414, 2499, 5773, 10737, 11317, -1028, -10010, -4795, -7464, -21772, -19383, -3500, -4578, -12173, -4208]
462d208J0417J173k88j816n140K015O09q527L068J7239M06j3610L132J0389p777
477G082r959J769j986p523k661j029K831J3688N027j1053k58J1295o224j1758
491a0759Q229R330q612n058P210N876M471N240n249o226L039o937j4913N607J3851
506E099p841j0610Q928P852m675J609M190m096l620l189q169M585J7434O20r957
521a840Q034R858j0395o323R912qj1773n143p83K35Q810N053o727K241O899j1146
537c096j1080J0761Q199j1794n197Q855K751J163P490L305j369J062q351j2368
551i669N959J1321q512p500J0381L923r599K093R015j970p309n137p195J582J0553
566b064K15m048J0791O957j2123k806J3182J359j1555l424J325k130K872M751
$$ y = [-4208, 6209, 7382, 7094, 5278, 138, 2153, 2762, -5765, -2697, 14542, 14948, 1338, 4470, 14859, 7082, -2877, -1108, -3094, -10617, -13278, -14307, -11476, 2212, 7239, -3814, -4072, 7223, 999, -10759, -2530, 6800, -1812, -6870, 340, 6216, 10687, 15927, 10678, 4452, 7491, 554, -14359, -8752, 5099, -2742, -13352, -4424, 3428, -1247, 362, 4552, 456, -3164, -6353, -14522, -9937, 7497, 8117, -1840, 6194, 16052, 5657, -666, 9246, 9238, -2535, -7678, -8461, -8226, 584, 5637, -1090, 1151, 8050, -3096, -14176, -3415, 4784, -7010, -12207, -3352, -601, 562, 8052, 11357, 9988, 11050, 2699, -9669, -3710, 7611, -901, -8401, 1980, 5903, -3696, -1603, 7412, 5442, -1867, -7004, -14199, -12617, -2064, -1849, -5897, 4894, 11851, -272, -3078, 10104, 11463, -92, -3516, -2191, -4321, -1449, 3302]
580C302J77M682L309j1609r255Q694M120j2249k985Q566j278m046O849Q055J499
595G831j69o227p735L904N475o611j471J1120J192r794K539J1166q79p620l658
610i37l924k521R22q04J029R330L202j0106r54J0884j07r734k67L606l297k771
626f449L857N437N596J739p017l739N731o90j0301j7P214l254o973M609Q859J571
642F173k058k712k363n0j583n369J703R139o9p304L447R796j447o387M88R42m053
659a707m241j273L514O211P17m673K153O987k960p840J195L914m760n901L296
674e368O339L183o08j519J548K017l883o763J612M778l646o128M464P417j76k788
690D79J630K342k174n263l490K876L944j651k905N437P127k392m885K095K602
$$ y = [3302, 3479, 8161, 11470, -139, -9394, -700, 3420, -8829, -11814, -3248, -4526, -8572, -1723, 6332, 7831, 7662, 1435, -6300, -2396, 3079, -3532, -5003, 6117, 7309, -2485, 54, 11220, 10341, 2721, -937, -4861, -7382, -6460, -7264, -6235, 3095, 6297, -3809, -4763, 6121, 6014, -3720, -3987, -381, -3678, -6449, -2592, 2845, 8441, 10180, 3163, -576, 5155, 4465, -5836, -5853, 1361, -1893, -8866, -4257, 4602, 6173, 4115, 1403, -960, -1010, -2593, -7962, -6259, 2880, 2811, -4493, -1046, 8750, 7303, 916, 1404, 2346, -1707, -5948, -7221, -3707, 2504, 3221, -1452, 701, 7688, 4728, -3112, -1917, 1997, -2763, -8664, -5368, 971, 4154, 3546, 2027, 3575, 5592, 1709, -5054, -3442, 1336, -2310, -8438, -3974, 3443, 3267, 479, 2109, 4451, 2277, -2986, -6476, -3600, 344, -1307, -4212, 1225, 8352, 5960, 1075, 3170, 5772]
705E772n042o198k01L859J463k365k78M800L361l627m532K476K750n365n231L289
721e069N865J56j361L091N017Q6n446l210K250P11n444l095M660M827k279k485
737a726L659L554l692n626p63K617q31l535N88O160M084k513j221M232K119n610
753A496n222J817L003k306k434K502N754N73l976j198K985j026n961l361L501
768c853K526k315r92N073N143j608l960J319K383k293n081n04M676J690k532j37
784d65N294K007m357m118J306Q16m070m369K545M996N17k076J882N134k0n054
800c2k105K620P74l593j818M517M303j191k323K328K660l365n964j217K686q69
816b589l645L85N623K760k172j478L176J773m190m116J810L914q77k056K931N246
$$ y = [5772, 730, -5468, -5669, -1810, -347, -2712, -2990, 1810, 5171, 1544, -2988, -512, 2238, -3127, -8358, -5069, 796, 952, -409, 2682, 7699, 7785, 2339, -871, 1379, 2090, -3354, -6449, -1789, 3038, 759, -1726, 1933, 5487, 1795, -3831, -4594, -1977, -2808, -6343, -5755, 405, 4489, 1976, 755, 4987, 7106, 1496, -3726, -1909, 1094, -1212, -3646, -1144, 4610, 5183, 1207, 9, 2994, 1968, -3993, -7354, -3853, -1327, -3642, -4634, 439, 5582, 3974, 14, 1333, 3716, 1423, -3658, -4162, 514, 2204, -328, -465, 4829, 6836, 2479, -1639, -333, 483, -3587, -7956, -5411, -415, 102, -1974, -92, 5042, 5022, -32, -2137, 483, 1257, -2336, -4154, 363, 4666, 3475, 1152, 3480, 6140, 2775, -3189, -4406, -1720, -2589, -6234, -5849, -226, 2534, 362, -1116, 2060, 3833, -357, -4473, -2663, 1251, 374, -1682, 1249, 6495]
832F495J58l568j499K517j244n760l003K507K319k264j427M126L684j878l847
847b684N52K815j824m273J029M970K181j565M47M840K254m272l732P81J242l432
863f71m139J575M184l36l151J330L270n86n469j832K627O64k343j145N195M491
879C664r3k139K813K827k300m812l15K747m32l192Q4L891J660l026k820J415Q48
896H20m150m670J541L723p50j943K992N507N68k688j19K347O78l556k562L160
912H98L614k279j790L214L327l584m740LJ188k414l773l41L069K358j573n52L983
929F08L494m075l165K766K375k788j588L259L403L56j535J18K102M49n005m319
945c545K100J137m285j555M872K461k704j279J931J339q75k634r13K950K207k471
$$ y = [6495, 6653, 3085, 1586, 4103, 2859, -2901, -5904, -3397, -1078, -3342, -4769, -643, 3041, 1163, -2684, -2132, 683, -1141, -5414, -4385, 585, 2766, 1201, 1648, 6488, 8742, 4470, 738, 1519, 2761, -671, -4810, -3235, 949, 613, -2538, -1208, 2062, 1476, -3993, -5825, -3198, -2534, -4877, -6022, -827, 3664, 3571, 1432, 4245, 7072, 4772, -40, -355, 2392, 1960, -1232, -1148, 2743, 4403, 1377, -1443, -28, 820, -3330, -8000, -6459, -2736, -3486, -5429, -2437, 3070, 3638, 950, 831, 3178, 3856, 300, -2262, 898, 4512, 2233, 443, 3657, 6984, 3400, -1340, -1337, -149, -2563, -6336, -6677, -3608, -1250, -2823, -3375, 608, 4102, 27, -3138, -372, 2003, -785, -2373, 886, 4289, 4645, 3110, 3228, 5330, 5779, 774, -3545, -1445, -308, -4593, -6148, -1276, 1185, -1519, -2798, -867, 472, -403, -3037, -3950, -1000, 1207, -1264]
961a264l88O913K950m336k190L286n02m862j490L73L73J82j817p98M400K332n191
978b029k912M319k25n205O58N184P56n47J343J567K435J042k895l027K880k45
994C099o405n11O330N40n066J236K723k043k649n40j080P50O31k877J26P191L120
1011D575m762J317N763k583m800J841J980j406r35k57o03L095J742n275j274M090
1027B508l282p899J909N182k439j959L589K012k11K330m51j018L286J1o294J343
1043a383P284j571m445M621L000m723k677J492j906j946k51l430j270N725L00
1058a180m608L881N763m511m934N085K199l044O39K111N4K476K089k761K34N168
1074H661m469p853K797L475n715k651N208L78l159J070P49j316K317p64n442J943
$$ y = [-1264, -1652, 5261, 8211, 3875, 1685, 4971, 4469, -393, -1883, -1510, -1137, -955, -2772, -3570, 830, 3162, -2029, -4941, -622, -847, -6052, -5394, -210, 546, -1, 1342, 2909, 5344, 6386, 3491, 464, 3344, 3099, -3306, -3817, 2513, 3053, -2013, -777, 1946, -97, -2746, -3286, -4366, -3616, -2985, -5862, -5736, 1455, 4575, -187, 1130, 6893, 4310, -490, 1351, 3331, 1925, 990, 733, 130, 3225, 4967, -308, -1582, 2508, -774, -8673, -6764, -1582, -4021, -5980, -2391, -379, -590, 1740, 1289, 271, 3557, 3568, -2726, -1383, 5901, 4330, -115, 4506, 7506, 2783, 106, 1598, -308, -2254, -2505, -5935, -7205, -1480, -1180, -5788, -1907, 3856, -655, -5589, -504, 1695, -1349, -710, 1401, 1455, 3931, 6020, 3259, 3493, 8661, 4192, -3661, -864, 2611, -3104, -5755, -547, -169, -3328, -2258, -1509, -2825, -508, -1272, -6714, -4771]
1090d771O311k519k801P537M153n576l65L964j715k178K87k411j695L372j225
1105C68m250M035M612o520m440M993L75n595R12L764o96O13K625n10J481N093
1121F860l215n019M101K831o609j153O360l44m539J358J580k635O15q89m305P67
1137d236L101m095k278P631K818n119R67N359j732k952J795O3r21K205r80k375
1153g49M210L355o083k352M967j754o831Q09L579k436j606K373K04J072L038j580
1169B16k754M382R20n508O83O377p98l607K806K973k316q90m14k430r2L59m353
1186d446j178N252J96m718K056M801k616k965K304R61j258Q20K10J98L925J638
1202E180l323L07M478k433n326J188K486l423k545J922P28j42k9j298n39K491
$$ y = [-4771, 1540, -979, -3780, 3757, 7910, 2334, 1969, 5933, 4218, 2040, 2327, -84, -1779, 1593, 368, -3882, 153, 4765, -1755, -6195, -1202, -827, -6422, -5510, -1746, -2442, -1829, 796, 286, 1767, 6860, 3645, -1374, 2727, 5558, -1051, -2204, 4156, 3812, -727, 631, 2211, -424, 191, -698, -5003, -4236, -1135, -5230, -7508, 123, 2941, -2178, -1211, 4148, 2416, -536, 1259, 1322, 401, 2606, 1626, -749, 3461, 6816, 733, -1619, 3348, 1594, -5237, -4428, -849, -3285, -4891, -2518, -2314, -1242, 1796, 216, -2538, 1844, 2764, -2744, -2061, 4316, 3518, -89, 2717, 5690, 3374, 2484, 2070, -360, -452, -93, -4446, -5624, -372, -176, -4894, -2838, 1963, -653, -3618, -1314, -353, -1611, -791, -581, -383, 3542, 5180, 1857, 2164, 6642, 4209, -1117, 71, 2557, -866, -3411, -1489, -761, -903, -932, -2230, -2769, -278]
1218b78r76m186J066N051j789k005M102L325j276o13J355l31j34j179k444L25
1234A3K730j475l415K258K685l115l242J733Q08k568j517P09J411J884K88o52
1250a465K658K867j813k456K407J638k792j681K287J550r14n05l14M68j84k856
1266a105k364J191R20k685j376K921K696j214p43K128J203p32j692J37J717Q47
1282A849j107k72K977J407k316j614J550j17k975k215O25R06r00j208P89K509
1298a12P79k279p16K227P78k622m54K847J470j042J23J853J616j007k463j39P41
1315A600r32k805o61K589M88k186k49J999Q46k289j255R85R43n72j247J719L162
1332B135M35j354P27K175n41k546j249J284J05k102p03J516J470j432j430R5J425
$$ y = [-278, -1254, -5440, -4374, 677, -1112, -3117, 985, 4310, 3034, 2421, 3776, 3445, 3311, 2132, -312, 13, 2743, 1268, -2147, 111, 2796, -319, -3561, -1828, -1020, -3588, -5105, -4396, -2985, -1101, -813, -1465, 1193, 4060, 2247, -209, 2198, 3836, 1044, -637, 1650, 3200, 2286, 1781, 1467, 1935, 1751, -1105, -3469, -2278, -1358, -4043, -5419, -2498, 198, -1016, -1759, 369, 1572, 840, -852, -715, 1002, 1849, 742, 470, 3447, 4854, 2538, 924, 2474, 2357, -618, -2833, -2208, -1302, -2202, -3410, -2621, -112, 667, -1612, -2328, -101, 677, -1945, -2399, 448, 1918, 876, 999, 2852, 4468, 3461, 998, 859, 1600, 668, -2137, -2798, -209, 279, -1907, -2156, -157, 689, -1600, -2855, -1870, -927, -1499, -2746, -1027, 2135, 2570, 1216, 1943, 4118, 3577, 1031, -218, 1066, 1171, -931, -1634, -118, 1352, -80, -1510, -1415, 10]
1349A0j011k776K11K191L01j385J349K784J284j167o83J384P94j689j787N66J401
1366A777m73j793N25J753m68k410q53P61j00k151q14J743J600l77n04J943K375
1383B534p83j639N76J580p78j402M23K038J49r57r11J104O38k607k387M29J130
1400h63j536j829J449K134l77n42R67J036N30j145j311J550J978j105j267K536
1416B205K300j739j937R36R79k094k190j99M05P06j491n50J898J603k091j350
1432b609J997O57j668o26J745J336r1r4Q45J553Q23j620k204J330P30k788j406
1449b090K277N26j891l77J456N09j078j079p50M99J270j432o03L503J605k396
1465e1k4K908K83k269k13K44n06m6q33k96K018J164k590j673K286J22l445LK389
$$ y = [10, -1001, -3777, -3566, -1375, -1074, -2459, -1110, 1674, 2958, 1791, 1108, 2492, 3286, 1597, -190, 376, 1777, 1304, -489, 36, 1789, 1321, -1089, -1942, -1181, -1281, -3432, -4246, -2503, -903, -1280, -1784, 159, 2534, 1751, 112, 688, 2268, 1490, 88, 511, 2549, 2698, 1741, 830, 1934, 2572, -35, -2422, -1993, -863, -2399, -4228, -2779, -645, -1022, -1564, -597, 439, 969, -176, -1487, 63, 2041, 936, -331, 2205, 4505, 2766, 829, 1765, 2744, 650, -1540, -1739, -1334, -628, -2119, -2669, -771, 832, -1259, -2609, -612, 45, -1623, -2249, -504, 832, 741, 647, 1492, 3045, 3868, 2248, 44, 1374, 2104, -684, -2090, 187, 713, -1178, -1555, -99, 410, -668, -1747, -2497, -1998, -728, -2160, -2763, 740, 2345, -51, -75, 2833, 3116, 847, 634, 878, 372, 326, -507, -803, 1215, 2379, -211, -1884, 402, 524, -2921, -2918, -529]
1484e29o58j324J097J218R08J505j058j122J752N30l296l4L550o68l025R88K212
1501B046j103n30M01j549k19j47j795m32L390J122l067N39L369j018k150K017
1517H74J255k244k21L04l22K016J447k293r40K580j080l849R33K654k483k021
1533c390J774P85m85J648Q4j091J179K38l096J060L850j080l012K461K429k404
1549I50j61J645p48j606R5j654j066K737J80k910J166K953k534j911K790J264
1565A190k779k03J344n71J122J682r93L41K607j650l683K441K333l349k041K647
1581D38j9k300J616R90j432Q31k17l009N87L399j749k425L847J425k873M56L029
1598B594m31j545M08o31j027J688n2k162J776K239l186j695L248k3l155p1J314
$$ y = [-529, -1187, -2511, -1414, -196, 712, 2217, 1159, 37, 1789, 2319, -977, -1011, 2539, 1871, -1154, -166, 2046, 943, 413, 814, -735, -954, -1101, -2896, -3328, 62, 1184, -1883, -1344, 2025, 1007, -1143, 874, 2129, -115, -336, -32, -354, 1662, 3109, 816, -124, 2456, 1376, -2473, -1540, 1114, -1369, -3390, -1616, -831, -1316, 332, 416, -675, 504, 742, -2354, -1294, 2556, 1476, -1536, 925, 3354, 950, 789, 2434, 1686, 80, 175, -1479, -2545, 192, 372, -2538, -1372, 1581, -953, -2864, -74, 1190, -1589, -1792, -448, -1019, 103, 1785, 792, 1133, 3740, 2090, -1593, 848, 3181, -168, -2209, 438, 419, -1881, -265, 725, -707, 124, -93, -3102, -2515, 884, -865, -3290, 557, 1982, -891, -435, 2594, 2163, 618, 1026, 395, -632, 1056, 1004, -1158, 618, 2857, -329, -2024, 1224, 1201, -1954, -2025, -711]
1615g11r25j54J291k81Q77K164j677k079K561J566l283j030L093k40j852Q54J763
1632A937p78l18j40j910L10J702k407j378L012J032k939M33L297j082j639J012
1648A44L96j221R95l86q46K365J028k283p10K982r12l103L93J698j474r37Q21
1665a050M35K18J282j156j045K142N67k898J13K364m65j893J667J746q31n35K30
1682H91m01J51K01k004n29K162m67k095Q93K558j022j446R53M15n92k51N0m6J219
1701F40M88j256O51K289q62k603P47J491j759j246R01N72o49J77j29j4J134l10
1719B62k179O24J907j482j234K003J542p96n86Q15N79o0n79p21j43J028q82j207
1737a109J126J445j239j290J055L10j364j68LM66J27j67m22J244J417o90j226
$$ y = [-711, -1636, -1790, -499, -780, 97, 2261, 584, -1495, 1066, 2632, -651, -1681, 1412, 1172, -680, 174, 1937, 1159, 841, 701, -1209, -899, 803, -1604, -2982, 30, 1062, -1877, -1444, 1853, 771, -868, 144, 540, -681, 314, -72, -918, 1447, 2475, 192, -518, 2464, 1552, -1551, -1158, 540, -934, -1871, -1050, -615, -397, 885, -271, -1316, 826, 1393, -1505, -1392, 972, 507, -1386, 281, 2027, 1196, 661, 891, 490, 641, 842, -1162, -1691, 471, 4, -2091, -1198, 1360, 338, -1108, -155, 260, -332, -583, -533, -579, 640, 1128, -128, 523, 2812, 1950, -653, 94, 1585, -174, -1420, -519, 53, -596, -419, -548, -562, 572, 262, -1917, -1293, 614, -868, -2102, -99, 1443, 647, 61, 876, 1455, 1395, 816, 95, -48, 980, 98, -1109, 17, 1462, 223, -1067, -12, 298, -1066, -1234, -1231, -765, -638, -805, -1227, 17, 1434, 744, -482]
1754d82J182Q37j396j038J518N58o37m82J1J073J44j168r35O13M58j650r38J304
1772a028J292j004k35J236N60o85m17J84O49j15j166J06J648O79j102k55P98K40
1790A385j523q98O06j09k19o22K31J410K46j056q5J143K23j501k03J183K75p91
1808c05q1J074R16n22p88k9O96m80j371l29J192q4r74K50R86L43p35m39N37M77
1828C34p99q01Q36R30M2o15N36J183m43q53o39O80O2j188n17J009N73m06q69J003
1848E8N08n23j090j45J030J14j013K29J449M70n95nP74J79o42j108L67P05q99
1867a37p16O77P17l76r29q1O27m2q71m49O60P79n97o4J269P75l27p88M92P33o57
1888F95p62j63J004K24r37j41J170j62r42p13M03j5o95j092Q16J047o1n86N05
$$ y = [-482, 700, 1537, 141, -897, 621, 1179, 542, 60, 71, 1144, 1288, 120, -815, -202, 256, -1394, -2332, -1028, 264, -740, -975, 261, 821, 136, -281, -97, 552, 437, -729, -623, 1025, 1704, 602, 347, 1145, 1385, -138, -1036, -430, -539, -758, -1380, -1149, 261, 507, -549, -634, 509, 732, -769, -972, 211, 486, -305, -386, 688, 1604, 1082, 294, 265, 961, 481, -890, -1219, -27, -111, -1085, -835, 151, 494, -241, -680, -143, 334, -465, -1266, -430, 500, 542, -73, 463, 1646, 1203, 350, -289, 391, 453, -735, -1252, -243, 330, -76, -945, 58, 566, 43, -1047, -1192, -162, -48, -1061, -832, 617, 1087, 492, 487, 1261, 1440, 798, -310, 57, 762, -137, -853, -176, 541, 165, -764, -845, -218, -260, -1131, -1580, -920, -141, -738, -802, 467, 1242, 915, 127, 619, 1352, 695, -67, -230, 774, 998, 61, -80, 1090, 928, -14, -727, -324, -339, -1034, -2126, -1310, -263, -324, -910, -405]
1907d05J287r6q94p8O79K69p21j03O70Q14m42p17L93O63j032j055J0N13l50m15
1927a010j13N71P10p79p7P97P65j296n76P82J012m08m30L52Q81J19p55j70M27
1946H02J62j287n65O10K23o84k13R06M06q17n58J21Q91K05j103j10J123M43o20
1965f5J10J231L86j157l10M09j24n38j68K08L39j86o60j92Q64L39j338m70Q15
1984e07L35p59o1J071N92l36k82K58J025k17r18m67P58q8j023J05J182k50p46
2003c28k10M58j14m12k51j2L57K45q10L89J742j70p25p5Q76l40n41j25P16o6N1
2024F55n43J72P58k46j320m6M79m31j188M16J415q3r17M76N79L1K66o39O8R13
2044H15o16p11N41J445l51p94L88J14n44m59l56J92J15k95j011L93J096j75n82
$$ y = [-405, 882, 786, -108, -186, 493, 762, 41, -62, 608, 1422, 980, 263, 656, 1319, 287, -768, -758, -245, -595, -1010, -1123, -552, 158, -621, -698, 99, 864, -432, -1008, -226, 786, 378, -52, 300, 1181, 1300, 545, 375, 802, 964, -323, -888, -278, -55, -739, -952, -46, 360, -457, -1015, -894, -3, 202, -901, -1011, 112, 555, -65, 45, 1276, 1662, 505, 195, 604, 480, -58, -226, -18, 321, 135, -525, -717, 147, 486, -852, -1322, -507, -172, -931, -992, 79, 671, 335, 53, 311, 1336, 1119, 201, -266, 492, 404, -619, -514, 668, 418, -328, -538, -80, -194, -606, -857, -869, -512, -267, -1077, -688, 1054, 884, 159, 84, 960, 620, 79, -46, 670, 604, 655, 112, 284, 1042, 796, -524, -570, -91, -522, -1710, -1294, 121, 38, -879, -403, 176, 207, 473, -166, -98, 815, 199, -512, 29, 1474, 1123, 329, 717, 831, 287, -172, -528, -336, -221, -516, -1527, -1134, -38, -213, -795]
2063g95L65P04n62n77O71M77P4j03L9Q01L16j61n66L43N33j303r67K74M91k59
2083b05p48L53M50l24o02J46O67k1l90m64P67J070m12m24Q73Q25o83o65O1P89
2103A063p13l53k28M27L05m21r43R33L81j121m62M62L86o92K7Q69L09k2K4m14
2123a83P24J75l48o72P50N48q66k86Q18J99o21l35K40m3m97l83j09L38L16n38
2143g73k15J098M39p19M6N64j27l25k21L93L25J30k78j19M95K69j267l53O33J69
2163A64j117l05P60N85l74k41N31L61l50m32L02O13K99j248J73Q87L75o33K60
2182F10N06l33o59p17M38K70n80k24O6M18K17q26L72O43Q4j121R1O82L83J8j78
2203A60L26N66j27p50K69N97m41q77o9L62J04p12L04M64J1o37l56M44L99n04o45
$$ y = [-795, -430, 274, -288, -865, -194, 283, 357, 254, 293, 1094, 1410, 1249, 683, 1026, 1559, 256, -711, -437, 54, -205, -953, -600, -150, -474, -1076, -930, -263, -284, -674, -1138, -371, 699, 287, -137, 736, 1561, 878, 213, 274, 1063, 350, -3, -231, 196, 501, 80, -863, 70, 451, -670, -1132, -670, -284, -976, -949, -80, 229, 207, 231, -183, 541, 716, 368, -304, 446, 994, 128, -158, 660, 859, 238, -97, 143, 100, -397, -780, -889, -551, -235, -773, -988, 110, 549, -170, -124, 440, 313, -12, -233, 160, 485, 615, 337, 218, 713, 982, -285, -638, -5, 164, -953, -1258, -498, 87, -287, -528, 3, 364, 14, -418, -116, 497, 796, -452, -279, 608, 983, 350, 610, 1116, 783, 124, -593, -155, 115, -465, -689, -623, -205, 12, -814, -442, 201, 285, -836, -745, -63, 320, 338, 160, 486, 1052, 925, 175, 444, 1041, 600, -277, -346, 16, 120, -592, -288, 176, 187, -450, -806, -362, 37, -467, -1112]
2224a112M48J051j84o30Q59Q97m79q91K48M05L9k48j95k74O64n02n79K26M67k96
2244h6r99J64N33l60l22M51N19K15l08L7O24M17k38q13N50L89j84n69M13L64j33
2265F64p33R7j2j00l52m61M83M18n30n03P51M60l95j95J33N70l71k20J02P53O5
2286F24m60J03K93K49n49k10oM31m91q10K84N83l24l24M75J04K6l93k97O98K18
2307B24m12k79Q52J93j85k55K39M21k59o64r0O02m78l26J19J97L80o47j3K96J81
2328I6k75n02K64N65j71m01L87O16M9m49q6P02l52n91j06L78M51q24j58L06M39
2349C38n34l79J36M18k12n84M28M56J25l14J06L27M89m91l21J54O78p79l76K36
2369i9Q46o46l17J67J80l8q17k79O71J46k90l02O45O87n83l49P64J83l15k11k12
$$ y = [-1112, -664, 387, 203, -427, 432, 1329, 850, -41, 207, 612, 651, 403, 208, -66, 598, 96, -483, -257, 210, -86, -1085, -921, -388, -748, -1070, -619, -100, 115, -193, -156, 468, 885, 647, -166, 384, 773, 589, 20, 433, 797, 664, -69, 28, 16, -84, -436, -897, -414, 4, -526, -1029, -278, 182, -213, -408, -275, 295, -76, -296, -194, 559, 624, 164, 267, 560, 809, 260, 50, 44, 475, -16, -826, -542, 41, -283, -607, -132, -28, -2, -395, -692, 6, 224, -188, -467, 385, 578, 393, 138, 377, 798, 539, -125, -215, 387, -91, -417, -298, -101, 279, -368, -381, -85, 96, -179, -681, -417, 148, -23, -424, -37, 579, 628, 179, 93, 795, 443, -148, -254, 124, 575, -249, -407, -101, 338, -196, -575, -439, -21, -233, -817, -389, 67, 192, -122, -16, 311, 800, 309, -12, 142, 820, 41, -335, -99, 747, 101, -216, -49, 131, 93, -724, -1003, -332, -186, -476, -778, -133, 554, -29, -378, 386, 569, 254, 43, -169]
2390a69R27l59m38KQ53l48n19j61K69R0m46o27K63O02l75q9L04N33m09l35J61
2411b71O40j12l06j98M08N20l64l59L74M84k43m50j14K77l61o46J31N63q6m26
2431e39j23L11N11m51j52J32L74k74k11M77M86Lm46K11L07k64k85j75J67K57m21
2452a05n3j95P66o61k69J61O17m42n23R7L78N15m47L2M24L22m11j25K61K10m83
2473F9n85O32M16l97j5j65L64k2m59l41R5O10m76k25L32M97m02j80P20k14j01
2494A53q8Q0J31J33k72o20P66K99q23Q1N70k15o43k26K17N10l94k1M4L40K43l33
2516f8k42N82K03o52K2M57J05m29n5N81l90l6j66l3m4M43o78NL21J50o55R0N39
2539E0j8m1J11J96k47M7l00q8P64J64o61J24O29r1p73J72Q4r7l13J48n0K37m7
$$ y = [-169, 758, 399, -39, -37, 816, 468, -51, -212, 57, 147, -299, -926, -663, -61, -436, -525, -221, 312, -97, -432, -271, 369, 257, -49, -247, 161, 681, 317, -42, 332, 816, 573, 123, 9, 286, -75, -721, -590, -27, -113, -539, -662, -351, 160, -291, -443, -311, 63, -211, -422, 55, 541, 544, 98, 309, 616, 352, 67, -108, 59, 316, -105, -158, -353, 413, -248, -517, -356, 261, -181, -704, -607, -229, 286, -161, -129, 295, 617, 206, 81, 342, 552, 69, -516, 116, 532, 135, 120, -45, 319, 297, -162, -503, -408, 202, -274, -499, -167, 330, -72, -252, 468, 254, 153, 65, 145, 276, 409, 137, -483, 283, 582, -241, -160, 410, 195, -448, -674, -457, 53, -341, -362, -318, 22, 265, -68, -310, 272, 475, -177, -155, 302, 407, -22, -77, 504, 114, 78, -88, -121, -165, 278, -400, -395, -74, 76, -579, -489, 50, 32, -9, 102, 298, 51, 98, -202, -290, 474, 638, -23, 101, 730, 639, -134, 38, 122, 25, -288, -140, -190, 47, 0]
2562@m92P0M92l7m44J54M43k79j71L19M18k08o8K25J98M9m61l79K85N32q25l79
2584e58L38N41n98k67N82Pm36Q9j14J72K33n3m34N47O34m15k38L43K90m16n02
2605b55J93K01M0l64O4L35P9m24m48L45L27k75o97P69J73j14p0L08K44j18l3l73
2627i3M8M82l64m31M15M03q98k0N90L63m58k98l48M69l9l76L86J91K88m61o6L05
2649H8L82l94q3K91n7l02%%L01j60j68l1K08K56n15m22L87M58p06Q5N03j9K34
2672C36l10M8K74p7m99K76J51K55k93m03Q44J25p33k45M47m00o9M7j30K17P9l75
2694d35J84J53K85o12M77K29k92j92m9O27M8j34J12k30K17j86l96Q3M82k04p00
2715e33R4L61J58n82J30J36J26l9j08q4O40r4o50K81L65K12l49M3J06J39k77l13
$$ y = [0, -492, -422, 70, 33, -411, -257, 186, -93, -264, 55, 473, 265, 197, 422, 620, 669, 208, -171, 114, 646, -179, -558, -220, 321, -277, -544, 38, 45, -391, -302, -416, -244, -11, -64, -498, 49, 683, 268, 30, 373, 663, 247, -255, -62, 139, 179, -185, -121, 214, 293, -131, -579, -234, 93, -182, -879, -110, 63, -51, -121, 187, 431, 313, 280, -93, -45, 437, 73, -358, 57, 460, -438, -458, 132, 495, 37, -261, -609, -140, -179, -555, -169, 22, 310, -151, -217, 88, 470, 76, -7, 284, 227, -75, -75, -75, 226, 66, -102, -133, 75, 331, -184, -606, -219, 239, -467, -382, 121, 102, 336, 26, 74, 348, 271, -228, 48, 199, 454, 161, -242, 602, 727, -6, -251, 196, -204, -273, -226, -356, -139, -60, -435, -251, -98, 187, -425, 52, 281, -11, -203, -252, 375, 423, 289, 401, 171, 388, 202, -194, -111, 371, 167, -533, -439, -78, 80, -502, -372, -236, -110, -149, -257, -341, 299, 205, -445, -164, 201, 413, 64, 107, 213, 352, 75, -238]
2737b38R7M00n0m71J84K95j54m78L01k4l92k12L79K97K44j67j99L73M6Oj8J4K00
2760D33l49M0o2M17k92M7N2q0j47k85k32K83M17m59k63L5O07j83k01K88J94k70
2782a0k34Q7M35k90J81q8Q6J47p1m30M42K7k11n83L02K34l34L6J03K92M6k08k20
2805b61M95o4l20p1K70L25l92P9M14j31r4j65J13j35o7k20qM01k35q5n6J48L22
2828B63m96j71J14K88M4j05k34O46q9o5m8J47K44q97K16L01k26J00l15P3L93m86
2850c03J86L39j57j35m78L74J33P6K3J25N5L1j21l03L40K49l43P9j22J15Jj30
2872C4l03L72Q0l23j82K15J63n42N6J11R5J70n5N8N5K63o42M84L41l00Q6j33K43
2895C46o6l72L9l5J77l60l1J02q2m2k69M61J5P8l61K38K93qk91K11K0L78k69r4
$$ y = [-238, -141, 259, 209, -262, -78, 217, 63, -415, -114, -138, -530, -742, -363, -66, 178, 11, -188, 185, 231, 237, 219, 233, 433, 84, 124, 62, 479, 187, 234, 286, 206, 59, -226, -458, -175, 242, -217, -480, -445, 162, -21, -222, 66, 260, -10, -244, -157, 278, -12, 169, 81, 167, 314, 243, -187, 255, 282, 71, -512, -210, 24, -310, -274, -171, 121, 167, -41, -261, 234, 170, -150, -221, 49, 374, -18, 61, 475, 344, 250, 85, 198, 63, -4, -224, -232, 169, -66, -151, -207, -59, 263, -233, -404, -290, -2, 42, -63, -297, 349, 260, 195, 147, 294, 538, -359, -143, 158, -68, 32, -283, -210, 183, -303, -117, 222, 65, -70, -548, -174, -41, 35, 58, 183, 238, 269, 148, -155, 185, 434, 91, 170, 48, 163, 164, 34, -269, 103, 183, -140, -322, -107, 56, -486, -430, -319, -224, -54, -109, -51, 4, 267, -375, 109, 450, 150, 236, 103, 346, 280, -92, -53, -88, 89, -271, -302, -200, -282, -324, -593, -132, -117, -39, -400, -162, 131, 123, -168, 43, 63, 441, 172, 78]
2919G8K17K16j00j77J36j40j20k87P6r2Q3l61P3K19L57l05q5K41J44k43j07L57
2941A80k2P2J7N5R4r1j2l21L27k77k24j13L68q6k0k76L03R5j66k72O6M79l03L14
2965A87l75M80j42k01J67j18L02j44j80J95p8k90j01K87KP6q1p5J04j8k03K5m0
2988b21J48j20J23J28J96L1l33J32kP5m14L98j30K06m18M6L76k3l23j01Q1K1j08
3011b32l42K15M84k35k89K11K40K60l24J60J24k3k38J16mK16k15l56P1K79K60
3032C78n20N3o9O0o03K40L16J45k33K8J29L93J0j65l15K74J42J61j51J01K29p02
3054i9j36O11l85k46K6j6J96j64k84M03K39k27j32k7L79l09k36K48M59l70J92
3075A22j33L76m6n5n08L60J50n46J87J46j35k14j37L24m1K8j55K9j89K60Qj48
$$ y = [78, 295, 511, 411, 234, 370, 230, 110, -177, -101, -193, -110, -471, -398, -179, 178, -127, -212, 29, 173, -70, -177, 180, 158, 230, 247, 302, 396, 305, 293, -28, 299, 22, -202, -315, 53, -33, -53, -329, -26, 69, -97, -369, -303, 176, -127, 187, -188, 292, 150, -51, 116, -2, 300, 156, -24, 171, 93, -197, -298, -11, -9, 67, -14, -89, 15, -3, -206, -181, -221, -73, -193, -70, 58, 254, 285, -48, 84, 82, 157, -257, 141, 11, 217, -201, -155, 221, 198, -125, -226, -145, -124, -232, -574, -359, 125, -110, -399, -188, 52, 312, -12, 148, 272, 249, 11, 127, 123, 339, 124, -232, -161, 118, 378, -142, -89, -158, -98, -701, -461, -145, 0, -233, -205, -76, 317, 327, 162, -153, 121, 263, 424, 273, 374, 603, -99, -235, 376, -9, -255, -229, -245, -49, -213, -497, -94, 145, -82, -214, -241, 138, -171, -407, -159, 300, -70, 122, -11, 365, 319, 264, -244, 116, 266, -280, -93, 53, -82, -296, -433, -109, -150, -122, -277, -248, -437, -177, -169, -317]
3097c17L31q6M6j27M64L41m94Kk17L74l66k49K26j04L13O0l72O5K21m30k85K50
3119c54L18m22J64K60J35p3R3k75L79J07l87K76k54L13m36J11L10M0l49j47K25
3140C4k62L20l91J30K00J7k37K58p7l2O5q4K12k11K3p2J01j70J71k30K50J43q9
3163F9j69L0K62j32r4m26N65J3l65n1J53K14M8j37j9L29M5l15J58J10l2j84J0
3186H2j6N7j36l11K05K94K2m64K23o0P3M6l8N4K19j50k98J77L9J53n6J02J39p4
3210B82k49J90j67Q2j98K03J3j33k25J80J02N8k53j72pJ60k4j07K88P0K81j28
3232B46k76K88n8j28J8N9Q2l65K98P1J50l51l16J28l6Nj64M9K08n1k9K01p2J67
3256A24l57K60K42l43M3K0K70J52o6n25J94L71m07p5k23L04J0k37Q4RL7O8j15
$$ y = [-317, 14, -72, -26, -153, 311, 652, 158, 160, -57, 317, -49, -298, -72, -176, 137, 197, -175, -110, 111, -319, -604, -354, -36, -458, -294, -34, 101, 28, 121, -154, 225, 332, -55, 221, -33, 280, -156, -45, 265, 305, -44, -191, 34, -228, 92, -299, -169, 31, 48, -189, 69, -8, -40, 25, -59, 153, -58, -35, -107, -6, -176, -5, -235, 15, 158, 69, -100, -70, 192, 60, -34, -460, 105, 118, -247, -298, -145, 69, 117, -20, -39, 290, 335, 20, 178, 288, 256, 72, 82, 66, 123, -13, -324, -119, 175, 197, -267, -44, -104, -31, 15, -23, 31, 250, 100, -198, -21, 18, 171, 115, 217, 356, 282, 33, 223, 56, 138, -60, 143, 156, 23, -202, -22, 80, 138, -115, -287, -294, -134, -158, -265, 23, 93, 374, 246, -30, 258, 200, 72, 90, 149, 231, -134, 164, 235, 385, 34, -282, -154, -190, -185, -349, -300, -92, -143, -172, 29, -43, 124, -233, 27, 269, -74, -31, -11, 259, 411, 345, -180, 14, 385, -22, -97, -320, -16, -6, -243, -159, -150, -113, -45, -160]
3279a60M7P5J33k74K77k4K32k34j34K6K32k71l5K77J63j71k08j94J95k77K92q9
3301a22j58M09l78N1K89j0k06J97kQ2l21J36J60K07k4q2j58J12j76m6r4j9k01
3324c54K46j18K72L3k19n3J00p3J60j39J91l54K97o2R0M5k7l57M65j70L61l67
3346c3n6K89l8k00j20k6K44o6j15J09J52l47J58P4L00k58n7o3K27O8l14j04K65
3369H9O3j74J77o9K06k65j17l6J17r4P2K3R8j77m73J79K24L81j07m29M39O7l30
3392a36K56J4j46L12l98L32k08K24p2l79K71J76m42J58l35L18J1j26J71K2l1m8
3414e6ko7L54k12j19J14K05j6R5o7k55o3P4J58k06P3k12K21k34K28n1j15J68N0
3438F5k57o6L29O5q0j58K39o2j05Q4O6K34k11k53J67q8K05L8j09N1r7k54J22p8
$$ y = [-160, -113, -38, 95, -179, 98, 74, 306, 72, -62, -36, 196, -75, -110, 167, 330, 159, -49, -243, -48, -325, -33, -122, -280, 129, -249, -198, 91, 81, -125, 72, 70, 152, -169, -33, 127, 334, 310, 228, 70, 182, 6, -40, -134, -153, -354, -108, -226, 46, 79, -140, -193, -93, -166, -6, -145, 46, -308, -11, -73, 17, 62, 35, -322, 143, -27, 334, -33, -89, 200, 162, -38, -158, -184, 60, -6, -121, -12, 140, -207, -49, 25, 325, 67, 10, -53, 174, 242, -72, -176, 89, 152, -22, 155, 86, 292, 27, -90, -126, -9, -103, -31, -8, 90, -87, -560, -381, -157, 224, 117, -312, 127, 194, -136, 120, 134, -12, 300, -98, 234, 26, 250, 178, -201, 70, 246, -196, -38, -373, -55, -44, -170, 1, 23, -8, -56, -58, -125, 229, 17, -102, 12, 217, 201, 296, 229, -26, -89, -15, 143, -63, 10, -202, 19, -215, 13, -38, -153, 15, 65, -192, -258, 71, 136, 56, -102, 137, 75, -30, 54, 120, 354, 143, -110, 57, -31, 174, 212, 103, 154, 57, -197, -75, -153]
3462a53J01jj22J05Q5OJ5K3J05n0j26Q5M1P6k3k02L2L59j74l43K65k01K07m5j97
3487a32k28K18r8Q4j26M43j60k72M03N0l17O9Q0K05k79j72K67j19J54O4k39K24
3509A19k36k0o9K37P1j74m6J80J18l43K24J54j30m7k18J61q0M23m32K01J44j66
3531G1m4l01J77J14R0r5j92Q5n2qJ53k4q8J5J53j36J44O1k14J80L27l52o3L20
3555C21j5l82K70m00K13J04k68L09k21l3O6j16J09j49J83j80J80o6Nk18L96NL5
3578A48j96M1J93j20N5j70K87j14k70M2K39%j98o3j29J42K37k13P4K94k97k51
3600b69M87k26K02l49K68q8J7ml9K27j38j40j54N3J69M8j82k3L26L8k96j5j19
3623b07J63J98j46q3K05L2k35K5P2q8J85k81K75k1k2j32J89jj14p5J29J8Ml50
$$ y = [-153, -52, -53, -175, -70, 15, 21, 36, 59, 164, 114, -12, 73, 114, 190, 167, -35, -3, 356, 182, -161, 104, -97, 110, 65, -132, -360, -142, -240, -156, -282, 161, 1, -271, 132, 182, -135, -66, 14, 219, -60, -232, 35, -84, 70, 134, -105, 119, -117, -137, -206, 31, 102, -72, -118, 62, 180, -163, 61, 215, 85, 38, -180, -19, -99, 324, -108, 93, 237, 71, 27, -274, -97, 17, 107, 12, -180, -95, -147, -155, -2, -26, -114, -99, 54, -82, 62, 123, -91, 89, 416, 64, 1, 321, 306, -76, 194, -206, 7, 111, -157, 152, -69, -102, -36, -152, -43, -192, -9, -189, -9, -75, -70, -288, 108, 113, 148, -48, -7, 186, 66, 121, -49, 238, 124, -146, -104, 135, 135, -63, -126, -255, -113, 124, -89, -15, 279, -18, -269, 218, -8, 194, -155, 113, 25, 42, 38, -1, 226, 88, -52, -206, -153, 16, 64, -118, -141, 185, 223, -73, -88, -207, -44, 154, 8, -75, 130, 162, -73, -48, 24, -64, 121, -160, 115, 94, 72, -60, 129, 128, 14, -61, 68, 86, 90, -260]
3647b60J0M91k18L9o3j8j98K65k78J01L49l78J32j3r3L47j29q2KM2l97M41k62
3670a70K32k47R6M7Q5K4l16M26j66j71%L4K11j50J46L4Qk87J65j32L47k57l9k16
3694b96J32Q9k23L37j3n4n6J58r7j31M33m21J20j8J31n3%J71k3j79j34r0J51J01
3718C5pj17o3M5Rk68M86l2j15j0N8q3J96o8n5K3mj02L7K59l79P4J24K3M8k72N
3745a53J12K8p4k1J32n3j56M2o3J02K27nk84L70j49n4k7J11n0m3J94k28J05j43
3769h0L33j01j9k03K2m5j33KM6J72k95K69q7j79K93%L1r1J7J16l7j99K77J73l50
3794f8QR5k97L48l14L31j23N0k42J52K36O9l24J0J5J71k21J11M4k2Q8J7j47R6
3818H3j52J10l37K46J37l3J12j87K34o0j63o0k2K25k09RP0J4J41l52L44k83K99
$$ y = [-260, -250, 241, 23, 62, -1, -19, -217, 48, -230, -129, 220, -158, -26, -39, -132, 215, 86, 4, 6, 48, -349, 92, -170, 62, -185, -89, -42, 43, 67, -249, 177, 11, -160, -160, -126, 85, -65, 81, 115, 123, -164, 1, -131, 216, -41, -80, -296, -164, -75, -298, 39, 26, -28, -84, 74, -23, -154, 279, -142, -22, -40, 91, 38, 38, 209, 186, 7, -127, -217, -66, 35, 28, -89, -152, -107, -98, -366, 120, 88, -27, -37, 21, -62, 134, 66, 11, 34, 30, -72, -35, 224, -155, -81, 43, 66, 114, -158, -153, -41, -13, -87, -108, 24, -29, -185, -143, -206, -104, 123, 118, -166, 204, 55, 1, -26, 85, 35, -8, 186, -42, 63, -80, 253, 152, 133, -70, -48, -93, -226, -224, -178, -6, -301, -32, -119, -298, -5, -5, 26, -65, -48, 68, 31, -168, 109, 282, -68, -60, 35, -262, 86, -228, 103, -20, 30, -212, -60, 176, 245, -79, -69, -54, 117, -104, 7, 51, 29, 117, 134, -13, 83, -69, 41, -296, -50, 87, 54, 166, -21, 213, 153, -10, -70, -92, 133, -76, -67, 3, 17, 158, -194, 150, -133, 166]
3841A66k09J18j26K22j63l07L42j78J66j04J8J63m8mp2L91j98k65J75o5K45j36
3863A31J13k19k07K16R5J1n9J0k00J74q5n2J99j76n4J75l7K41m36j31L70j42J83
3886A20k19P4q1M72p2l73j51K48M4L1Q3K0K0k82N9J03j77j13L1j14J89p4J70L1
3910C9k1j50L31j89J6L00n53J62k32J82K40j97J85j9K68m15K76j38j51q6L0K2
3932a00J29p8j56M04o00N10j22N8P1j89J45l62L35l6k0l7L53l8J76n93o2K95K1
3955A04k00p1r2L06j14l7J50jP1k24J20Rp9K51j97j25JK90k81K30Q7j35L4o6L3
3980F4k02kk8J97Kl06K07Q1O1j36P1l7j20J76k98L83N6%j61J99l76J54J59j11
4004C3m3l23L08J80k22J40j37L8j79K63J90k21r2J27P2j2k71K79j00O4n6K29p7
$$ y = [166, -43, 75, -51, 171, 8, -299, 43, -135, 31, -73, -55, 108, 60, 56, -16, 375, 177, -88, 87, 22, 267, 131, 244, 25, -182, 34, 129, 140, 81, 91, -109, 65, -20, -72, 127, -49, -103, 72, 35, 276, -160, -291, 79, -63, 120, -99, -25, -106, 366, 294, -79, -230, 18, 62, 93, 176, 196, 216, -66, -7, 96, -81, -194, -163, -277, -88, -162, 8, 39, 18, -132, 199, 10, 26, 326, -227, -65, -297, -115, 125, -72, 113, 94, 362, -53, 223, 85, -66, -152, -122, -100, 29, -49, -205, 199, -401, 109, -13, 45, 116, -73, 72, -290, 45, 9, -11, -48, 305, 267, 443, -150, -212, 83, 104, -96, -167, -259, 47, -67, -104, 46, 45, 116, -108, 12, 21, -58, 193, -4, -129, -128, 162, -119, 111, 198, 63, 97, 31, 64, -138, -140, -168, 29, 31, -275, -68, 13, 74, -62, 9, -28, -148, 28, -270, 113, 169, 169, 8, 207, -169, -15, 144, 33, -10, -333, -25, 155, -67, 73, -64, -26, -205, 58, 248, 27, -65, 62, 134, 122, -149, 130, 30, 94, 38, 267, 190]
4027A90l80k8L65L7l26J8j3J51l4rl1j00K59j89K72l45J50j72o9K61mk78M22M4
4051A91k29J11j49K8J92j37J16j9k21L67m22jJ11jJ18j00q3J57j31qJ31j40J80
4074F1R1k11J51j30m8o5M91k03j12k00J87Q6Qo0j34L10l46n5M7K69l03Q2K19K11
4098C46l22J9Q7o9j9j64J96J00k32J61k75m0L61l21J59n9J20l40J31Q3J56L1k05
4121i6j59K37%j36L63j85O8j62J4J53k21n5K40q9k2J20o9M5n0QJ87l79K91J22
4145B25k68j51K34N1k11k64N98k4q5j44k52K45r9L16k02M4m4R0l03K90j68K8J11
4168A7Qo7j09J05MJ3P5P0l31P3K42j67J89l0M15n23l02N45p6n9o3N5j7l1k01j14
4194b79J39J44k62J57J74k9j30q3Q0M8O6K05j54j85M7j20R2Q1K04n5k01J02J13
$$ y = [190, -190, -218, 147, 184, -142, -124, -137, 14, -20, -29, -60, -160, 99, -90, 182, -163, -13, -185, -254, 7, 3, -275, 147, 191, -38, 73, -76, -48, 144, 7, 123, 104, -117, 250, -172, -173, -62, -63, 55, -45, -128, 29, -102, -110, 21, -119, 61, 152, -59, 92, -38, -86, -151, 340, 137, 25, -175, 12, 98, 106, 46, -88, 222, -124, -179, -132, 137, -166, -84, 135, 346, 24, 43, 130, 61, 42, -122, 74, 174, -58, 103, -172, -212, 149, -172, -13, -72, 48, -292, -161, -78, 78, 109, -96, -255, -18, -18, -154, 209, 24, 92, -70, -56, 97, -124, -179, 61, -28, -50, 70, 1, 46, -4, 4, 191, -188, 103, 225, -43, -194, 40, 91, -120, -384, 214, 190, 105, -39, -291, -46, -145, 171, -31, 13, -31, 59, -244, 46, -122, -94, 17, 25, -42, -151, -46, -42, -29, 46, 116, -215, -142, 100, -67, 122, 92, 507, -16, -318, 227, 151, 92, 29, 84, 67, 36, -165, -279, -140, 4, -258, -101, 73, 44, -86, -169, -89, -41, 25, 230, 76, -109, -62, -182, -90, -9, 195, 140, -61, 41, 154]
4217A54l44k5K54k10K37k87J87j21J72l1j70N11l11n0K2R5o2Q1K57k57J00l00
4239i8pJ11K36k95j56M08k36OJ0L6J35r7k27J88j04K1k4k35L36N5Lr4J19j34L02
4264B59j50Q0k78J60m0N8r4j62Q4j15M2K20n0P7j14R8p8k6PR6j52J87q2m6n0r6
4290a65O7L9J19L7j98J66Qr6p3n4K30r9Jk78M05j74J92p8k46J72Q1l65M75J2j97
4315a9M3n3K05mj67j59J39Q0q6j11R7J68j39m9j4J78k11K08k37Q6J55m01K39k6
4339g8j0M13n30J34M0PK05j95J09r6j37k3L86L2m81R8J16p4j6J03J14l5j08O6
4363D0K1pj30M6q1R6J57j12J07k58J50k53K18nM3j16O6%q8K02k58J02j19K17k16
4388a78J54J42k1l33J76J75p6NL6j34J87r1j70L67j09j81K91k87j27K25M1m75
$$ y = [154, -190, -215, 39, -171, 66, -221, -34, -155, 17, -14, -184, 327, 16, -34, -12, 83, 21, 102, 359, 102, 202, -98, -105, 6, 242, -53, -209, 199, -37, -31, -21, 15, 150, 53, -174, 14, -90, -69, -93, -328, 8, 63, 66, -28, 91, -43, 259, 109, 189, -89, 71, 31, 89, -5, -167, -83, -198, -156, 64, 14, 91, -23, 75, -3, -29, -22, 74, -78, 109, 27, -19, -69, -165, -98, -59, 60, 97, -101, 65, 73, -23, -96, -150, 80, -19, -18, -296, 109, -65, 127, 49, -197, -25, 56, -309, 166, 178, -19, 24, -29, 176, 172, 5, -154, -15, 65, -21, -132, -35, 133, -6, -55, -69, 109, -102, 106, -131, -45, 110, -291, -52, -78, -88, 325, -205, -71, -31, -24, 181, -14, 95, -1, -138, -161, 225, 257, -224, -126, -10, -84, -100, 3, 117, 82, -26, 40, 61, 54, -76, -30, -111, -15, 142, 30, 137, -121, 29, -224, -6, -11, 32, -84, -18, -18, -106, 96, -162, -60, -179, 38, -178, -24, 118, 97, -236, -60, 115, 39, 44, 80, -54, 133, 42, -128, 239, 130, -51, 240, -47, -174, 51, 92, -383]
4410c83L18r3j3J5K35L4j85k41M20k36R4L08l46K57K5j7l53J93j2J8m20O34l16
4433f4R9q9k1j2o1J12j30J46J22j97O4K45j79j77L86j13k03O2P8J26L1l43j14
4456b32K12K81k86j33Q4K75j69j47k3K70k00q2K06J82j39j97J52j44J70J47j50
4477G7j63R3J63j10k18L48k33J33j64L63m66N4q8K58p0P8l31K02M6j10OK12j10
4500c0J84n24L99l3j57K71j8J91q2j35j38J09O3q8j50o7J39K28k75P9J7J49j17
4523A5j49J23K11l38nk6L18j71j20J68p8L82j04j54K1j35N8k45K55Jj64lL56n9
4547A57k34K11j01rQ5r2O2J29j42l26J15L41m47J53O0m3J94j89Np5J11j29K0J31
4571a3M6Q1r5j06J73l7j07j02P5J9K34j14j36L14k51l9q9L44o2l10k5nlK39j65
$$ y = [-383, -65, -158, -171, -156, 79, 113, -72, -313, 107, -129, -35, 273, -73, 184, 209, 192, -161, 32, 20, 38, -382, 252, -64, 35, -54, -75, -87, -148, -36, -166, -20, 102, -95, -31, 214, 35, -142, 244, 131, -72, -10, 68, 194, 225, -118, -232, -20, 261, -25, -158, -74, 201, 32, -115, -138, 132, -68, -150, 56, 238, 99, -98, 54, -90, 80, 227, 77, -86, 7, 170, 60, -158, 190, -43, 90, -74, 289, -177, -123, -211, 47, -23, 55, -276, -74, -28, -138, -132, 80, -30, 154, -370, 29, -4, -161, 110, 92, 283, 201, 66, -72, 37, 100, 12, -138, -205, -66, 162, -113, -34, -17, 132, 15, -134, -11, 200, -138, -143, -169, 149, -22, -142, 26, -52, 330, 226, 72, 93, -42, 16, -229, 26, 27, -137, -140, 216, 157, -77, 134, 33, 24, 109, 17, 79, 208, 66, -260, -145, 196, -251, -98, -38, -81, 113, -76, -71, -146, -35, -164, -144, -13, 33, 114, 19, -87, 86, 49, -58, -160, -85, -66, 168, 54, -82, 232, -19, -58, -147, 197, 135, -175, -200, -205, -208, 31, -134]
4596a34k8M37l41j54K5J61J56m39J80L91m12J35p3k07L82l08N45k48j82P0p7L1
4618i0R7j8m6K82k10j85j03L09k21K13l10K64j28K01k07J98j1J12l4m48L98o2
4640Am9J90lk66L17j35j88rK27Qj00R0J22j19j15P1R1j40J0l11L02n9O2j91J80
4665a4Q5k58L55k65j60K53R8q6J28%k89M6R2k68M96m40M01n3j03k06Q0L25j10
4688A07j22J25k09M3j77M02j94J20r3k51M42j83L1k8Q1J52j82K85m49J04n%p1
4711g2J35R2l19J28J87Q1k53J16J31k65J69l32J91Q6k92R7M9K62j96q9j37M77
4733B46j04n9k7j0q7K48l84J51l02J60J58K66J7j05k53o1L4M8J46l61K50j33P8
4756h4n6J36Q5j4k4p0N9j26J67j05Q3J56k60J45Q1k60L4k48M17k71K49j35J2J8
$$ y = [-134, -162, 275, -66, -220, -195, -34, 122, -317, -137, 254, -158, -23, -96, -303, 79, -229, 316, 68, -114, -44, -121, -90, 7, -11, -57, 225, 15, -170, -273, 36, -185, 28, -282, -18, -146, 55, -152, 46, 35, 147, 113, -335, 63, 1, -48, 142, 139, -127, 190, 55, -133, -142, 85, 93, -7, 83, 205, 86, -29, 42, 133, -7, 3, -308, -6, -65, -3, -194, -14, 71, -187, 168, -97, -257, -4, 94, 8, 136, 136, -153, -107, -15, -283, 213, -227, 174, 121, 18, -188, -108, 217, 107, -15, 110, -99, -56, -233, 169, -25, 95, 2, -249, 193, 10, 41, 13, 94, 246, 64, 349, -100, 4, -1, -1, -72, 63, 155, -164, -36, 151, 232, -21, 95, 226, -39, 130, -202, -11, 75, -217, -120, -71, 191, -5, -94, -231, 246, 142, 83, 56, 46, -41, 207, -177, -26, -328, -168, -10, 256, 273, 168, -85, -146, -112, -64, 82, -279, -29, -162, -84, -140, -4, 81, 67, 43, -27, 32, -94, 73, -32, 51, 207, -53, 92, 173, -87, -53, -301, 116, -155, 94, -41, -29, -11]
4780a1p3l2m5K41j98K48o3l2O5k60K37j66Q9n2l7P0J44o0N6kk32K98k39j34J39
4805d9L4k22J38Q5Q8k06K32J11j53j78J56j45Q6k13j3L06j52Oj6k9M21k24j5J46
4829A94r9j63J21M8n5jo8J40l78L59jj66J78j66J65j6q9J67m9k47K69R7k07k3
4853A0N6k91K2J89K77j39j6j24o0J15j15L30k37n3Q8P5J47j97r2K06m12L68j18
4876B9L14j90J7l49P9J47j91N1J98j00Q0l1m1J09o2n7L8QL3j17N9QJ5j08J91M4
4902A74k68j58K02k8K86j86j56N6K9J60j15R6k43K7J36NJ24k1j46J56l10K69o2
4925B7k49Q9K52r7j30N9L63j51l5o8L4j5Q3k54l5J80k98L02o0J1M3k62P8J62l8
4950iJ8m3j44J89o5l4K20l92K16J1j14J88m4Q3j81J02qP7o6K65j71m5r0j6J1j6
$$ y = [-11, -84, -116, -161, 80, -118, 130, 67, 35, 100, -160, 77, -89, 0, -52, -89, -19, 125, 65, 121, 119, -113, 185, -54, -188, -49, -15, -237, -99, -14, 74, -132, 100, 211, 58, -120, 36, -109, -23, -236, -249, 57, -95, -89, -105, -134, 287, 63, 48, 194, 95, -68, 53, 101, 46, 45, -23, 117, -261, 98, 97, -69, 109, -57, 108, 92, 3, 170, 121, -126, 143, 240, 33, 10, 66, -225, -203, -14, 263, 124, 108, -16, -76, 39, -76, 254, 17, -36, 52, 127, 274, 77, -15, 191, -221, 147, 29, 343, 153, 170, -179, -100, 47, -144, -93, 105, 5, 85, 54, 13, 122, 60, 3, 41, 49, 82, -35, 24, 32, 47, -61, 130, 174, -94, -252, -50, -78, 208, 22, -134, -78, -49, 111, -4, 92, -151, -124, 12, 17, 141, 120, -26, 130, -180, 89, 27, -222, -133, 119, 22, -108, -49, 314, 163, 128, 60, 94, 79, 162, -92, -127, 53, -245, 57, -3, 8, 51, -211, -133, 29, -9, 9, -34, -178, 11, -54, -88, 132, -260, -44, -33, -147, 41, -3, 80, -101, 1, -7, 70, 4, 269, 98, 53, -37, -53, -42, -58]
4976e8j74K66M5J41l36M6Q3J50j82l2K20k74L4lK13k40K80l15J82j24K53l36K49
4999H8l7J45k50K81j74L4j35R9l2J30m31K35N0L5j2j37r0J03J33p7J1j55lK8J81
5024B0j70Q1J0p5L02k88p1J62K02j50n5L3K1o0J03m5R2k45L69n9l41J40%m2J86
5049A20m4o9K19k44j17J52l5q3J56J95m18J49k62L60j05j13n1L67m0n5j60J86
5071A08P9j80o4mJ04n4ko4M9O9J00J63m40J18J16j5L6j78N5j88J75K3K3k6L0j
5097C2j9N1M7q2K13j57j37J6L0J2k86j5M24j55m8J65o4R2o0j5j25J31J5n9L6q4
5123d2J45K73l02K5k69j80M54N0P9j61o2j52j8O7k21N19k50J8p5L8J4lR6J31m0
5148A34j10o8j31r7K31k5J33j0M4p2k3j66K16J9rj17PNK55k50J06J12l22m8J98
$$ y = [-58, -232, 34, 79, 220, -116, -70, 13, 163, -19, -51, 169, -105, -71, -74, 139, -101, 179, -136, 46, -78, 175, -161, 88, 51, 196, -54, 227, 53, 87, -48, 51, 19, 149, -282, -47, 3, 38, 26, -111, -201, -98, 35, -42, -31, -186, -189, -161, 20, -150, -69, -59, -134, 168, -120, -191, -29, 173, 23, -32, 1, 22, -38, 65, 20, 112, -133, 236, 177, -164, -24, -24, -66, 120, 76, 7, 226, -18, -135, 17, -18, -101, 55, 250, -168, -19, -281, 79, -26, -139, -190, 177, 137, 82, -78, 108, 187, 7, -57, -61, 43, -11, -13, -77, -28, 41, 141, 304, -136, -18, 98, 83, 119, -59, -4, -192, -17, 6, 29, 3, 33, 32, 13, 64, 111, 29, 242, 85, -52, -36, -6, 6, -280, -295, 129, -26, -74, 91, 27, 119, 59, 44, -81, 50, 65, 6, 42, -42, 103, 376, 74, 99, -170, -350, 104, 154, 233, 72, 10, -142, -160, -93, -314, 205, -45, -27, -102, -64, -50, -53, 43, 174, 134, 24, -44, -175, -272, -41, -66, 67, 57, 101, 29, 6, -160, 56, 75, 66, -51, -44, -39, 216, -34, 72, 184, -138, -186, 12]
5173A2j87K78n7j30J34q3J43J02L1m51K68j10K10j68j63K62QK23k91j04j47L07
5195H7l9q8j03J34N5k08J1K15j89J88k20J57Q4j08k6J66j76q5J50jN6K39l60k17
5219b78L31p0j68L67j33Q1k36O9p2K50j36Q3j92P6n1j05J95N1r7jj41K67ro8j26
5244a13J94p7j00J00qK86l80O6n7K55j41r1Q9j24L0p2J06J32j22J71l07J93K30
5267B60n31L60m3n7j21J36K15j81J96k97j07j55O6L81l84K44K5N5l28kM96j30
5289I8J09l5j91K40j77q3j47J52P5j95K68RJ8O0k22L1J5k72m8M85l04K20k44P6
5313f2Q3j63o6J68R2L5k57K36j12j94L26l46L45j63K00k41K37L1l07J57M9P5k98
5336a75J62j22K14l7L5j45N02l40j09J59k46M60o10L44k22J67k0N2k38K16J84
$$ y = [12, -175, 103, 46, -84, 50, -33, 110, 212, 243, -208, 60, -50, 160, -8, -171, 91, 99, 322, 31, -73, -220, 87, 48, -40, -143, -9, 46, -162, -151, 64, -125, 63, -157, 0, 84, -24, -50, 116, -60, -145, 5, 4, 60, 299, -61, -278, 53, -17, -185, 182, 49, 130, -106, -37, -109, 141, 5, 88, -104, -28, -79, -184, 11, 62, -35, -36, -177, 90, 81, 13, -113, 81, 4, -96, 4, -4, 282, -98, -32, -89, 166, 25, -66, 23, -101, -71, -143, -37, 95, -27, 144, -163, 30, 260, -271, 89, 46, -11, -132, 4, 219, 38, 234, -63, -170, -325, -259, 122, -262, -18, 7, 62, -266, -268, 228, 98, 207, 172, -19, 221, 44, -39, -186, -34, 41, -154, 114, 123, 141, 201, -21, 10, 25, -247, -295, 190, -114, 106, -138, -62, 21, -142, -208, -40, 52, 87, -170, 66, -46, -240, 86, -260, 85, -78, 122, -119, 118, 149, -158, -1, 48, 123, -175, -13, -135, 79, 42, 77, -68, 434, 94, -15, 144, -102, 358, -252, 92, -130, 37, 17, 69, -169, 47, 231]
5357B31k96pn9M1K3jK57o7k25K39k72J61j4j04J19J37j76O7Kj47oMJ09J08j12
5382A2K3J01j10q6J93k06q0M47k77P3J05j74J70r0l32K85j62J55l4R4nkj76N2
5406b4j7l0R7m3J22j75P3k99K83O6m8r9L03l0k47O5Q1j1k1P5k56j32L86J12k25
5431Fk62J01L25QM5j42Q1k97K60M0k18J95k26J30J51j13n8j36%n9L31J06j57m
5455A07j24n8K22j84j07J10l0K58m32K23L7M6m6k4J03m9j16n7m1J42O0J04j68
5478b4K09l14K91l2j21O4O6J3O1l25J0J88l48L25J36m51L67l32K17o6r6J10JJ01
5502E0J2j86J95o9K2K92j16j30j59M9j1K9R9k01J38J77m35M15j37j54R4q9M73
5525C58l25p0Q3J80j78p9q3R5K27k96J58q7kn7p5J12J41N5j42l0l8K1K5q3L4K12
$$ y = [231, -65, -72, -131, -90, -67, -68, 189, 122, -103, 136, -136, 25, 11, -93, 26, 163, -13, 54, 56, -91, -97, -93, 16, 124, 12, 35, 136, 26, -60, 133, -73, -153, 294, 17, 90, 195, 21, 191, 101, -231, 54, -108, 47, 13, 107, 102, 100, -76, -24, -41, -71, 26, -17, 105, -70, 3, -296, -13, 53, 5, -94, 209, 179, -68, -3, 78, 67, 46, 121, -135, -267, 119, 231, 6, -256, -155, 170, 178, 223, 81, 162, -135, 125, 165, -53, 142, -84, 46, 197, 84, 26, -110, -110, -169, 162, 268, 111, 107, -17, -75, 147, -37, -144, -34, -64, 194, -238, -15, 22, 68, 22, -2, 101, 52, -64, -121, -162, -20, 40, 144, -24, 185, -129, 162, 130, 9, 73, 139, 152, 213, -112, -102, 86, -262, 63, 199, -252, 115, -217, 0, -66, -162, -52, -51, 50, 62, -124, 71, 2, 24, 316, 200, 70, -89, -40, -51, -22, 77, -124, 14, 191, -244, 171, 34, -120, -26, -115, 358, 33, -37, 46, 226, 48, -31, -114, -19, 208, -88, 70, -17, -19, -76, -151, -39, 102, 157, 15, -15, -53, -32, -7, -90, -56, 156]
5551A56p3j79NK39j59j76J78K0P5j17N7j35J97J52k44Q1M1l05L60k61p5K37j26
5574e2j21K51j8m22K63R6m7j57J15m6K9J80M8k77P7L13k38Q5o8J21n0k06K71k20
5598g3J15j46n5J56J0k2l31M43k50K24j88J90j50K8Q2j47R6j75L00j69P1n0J62
5621A21j69J47j30j6P5K9r3k09M6l7K88j60m8J50K2j9J0k59L66l67Q6J81Q4kM1
5646A37k53J07N4o9k35K58K60l99J85m5Q1j43o5L30n6q0J4o2Po6p6mK07m9k61
5671b23K45K9l6j96J11k7K53k95J49n0j16L30k26J38j76J4K26l77J90M7MJ3p0
5694d3K6RQ0k33K87K02j29n6j0M6k84N3K0L57l96J10Q8q7j69Q4L6K2Q1k11p2L54
5720A65k3k85l2J45Q7Q3p1N6k24J79J27j42l8J05j95k33K90k91K33J04P6l76N20
$$ y = [156, 83, -96, -91, 148, -11, -187, -9, 11, 86, -31, 26, -109, 88, 240, -4, 77, 118, -187, 173, -88, -163, 74, -52, -173, 78, 60, -362, -99, -3, -50, -207, -92, -138, -109, 71, 119, -158, -81, 232, -6, 79, 11, 132, 82, -124, 147, -73, 42, -104, -159, -3, 7, -15, -346, 97, -153, 71, -117, 73, -77, -49, 33, -114, -18, -193, 107, -62, 9, -41, 121, -48, 99, -31, -47, 28, 57, -36, -245, -199, -236, 52, -108, -156, -6, 16, -3, 7, -252, 114, -253, -167, 14, 98, 96, 137, -116, -9, 45, -24, -259, -1, 259, -140, 45, 0, 81, -62, -127, 203, 147, 67, 81, 19, 26, -40, -116, -120, 87, 38, -223, 22, 51, 15, -181, -70, -97, 156, -139, 10, -40, -156, 174, -52, 86, -90, -76, 150, -227, -37, 10, 14, 27, -43, -17, -8, 72, -161, 126, 328, 199, 143, 133, 179, -105, -52, -32, 325, -71, 39, 127, 40, -129, -45, -9, 13, 94, -117, -189, 165, 142, -143, -175, -30, 57, 140, 69, 125, -99, 80, 207, 65, 27, 132, -63, -296, -6, -297, -64, 40, 116, -260, 260]
5743B60p3j74j04K06o0Nr0op6l2K45M2l04J77k22J17Rj32M00j26L3R7j86k48J63
5768g9o7L40o9l1m4k6j81K04j92k2J90O8K66m28J04l99K58P8N9l5J01k75M6M5
5792h9K1M7L2l17J84j20J54J49K64l42J31pR6l14jm4J49q4q3L66l24K88k40L32
5816B48l24j77J98k6l4J00N7P8RK85n65Q3k09L94j41q8p7J70j1K33J63j60j03
5839A03j62p9K94k35J20J23k89J2J76P5l90L25m0p6k2J40J43m04L8J40J1k55J26
5862a26J19J04k36K23j50k9k6P8O2R8k09K22r6r9P3J05j75Q5k89L31p2p9Q7p6
5886g5o9N47n04J01K66n41L33j05n8m6l9L27j7p7k36K7L68l53K41j71P1p8K27
5909A39o5kk54J66O1l7J85r8q1R9j26J01l26J40O4j25L26j52j6q8k10L1L02l9
$$ y = [260, 187, 13, -91, 115, 55, 60, -30, -36, -112, -144, 101, 143, -161, 16, -206, -89, -80, -212, 188, 62, 95, 192, 6, -242, -79, -146, 194, 125, 94, 50, 24, -157, 47, -145, -167, 23, 91, 357, -71, 33, -366, -108, -30, 29, -6, 95, -180, -134, -89, -68, -21, 11, -306, -122, -242, -88, 61, 325, -17, 114, 107, 203, -111, -112, -156, -7, -91, -174, 192, -132, 156, -84, 248, -76, -253, -55, -81, -115, -15, 42, 120, 129, 414, -151, -68, -277, 117, -24, -112, -189, -19, -30, 203, 366, 206, 103, -59, -138, 156, -79, 41, 164, -125, -113, 63, 138, -252, 73, 33, -43, -65, 75, 218, -186, -148, -8, 3, -252, -126, -7, 97, -139, 84, -66, -95, -121, -43, 19, 117, -92, 130, 34, -65, 8, 113, -62, 23, -266, 65, -7, -86, 1, -75, -144, 403, -101, 0, 266, -275, 58, -47, -105, -151, -190, 137, 120, 43, -193, -166, 202, -151, 90, -81, -10, -88, 139, 74, 72, -182, -16, 45, 8, 193, 95, 14, 113, -13, 88, -238, -98, -34, -159, 167, 15, -1, -89, -299, -268, 34, -5]
5933eJ54r6P9l28L32k91K06P4k08J22l1j59K50k10Rj6Q3j45K57J42n18K59J00
5956F0M4l57N87o07J69K39l26L2J92Mj2J97r2k33nJ5P2P7l8q6LqQ0l05L28L5k75
5983b10J94n0K00k10K03k40J26l07L05J3o1j02K04k30p7J57J09k0l2o8L12j58
6005E8PP5k09%q1J28J93l48J34J60J53l46o9K00j80L12p3k61M03j55j1j76N0J90
6029A54j65N1q2P6j3j35J6L46n6k17j98K18P0j0j56J92j38l7J54j50J87l18L1
6052a80K83j61R6P7j11p6J01k5P1j03n8j27K83o6M4J09m21L14LN5k77R9J54j73
6076h9m0j62M44k4o1j40j16K17j92L23kj11L45m32o2j3J93j50K64j60j71pK10
6099F4K9k09J4M9J09l20K33J53j78j6K1K64k94J8L5M0k15M41p1p0p6k23m8J33
$$ y = [-5, 149, 53, 132, -196, 136, -155, 51, 125, -83, 39, 8, -151, 99, -111, -102, -118, -35, -180, 77, 219, -299, -40, 60, 104, -253, 334, -273, -104, 135, -191, -159, 33, 37, 25, 222, 130, -103, -108, -93, -21, 56, 18, -68, -65, -73, 7, -298, 30, 65, -210, -16, -66, 134, -76, 127, -113, 13, -294, 11, 24, -37, -139, 65, -165, -242, -85, 24, 4, -28, -96, 216, 58, 65, 140, -69, -69, -150, -22, 171, -177, -43, 117, 270, -76, -145, 55, -125, 187, 114, -147, 256, 101, 90, -86, -36, 154, -11, 40, -42, 34, 21, -114, -98, 248, 192, -25, -223, -5, 65, 55, -101, 91, -47, -84, 70, -80, 107, -211, -180, 103, -58, 38, 115, 4, -72, 29, 4, 75, -28, -86, -213, 70, 4, 48, 157, -264, 50, 53, 108, -169, -70, 84, -89, -129, -291, 153, 129, 68, -72, -188, 29, -163, 160, 158, 47, 392, -40, -102, -115, 78, -72, 192, 32, -139, -146, 64, 93, -116, -102, -53, 56, -264, -31, 122, -56, -72, -51, 213, -81, -63, -28, 12, -203, 238, 167, 97, 21, -202, -250, -117]
6123a17J34j48K11j22m5K68k81J71j54qJ03Q4k94L25j55j82K86j38R9J93q2k28
6145h0l0L25m04J42K99k71R4q6J78j47l1k1q8K41q4J48l75N6J16M1j68J08K18
6168A81j70M5L0k28LL83j88q6L6K34k79K33k45P8p2K22j05m3L3j89L51l02J00
6191B2q5P9m9n5N3J58r8N1P5l7k40O0K1K09k18M6n6j88L57p7K2m2J12J16l07J
6217g0jJ39j1n1j79L38j76K00lk40N77o68K33M8k75%m9K46j81qP2R7j18q0J26
6242c4J43j11Jk6p5K34J08k35P6P2k92N6J64j14j87K66M4m2m23M60k6J10j21p1
6266b3k6M4j10J27j34J93P7j26n0J0J20l02K59L6j45L75n00M3R4J8l41L20R5l58
6290c04J75J73k14l5K74k76J47J70o6j29N6J81l43kM63j34l93K66K0j49J51l05
$$ y = [-117, 17, -131, 80, -42, -87, 181, -100, 71, -83, -91, 12, 96, -198, 127, -28, -210, 76, -62, 37, 230, 148, -80, -110, 215, -189, -47, 252, -19, 75, -11, 167, 20, -11, -32, -120, 121, 37, 185, -190, -134, -18, 23, -145, -37, 181, 11, 56, 86, -142, -139, 244, 56, -30, 6, 240, -39, 194, -51, 27, -45, 177, 72, 29, 62, -127, 224, -78, 22, -63, 16, -33, -88, -35, 123, 25, 76, 151, 114, -126, -66, -45, 164, -54, -8, -64, -252, 105, 28, 50, 8, 120, 236, -71, -70, -71, 68, 57, 6, -173, 165, -11, 189, 186, -54, 523, -145, 88, 136, -139, -139, -188, 58, -123, -131, -59, 38, -80, -160, -34, 109, -2, -1, -27, -102, 132, 240, 5, 81, 153, -139, -83, 81, -33, -220, 46, 90, 48, -375, 85, 59, 169, 48, -23, -49, -5, -115, 12, -122, 71, 148, 22, -28, -18, 102, -200, 59, 95, -50, 325, -175, -132, -38, -20, -361, -41, 54, -304, -129, 44, -170, -205, 69, -207, -60, 110, 44, -85, -29, 152, -191, -193, 270, 136, -257, 9, 29, -120, 31, -274]
6312b74J20q1J97k04K06K23k57r8J61K02j42k25K02L3k08J5L7K8K35l87q6N46
6334B43l57K98M0k27J24Q1j25j31Q7L3P0l22J97K01j31O3l86K68nj31J86L7j66
6357e3M5M5rl0p1N5J44p4n3K08N3k23pNq9j38J93R9m4O0j89J28R5J18n02L31j91
6384i4K50k09O7K20l43o3J56J06p8j72J03j9j67L73l04j42L09J17o0k7j43J08
6406a2J95M0l96L95k15Q1j7k07J16P2l9J51m2k13K28n0k98L20j84j23J30M51l93
6429a0K33n9k01N7J25j9j69o6M2Mo4%l77M52J07j24j3J0J54J14K2k93j98K41K6
6454fpp1j14P2J5j25K73k26K05j06j37L18J18k29l8o5q0K01k0Mk23L77j47p2J39
6479E6k21K04j87K08j03J59l32L11Jl54L73k8j76O5N3Q2k12rk6K23J07j82J68
$$ y = [-274, -154, -235, -38, -242, -36, 187, -70, -168, -7, 195, 53, -172, 30, 63, -145, -130, -93, -65, 170, -217, -303, 243, -114, 184, 224, -3, 121, 202, 77, -54, 33, 66, 136, -186, 11, 212, 81, 144, -242, 26, 21, -110, 76, 113, -53, -8, 37, 28, -2, -73, -18, 126, 52, -1, 207, 260, 37, 30, 35, -54, -192, 1, 100, 56, 116, -73, 55, 150, 268, -234, 97, -94, 156, -53, 14, 234, -109, -172, -16, 90, 12, -160, -57, -76, -243, 130, -174, -316, -7, 110, 50, 23, -120, -12, 183, 223, -173, 222, 7, 88, 71, -136, -20, 52, 13, 164, 122, -91, 137, 87, -211, 109, -75, -198, -68, 383, -10, 223, 164, -37, 20, 145, 126, -43, -109, -67, -63, -127, -127, -504, -52, 55, -69, -82, -72, 82, 196, 218, -75, -273, -32, -6, -13, -84, -198, -126, -111, -236, 37, -189, 16, -90, -227, 91, 209, -20, -58, -123, -203, -2, -22, -18, -241, 136, -11, -83, 56, -165, 39, -148, 60, -43, 116, -216, 95, 96, -258, 115, 87, -89, -24, 29, 111, -101, -110, -136, 87, 194, 12, 180]
6502A80o7k02JJ56j10J63n6K7n7l9m1Q2p3R2j55J10l9J05J40j66o4q5J74K9j16
6527a1L9k1P3n6n2K43K4k91j83K55J91k29J93j0qk14l4J72o2J1q2M4j98K61o8
6552a3N3P9m6J66j67j52J19k5n2l72Q43o20K37Q4l52J58j46K90q7j2q3K1J44M1
6576A08j11P0q3n7q7R4L49m00l14O84l71k9Q8LJ90j60P3P7j41O7j14K14j68P2
6600E4l38K84P8l4R9j04J58k41J85m59L56j87m6K84J36k93M4j5J24j83k9J9K76
6623A68n2j13j93J29K7N3l32K60M8K41l03K0j9k44M71k16J39L3j56P5Q8k11K3
6646f4J24J96m86K53N6r6j15J87j02j23J32J79j56J5j36J13Pj63K87j81O3R6O3
6669A49l31P2K44l57K09Q2K6q9M7JK9Lj09m3n9K50K1j24j77Q3J20j87J60q0J40
$$ y = [180, 113, -89, -88, 68, -42, 121, 65, 92, 35, -4, -45, 37, -36, 56, -99, 11, -28, 77, 217, 51, -13, -98, 76, 105, -11, 28, 7, 80, 24, -28, 215, 239, -52, -235, 20, 211, -18, 175, 165, 157, -57, -91, 81, 19, 30, -52, -8, -206, 55, -13, 40, 119, 73, 239, 72, -80, 39, 14, -38, -410, 433, -187, 50, 134, -218, -60, -206, 84, -3, -15, -98, -77, 67, 108, -3, 67, -16, -73, -160, -66, 283, -117, -431, 253, -118, -147, -59, -56, 134, -26, 47, 124, -17, 50, -64, 150, -18, 54, -284, 0, 78, 44, 143, 39, 197, -44, 141, -318, 38, -149, -195, 89, 225, -68, -24, -39, 85, -98, -127, -108, 168, 116, 3, -190, -61, -34, 19, -313, -53, -5, 236, -67, -47, -66, -310, 161, -55, 84, 117, -39, 36, 124, -87, -64, 60, 256, -230, 23, 79, -17, -132, 55, -47, -170, -38, 141, -15, 0, -136, -23, -16, -179, 108, -73, -10, 86, 149, -182, -110, 134, -223, -14, 68, 94, 5, 52, 53, 82, 85, -24, -67, -126, 124, 145, 21, -156, -73, 47, -140, 20, -60, 80]
6694H0m33M69l2j15L6r3L2k31R3J24J10K2l7J90j24l7J2j0r3N9j09P4J05j87k0
6719a15o2L59j06k00j4R3R1j42j19K13j69L00l37K43k65J06o1K54r6K44k63J93
6741A47j36m6J21k54K65j48J03J40k22Q6J00j4k64j00L58j66K77k81R8k62N1K69
6763A22j00J08R9n20K70K6K00k6j43J10P2o26M87k15k78M85j51R4J40K47n56J38
6785a7j35NL80l41M09l65O9j74K26q8j19p9L12N4L4k30J45K7k64Q9K78r4J37j36
6809A23j75K86n70K76m3Q0OJ07k15J79j79J46qJ96j70m9L0J09O5j33l03K17K62
6832B37k28k25J17j75J68K71P1j92L4l25K71J79l48J06J22k40J06J39k44K46P2
6853A62l30K31pm2k48K10Q1l6n6J14P2J5l01J92r1k5J95q1J09k6k42K58k45M4
$$ y = [80, -353, 116, 84, -31, 5, -88, -56, -287, -194, -70, 40, 62, 25, 215, 91, 54, 66, 56, -37, 22, -87, -13, 92, -95, -115, -177, 182, 76, -124, -138, -45, 46, -96, -215, -2, -171, 129, -208, 35, -230, -124, -185, 69, -27, 217, -46, 147, 11, -35, 86, -168, 97, -51, 52, 192, -30, 56, 156, 142, -122, -222, 136, -30, 247, -34, 64, -198, -147, 122, 22, 130, 229, -291, -21, 5, 205, 179, 36, 146, 218, -408, 79, -136, -414, 71, -80, 14, 154, 401, -155, -17, -152, -147, 233, -108, 301, -64, 5, -169, 57, -31, -150, -229, 83, 137, 171, -59, 86, 113, -151, -62, 216, 122, 259, 123, -52, 234, -336, -60, -103, -23, -17, 90, -125, 54, -125, 21, 13, 209, 39, -10, 20, 129, 194, 61, -242, -25, 237, 9, -216, -99, -274, -106, 165, 236, 44, 78, -247, 24, 203, -145, -39, 83, -157, -51, 88, -156, 90, 162, -168, 63, 56, 14, -234, -24, 57, 21, -35, 79, 151, 166, -135, 57, -34, -59, 136, 55, 164, 138, -104, 154, -91, -47]
6877d7J35l7k7r8K0N8j02K65k59J67R0j94J53j79JlJ23k63k0L90l12J92l9j65
6901a51J62q6K21l81K84q9J08M8J3o3j21O9k40R8K40j53O0j67J37k49M39N9J40
6924C78l95j44J95j52K89q5Q7j87qJ73n6r3P9Q5k26o3M03j89Q3k87L45k54N3K9
6948F0R0J38k12l3j17j11J75j32M7K15K8k05K45r2k23J8O7qR7rjk67L17k9l7j3
6974HK25j54k16J43j28Q7L4J79l95N7J91k3J84j08%q2N8k9J47l06LN7J32r9J01
6999F6j8o5J03k86L68O5l55J03j36L25j81j3j01K06K81l60L78p3l27M5K58m31
7021a48J43L1J92j30M2j3j83j88M67l16K14k27q9J99O2j52K03n0j28J2K57k82
7043h4P6J59O4j79r7J35J08m6j02l9N8J33j07pM6k36L67l31k7M7J41o7Q1k19N8
$$ y = [-47, 88, 51, 24, -74, -54, 4, -98, 167, -92, 75, 165, -29, 124, -55, -54, -57, 66, -197, -217, 173, -139, 53, 14, -151, 11, -75, 146, -235, 49, -40, 68, 116, 129, 66, -55, 14, -226, -128, 112, -41, 19, -148, -11, -260, 179, 238, 378, -17, -161, 34, -118, 171, 86, 173, -14, -22, 151, 95, 2, 81, 166, -60, -123, 280, 91, 174, -113, 232, -22, 31, 60, 150, 288, 76, 43, -74, -185, -10, -142, -95, 120, 148, -57, 188, 96, -127, -109, -42, -50, 47, 38, 37, -230, 87, 58, 21, 8, 233, 79, -137, 6, -122, -35, -1, 178, -217, -160, 31, 8, 192, 84, 84, 2, 60, 31, 178, -128, -125, -68, 64, -35, 66, 48, -17, 86, -200, 168, 233, -122, -19, -155, 170, -11, -24, -125, 81, 362, 2, 380, 307, -20, 25, 283, -148, -5, 26, 218, 88, 130, 117, -66, -254, 213, -103, 111, -116, -205, -6, 56, -96, 107, 57, -71, -59, 198, -84, -8, 151, 215, 36, -61, 74, 182, 136, 34, -5, 53, 186, 79, 72, 118, -118, 249, -82, -109, -62, 79, 12, 93, -126, -68]
7068f8p7L9J15po9N9l5J2l8j77L72q6m10K30j12K08K89k35j47P4j87K70J73k86
7092i3J20k17K52j43J79j86O6o9J60R9p8m8jj24K9K8k6J20J49l16K62k07Q9n5
7116a0j35J67J45j54J46k86M14m34j45K49J09p5l9J50p5j8J36j3k05k03M12j15
7138B1L58m48j4K06j42N6k49K75M5r7J30k81J6K78l37K99k38J8J19j10o3J15J13
7161G0M5m1j33Lj28J44N9L39k84o4k31J57J03P5n4j18J01j99K20k30J14J11q0
7184b1J6O1O8k70L1L6o1N3O8N9m6k58M38K5j44K11l10J04k39L17k51K08Jl03K87
7209H0ok89M57l24M18k98j14K69j05p6K28j78k16K60l06L02r0J44k10n7j17J30
7231i8J63j59J14m0J38j31K77j56N9j67k03K35j18K52k29j80J09J93j84L04k13
$$ y = [-68, -145, -106, 9, 2, -67, -8, -43, -31, -69, -246, 126, 40, -370, -140, -252, -44, 245, 10, -137, -63, -250, 20, 193, -93, 27, -190, 62, -81, 98, -88, -22, -91, 69, 168, 90, 42, 41, -83, -54, -26, -52, 68, 217, -99, 163, -44, 45, -10, -145, 22, 167, 13, 159, -127, 287, -147, -292, -43, 66, -9, -48, 102, 27, 9, 145, 132, -73, -276, 136, 21, 379, -69, -83, 123, -19, 37, -212, 63, 108, 11, 141, -140, -124, 154, -183, 116, -122, -104, 15, -95, -158, -43, 70, 115, 74, -59, -56, -184, -40, 19, 358, 74, 10, -221, -64, 39, 114, 60, -58, 43, -156, 64, -166, -52, 59, -21, -5, 56, 124, -146, -115, -79, -140, -87, -19, 40, -6, -264, 174, 199, 55, 266, -44, 60, -179, 138, -113, 95, 96, -207, 80, 74, -215, 242, -82, 336, 38, -76, 193, 88, 12, 240, 62, -154, 106, -200, 102, 12, 156, -54, -111, -228, -98, 65, -94, 20, -20, 118, -13, 264, 108, 167, 0, -203, 32, -86, 166, -63, -243, -134, 59, -125, 179, -34]
7252c4J94k15K32j39j36l8J65j63j32J72O7RR2j66n8J01K51l69J14J65K5K09m89
7275a43K90k05Lo6K58O6k95M1l3J55j36p4J65j09Qj99K71%p4m7J50L65o81J66
7299a24K62j77J92m3J08m35K19J46l10j05L13O3j82J72q2k26K25j43J10J09o7
7320B5n9P9j49L1L6j1J71j29M1Lkj74J09J38j19J12j34O5K7j64K10M4j89r7j65
7345c01K07K80k35J00n2l1J70L2k30j35K77N3k00q9J81j30j01J85J61j60l3LJ90
7368A42k34J78r3K03l80K8J50j10K70r3j50J56P0K5k99J21j27J26k1jL0M3k88
7391b54K52J23q9l5j7J2k59K31K3M4j83J60L08m8k83r0q7J81j91L22j59m4J36
7414E3k3J41j65J91k98J58m7r8Q3Q3j82O9L15q8m93K73J38J14j01r2M0j10M4K25
$$ y = [-34, 160, -55, 177, 38, -98, -136, 29, -134, -266, -94, -27, -18, 74, -92, -150, -49, 202, -167, -53, 112, 137, 346, -143, 147, -58, -55, -121, 137, 203, -92, -51, -84, 71, -65, -139, 26, -83, -75, -274, -3, -3, -77, -124, 26, 391, -290, -124, 138, -39, 153, 110, 218, -217, 2, 148, -162, -267, 46, 109, -73, 99, 17, -209, 16, -127, -17, 92, 25, -34, 45, -104, -73, -37, -48, 123, -6, 35, 38, 36, -138, -29, 109, -10, 102, -32, 33, 60, -104, 106, 150, -39, -136, -301, -94, 186, -49, 51, -1, -32, 138, 170, -60, -195, 82, 135, -65, -154, 27, -103, -204, -19, 142, -18, -51, -48, 142, -92, 86, -7, 196, -184, -156, -6, -116, 154, 61, -89, 67, 137, 162, -137, -16, -143, -17, -38, -39, -9, 34, -254, -2, 121, 32, -3, -20, -8, -267, -36, -13, 31, -152, 8, 316, 268, -15, -105, -192, -11, -202, 120, -39, -83, 53, 30, 171, 6, 197, -101, 57, 10, -88, -5, 78, -104, -35, 280, 192, -301, -28, 110, 224, 123, 31, 71, -39, 5, 230]
7438B30n04K59q9R9LJ33j61J93l72K30J1l12L00M8Oj19m8N4j8J75K5l95L51k00
7462a01N1J7M7P7r4K1m4L2j48J77k63nL36J7M5r5j21J14J2M4k31K21o6p4L5j53
7488a49J02O8J6j82J55P2J54k74J1J4j34J70j14J52j80R7J27j88K8j91M5M66k93
7511b8R1p2k80M36j36m1N0n0M6J99o3m05J04L55k84J12N6Jl8j48K70j6k14M6o2
7536g1M7L0j81J61K4j6J8R5j70K54j35q7K7O1J35j89J00l33J82Q3K21m99L11o0
7560Hn1L2o1j16L06j06J37P4k56J02oj40MN9k15L82j03Lk15K20j37p6K73K0J89
7585C27k59j21K21k73j0L5K69j92J58j13k27J85j6J25N6k40J34m4J09k20j04J72
7607b8N3lp4nL8R3k27K67L8q8j72K48j10j51o9K63l7J86k33j03J69k50K27N4L6
$$ y = [230, -274, -15, -104, -5, -2, 131, -30, 163, -209, 21, 32, -280, 20, 68, 74, -45, -93, -39, -57, 118, 143, -252, 99, -101, -50, -33, 14, 91, -3, 18, -26, 6, -142, 35, -228, -233, 103, 120, 165, 70, -51, 63, 75, 119, -112, 109, 43, -31, 4, -149, -47, 21, 37, -145, 10, 82, 236, -38, -27, -13, -147, 23, -91, 61, -119, -22, 105, -83, -55, -246, -201, 265, -28, 63, -9, -289, 147, 11, -30, 20, -30, 16, 215, 152, -253, -149, 206, -78, 34, 90, 91, 53, -95, 175, 159, -55, -9, -71, -24, 6, -175, -14, 10, -6, 12, 107, -63, 191, 56, -31, -4, 57, 192, 3, 103, -230, -48, 35, 256, -243, 68, 8, -43, -11, -72, -188, 118, 12, 149, 223, -33, 69, 63, -77, -73, -14, -229, 153, 50, 53, -162, 58, -79, -155, 118, 138, 327, 68, -53, 168, -105, -115, -80, 189, -3, 155, 42, -185, 0, -16, 109, 165, -75, 59, 15, 124, -96, -200, -28, 25, 22, -52, -57, -19, 74, -153, 114, 152, 64, -108, 140, 30, -121, -190, 73, 36, 222, -11, -114, 55, -195, 32, 86, 122]
7632A22k71J53K3q8PP5P6M2L4q4J11l13R1L8k88K94l60L00J7J40k04L3J3q9J86
7657E8O9l5K51l64J32p4j94J48n4N9R5j9q7N5j05K5O4J87j20k7o7o0J26J57k68
7682d8j67O6J64K1m0J19N6m8q1k9J20p1M8m7J11J9j33j53P1N5j13N6j56O4J29
7707A3r0J3Q4j24K75PnJ89k60k91J03m3K08J22l48M32l42K35k52J01K0k83J57
7730g9QJ39k23J89N7m1r9j24J97j74J19k59K99p9%J58n6k0PN7l49R3J64N7j4J45
7756A72j89lM7J6r9J4Q4J76jl22jJ52j17M1J8J49j64j2J37k85K66k12p8K30k05
7781a86L0K90j43J17k51J32J30j85rJ17j32K13J56l94J79j5L5n0Q0l05o7L59m59
7804c58M67k27J01J06k0k80K63n1k94K68J93l95L66p0j79J68o8L6K10l46O3kK9
$$ y = [122, -149, 4, 27, -61, -54, 21, 97, 139, 173, 89, 200, -113, -22, 16, -272, 22, -338, -38, -21, 119, -85, -52, -39, -128, 58, 127, 92, 343, -21, 111, 37, -157, -9, -63, -4, 91, 72, -15, 40, -65, -40, 24, 211, 91, 64, -3, -63, 63, 220, -48, -215, -149, 15, 36, -4, 115, 171, 123, 42, 13, 133, 62, 110, 63, 174, 193, 60, -93, -22, 33, -80, -24, -180, -116, 13, -77, -64, 20, -104, 171, 178, 173, 362, 102, -189, -86, -129, 79, 201, -147, 285, -57, 178, -74, 27, 47, -236, -79, -71, 68, -155, 34, 91, 50, -49, -173, 24, -150, -31, -290, 9, -70, -70, 88, 32, 12, 19, 76, -273, -180, -16, 41, 27, 172, -17, -20, 27, 43, -56, -42, 42, 218, 217, -105, -106, 46, -71, -30, -12, 137, -27, -39, 98, -187, 79, -133, -211, 19, -186, -156, 134, -9, 108, -143, -11, 119, -66, -75, 42, -90, 123, 279, -115, 64, 49, 84, 34, 114, -191, -258, 101, -358, 109, -118, -17, 89, 69, -211, 52, 1, -293, -25, 168, -227, 139, 69, -110, 58, -10, 26, 236, -110, -47, -49, -20]
7827b0rj22K76K55l29N8k36J95Q5k03K3k4J52l07K31J29Rq7k33K14R7l41J87l7
7851c7N2K9K35o2j99K7J37k20J74j23k12K6J96M2k3J7n0j6K82l28N4K73k70O4
7875F8l6r4K20k23J31j48p9L63k21K66l68J56pJ13k69j29K15L64k89Q7ko4j01
7898d7j4m1Q9j0j85L01oJ87mj45j78l5m9L82n8k72L64j87kM8j66q3J46n5k2K11
7924A69j98nj31J37L4J02k95L03J02l05q9L33k41PM09l10j21K33j39l12M82k70
7946a05N7o5J6L4k0O3Qn9j60K85k29j09K33K42k10j35m2L39J25m19Q9O8R3k24
7970a25Mj09N07k19l22L84J03l30K65kj59l5n5J72k74M28M4k58J15k37L79j23
7992A53q9P3k83L32N0j69n1j88J44K10l40J94r9n3J72J80j11j09J33k38J82j52
$$ y = [-20, -29, -151, 125, 380, 51, 109, -127, 68, 153, -50, -27, -51, 101, -206, 25, 154, 163, 76, -157, 57, 154, -187, 0, -37, 15, 44, 279, 217, 18, 45, 182, -38, 136, 13, -199, -173, 23, 65, 42, 59, 9, -7, 275, -53, 1, 274, 4, 68, 32, -62, 158, -65, 66, -82, -161, 202, -19, 247, -121, 35, 28, 141, -128, -257, -42, 322, 33, 120, 118, 54, -47, -61, -102, -13, -23, -208, 93, 87, 274, 270, 125, -53, -88, -137, 245, 187, -85, 279, 92, 90, 138, -28, -111, 35, -20, -42, 169, -29, -34, -165, -28, 6, 108, -187, 116, 218, -87, -176, 157, -84, -77, 332, 22, -99, 134, -5, -317, 165, -105, -48, -113, -97, -63, -83, -20, -12, -71, -231, 54, -175, -284, -51, 191, -19, -154, -196, 143, 268, -151, -62, 6, 99, -125, -121, -230, 277, 58, -264, 120, 223, -107, 158, 156, -3, -38, -93, 79, -195, 233, 277, 19, 134, -103, 276, 153, 64, 137, -146, 186, 236, 67, 16, -172, -28, 182, -158, 36, -63, -116, 56, 236, 125, 16, 149, -89, 93, -59]
8014e9M9K64Q7k33k9J30o2j68R2J8o3J9q3jJ30J02m19J99J74o3K6n6Q1k45m2L39
8040A87Oj41k43J39K37j66O5q6J96l21K30j86l7J58j16J25r2j26J84j40n1K56
8062G8m5J40k48k7L4L14L3k73K0j22J09j54K85l06K35j63J84O7l0j82J08R9l26
8085a70L8k3J43J34l47L04j18K75j22l64M77k45J48j31Krn6Q0l55N00j30P8j97
8108h8J62l4l39K99j33J73L58o39J37J38n9k29M83k66RP4q5J57m8Mj24K69k59
8131d0K26k34L48m89J9J83n9Ko0L17r4l5j57L02j96Q5j62J46K61m29j2J48j00
8154c0j52P2M0p2j07L44rk03L00k12K2K29k65J24j70K7L2j24K27q8J22o6n9P9
8178F1J29k72L27l7l48j98M48P2n1j02k25L54j32
$$ y = [-59, -10, 254, 341, 108, 79, 209, 147, -21, 71, 89, 26, 45, -38, -39, 91, 193, -226, -27, 147, 84, 110, 54, 135, -110, -152, 187, 193, 52, -191, -52, 185, 19, 84, -2, 194, -127, 103, -83, -120, 38, -78, 47, -45, -171, 13, -127, -178, 78, 33, 173, -75, -102, -68, 246, 279, 6, 26, -96, 13, -141, 144, -162, 73, -90, 94, 161, 131, -51, 57, 156, -170, -132, -155, -12, 122, -225, 79, -39, 236, 114, -250, 227, -18, 130, -1, 1, -8, -64, 16, -339, 161, 31, 109, -88, 74, 40, -299, 0, -133, 40, 398, -241, -104, 34, -25, -254, 229, -37, -28, 46, -39, 118, 70, 74, -50, 219, -40, 186, -48, 300, -189, -170, 13, -46, -44, -104, 213, 119, 84, -73, 229, 33, 118, -44, 102, 363, -66, -78, 70, -30, -182, -110, -70, -142, -249, 95, 86, -117, 183, -29, -7, 222, -43, 81, -89, -62, -30, -154, 73, -15, 107, 41, -18, 61, 190, -82, 245, 208, -140, -338, 110, 182, 131, 29, -196, 158, 26]
8191B6
$$ Imaginary data points
##PAGE= N=2
##DATA TABLE= (X++(I..I)), XYDATA
0@%%%%%%%%%%%%%%%%JrJ6j6J6j6K1k9L2l3M1m8N6o4P2q2R1j05J20j36J53j70J87
39I8k09K33k58K87l18L52l90M30m74N24n77O35o99P71q50R39j043J159j290J442
59G62j624J845k115K454k900L511m401N831q477J4955n8423q1541J27117L9637
73C6631k9141O4796O0941n5474q252L3047l6634j4529L8591p2277r9612L9644
85d2269L6394o7254J7947Q2851m3398p6691L2785J6851k7957L8324K5557n2881
97e9741J6022P4865r507J24R3040P033r9935j1032M4262l1935j3776M2741k3955
110B8206m8050J9970m993l7419M1012K7782q6235m5266N4342m226l7145N8420
122c3602N5402k8363O45L8734n694P525L8774k9359m6766L4416J3882n0875J7330
$$ y = [0, 0, 0, 0, 0, 0, 0, 0, 0, 0, 0, 0, 0, 0, 0, 0, 0, 1, -8, 8, -8, 8, -8, 13, -16, 16, -17, 24, -24, 32, -32, 40, -42, 49, -56, 64, -72, 81, -89, 98, -111, 122, -136, 151, -167, 185, -205, 225, -249, 275, -302, 333, -366, 405, -445, 494, -549, 610, -680, 762, -862, 983, -1132, 1322, -1578, 1933, -2468, 3363, -5114, 9841, -48582, -130123, -3006, 36631, 7490, 72286, 133227, 77753, 69501, 102548, 65914, 51385, 89976, 17699, -81913, -42269, -5875, -73129, -55182, 27669, -15729, -92420, -59635, -42784, -70741, -32417, -6860, -59741, -43719, 31146, 21639, 21763, 114803, 121836, 21901, 10869, 55131, 23196, 9420, 52161, 28206, -19844, 126, -4867, -42286, -1274, 26508, -59727, -104993, -50651, -54877, -92022, -33602, 21800, -6563, -5918, 32816, 27122, 34647, 73421, 44062, -2704, 31712, 45594, -5281, 12049]
135A2049O1697l2752n6513J5797N90l9758K881Q690l2679J202K5922k0292N380
148d7786O9570J2152m7526J3551L2819l0908j3125M1275Q797j6622J4258R39j5012
161B2382K4152R463n0565k1709J9736l0862m2033K9825K9817k5021o335K4352
173a6798l11M66J7776q794j1770K3697K785k3468K7489M8309j2376k2406K2865
186D7464L703l2432j0220J340j7641q282j546j8490L480K9947n971k6204J5436
199a9416J6610k7741j3550K6249J1649n485J1959J5209Q719J6764M821j5732K056
212C2112R055k6835k6466J5581J0571k1241p213J4771n64j2690n257o952l890
225b9018K822r785r759K1589K5622m426J340K8154J2236j5150m543P618k630q658
$$ y = [12049, 73746, 40994, -15519, 278, 868, -38890, -36009, -27319, -59998, -58796, -32874, -53166, -47786, 21784, 33936, -13590, -39, 32780, 1872, -11253, 30022, 38819, 22197, 36455, 37394, 22382, 46534, 55997, 5432, -16277, 3459, -27403, -69436, -39611, -9794, -34815, -41150, -16798, -17109, -16643, 1133, -7661, -19431, 4266, 7051, -16417, 11072, 59381, 47005, 24599, 47464, 51167, 18735, 8515, 9855, -7786, -16068, -17614, -36104, -32624, -2677, -8648, -34852, -19416, -2806, -30547, -44097, -17848, -6199, -11684, 275, 15484, 24203, 40967, 45788, 30056, 32112, 41167, 14332, -12134, 3447, 14018, -7223, -14436, 335, -229, -12919, -18176, -25128, -29018, -26196, -35981, -45740, -24151, 1471, -2955, -1615, 26539, 38775, 23625, 19082, 26700, 24070, 15412]
239A5412o333k930P547P360j1544j0494R695r87k7035j5387P966K9j2493J063
253c8131J5450J3914O921J631N323J2658L221j4578n084J3891N126j0696J612
266A1258J6091M463j0997q487j214m210j4523j7960n100P921M73q264N717J8845
280e987O360q513j96J0641J995r375l156J1020J3098K659k499Q494J1281n021
294C0801j7059p514J253q820j6947n207R314M932n935k130R681P353p060j0234
308a7572K828P869k530n158R435J9131Q158l553J718Q754j373j5108j1805J098
322A892R82q913p212O965R319l648r438N58N941m815j2628k740R062N483k693
337a1885M798J6421J2037k914n304L780L569j0490j2746J230Q395q03o729J695
$$ y = [15412, 9079, 6149, 13696, 21056, 9512, -982, 8713, 7726, -19309, -34696, -26730, -26701, -39194, -38131, -22681, -8767, -1846, -215, 5108, 17766, 20987, 6409, 1325, 15216, 20342, 9646, 11258, 27349, 31812, 20815, 12328, 11114, 6904, -7619, -25579, -30679, -22758, -22285, -30549, -24832, -5987, 373, -8140, -8336, 2305, 4300, -5075, -8231, 2789, 15887, 18546, 16047, 24541, 35822, 30801, 13742, 6228, 7481, -1339, -18286, -23493, -14179, -9247, -15182, -17312, -7631, -278, -7338, -17572, -14744, -6875, -9405, -14563, -5128, 14003, 22161, 18608, 20326, 29080, 27707, 12599, 794, 1892, 2874, -6039, -13251, -6286, 3033, -615, -10053, -9495, -3554, -8369, -20997, -23737, -14675, -9192, -11885, -7087, 9334, 21371, 18457, 13153, 16933, 20502, 10012, -2734, -1504, 6891, 6088, -641, 1054]
351A054Q172p74j1880q820K260K21j0352p387Q355J1788Q82n24J1053J2507j584
366A4971p790j377M432j398q298j930J0721P990n298o449M956J762j3491j2826
380a4025K73K015n289o114L777J1005O839j647k17J0254M469j0089p269Q520O081
395H583n842o27J0313P857j728n921l680J43n060j4142q937P445M944q828j446
410a6926J3183N469p066j579N398J482m010m808N5R501R198k992J569J3820K300
425B4594j4702o184N825l831j2107l267K698J715J599j763l43P132N33j4274n534
440a7909J1476K053j0382M231J3990K619j420O370N628J084k474j1339p774O839
454B992J773j1124J773J4390l023j3415L071P023n439p315l219k900K410N405
$$ y = [1054, 9226, 8452, -3428, -12248, -9988, -9767, -20119, -27506, -19151, -7363, -6481, -7005, 4048, 16555, 14971, 7181, 5804, 10236, 8838, 540, -1390, 9331, 17321, 12023, 5574, 10530, 12292, -1199, -14025, -13752, -11737, -17026, -23140, -19363, -8358, -1519, -3166, -3383, 6871, 11340, 1251, -6018, 2502, 8583, 2741, 2114, 12427, 20284, 18556, 12635, 8955, 9098, 4038, -10104, -19041, -11596, -6652, -15480, -16926, -3743, 1726, -5340, -6919, -1521, -39, -4049, -8857, -8802, 699, 9897, 6905, 8474, 22294, 24594, 9892, 3708, 9533, 5702, -6405, -9672, -6974, -5259, -3660, -5423, -5766, 1366, 1899, -12375, -17909, -6433, -4380, -14762, -10531, 3459, 6078, 4658, 11028, 16656, 17740, 15266, 3927, -3847, 2992, 4765, -6359, -4586, 9804, 6781, -6634, -3563, 3460, -1979, -9294, -12513, -15413, -13003, -7598]
468g598j524N024J6470J661j4055J975J2119n679j1182M139L218n633J29M120
482C184K603O757m66j5690n616Q584m861j2857P168J1733p207n111J1144P483
496F848M49Q36n552o549L620J72p956P523J6068n759j2843Q340Q539q867n360
511d91J760o116o525j89j398N682J4716j51j3367M184R956r008p806J0505L216
526D968j0890p80P448M508O619L058q851m029M171q934j1573J0593R039j2045
540f698o519J1107N045k575L573M71n569k515l797o043R402J4309n524p788J0689
555G568N812r876j317Q076m818j0962l237p10L693J0017K72p135M684M205j1892
570e620n861J2356K303j2895j595Q174K807L399O198j92p02P19r744q105R775
$$ y = [-7598, -9122, -4098, 12372, 14033, -22, 1953, 14072, 8393, -2789, 1350, 4568, -1065, -936, 3184, 5787, 12544, 12078, -3612, -9228, -644, -5505, -18362, -11194, 539, -6668, -11779, -635, 6848, 7297, 8133, 2581, -3968, -348, -176, -8132, -609, 15459, 9700, -3143, 5197, 13736, 4869, -491, 1269, -4847, -11372, -11561, -12959, -7277, 7439, 7288, -6079, -1895, 8061, -947, -8753, 1752, 4968, -5922, -6702, 746, 5254, 11873, 14931, 6080, 2051, 6222, -2712, -14285, -3692, 5347, -6698, -13217, -2110, 2935, 360, 3933, 4404, -1165, -3680, -7477, -13520, -4118, 10191, 4667, -3121, 7568, 13380, 3504, 2187, 10263, 5445, -5517, -8754, -9464, -5771, 4246, 4518, -2617, 2067, 6272, -5620, -11481, 875, 3178, -9717, -11312, -3138, -331, 3068, 9266, 9074, 8372, 9091, -653, -8758, 1017]
585A017O342j0924l887J0479J109o106M048N580m158o284n834m757N455Q074l690
600c536j866J0645K879r862J414J0767k382j0247k710J048N59M095K033P55N103
615H695K06j1350l453R034o23j1686p33P191j037j864O026N320J202j838o788
630a698l811N942J695p463K37R716o53o490M963Q080k097p151m198k141P16K31
646d122j883K650Q163l0p394J780Q526l002q666n0K854k523j620K678M933M570
662F864q91n745L70M861l767q490J058O072l044l979N490P575L25l634k648M9
678D66Q54l411m511K852O541k072m670N126P082k404n768q3R65l018m696q45M403
695c189M825r33k724M095N300m257o350J861L039l949l858L669N892J480k029
$$ y = [1017, 7359, -3565, -7452, 3027, 4136, -1970, 2078, 7658, 3500, -2784, -8618, -13375, -7920, 154, -3536, -5402, 5243, 8122, -1740, -326, 10441, 8059, -2188, -4898, -3850, -3291, 804, 2837, 3592, 8695, 8901, -2449, -5902, 3132, 2509, -9177, -9910, -2719, -3756, -5620, 406, 5726, 6928, 5090, -1698, -5509, 433, 2128, -5335, -5098, 4618, 3965, -2525, 2438, 10518, 8421, 1270, -2928, -5069, -4353, -4122, -6005, -3355, 4808, 4778, -2616, -836, 7690, 4688, -3978, -4028, -1174, -3697, -5317, -2639, 2294, 6864, 5973, 228, 598, 5459, 1692, -6798, -5740, 332, -2712, -6691, -1201, 6374, 6699, 3065, 417, 466, 1320, -2091, -6602, -3750, 2791, 719, -3951, 1175, 8257, 5853, 85, 2, 967, -2051, -6747, -7592, -3189, 1636, 703, -2021, 2074, 7374, 3117, -3233, -1372, 1667, -2282, -6140, -2471, 3421, 4901, 2872]
710B872o70L301Q59n480n687J870K739m393l518M880O165p29l206J987L175k281
726A884n715j853L742K946k952n91O185M788l243l944J852K269m959n844N73L869
742i93J10k732J213N605J917m592l238K530R69n057l793M460M758n32j339L407
758B693N004j429m956k026K564n51n100k002N262L647k501j793L743K659m139
773A075n136L49K255j767l460K147O212K562k699m83M397R17n747l927K469K211
789A375k873k416L880M812q93l730K01K533k170o167j673L688K142k472J01N642
805A980M268k363l340J658K130l336m872J051M254K43k391Q75M757Q65m877l671
821b769J510N11m372l223L501M806k18j920K763M640n55m776r39K693Q2l650n29
$$ y = [2872, 2202, 5503, 6362, 882, -4805, -2935, -196, -4589, -8107, -3227, 2938, 2209, -997, 990, 4165, 1884, -3831, -5684, -1942, 1004, -1948, -2539, 3646, 8434, 5191, 1247, 3099, 5368, 409, -5435, -4862, -993, -883, -3615, -2402, 3203, 5120, 528, -2710, -180, 789, -4268, -8061, -3601, 1157, 625, -714, 2693, 7697, 6268, 1312, -714, 1850, 1299, -3801, -5803, -541, 3106, 605, -1188, 2555, 5214, 1075, -4061, -3712, -1457, -3224, -6684, -4537, 1675, 4237, 1538, 1055, 5452, 6369, 622, -3305, -836, 1375, -1498, -3914, -34, 4778, 3885, 155, 356, 2889, 719, -5448, -7121, -3433, -1291, -3763, -3662, 1980, 6248, 3885, 545, 2203, 4333, 997, -3875, -2824, 1430, 1673, -718, 157, 4914, 5779, 902, -2769, -1259, -748, -5120, -8343, -4842, -36, -254, -2174, 589, 5229, 4674, -102, -1041, 1652, 1734, -1916, -2445]
838b445M731L291k223j824K407J984m354n766k77K300j629l537J758N563J888
853A867k913l78L627P26m144l090L121K932j331j315L640M570m34l745m32K104
869D805k333n467k217L009R68k397q36L910K845k431l741J504K345k253l942J914
885d317N113J675k082K055L993J314l140l790J693P81l781l593K262M054j341
900H96l484J992L087k592m446j056K120M86k416o67N208M152j063j514L638K621
916F962l478m130R09K753j719k141P86L254J180k853k562J646R29n465m242K927
932e244L084k254j185M691L619n07j734M83J841L61l541k225L948L280k935j189
948D93M770J506m822l254R50r4k563k463m91K638K323j848n55N279K263n233k542
$$ y = [-2445, 2286, 5577, 3354, 1530, 3937, 5921, 1567, -4199, -4476, -2176, -3805, -7342, -5584, -21, 1867, -1046, -1424, 2203, 2929, -1215, -4305, -1184, 1748, 417, -898, 2742, 7312, 6878, 3133, 2701, 4805, 2472, -2995, -5212, -2203, -1235, -3632, -4468, -558, 2287, -144, -3885, -2381, -36, -2289, -6231, -4317, 796, 2471, 389, 2444, 6437, 7751, 4611, 821, 2514, 3295, -486, -4079, -1817, 2237, 896, -2588, -596, 2491, -101, -4547, -5603, -3483, -2997, -5413, -6080, -872, 3280, 2217, 703, 4341, 6962, 3484, -646, 263, 3016, 1297, -844, -58, 3196, 4376, 1523, -1039, 607, 1536, -3929, -8171, -5244, -2160, -4414, -5599, -908, 2711, 2204, 470, 953, 2794, 3155, -386, -2611, 1337, 4617, 1682, 493, 5263, 6769, 1947, -1307, -357, -451, -3014, -5477, -5968, -3330, -1007, -2855, -3410, 1869, 4132, -1101, -3643]
965c643M584Q15l102p7L669J616k1m85m87K240O82o246l822L349M43n296R7N553
983a31O38l134N40J727M62k40k202j660L207K472l598J115P692R34n532NL217
1000E512k478l712l81m89K59M88k285q59N635R17o505o42M673k176n125L024M530
1017C86n33j01K245R70K706J594m184k466M169j744o996J960O360k453m323K342
1033f8J153k539j266r04k124J993P35m295J718Q599L5m685M025M444m175k992
1049c46L486R3j714P91j358n49M576L39o227KM022n371o761M291L436m084k22
1066e596L665L62R07K499j998l72M344j819o176M117O604l660k343N273Q91m901
1082A797P4L74k914m21l28n245M69O434j789m197N213L942o497k191N391K14l051
$$ y = [-3643, 941, 1756, -1346, -1423, 2246, 3862, 3841, 3356, 2869, 5109, 5791, -455, -4277, -928, -485, -5781, -5684, -131, 507, -2627, -2087, -360, 102, -138, -2340, -4000, -793, 1679, -1919, -804, 6888, 7822, 2290, 2295, 5512, 3034, -678, -1059, -1548, -1289, -801, -3086, -3945, 1690, 2607, -3898, -4540, 133, -2043, -7168, -4144, 386, -147, -248, 1997, 2967, 5673, 7267, 3083, 617, 4786, 3042, -3954, -1994, 4366, 1913, -2410, -68, 1085, -1454, -2720, -3624, -5748, -3755, -3020, -7315, -5597, 3002, 3037, -1648, 2377, 6821, 2646, -346, 3140, 3233, 1519, 2310, 952, 403, 4979, 5318, -909, -907, 3115, -2256, -9017, -4726, -1290, -5374, -5596, -1931, -1569, -662, 1837, -161, -533, 3811, 1992, -4184, -67, 6537, 2877, 534, 5807, 6698, 1797, 1871, 2245, -669, -1090, -1418, -6663, -6194, 240, -1549, -5746, -533, 3409, -3088, -5279, 112, 326, -2725]
1099b725K537J202l47L800J251l318K082M371o481o075M652J623o277m4M104j160
1115h05k160K101r00p42K936k684m921L946N171m388o22P986J383n238J325K789
1131E177k008j242K37l574L91L223k913l173N775K246p213j589M925j937m430
1146f105K032K143o26J917J538j213L246L870n013l128N514k71o080J355N161
1161D340k568k572K223j57j229M66k392l449K531J403m719M51P014R4l944K910
1177D02L604j965j625J420p77K54J460k058n94M722P55o031k14L986l277n334
1193e272J676J653j745n24J578J25K495J695k893o66M466j021m594K330M869j806
1209B366j535K910J469j238q51j602j767R00j367l994P91M220j643l333K757L302
$$ y = [-2725, -188, 1014, 667, 4467, 5718, 2400, 4482, 8853, 2372, -3703, 949, 2572, -3705, -3749, 355, -805, -2965, -864, -1764, -2506, 430, -2254, -7175, -3229, 1942, -2446, -3068, 4918, 6301, 1063, 2388, 5177, 3169, 1927, 2164, -1410, -1019, 2204, -709, -3882, 1893, 4139, -3074, -4663, 262, -1675, -6105, -4073, -1930, -2556, -639, 899, -314, 2932, 6802, 1789, -1339, 4175, 3904, -2176, -821, 4340, 1772, -800, 1423, 1266, 37, 503, -1889, -5338, -2807, -1404, -6123, -5672, 1342, 1436, -2508, 402, 4006, 2041, 416, 1836, 1059, 1313, 2773, 715, 121, 4843, 5598, -433, -647, 3339, 62, -5272, -3596, -1943, -3688, -4212, -2634, -2509, -14, 1681, -1212, -1878, 2588, 1567, -3027, -697, 4172, 2366, 831, 3741, 5210, 3972, 3121, 1519, -248, 652, -715, -4709, -3918, 302, -1341, -4674, -1917, 1385]
1225A385k702k236J900O12o14M20k48J850L767l02k426K414K491l092l732J476
1241I63J250k988j487R63J080Q8o36j470L85J746k637k874K193L248k015n72L422
1258F59K567p45m30Q64O06k57k081j570J464J600k118j802K461J372k909k304
1274b623J061N60k395j203M87K034J375j029L49L021J724k287j241K100Q87k432
1290C88p45J832J567p03j326J50J425r04l152j702J687L58k886j39K771J791j664
1307a252r5J913J277j519j336O09J974L9j579M20K849R14k366r26J307m12k927
1324a110j681P30J124j053j090J341K073o6j756J2J681R8k164j07K702J422j074
1341A082k34K306J315j483k332L26P40j636k643L22J887N9j994J45K181K01j942
$$ y = [1385, -1317, -3553, -1653, -1041, -1655, -1235, -1483, 367, 4134, 3832, 1406, 3820, 6311, 3219, -513, 963, 2213, -775, -2262, -1299, -219, -131, -767, -2237, -1852, -106, -2743, -5617, -3424, -176, -2191, -2763, 659, 3226, 2481, 2051, 2915, 3521, 3264, 1183, -387, 1077, 2677, 559, -1243, 1218, 2590, -319, -2623, -1562, -1002, -3397, -4600, -4113, -2079, -704, -1733, -1384, 1637, 3361, 1074, -167, 1933, 2820, 388, -357, 1475, 3042, 2339, 1013, 1163, 2588, 1684, -1468, -3170, -1483, -1125, -4011, -4150, -1379, 412, -1252, -1347, 566, 1843, 324, -1012, -403, 1571, 1610, 31, 451, 3300, 4214, 1848, 922, 2229, 1817, -1110, -2791, -2061, -937, -1990, -3080, -1739, 334, 268, -1488, -1476, 205, 303, -1861, -1968, 734, 2156, 1082, 848, 3154, 4469, 2986, 654, 980, 1720, 84, -2559, -2237, -350, -291, -2285, -2140, 41, 242, -1700]
1358a700r82J079J009r69o42K064K384J51r20R98J287n46k402q34J456l22j835
1375g24p89J529J246j478j661P48J169j541k218O57J851k68q79J266K852N51o18
1392A693o38J386O77j808j873J186J810j350j646J193J710j323k359k07O87n99
1408a461j956n00J195J830m44n59K184K085j335j880J811J056j563p53J205J132
1424B047P32o95r22P06Q89k882k239R49J304k691j275K412J195p33j06R60O47
1441B98N07j444j273K137J550j637o30L166J184k580l37J066K06j833j129q53
1457a602L75R24j335p41K447J043k954q06K741R5k196L5J651L34J23O48J74J839
1475B795P47k235k064K324K85l128l42K680n01k251J027J075m68j02r50j477J244
$$ y = [-1700, -2682, -1603, -594, -1563, -2205, -141, 2243, 2394, 1474, 2472, 3759, 3213, 811, -23, 1433, 1111, -724, -1513, 16, 1262, -216, -1877, -1129, 40, -1501, -3719, -3062, -1211, -1479, -2358, -1092, 1760, 2311, 1693, 1055, 2441, 3118, 1310, -563, 623, 2433, 1083, -563, 630, 2340, 1017, -1342, -1549, -862, -1461, -3417, -3917, -2722, -892, -1336, -1895, 289, 2374, 1039, -841, 970, 2026, 463, -290, 915, 2047, 2779, 2084, 1162, 1868, 2757, -125, -2364, -1415, -111, -2802, -4077, -1665, -470, -1203, -1309, -349, 298, 805, -639, -1912, 225, 1775, 138, -492, 2674, 3858, 1278, 941, 2007, 2213, 380, -749, -1602, -1227, -303, -1638, -2379, 68, 1111, -1843, -2649, 92, 187, -2009, -1974, -323, 11, 134, 782, 956, 2795, 3542, 1307, -757, 1567, 1852, -1276, -1618, 1062, 561, -1690, -663, 412, -56, -158, -1108, -2585, -1341]
1492a341J172j879j21L869K17k589R74L014j248j651N90m32q27N19o71k88K315
1509A623N26l476o89L133j101l156J251J882j849m15J555P58J221J399j875j135
1525c48K362L6l261Q16L430j930k605K142J017j253j49Q5j638k19M01k325L44
1542c095M076o93l170K208L421k548q35K160j14j866N25K26l44K689O65l379L48
1559B74K789k493l114K400J356l735q08K275j23J21J651o88j070K157q72k721
1575b601K020L422k448k171L619J014j894M58J278j625o03l5k526M32K796j407
1591b71k634K136K226k892j182L219m14k467Q30L94M4J788Q45j464J189K292k624
1608A015k442L188P40l423m98K380r15j001J359k28m36R42j270k400J972J762
$$ y = [-1341, -169, -2048, -2169, 1700, 1917, -672, 302, 3316, 2068, 417, 1007, 575, -252, 267, -404, -692, 1623, 2149, -1327, -2016, 1117, 16, -3140, -1889, -7, -1856, -2271, -716, 42, 1263, 2662, 787, -348, 2014, 2050, -1211, -395, 3035, 1105, -1500, 642, 1659, 406, 257, 342, -1296, -1515, -1114, -3439, -3095, 981, 288, -2882, -674, 2747, 199, -636, 1524, 1410, -456, 69, 295, -49, 2640, 3305, -74, 274, 3063, 570, -2544, -144, 1212, -2523, -3331, -1056, -1179, -1058, 593, -95, -1165, 992, 120, -2601, -581, 2841, 393, -1778, 1841, 2855, 961, 1419, 2697, 1072, 469, 434, -2092, -1660, 1136, -271, -2905, -769, 1457, -1435, -2617, 602, 188, -2279, -1449, -1055, -1011, 777, 1622, 158, 1347, 3639, 1015, -1427, 1761, 2501, -922, -1420, 960, 45, -956, 403, 175, -261, 681, -589, -2989, -1017, 745]
1624G45k927p12L764M64k130J122K183j360q74M14j044o4J669r48j351K363J131
1641B445l372l30L112j365k445M78P77j017O89Q94r45J445J727k205j042K980
1657A826o7l108K69K665j305p65J196K77l98L94q42j372J220M33k575m51L040
1674D37j92j971J653J928j181r16N59q7j38M81q00o95K400L79k165M74K053j498
1692G21k474J112O10j157l33N63MQ07O18j310N99J588p24k197Q40K113j319p07
1710f46J411R73m45o04j27l93Q40j007j792L28J751p95j410J506J304j381p94
1727a281R23J98j95l12o4K21J291j82o14J323J448j377j949J435M49j535p31Q80
1745g2K01j32n58k64P37N31r04j539J061P88j183j28J409J033n15l62P05L39k5
$$ y = [745, -2182, -2894, 870, 1334, -796, 326, 2509, 1149, 275, 689, -355, -419, 1250, 302, -1049, 1314, 2445, -927, -1257, 1855, 490, -1955, -1477, -700, -1717, -1028, -134, -1079, 366, 2093, -112, -1154, 1826, 1759, -1349, -1080, 1585, 280, -485, 711, 988, 590, 984, 142, -1230, -10, 423, -2152, -2603, 437, 245, -1726, -73, 1855, 674, -242, 317, 230, 92, 573, -227, -922, 1478, 1857, -308, 166, 2219, 721, -1753, -641, -31, -1188, -1521, -958, -954, -147, 471, -839, -240, 1348, 624, -1573, -733, 1380, 61, -646, 765, 1738, 1293, 689, 562, 169, 1009, 2, -1790, -1462, 289, -506, -1916, -410, 894, -487, -1281, -358, -160, -355, -667, -731, -510, 781, 599, -15, 1308, 2756, 1379, -570, 865, 1314, -221, -952, -72, 129, -3, -561, -825, -88, 443, -461, -2000, -939, -151, -1334, -1462, -53, 980, 465, 103, 808, 1147, 1122]
1764A122p44m81M56M00q52p93J726N82j213p77O10J54r30q63J48Q46J66p48J83
1783a008J720K96o58l87Q82K78j551k66Q55P68o37n08M91Q28L3j188m16N09j39
1802i8j478P9J089N18o51j08J131N13o09r75M99M78l42r22M98J250J20o97l09
1821a4J362k39j405j250P12N56n70p05P83R16K80p97R0J192n12r41M1R17L50q82
1841a16j47J140N23q07l60J25N18r07r83j03R25k60m73J01R67L94j063j50N61
1860a15N78r83m74P84R51M5n27N80J150o48j046j97K79q3p62p19R23M07o01m28
1880h86O29N49o53j235N56Q01q5q00O74J021L62m07J6O65M55j164n42M91L70o97
1900A20r91Q19R41l73j090J21M70n06q88Q8O70K22l51k78R86J140p78n80Q90Q38
$$ y = [1122, 378, -103, 353, 753, -99, -892, 834, 1416, 203, -574, 36, 190, -740, -1603, -1455, -609, -443, -1191, -1008, 712, 1008, 350, -37, 845, 1123, -428, -694, 161, 929, 292, -216, 275, 1103, 1136, -52, -468, 41, -98, -1576, -1497, -408, 110, -541, -649, 482, 995, 386, -589, -90, 388, 46, -876, -378, 872, 992, 295, -14, 1348, 1109, -296, -1546, -834, -278, -848, -1553, -770, 146, 426, -371, -281, 911, 399, -542, -501, 416, 766, -116, -263, 877, 1400, 593, 233, 358, 876, -31, -1014, -1117, -192, -452, -925, -824, 143, 537, -526, -676, -115, 463, -520, -994, -210, 741, 786, 259, 839, 1989, 1341, 295, 98, 377, 294, -468, -1187, -264, 143, -458, -886, -257, 292, -361, -1596, -1040, -239, -324, -1124, -450, 571, 933, 526, 542, 1207, 1662, 498, -44, 447, 817, 120, -871, -52, 889, 516, -574, -453, 17, -489, -1377, -1289, -619, -397, -748, -1026, -40, 1100, 322, -258, 632, 1470]
1920A470j127n47N05N70rn57k46P33L45j242o02M34j2p39o70R07P13p04p9O22
1940b35O25J11q54r0Q90J16o90l03J217M40o16l16M87L65j145o32L95M00n46o68
1960a049j31R97L92o58k29Q32O17j459k30Q31N71m47k00O81O04p9q85j99P04O21
1980A284k067m49J124j75n55K43N10N04j047m40P61M79p4q54j55J110M02p59O43
1999D85J158k13j338n0M78j12n39m77K29M87O0r92M22R29m43j296j56J044n2p19
2019a095O29O53M80m13K04L13O55o4j458r9R83o23o84L59J137n36j044j38L92
2038c49M7l80n17j28J193o02m11P21J623m80j123L97J017m41n43M24M98k37j68
2057E41n27L98O75p87r37K64L55q20r14R19P06j95l52L18L37K32P7n56L74O39
$$ y = [1470, 343, -204, 301, 871, 862, 305, 59, 792, 1137, -105, -707, -273, -285, -1024, -1694, -787, -74, -778, -857, -235, 390, 501, -353, -443, 447, 563, -127, -430, 787, 1227, 611, 295, 782, 1147, 2, -630, -235, 165, -381, -1049, -1180, -183, 209, -449, -678, 154, 771, -688, -918, -87, 484, 37, -163, 518, 1122, 1043, 158, -41, 663, 1284, -783, -1232, -108, -283, -838, -595, -85, 419, -628, -1068, -307, 172, 98, -756, -911, 199, 601, -158, 485, 1643, 1430, 92, 42, 520, 408, -131, -608, -379, 108, 168, -824, -402, 527, 84, -1212, -1368, -324, -376, -1095, -466, 187, 667, 254, 458, 771, 1426, 1362, -96, -195, 788, 165, -519, -160, 977, 441, -603, -741, -349, -302, -682, -1199, -1327, -134, -736, -1147, -426, 1197, 717, -406, -9, 1008, 567, 24, 448, 946, 709, 541, 14, 412, 1087, 300, -637, -373, -18, -838, -1752, -833, -127, -322, -674, -356, -19, 213, 290, -266, 108, 747]
2077G47l42q60P16J381o76q25L38Q23q15m73l99M3j1k91p57Q94P55m98q58O50
2097d58R95j074n66P28M57j55k08M59O45N87m99n10N28Oq51q93Q39M12q70k39
2117f67R89j79n86r6k92K43K94o93j97J331N30o13j14R18M06p38l40M95n7l73
2137B61l82N7M68j8n17n68P55M36j123k97O66J23p71M6R08M63k76r5m4O00K00
2158H92o39l16P33L5r12J01P84K26r07l8j00Q4m43l10l10Q30J15q17M9J056M62
2179E75q94J28P05N1q15J04O42J0M1m86l37J030r3j010j63P52m08j152J62N00
2199f58O10n42M3O27J72l48k43J38R89k86r37O52O00J63n61L07L36m73n15o02
2219e28M12K8k3o76J80P93o19m09N46N04o59o49M96N14M28m15J1N23N43k85m35
$$ y = [747, 405, -455, 261, 1642, 966, 141, 479, 1302, 487, 14, -385, -342, -353, -644, -1401, -507, 248, -250, -1108, -458, 537, -537, -1103, -375, 82, -73, -281, 178, 823, 1410, 911, 401, 929, 935, 84, -809, 30, 442, -428, -667, 322, 143, -443, -539, -831, -588, -294, -987, -1184, 147, 677, 64, -50, 868, 1274, 536, 196, 691, 634, 261, -121, -64, 404, 386, -131, -699, 56, 492, -631, -928, -262, -139, -910, -864, 44, 507, 231, 136, 92, 692, 892, 253, -63, 670, 705, -207, -106, 678, 904, -3, -41, -141, -57, -500, -810, -1120, -290, -175, -992, -943, 113, 575, -319, -191, 514, 565, -250, -146, 496, 506, 547, 61, -276, 754, 661, -349, -512, 240, -168, -1320, -1158, -658, -48, -590, -547, 80, 252, -96, -339, -201, 788, 502, -435, 217, 817, 980, 419, 726, 1062, 589, 74, -528, -116, -88, -111, -787, -607, 186, -433, -842, -296, 208, -451, -1100, -604, -90, 338, -77, -66, 457, 1000, 715, 280]
2240B80N40K09q53o74K63N11m09j34P0L39p1o04q5l3N01l53l85L61N92k69J72
2261c2K41Q14m51n73L06L4J95k41n34O20J65k99m00K14M67o74n72L9M05j61m13
2282h50L25N31N6k12L7J30O84p97k72O72K47k38l86Q82J59j47q40K66L84l82r43
2303f94r9M06J04j74L1K98M90n52k21J65M23l59j22K37N40M2m76J2O65M2p55j05
2325a02K98q8l88m42J83Q11m07l91J89O28j16m77j43N39K30o82J36N79M05n46
2345B16O3K48K01m56o89K02N77n24k75k1L16J22l40m01O59K98m61l95N75L31m42
2366a96J6L93M59j37k73J2K14j71n11j66M54J01l88l89O17Q5l23l32J75L0l55
2387f85r4J11Q49K97o21K46L81Q6j25o00Q02j39l14l06K31L43k47l09J33K42j89
$$ y = [280, 820, 1029, 176, -498, -235, 276, -133, -267, -197, 142, 71, -533, -618, -651, -150, -503, -888, -527, 65, -204, -32, 209, 1023, 572, -1, 305, 339, 534, 293, -241, 379, 544, 245, -155, 59, 526, -148, -720, -681, -276, -437, -850, -525, 6, 62, -150, -113, 17, 701, -96, -368, 304, 551, 313, -73, 809, 968, 821, -19, 247, 631, 249, -694, -793, -387, -283, -457, -426, -128, 362, -190, -411, -246, 177, -182, -304, -67, 473, 515, 39, 51, 716, 758, 3, -102, 196, 108, -280, -722, -539, 272, -135, -526, -337, 291, 175, -302, -445, 94, 324, -358, -222, 357, 762, 216, 279, 527, 728, 272, -417, -215, 362, -162, -437, -458, -142, -20, -360, -761, -102, 196, -265, -660, -85, 246, -196, -180, 213, 672, 535, 262, 274, 488, 317, -194, -360, 94, 195, -193, -582, 35, 120, -203, -535, -360, -330, -685, -779, -668, 181, 478, -143, 103, 484, 570, 445, -155, 647, 508, 194, -112, 119, 462, 215, -94, 39, 281, 92]
2408I2o51q6J48k7j05O4L67L06j43m02N68L24k52l08L07K39p3l60K2P27l7n51
2430A69j17J74J54q14k16N15p7j76oO2N02k28k77Q8K32O3l75P5P15J14k82k57
2452C8N26K19l40m07J95L91p81l17L17M91j04k61m50O80O1m23m06J7R32p49l10
2473f81M72P81M5n20J82M13l77k60j80K93J29o60J0M30J96n40N6j9M61m89j64
2494d22j14N35L30n40O3K99L96n54J59K51n4m44j74L97k2r8k00J14L33k72j89
2515b06o1J26K73n38k65O68K56l95J23M53m9J6m43p1L09J27m79l6Q09n63j71j58
2537b75Q75l62o09k79M49k26K20l44L43M99j37k07J33O94k95p08RP65l63k00R7
2558G9RK93n9m08q2L45j7q19J6L88K24o23L15O31l77j82L48L4k1O2l38M29K70
$$ y = [92, -559, -645, -497, -524, -629, -565, -198, 108, -35, -437, 131, 455, 203, -105, 202, 441, 368, 8, 30, 757, 720, 169, 52, 226, 380, -434, -650, -135, -212, -388, -394, -332, 170, -58, -335, -247, -15, 48, -327, -252, 463, 577, 295, 38, 564, 783, 443, 36, 231, 622, -159, -476, -159, 332, 228, -33, -483, 197, 258, -165, -571, -554, 378, -371, -681, -209, 572, 617, 97, 279, 692, 315, 55, -125, 168, 297, -363, -353, 77, 273, -267, -211, -230, 231, -258, -422, -536, -1, 329, -211, -148, 151, 547, -7, 152, 403, 349, -95, -269, 128, 106, 8, -192, -78, 255, -17, -206, -267, -141, 132, -406, -671, -3, 253, -142, -19, 434, 385, 401, -42, -113, 196, 323, -156, -192, 617, 54, -117, -275, 600, 238, -371, -650, -201, -427, -207, -551, -208, 291, 154, -53, 80, 774, 479, -229, -220, 545, 182, -18, 79, 88, 381, 322, -86, -168, 177, 160, -659, -643, -255, -31, -654, -339, 292, -85, -267, 81, 115, 94, 156, -182, 247, 517]
2581E17k71m65J00J153p38m89K74J0k97k66j1L12L12j49n46L11K44j4n56J96Q47
2602D74o21m2M31j09p3K10R5k34N06l09n29K77M32n25m23P07Qp47L49J93RN9m22
2625b84j47K66L81l89j44O82K73o20L6L59q5l3n03J78J61j97j0p7K22K0l61k15
2647d87M88K14n34n16P87J07l12K01K70J46k79k67k4N31K07n75k65P51n5n65J4
2668a63P8L95l73j20l38L17M0%l47O52L10q51J18N67Q0m14k33N03k96J01O9N6
2690A51j9L4k66k02K46L05n88k80N65j36j02R7J75n6J73l60J45L22j58p6L27K64
2712E61q8o12K36L15Nm56j35J18r9j80j07K2J73K7k43K27M75j90l59J79K92n6
2734A05l41K25J55M47m38J53M3J40m4p55K53J10k81l51P3P65l35j75j49J29J50
$$ y = [517, 246, -219, -119, 1034, 296, -193, 81, 91, -206, -472, -483, -171, 141, -8, -554, -243, 1, -13, -569, -373, 474, -147, -189, 242, 133, 60, 270, 365, 131, 637, 328, -201, 76, 508, -17, -440, 267, 275, -472, -123, 70, 79, 138, -284, -431, -165, 216, -173, -317, 365, 638, 18, 54, 413, 328, 295, -208, -30, 131, -66, -76, -153, 69, 89, -272, -487, 1, 215, -319, -835, -48, 59, -253, -52, 218, 364, 85, -182, -206, 325, 532, -43, -308, 443, 388, -177, -163, -85, 310, -63, -183, -521, -204, -164, -164, -511, 141, 451, -400, -282, 285, 365, -49, -282, 221, -75, 26, 95, 151, 132, 166, -100, -302, -56, 249, -339, -619, -54, -190, -292, -195, -20, -76, 97, -263, -118, 204, 46, -30, 297, 561, 473, -139, 97, 412, 417, -39, -174, -56, -155, -335, -442, -420, -247, -220, -463, -236, 239, 49, -310, -131, 161, 105, -236, -11, 144, 591, 153, 306, 349, 489, 445, -310, -57, 53, -228, -579, -506, 259, -76, -251, -400, -271, -121]
2755a21l82J31J18M50m48N2K51M04j14m85L22M27l90o4l41L42J39m75l9L23K67
2776C67l91l95kL94k95k52O9N97N8l36J16N09j22k18p5K30J6k44r5J97L25o33
2798a80L15l33K00O3m50K94k44K96l97m2O43j7k60o4L40K09n20L3J02J02N2J1
2820A53j22M09j33m72l9M36k06l06k06K50Q5r4k3K98m3R8k94J36M14l86j9mK00
2843A32L65o38L17J66p9l89l9K89J0l43o8N3K55k65k41K00K13n4m28k0N11J71
2865A18N7j05L39%k11l25K01N44m77l64K24J93k33p3J9K35K1l08m03L17Q3Q6l33
2888c95R9K16p4J33o7N25L3k14l3K15j76k56l0K53J58n93K7n4K61o5n0j79L45
2911G9j24l45l9L42j0m7m6M65M7l8k21K09K70m99N9j53K45J30k15j58K66j32j39
$$ y = [-121, -503, -372, -254, 196, -252, -200, 51, 455, 341, -144, 178, 605, 215, 151, -190, 152, 291, -184, -223, 100, 367, -24, -419, -421, -27, -322, -574, -505, 92, 150, -186, -70, 439, 317, 99, 24, 254, 270, 26, -69, 128, 453, -180, 135, -198, 2, 65, -385, -91, -335, -39, -436, -478, 165, 148, -112, -176, 164, 373, -147, -114, -12, 90, 142, 153, 31, 440, 307, -165, -204, 232, 26, -280, -486, -236, -151, -245, -268, 30, -13, 85, -209, -73, 341, -45, -64, -68, 132, 497, -141, 176, 342, 263, -126, -165, 124, 134, -209, -277, -224, 31, -234, -475, -275, -62, -116, -544, -564, -53, 118, 175, 70, 409, 409, 198, -127, 74, 618, 141, -223, 1, 194, -39, -112, -93, 142, 163, -145, -548, -231, -148, -62, -395, -296, -80, -154, -21, -88, 437, 470, 256, 223, 438, 262, 6, -24, 229, 387, -206, -179, -233, 28, -37, -87, -266, 79, -45, -390, -429, -87, -97, -144, -190, 275, 322, 284, 63, 272, 542, 43, 102, -51, 194, 324, 109, -49, 217, 85, -54]
2934e4r7k05L24k30k10J93M35r4l13J40K97J21m02J57O3P1j72j34M16L8m0m73
2956a69M19J62n66J8R0j44J22j41q3J97j78J42J05J55J05k66l3K43j21K12m1o2
2978A66J20k19q3p7K38j76n36J85K70L14m85K1K06%J80l95K52R0o1l01K26M32
3000C67k07r4M9L35k47j04j26J31J31j99j59K41j54J57l83P2Q5J47m82K9M37N4
3022H0k09M02k23M26m32j49N14k20Q6k37j02K76m4m88L13K12k45j82M7OJ16j85
3044b38j10J06K30j93n4K56K64j0l09j02O82j71m07J55L18j55j40j33O3R6k30
$$ y = [-54, -151, -356, -32, -262, -472, -279, 156, 62, -251, -111, 186, 307, -95, 62, 125, 196, 24, -110, 306, 344, 304, -169, 250, 412, -154, -136, -46, -190, -68, -209, -292, -95, -273, -131, -26, 129, 234, -32, -65, 178, 57, 269, 228, 166, 286, 67, -16, -93, 145, -31, -567, -382, -112, 202, -283, -262, -56, -56, 124, -271, -19, 71, 10, -291, -65, 367, 160, 66, 115, 450, 203, 99, -27, 104, 235, 36, -123, 118, -36, 121, -262, -190, -105, 42, -440, -411, 26, 80, -129, 273, 50, 476, 44, -105, 409, 189, 275, 38, -64, 212, 168, -320, -7, 205, -40, -222, -175, -169, -53, -238, -348, -242, -12, -205, -259, -3, 261, 251, -58, -160, 522, 351, -56, 99, 417, 262, 122, -11, 52, 148, -82]
$$ [...]
8191c5
##END NTUPLES=NMR FID
##END=
