##TITLE=1H_LR-743-R2-C1
 CDCl3
 8 sc, 
 14.1.2022
##JCAMPDX= 6.0         $$ Bruker NMR JCAMP-DX V2.0
##DATA TYPE= NMR FID
##DATA CLASS= NTUPLES
##ORIGIN= UXNMR, Bruker Analytische Messtechnik GmbH
##OWNER= root
$$ XWIN-NMR		Version 3.5
$$ Fri Jan 14 15:24:48 2022 Russian Standard Time (UT+4h)  she@DPX200
##.OBSERVE FREQUENCY= 200.131346
##.OBSERVE NUCLEUS= ^1H
##.DELAY= (6, 6)
##.ACQUISITION MODE= SIMULTANEOUS
##.ACQUISITION SCHEME= undefined
##.AVERAGES= 8
##.DIGITISER RES= 18
##SPECTROMETER/DATA SYSTEM= spect
##.PULSE SEQUENCE= zg30
##.SOLVENT NAME= DMSO
##.SHIFT REFERENCE= (INTERNAL, DMSO, 0, 15.7039)
##AUDIT TRAIL= $$ (NUMBER, WHEN, WHO, WHERE, WHAT)
$$ ##TITLE= Audit trail, XWIN-NMR		Version 3.5
$$ ##JCAMPDX= 5.01
$$ ##ORIGIN= Bruker BioSpin GmbH
$$ ##OWNER= she
$$ F:/spectra/data/she/nmr/H-F/1/audita.txt
$$ ##AUDIT TRAIL=  $$ (NUMBER, WHEN, WHO, WHERE, WHAT)
(   1,<2022-01-14 15:23:34.17 +0400>,<she>,<DPX200>,
      <created by zg, POWCHK disabled, PULCHK disabled
       configuration hash MD5:
       00 E9 B6 7A A2 85 ED C7 34 08 36 98 17 FE 4E 26
       data hash MD5: 16K
       42 51 23 2F 37 4E BA 3D A6 1E 6E BB 3C F5 19 20>)
$$ ##END=
$$ 
$$ hash MD5
$$ EA 35 53 92 8A 3C CF 7D 14 85 71 5F 79 D5 FD CF
##$RELAX= 
##$RELAX= 
##$RELAX= 
##$RELAX= 
##$RELAX= 
##$RELAX= 
$$ Bruker specific parameters
$$ --------------------------
##$DU= <F:/spectra>
##$EXPNO= 1
##$NAME= <H-F>
##$PROCNO= 1
##$TYPE= <nmr>
##$USER= <she>
##$AMP= (0..31)
100 100 100 100 100 100 100 100 100 100 100 100 100 100 100 100 100 100 
100 100 100 100 100 100 100 100 100 100 100 100 100 100 
##$AQSEQ= 0
##$AQ_mod= 1
##$AUNM= <au_zg>
##$AUTOPOS= <>
##$BF1= 200.13
##$BF2= 200.13
##$BF3= 200.13
##$BF4= 200.13
##$BF5= 200.13
##$BF6= 200.13
##$BF7= 200.13
##$BF8= 200.13
##$BYTORDA= 1
##$CFDGTYP= 0
##$CFRGTYP= 5
##$CHEMSTR= <none>
##$CNST= (0..31)
1 1 145 1 1 1 1 1 1 1 1 1 1 1 1 1 1 1 1 1 1 1 1 1 1 1 1 1 1 1 1 1 
##$CPDPRG= <>
##$CPDPRG1= <>
##$CPDPRG2= <>
##$CPDPRG3= <>
##$CPDPRG4= <mlev>
##$CPDPRG5= <mlev>
##$CPDPRG6= <mlev>
##$CPDPRG7= <mlev>
##$CPDPRG8= <mlev>
##$CPDPRGB= <>
##$CPDPRGT= <>
##$D= (0..31)
0 1.2 0 0 0 0 0 0 0 0.06 0 0.03 0 0 0 0 0.0002 0 0 0 0 0 0 0 0 0 0 0 0 
0 0 0 
##$DATE= 1642159413
##$DBL= (0..7)
120 120 120 120 120 120 120 120 
##$DBP= (0..7)
150 150 150 150 150 150 150 150 
##$DBP07= 0
##$DBPNAM0= <>
##$DBPNAM1= <>
##$DBPNAM2= <>
##$DBPNAM3= <>
##$DBPNAM4= <>
##$DBPNAM5= <>
##$DBPNAM6= <>
##$DBPNAM7= <>
##$DBPOAL= (0..7)
0.5 0.5 0.5 0.5 0.5 0.5 0.5 0.5 
##$DBPOFFS= (0..7)
0 0 0 0 0 0 0 0 
##$DE= 6
##$DECBNUC= <off>
##$DECIM= 32
##$DECNUC= <off>
##$DECSTAT= 4
##$DIGMOD= 1
##$DIGTYP= 9
##$DL= (0..7)
0 120 120 120 120 120 120 120 
##$DP= (0..7)
150 150 150 150 150 150 150 150 
##$DP07= 0
##$DPNAME0= <>
##$DPNAME1= <>
##$DPNAME2= <>
##$DPNAME3= <>
##$DPNAME4= <>
##$DPNAME5= <>
##$DPNAME6= <>
##$DPNAME7= <>
##$DPOAL= (0..7)
0.5 0.5 0.5 0.5 0.5 0.5 0.5 0.5 
##$DPOFFS= (0..7)
0 0 0 0 0 0 0 0 
##$DQDMODE= 0
##$DR= 18
##$DS= 0
##$DSLIST= <SSSSSSSSSSSSSSS>
$$ [...]
##$SUBNAM2= <"">
##$SUBNAM3= <"">
##$SUBNAM4= <"">
##$SUBNAM5= <"">
##$SUBNAM6= <"">
##$SUBNAM7= <"">
##$SUBNAM8= <"">
##$SUBNAM9= <"">
##$SW= 18.0517287032376
##$SWIBOX= (0..15)
0 0 2 0 0 0 0 0 0 0 0 0 0 0 0 0 
##$SW_h= 3612.71676300578
##$TD= 16384
##$TD0= 1
##$TE= 0
##$TE2= 300
##$TE3= 300
##$TEG= 300
##$TL= (0..7)
0 120 120 120 120 120 120 120 
##$TP= (0..7)
150 150 150 150 150 150 150 150 
##$TP07= 0
##$TPNAME0= <>
##$TPNAME1= <>
##$TPNAME2= <>
##$TPNAME3= <>
##$TPNAME4= <>
##$TPNAME5= <>
##$TPNAME6= <>
##$TPNAME7= <>
##$TPOAL= (0..7)
0.5 0.5 0.5 0.5 0.5 0.5 0.5 0.5 
##$TPOFFS= (0..7)
0 0 0 0 0 0 0 0 
##$TUNHIN= 0
##$TUNHOUT= 0
##$TUNXOUT= 0
##$USERA1= <user>
##$USERA2= <user>
##$USERA3= <user>
##$USERA4= <user>
##$USERA5= <user>
##$V9= 5
##$VALIST= <valist>
##$VCLIST= <CCCCCCCCCCCCCCC>
##$VD= 0
##$VDLIST= <DDDDDDDDDDDDDDD>
##$VPLIST= <PPPPPPPPPPPPPPP>
##$VTLIST= <TTTTTTTTTTTTTTT>
##$WBST= 1024
##$WBSW= 4
##$XGAIN= (0..3)
0 0 0 0 
##$XL= 0
##$YL= 0
##$YMAX_a= 19528
##$YMIN_a= -25459
##$ZGOPTNS= <>
##$ZL1= 120
##$ZL2= 120
##$ZL3= 120
##$ZL4= 120
##$ABSF1= 10
##$ABSF2= 0
##$ABSG= 5
##$ABSL= 3
##$ALPHA= 0
##$AQORDER= 0
##$ASSFAC= 0
##$ASSFACI= 0
##$ASSFACX= 0
##$ASSWID= 0
##$AUNMP= <proc_1d>
##$AZFE= 0.1
##$AZFW= 0.1
##$BCFW= 1
##$BC_mod= 2
##$BYTORDP= 1
##$COROFFS= 0
##$CY= 11.3945322036743
##$DATMOD= 1
##$DC= 2
##$DFILT= <>
##$DTYPP= 0
##$F1P= 2.36226072786647
##$F2P= -0.459571619588291
##$FCOR= 0.5
##$FTSIZE= 0
##$FT_mod= 4
##$GAMMA= 1
##$GB= 0.15
##$INTBC= 1
##$INTSCL= 1
##$ISEN= 128
##$LB= 0.24
##$LEV0= 0
##$LPBIN= 0
##$MAXI= 10000
##$MC2= 0
##$MEAN= 0
##$ME_mod= 0
##$MI= 1.114404
##$NCOEF= 0
##$NC_proc= 0
##$NLEV= 6
##$NOISF1= 3.799351
##$NOISF2= 2.8
##$NSP= 1
##$NTH_PI= 0
##$NZP= 0
##$OFFSET= 15.70392
##$PC= 1
##$PHC0= -15954.77
##$PHC1= 19.00078
##$PH_mod= 1
##$PKNL= yes
##$PPARMOD= 0
##$PSCAL= 0
##$PSIGN= 0
##$REVERSE= no
##$SF= 200.130013532006
##$SI= 16384
##$SIGF1= 3
##$SIGF2= 2
##$SINO= 400
##$SIOLD= 16384
##$SREGLST= <1H.CDCl3>
##$SSB= 0
##$STSI= 0
##$STSR= 0
##$SW_p= 3612.71676300578
##$SYMM= 0
##$S_DEV= 0
##$TDeff= 0
##$TDoff= 0
##$TI= <>
##$TILT= no
##$TM1= 0
##$TM2= 0
##$TOPLEV= 0
##$USERP1= <user>
##$USERP2= <user>
##$USERP3= <user>
##$USERP4= <user>
##$USERP5= <user>
##$WDW= 1
##$XDIM= 8192
##$YMAX_p= 0
##$YMIN_p= 0
$$ End of Bruker specific parameters
$$ ---------------------------------
##NTUPLES= NMR FID
##VAR_NAME=  TIME,          FID/REAL,        FID/IMAG
##SYMBOL=    X,             R,               I
##VAR_TYPE=  INDEPENDENT,   DEPENDENT,       DEPENDENT
##VAR_FORM=  AFFN,          ASDF,            ASDF
##VAR_DIM=   8192,          8192,            8192
##UNITS=     SECONDS,       ARBITRARY UNITS, ARBITRARY UNITS
##FACTOR=    0.0002768,     1,               1
##FIRST=     0,             0,               0
##LAST=      2.2672688,     0,               0
##MIN=       0,             -25459,          0
##MAX=       2.2672688,     19528,           0
$$ Real data points
##PAGE= N=1
##DATA TABLE= (X++(R..R)), XYDATA
0@%%%%%%%%%%%%%%%%%%%%%%%%%%%%%%%%%kJ0j6J6j6J6j6J6j6J6j6K1k9L2l2L2
49A6l5M3m8M9n6O3o9P7q7R8j10J28j50J78k18K74l61N14q14J623p366j9208K6475
72A016O940j5224J7226N519k9612K697K2592j1446m303J7708j3436j5911K1970
85E736L862k1317J2535J4847k2125m028J9293j1520j1353K2350M395j8473M149
98a649L841j4274Q629J8240j2249r699J0483o232p825J9186N829j9852j032R706
112C102q251M71J5134m185j1716N024Q94o856O772N846q247j09O528o459m155
127f207R065J231o669K766K129o849J30P802R27k919j62k745l370L061M640P6
143B906j088q01k761j452L130K830j779j978Q05p86j763L016L341k770k347J540
$$ plain form
0 0 0 0 0 0 0 0 0 0 0 0 0 0 0 0 0 0 0 0 0 0 0 0 0 0 0 0 0 0 0 0 0 0 0 -2 8 -8 8 -8 8 -8 8 -8 8 -8 13 -16 16 -16 16
49 16 -19 24 -24 25 -31 32 -37 40 -47 51 -59 69 -81 97 -121 153 -208 306 -508 1115 -6251 -25459 1016
72 1016 7956 -7268 9958 15477 -14135 -11438 11154 -292 -4595 13113 -323 -16234 5736
85 5736 9598 -11719 816 15663 -6462 -10490 8803 -2717 -14070 8280 12675 -5798 -1649
98 -1649 2192 -12082 -3453 14787 2538 -7161 3322 -2910 -10735 8451 14280 -5572 -6604 3102
112 3102 -5149 -4678 10456 6271 -5445 -421 473 -6383 389 6235 -2012 -2121 4407 -2052 -6207
127 -6207 2858 4089 -2580 186 2315 -4534 -4404 3398 4325 1406 1244 -1501 -4871 -1810 2830 2906
143 2906 1818 1017 -1744 -3196 -66 2764 985 -993 -188 -974 -2737 279 3620 850 -1497 43
159D3j862k139M857K960l698j07J587m329m31O154q69m245L234N55m907K977M409
176D189m843j277M632l578l479O285Q27n489L658K762p294j86O824k828k955N620
192B868j299n791M269L106n015J487L632n543r10O815k102m412N254N15o710K547
208a289M806m706j018N224k315l366L860k38l744L268J605m708J493M045l969
223a052j374N217j554m600L399K136l824R50L292k457j250K280j332j117K792
238A506o71k678K416J292l308N86K974k368k030K822N14k275Q09J243j160m2O38
255B68r03K53J083j034l57J748m22j738J169J280j529o38J393L5r15L12M90l01
273A94k82j71P4M22k16o98M81P44o37n99O82L02p20p4P13P2m96NN11R3m87j75
$$ plain form
159 43 -1819 -3958 899 3859 161 54 1641 -2688 -3119 3035 2166 -2079 1155 1710 -3197 -220 4189
176 4189 -654 -1931 2701 -877 -4356 1929 2756 -2733 925 3687 -3607 -3793 3031 203 -2752 2868
192 2868 1569 -4222 47 3153 -1862 -375 3257 -2286 -3196 3619 1517 -2895 2359 2874 -3836 -1289
208 -1289 3517 -1189 -2207 3017 702 -2664 1196 958 -2786 482 2087 -2621 -1128 2917 -1052
223 -1052 -2426 2791 1237 -3363 36 2172 -1652 -702 2590 133 -1117 1163 -169 -1286 1506
238 1506 835 -1843 573 1865 -1443 -857 2117 -251 -2281 541 1055 -1220 -411 832 -328 -370 268
255 268 -635 -382 701 -333 -690 1058 636 -1102 67 1347 -182 -820 573 608 -307 5 495 194
273 194 -88 -259 -185 237 21 -677 -196 548 -89 -688 -6 296 -424 -498 215 287 -209 -204 307 400 -87 -262
295b62M87K10m19j64M29J14m28r4L01j6m04QL63ll96o5L55M4l37k5K86J5k22J06
319a17K55m5k02J00K42m4j87M2J89Qj52NJ10o4j37K9N4j18q2N6L8r9p5l6P5P0
345h5j12l8J77J8j23J27J04j59M0K76r9j36K69l2k36K33J04l88J04L19l56j25
367a18M18k52m47M69O1n73K96L88o22j0O66m72m27Q26K1o91N69L08r05L12R65
388G82p25m07R10l84p31J054K83j235L32O99j011M4J208p59q15J093j76j150J043
407E5O59j400K21J228j069n94J415j92r37J047J82j388N56J000q98J41J007j228
425a95q61J509K12j089P62L74j510k1J256l12l01O50n78q10O81K97l26P47J72
444F57j287j47R52n4j00P24j98j008j34N63M85J84k81l07j05m02l6Q23L35m71
$$ plain form
295 -262 225 435 16 -148 281 395 -33 -127 174 158 -246 -238 125 122 -274 -339 16 60 -277 -302 -16 -1 -223 -117
319 -117 138 93 -109 -9 233 189 2 44 233 241 89 94 204 140 3 32 86 -32 -114 -58 -20 -119 -194 -230 -155 -85
345 -85 -197 -235 -58 -40 -163 -36 68 -91 -51 225 126 -10 259 227 -9 224 328 -60 44 363 7 -118
367 -118 300 48 -399 70 131 -442 -146 242 -380 -390 276 -196 -623 203 224 -467 102 410 -495 -183 782
388 782 57 -350 560 176 -555 499 782 -453 -121 578 -433 -389 819 60 -755 338 162 -988 55
407 55 714 -686 -465 763 -306 -900 515 323 -614 433 615 -773 -217 783 -115 26 1033 -195
425 -195 -1056 453 665 -424 338 712 -798 -819 437 125 -176 474 -104 -914 -233 64 -262 485 657
444 657 -630 -777 175 121 21 745 547 -461 -595 -32 453 637 356 49 -56 -458 -494 329 664 193
464A93k27k92m22L41M72J42N88l34j798j8J723L6k14J156j048k370J119K083l94
483G36R2K40k225n88K423J87p88J381j070k790J885K196k279q6K506j934j895
500b009K532j33k170K443J443l055L8J449k429R45M541j984l871J951J00k225
516b434M051K808n075j946K910j298jM486j748m774K337J587k889K437K845m582
532a286j113M273k087k761M362P03l768K289J387m927O81M969j747j488K827k919
548f05l691M878K905l595N32R36m682N45N887j103k981K224j565l634L918L045
564C014l668J08K458l339j087M136p22k385K947Kl866J575K325k367J027L065
580C223l331k877K938M82j338K862N22m184l68K204o32Q02K018k393k206K018
$$ plain form
464 193 -34 -326 -748 -407 65 207 795 461 -1337 -1355 368 404 190 1346 298 -2072 -953 1130 736
483 736 828 1068 -1157 -1745 678 865 77 1458 388 -2402 -517 1679 -600 -686 1820 -114 -2009
500 -2009 523 390 -1780 663 2106 -949 -911 538 -1891 -946 3595 1611 -2260 -309 -209 -2434
516 -2434 1617 4425 -650 -2596 314 -984 -985 3501 1753 -3021 -684 903 -1986 451 3296 -1286
532 -1286 -2399 1874 -213 -2974 1388 2091 -1677 612 1999 -2928 -2247 2722 975 -513 2314 -605
548 -605 -4296 582 3487 -108 424 1360 -3322 -2777 3110 2007 -974 1250 -315 -3949 -31 3014
564 3014 -654 -546 1912 -1427 -2514 1622 900 -1485 1462 1464 -2402 -827 1498 -869 158 3223
580 3223 -108 -2985 -47 435 -903 1959 2481 -1703 -2071 133 -499 303 2321 -72 -2278 -260
596b60L73r39K170M98l134k47J892p35q2J962l27j516P8l44l43J562O19j012P0
615B85k32j484O85K126k54j323k63m09j72J058P85J21l22j504p43J496O78p29
633b01P52N20j662m77J349J05k10M99p36o02Q64k09l71J746o0k599L12J646j334
652f68j75K431n60k143P11L75r44J218P35j678K93J099j587K28K598j367k360
669a794J947P77k191J136K025j862p81J572j004r09J791l26j324J777J46k555
685a575J151K067k217p11K392j058j881K254R48j967N11Q39j761L10J749j278
701b27m24J987r25j709J912N31k310P07J714j634n82J914m77j190J151j55j452
718a169R68P58j261N55J263j369n89J518n19j283J236O15j195M35R26r45k46Q96
$$ plain form
596 -260 113 -826 1344 1842 -1292 -1539 353 -382 -464 1498 1171 -345 -267 -611 -954 608 1227 215 285
615 285 53 -1431 -746 1380 1126 -197 -460 -869 -1041 17 802 923 601 -903 -1646 -150 528 -201
633 -201 551 1071 -591 -1068 281 386 176 675 -61 -663 201 -8 -379 1367 1307 -1292 -980 666 -668
652 -668 -843 1588 1028 -1115 -404 -29 -973 245 980 -698 -405 694 -893 -665 1933 566 -1794
669 -1794 153 930 -1261 -125 1900 38 -743 829 -175 -1084 707 381 -943 834 980 -1575
685 -1575 -424 1643 -574 -1285 1107 49 -1832 422 1370 -597 -86 753 -1008 -698 1051 -227
701 -227 -651 1336 411 -1298 614 1145 -1165 -458 1256 -378 -960 954 477 -713 438 283 -1169
718 -1169 -201 557 -704 -149 1114 -255 -844 674 155 -1128 108 723 -472 -37 889 -56 -302 594
736E94o34o19R58Kp03P70L54j060N2O47o79k52Q06j88m57O32J09o92K22L28n50
757c60k5N85j24k02M12J3l55R2K0k22K01J61k63J47L56k58l08J61l3l16R4L31
779A07%j57nJ15J1k39k17J89K20q6RK92K1l24n5K33m7k63N0L84J62k71j38J96
803A87m8l86j1L73kk89J45L28j63m16k4K80ok24P4L69Ol03K2K69j50l39J91M20
827C03j05k99J59K90j75l38O9K55j13k18J67K73j89l21J73K42k53l05K38K96j56
848gj85K04J75k07j83J50J97j52j75K59L10k43k98K27J83l24j23L15M7k09J5J43
870A19m6j44j34L5K26q2k56K44L15l41k51L62L6l59K05L38k41j10K22l2p6J10
892A40j67q6L43n1l65L03K34m89q6M48k69l36M32J55l94J08J51l31R6L35k75q9
$$ plain form
736 594 -40 -659 299 301 -402 368 722 -338 -286 361 -318 -570 236 48 -409 223 332 -360 -138 190 -360
757 -360 -385 200 76 -126 286 299 -56 36 56 -166 35 196 -67 80 436 178 -130 31 -2 -318 -224 107
779 107 107 -50 -55 60 71 -168 -385 -196 24 -62 -53 239 260 -64 -119 114 67 -196 -146 238 400 129 -9 187
803 187 139 -247 -258 115 113 -176 -31 297 134 -282 -306 -26 -32 -256 -182 187 193 -110 -88 181 31 -308 -117 303
827 303 198 -101 58 348 173 -165 -96 159 46 -172 -5 268 79 -242 -69 173 -80 -385 -147 149 -7
848 -7 -192 12 187 -20 -203 -53 144 -8 -183 76 386 143 -155 72 255 -69 -192 123 170 -39 -24 119
870 119 73 -71 -205 -170 56 -26 -282 -38 277 -64 -315 47 83 -276 -71 267 26 -84 138 106 30 140
892 140 -27 -113 230 179 -186 117 351 -138 -224 224 -45 -381 51 206 -188 -80 71 -260 -164 171 -104 -193
914a93L77k03k94M74J63m75J39L18m21r5N01p7k57K34q4l86K38K80k49j5J45l11
936a91j25L92O7k48O1K7k27O6K47j8n3R6m5j73j8J73J24QK5n9k83r1L92J91k11
961A27n1q0m00J61O04j38l30J73k44m18O22M51o16jM50o41k25R67j13o81O71J69
983D57j046L35Q65p24m9J033p97j020J109K78r23Q89N30j725j51J493n67m44J396
1002I39o52j681J185R43j277N70J127j715n86J867m32j096J620J10j997Q24J211
1019I60j612J89J932j289j327J651k42j549J769J026k269k7J474j407j97K361
1035A443p55j994J304L73j588J386J504k116n43J788r90q99K147j1k052R45R07
1052H49j731L89J778j178q29J467o89j431J598P96j492M26Q28j698k66K003j84
$$ plain form
914 -193 184 -19 -313 161 324 -151 -12 306 -115 -210 291 214 -43 191 107 -279 -41 239 -10 -25 120 -191
936 -191 -316 76 143 -105 -44 -17 -244 -178 69 51 -2 94 49 -124 -142 31 155 163 188 129 -154 -245 147 338 127
961 127 76 -4 -404 -243 361 223 -107 66 -178 -596 26 477 -139 -140 310 -331 -556 411 298 -383 288 457
983 457 -589 -254 611 -113 -162 871 74 -946 163 441 -482 407 937 -788 -939 554 -13 -457 939
1002 939 287 -1394 -209 734 -543 27 1154 -561 -1147 720 288 -808 812 922 -1075 -251 960
1019 960 -652 -463 1469 180 -1147 504 262 -1287 482 1508 -761 -788 686 -721 -918 1443
1035 1443 688 -1306 -2 371 -1217 169 1673 -443 -986 802 -188 -1087 1060 1049 -1003 -58 849
1052 849 -882 -493 1285 107 -722 745 56 -1375 223 1019 -473 -47 781 -917 -1183 820 636
1069F36j074Q36k54j380R84J317r23k74O04r52l72J438J36j007M40K40j015K26
1087c94R75m40m28O20j47p34K77L71j90K20K99n59m74L04L59J19K54r5p17l22
1107g02O28N89j45j57j04n18j20Q39L10n90r9J40m67J24P56l54n40N88J7p47M26
1128a26M89p57J62R54p28p69Q95J09o60Q79L36j441M9J189n42k60J087o84j241
1147a059J127O48j100M12P04j294j58J430n78q98J193k9j311Q79Q10j389P7J391
1165H55q54p37J219k11j079J086N29j316L02R09j061j27J394o69j054J122K10
1182E18j240O87Q59j186k11J098n76n65R87j39q88P60L50j024L87Q55r28k92J098
1201E50l48q18Q60L23r16K02N76n76o3O08l96l10O23j87n53N57J86p75J90O77
$$ plain form
1069 636 -438 398 144 -1236 -252 1065 142 -132 472 -480 -852 586 722 -285 155 395 -620 -394
1087 -394 581 141 -287 333 186 -548 -271 100 -90 130 429 -130 -604 -300 59 178 432 337 -380 -702
1107 -702 -74 515 370 213 109 -409 -529 310 620 30 -69 71 -396 -272 484 130 -410 178 195 -552 -126
1128 -126 363 -394 -232 722 -6 -775 120 229 -431 448 784 -657 -608 581 39 -221 866 182 -1059
1147 -1059 68 716 -384 28 732 -562 -720 710 132 -766 427 398 -913 -34 776 -613 -536 855
1165 855 1 -736 483 272 -807 279 808 -508 -206 703 -358 -485 909 240 -814 308 518
1182 518 -722 -35 824 -362 -573 525 -51 -616 371 232 -656 104 454 -570 -183 672 -256 -548 550
1201 550 202 -616 244 567 -349 -147 429 -147 -210 398 2 -308 315 128 -425 132 318 -457 -267 410
1221D10m67l43N54mm46K41K05k76N8J61j56J15J94l33r2L92m8l50K03K17k99n5
1243a19L15l7k93l1J36P8k9j06J2Q5p1o1J25O8j91o1J93J41j16j25J14J16j62
1266a9q3J93O0k09K6K22o6j88L2O4l2k4l8K8P8n1j11J13O7k15o1K40K6j71R4J56
1292A31j25q8R0J1k7M4j1L2P1o2q6Q4Qj65K6J62m0j18P9L2j04k3K3l6MN4J0K8
1320DJ9n7l9O7om3M0O8%J5L0m8l3K0j1l0K0K0j1J1J4m8n6oJ3J5j2j0K6N8k0p1
1352f1PK4l2JR4L0l5OM2nq3l1M6M8j7k2N4L4j08o9N8J8j14J3J40J5j01NN1l1o5
1383h8%O8M1l1NJ08Lj47k9J38pj07N0J31l8r7ML6n7n7J8P8j0r7K2J26l8j57PJ23
1413bk9o5P7R9l1r8K9J07n3j08R2J24q0j12J08O8r8m5J4k8j3MJ6J14j7k19QJ84
$$ plain form
1221 410 -57 -400 154 150 -296 -55 150 -126 -68 93 -63 52 246 -87 -179 213 165 -185 18 235 -64 -119
1243 -119 196 159 -134 -165 -29 49 20 -86 -74 11 -60 -121 4 72 -119 -180 13 154 38 -87 27 143 -19
1266 -19 -102 91 151 -58 -32 190 124 -64 -32 32 0 -24 -62 -34 44 -7 -118 -5 62 -153 -214 26 52 -119 -25 131
1292 131 6 -82 8 19 -8 36 25 57 128 66 -20 64 72 -93 -67 95 55 -63 16 48 -56 -79 -56 -92 -88 -34 -24 4
1320 4 23 -34 -73 -6 -12 -55 -15 53 53 68 98 50 17 37 26 -4 16 36 25 36 50 2 -54 -60 -47 -32 -44 -54 -28 30 10 -61
1352 -61 -54 -30 -62 -61 33 63 28 34 76 71 -12 -43 3 51 34 12 66 100 -8 -77 -19 -1 -115 -102 38 53 -48 -43 8 -23 -88
1383 -88 -88 -20 21 -10 -5 103 106 -41 -70 68 61 -46 4 135 97 0 4 40 -17 -74 -56 22 12 -85 -63 63 25 -132 -125 -2
1413 -2 -31 -96 -19 80 49 -49 -20 87 34 -74 18 142 62 -50 58 126 28 -17 -3 -31 -44 -40 -24 90 73 -146 -138 46
1441D6j16j22K25Q8k48N1J76j14n5J44o8p6J48p6n6K59kl53J05K09k76l1L99j24
1465A33l22K17O2k93J55K00k80J8K38k88o4M60j33l64L08O7m39K60M69l84j80
1486a60L76k24k67M72N2m33K39J71m76J28M78l81k25M82k04m50M50K35m91J98
1506c0L20n17j10N48j79k37M79j07n46L44L34m04J07L70n02k37N80k7l20L46k0
1527A92n81K29M23l50m8L90l21k72M51Lm05L09K02m03Q0K91l39m4M93j18l61K10
1549C1kk61L48K85l95j72J57j17O9L49j46l59Q9R0r3K04J03l22o6K08j2m8J03
1572D3n2o2J20J8j23K8L1J4J36j1k20m0J16O8R7Pk40j16J39P6O5R2k43k30K01
1597h6J38q6J01pk82O8K86j16j10J86j03j45K90K5l26J52K31k65L5K35k98j70
$$ plain form
1441 46 -70 -192 33 121 -127 -76 100 -14 -69 75 7 -69 79 3 -53 206 204 -149 -44 165 -111 -142 257 133
1465 133 -189 28 90 -203 -48 152 -128 -110 128 -160 -224 236 103 -261 47 114 -325 -65 404 20 -160
1486 -160 216 -8 -275 197 249 -184 55 226 -250 -122 356 -25 -250 232 28 -422 28 263 -228 -30
1506 -30 290 -227 -337 211 32 -205 274 167 -379 -35 299 -105 2 372 -130 -367 213 186 -134 212 192
1527 192 -389 -160 263 -87 -135 255 -66 -338 113 116 -289 20 222 -181 -101 190 -149 -193 300 182 -179 31
1549 31 29 -232 116 401 6 -166 -9 -126 -57 292 146 -213 -124 -34 -127 77 180 -142 -208 0 -12 -60 43
1572 43 -9 -71 49 67 -56 -28 3 17 153 142 -78 -118 -2 66 163 170 -70 -186 -47 29 94 186 -57 -287 -86
1597 -86 52 -34 67 60 -222 -154 132 16 -94 92 -11 -156 134 159 -167 -15 216 -49 -14 221 -77 -247
1619b47M34J0l34J91J4l58K29L60l66j39L13j96j69M41om59K26K33l58J08L73
1640C00l61j76M71j28l45L54R4m23K07L11m41n4M32k32k29L91p0m12L20K08m19
1661b02R8L23l36j23M43j45l04L39Q1l74J86K62l58RL48k34j95L47m7k88K44J12
1683A86l66P0K98k34r6K69j29k20K64P0k67R9J44k22M1K56j61j37K11k3j58J72
1705F7R1k24L9J71j30l3J32q7j01J23K7j44N1O1j03K0R3r0p4Q9J2l8P0jr7L9P4
1732C7k2nK1k6k1N3K5k1j7j6rK6kj1j0jl0K6nj4rqmK3Km3L4K9k0nM1rm2M4L7k8
1768B0qJ8k9J3L8l0j3K8k8m6O9J3r2J5N8l7m7N9ll6J5OpK2J0l2M2K7m8j7O3rn1
1801a7L4L7m1j7L4Ok2oj5Qjk6j0L2%n2J4N0k8k4K5L2k4j6L8Oj1%K0Ljj6J4K1k9
$$ plain form
1619 -247 187 197 -137 54 68 -290 -61 299 -67 -206 107 -89 -258 183 177 -282 -56 177 -181 -73 300
1640 300 -61 -237 234 106 -239 115 209 -214 -7 304 -137 -191 241 9 -220 171 101 -311 9 217 -202
1661 -202 -104 219 -117 -240 203 58 -246 93 174 -200 -14 248 -110 -101 247 13 -182 165 118 -170 74 186
1683 186 -180 -110 188 -46 -142 127 -2 -222 42 112 -155 -56 88 -134 -93 163 2 -135 76 53 -105 67
1705 67 158 -66 -27 144 14 -19 113 26 -75 48 75 -69 -18 43 -60 -40 53 -37 -111 -22 -10 -48 22 21 -76 -37 37
1732 37 15 10 31 5 -16 37 62 41 24 8 -1 25 23 12 2 1 -29 -3 -8 -22 -31 -39 -43 -20 -18 -61 -27 2 -18 -23 18 9 -33 11 48 20
1768 20 12 30 1 14 52 22 9 37 9 -37 32 45 -47 -32 26 -11 -58 1 -2 -38 -23 -17 -24 -2 8 -24 18 45 -3 -20 43 34 -17
1801 -17 17 54 13 -4 30 36 14 8 -7 1 0 -26 -36 -4 -4 -56 -42 8 -20 -44 -19 13 -11 -27 11 17 6 6 26 29 28 12 26 47 18
1836A8k7L3J9m3k4J6J6k8k3J9K1k8j7J7J6j5j1K9J4k3j0L7J5k3kK3J1qj4K6Jj8
1868A7j3K8ll2jNOk5j0J2J1j4j0J5j6oOJ8Nj3KK4Pj7RJ4J0j2J0kopJJ2j4j3nJ1
1906Dj1j6J8Kk8PJ5op%J5nJ2Mj2RJ1j1J0K2j5%J6j5k4M0j8l3K2J3l6lK5j5l2L7
1942ej8l4N5Jl1L2K5n3MO1m0j5O7Rq1M0L9m1pL9l4l9N0k0l3N4mq7L8N7p6j3Q6
1975B6l9o3O6K7p1L8M8n1MP3n7j3Q3m7n5Q0J5r5K4R2o1l8N4l4n7P1Mo5K1K0p0
2006g0L7P5p1n2R3k5n3R0K9p5QN3k3mK7k4j5N0Mo9K3J2n0L4M4n6n0N2Pj5KKn1
2039f1J7L1J0J8j3l9PN0jj2J8j6j2J9J7mjl0RK1j8k4J2Pk1J3J7l9k2M3Jj0J2j3
2073a4k9L8L1l6J2K1m5KQ4j9m4K9j0l6L9M1p1j0N0m2j6N0k2o1N3K6p7K7M2n3P
$$ plain form
1836 18 -9 24 43 0 -24 -8 8 -20 -43 -24 -3 -31 -48 -31 -15 -30 -41 -12 2 -21 -31 6 21 -2 -4 19 30 22 8 34 35 17
1868 17 4 32 29 -3 -4 1 7 -18 -28 -16 -5 -19 -29 -14 -30 -36 -30 -12 -7 -20 -18 6 13 -4 5 19 29 17 27 25 19 12 13 25 11 -2 -7 4
1906 4 -7 -23 -5 -3 -31 -24 -9 -15 -22 -22 -7 -12 0 4 -8 1 12 1 11 33 18 18 34 19 -5 35 17 -16 6 19 -17 -20 5 -10 -42 -5
1942 -5 -23 -57 -2 -1 -32 0 25 -28 -24 37 -3 -18 49 58 -23 17 56 15 8 47 13 -26 24 4 -29 25 21 -66 -28 29 -47 -60 26
1975 26 -13 -76 -10 17 -54 -16 32 -19 -15 58 1 -12 71 24 -31 49 64 -31 -7 85 24 -14 40 6 -51 20 24 -41 -20 0 -70
2006 -70 -33 42 -29 -81 12 -13 -66 24 53 -22 -14 39 16 12 39 15 0 50 54 -15 8 20 -30 4 48 -8 -58 -6 1 -14 -12 -10 -61
2039 -61 -44 -13 -3 15 2 -37 -30 20 19 7 25 9 -3 16 33 29 28 -2 7 28 10 -14 -2 5 -16 -3 14 -25 -47 -4 -3 -13 -1 -14
2073 -14 -43 -5 26 -10 2 23 -22 -20 64 45 1 30 20 -16 23 64 -7 -17 33 -9 -25 25 3 -58 -5 21 -56 -29 13 -40 -33
2104c3O8l2p2Q2J1n5N4L6o9QO1m6l2Q3l0o6O5J3p8L2M9p4j4O3l7m2O0oo6M2M5
2135B0o4J0N5m5k2Q4j8m5N9K2o2K2M9o2j3N9k9m4N0%m9K8K0n3J0K8l6k2N8j5m0
2166d5L8K2l8NM8l6rL1j2qL2j6k9M0J3l1RJ9k0k6L0rk0J4Ml0PJ8k4KK1k6RQPn
2202gJ6RrMJ3j1jJ0nN%qpLJrJLj6JLj0Nn%j1J9j2qJ3J9j4J5OpMJ1jj0J5Mj0kJ1
2246B8j4mJ4k9mLj0rJ2jj9K0Oj7JK1k0J7J4j0j2K3NoJ2J0j7LQpj7J0Qk5J1Kj6
2283iRMk2J6qlj2OQmQLqJ2OJpJ5oj2K6mjjJj4PlOj3Mj1j1QLj2MoMLmJ2rKJ4j1
2329iJ2J2j1mN%J0kMj4PnkjnonLJj4NJJNJ0nmJ5JlKOj1J8j0NJQj1J4oqMnj%j2
2376d%kKj4%QMk6RJ2Nj3OJ7oKJMN%mJ8Jj1JNLrj2qJ9j1mOqj1oKRqKKLj2QJ5qj
$$ plain form
2104 -33 35 3 -69 13 24 -31 23 59 -10 -2 59 13 -19 64 34 -32 33 46 -32 0 49 -25 -39 24 -13 -55 5 -1 -67 -25 20
2135 20 -44 -34 21 -24 -46 38 20 -25 34 56 -6 16 65 3 -10 49 20 -24 26 26 -23 5 25 -28 -18 10 -26 -48 10 -5 -45
2166 -45 -7 15 -23 -18 30 -6 -15 16 4 -4 28 12 -17 23 36 5 14 33 13 -13 17 8 -12 2 6 -24 -17 1 -23 -21 0 -26 -17 -9 -2 -7
2202 -7 9 18 9 13 26 15 14 24 19 24 24 16 9 12 13 4 5 8 -8 -7 -4 -14 -9 -14 -14 -25 -6 -18 -26 -13 6 -8 7 13 6 10 21 20 10 25 29 19 17 28
2246 28 14 10 24 -5 -9 -6 -16 -25 -13 -14 -33 -13 -7 -24 -23 -2 -22 -5 9 -1 -13 10 15 9 21 31 14 17 25 18 1 11 19 -6 5 7 -9
2283 -9 0 4 -18 -2 -10 -13 -25 -19 -11 -15 -7 -4 -12 0 6 7 0 15 9 -3 23 19 18 17 18 4 11 8 14 1 5 -6 -17 -9 -6 -18 -14 -20 -16 -13 -17 -5 -14 -12 2 -9
2329 -9 3 15 4 0 5 5 15 13 17 3 10 5 3 2 -3 -9 -14 -11 -10 -24 -19 -18 -17 -12 -2 -7 -11 4 5 2 4 10 -1 17 7 12 13 21 10 24 18 10 14 9 8 8 -4
2376 -4 -4 -6 -4 -18 -18 -10 -6 -32 -23 -11 -6 -19 -13 4 -2 0 1 5 10 10 6 24 25 14 15 20 23 14 2 -6 13 2 -2 4 -4 -15 -21 -19 -10 -18 -16 -14 -11 -23 -15 0 -8 -9
2424iK5%nmnJ5MrLNjj2JKpj2MRk3OJ8rkLj7ORnqK6Ok5J4J6j6pK1j1jK0rj1LQk7
2469a1J2Lk3J4J2j4rK0pk4K3K0j9lJ7nqL2k0j5K3J5l5J7K6l6j5M6k6k0K4ql4L4
2503F%k6OJ6j7j2L1j2k8K6Oj8K9J6l8J5L4j3j5K5j9j5K3Plj4kljLqLqk0JJ9ln
2541a4lJ0qMOqJ1oKK0kk4J1M1l2lJ7j8j3L0Rl4J3ql1J9L1m8jL8l6k2N8Pn2J6M2
2578B2m3RL5l3jM4k4l4M5Mo4M9M7q9kQ7n1n1P9j4p1M7L1n1J0N3q0oJ00m1n9Q5
2610C3J1j03N0Q2q7k0R4m5m4P0np7N5K5o9J9O6r7j3J01l2q6P6L2r4K7Q3q1j5Q4
2640D0l7m1P4k0n8O3M2q1RP9o1m4Q5l0n2L9K0o4L2K9m9j2N8m6k2O1j5m5L2L0n0
2671c4J5M4k3j3L8j1m3M4Rk6J9J1k7nK8j5rOj2j4K2Qj5jk0KJ3mlRmj2K1Lj3J2
$$ plain form
2424 -9 16 16 11 7 2 17 21 12 15 20 19 7 8 10 3 -9 -5 4 -19 -13 5 -4 -6 -3 -20 -14 -5 -10 -18 8 14 -11 3 19 3 -4 17 6 5 25 16 5 8 16 -11
2469 -11 1 4 -19 -5 7 -7 -16 4 -3 -27 -4 16 -3 -6 11 6 -2 30 10 -5 18 33 -2 15 41 5 -10 36 10 -10 14 6 -28 6
2503 6 6 -20 -14 2 -15 -27 4 -8 -36 -10 -4 -22 7 23 -15 0 34 21 6 31 12 -3 20 27 24 10 8 5 4 7 -1 2 -6 -26 -25 -6 -9 -14
2541 -14 -17 -7 -15 -11 -5 -13 -2 -8 -6 14 12 -12 -1 40 8 5 22 4 -9 21 30 -4 9 1 -30 -11 20 -28 -29 9 -27 -49 9 16 -36 -20 22
2578 22 -21 -12 23 -10 -11 33 9 -25 20 24 -40 9 56 -33 -35 52 1 -50 29 15 -56 -9 22 -29 -19 34 -46 -52 48 7 -52 33
2610 33 44 -59 -9 73 -14 -34 60 15 -29 41 36 -41 14 39 -30 -11 55 -42 -55 46 14 -72 4 36 -58 -31 52 -29 -44 40
2640 40 3 -38 36 16 -42 21 63 -18 -9 70 9 -35 50 20 -32 7 27 -37 -5 24 -25 -37 21 -25 -47 14 -1 -46 -14 16 -34
2671 -34 -19 25 2 -11 27 16 -27 17 26 0 19 30 3 -2 26 11 2 8 -4 -18 4 12 -3 -4 -24 -22 -9 -13 -16 -7 -11 -23 -2 1 -12 0
2707@K9k9kK3k6jM6j2l8K3Ol0K7K0m1mL4m0j1L7j4m1L8K9n2lM8l5j2N4k5m6O8
2740B0J5m8M2J5p8J7N8k9m1N7j6n7N8K0p6K1L5m5oN8l4l6P5Mp5M3J9l6J4M9l7
2771Fl2M3Ql3K3J2m6K3K0l6%L7k9l5L9Km1K9K6m1%K4j0rK5j2j6K4J3k1J0J6j5
2804DlJ7j1j2J5J6k6%MqRpoOKk5J0PnqP%jP%O%QpkLLOPqjJ2j0%n%j5RNj2J1j2
2851a0jNjJk%%kMlPNokPQJqLoOplLkJ0j5J0qL%oQpRj1J0N%Rk7J7QjKmkKM%k2J9
2903A0rrOMK%oMj0Mj0nJ3Jj1kJ7k0J2OQpJ1qjJ2Pk1J1J7k0LJ4j1j8J9j2j0PJ4
2943A2k6kL1l2rK9j5j7J8J4j7OJ6k4kL7k3jK0pJK0j6k3K4Lj4oK6k5j7J2J2qoo
2979a5oJ0RqMQj7mK0krJ1J1j4LNlJ1j4j4RJ9k4ML2k7k1J1Oj9K4nMjJ3l8K4K9m3
$$ plain form
2707 0 29 0 -2 21 -5 -6 40 28 -10 13 19 -11 16 36 -5 -9 25 -15 -26 11 -3 -44 -6 23 -29 -32 16 -19 -31 23 -2 -48 20
2740 20 35 -13 29 44 -34 -17 41 12 -29 28 12 -45 13 33 -43 -22 13 -32 -38 20 -14 -50 25 29 -46 -3 16 -20 -6 43 6
2771 6 -26 17 25 -8 15 27 -19 4 24 -12 -12 25 -4 -39 0 2 -39 -10 16 -25 -25 -1 -11 -20 5 -7 -23 1 14 -7 3 19 4
2804 4 1 18 7 -5 10 26 0 0 4 -4 5 -2 -8 -2 0 -25 -15 -8 -13 -21 -14 -14 -15 -8 -8 -2 -2 6 -1 -3 0 3 9 16 8 7 19 9 9 4 4 -11 -2 3 -9 2 -10
2851 -10 -11 -6 -7 -6 -8 -8 -8 -10 -6 -9 -2 3 -3 -5 2 10 11 3 6 0 6 -1 -4 -1 -3 7 -8 2 -6 -3 -3 -9 -1 -8 1 -10 0 5 5 14 -13 4 12 11 13 9 7 9 13 13 -9 10
2903 10 1 -8 -2 2 4 4 -2 2 -8 -4 -14 -19 -6 -5 -16 -18 -1 -21 -9 -3 5 -2 9 1 0 12 19 -2 9 26 6 9 23 12 -6 13 1 -9 -2 12
2943 12 -14 -16 15 -17 -26 3 -12 -29 -11 3 -14 -8 8 -16 -18 19 -4 -5 15 8 9 29 13 -10 14 17 3 -3 23 -2 -19 -7 5 -3 -9 -15
2979 -15 -21 -11 -2 -10 -6 2 -15 -19 1 -1 -10 1 12 -2 1 6 3 14 0 -14 -5 14 -10 -6 26 -1 -22 -11 -5 -24 0 -5 -1 -2 11 -27 -3 26 -17
3018a7MK4j4k5N6Jl5ML1m3OL3l4j0N7k6m5N2ko4M4M5q4%P2l0l0N9j7p2O6L0n8
3051b2L0N9q7j3Q6l6o3Q8lp4N6N0r1j6Q9n6m2Q6m5p1Q0L0q6K6N8p9nJ00l4o4P0
3082B1Kp0O8M6j06J3O4l6j6P5l9q0P9K2o9L7K2q2K5Q6o2n2O3k9l8P7K5q2lN0j9
3113hLM8n1l3O0%l4L8No0L6L6m8k5L8loL7k8l5K0j2NN5k0n5J7M0k0KK5m6j4L6
3147CPqK9j6m1M1Rn4L7M6o1j9N2k3m5O3Lm8J9Lm0M2M1n9nO4n0m6R6Mp5L5M1o0
3181a5oP1l5j3M1m0n0O7J5n8M7J4j10J1J06k7n6O1k4o5N3N0m9J5J5n4K8N9n0l7
3211c6P6lo6L3M2p2K9O5m5n7L5j7MN9j5o6K0Ql5M8M3n2n2M5Kj8M4%m7J5J4kPJ9
3245B5l8%L3j2l4M6Pl0K0Qm5JL4j3J0Kl2j6L6Rk3L4k6l3L1K4j4rJ2j9QK9k3j6
$$ plain form
3018 -17 -13 11 -3 -28 28 29 -6 -2 29 -14 -8 25 -9 -19 38 12 -33 19 17 -47 -3 42 -42 -42 30 0 -30 29 12 -60 6 36 -22
3051 -22 8 67 -20 -33 53 17 -46 42 39 -35 21 71 -20 -36 53 -3 -45 41 -4 -75 5 35 -51 -25 33 -46 -51 49 15 -49 21
3082 21 23 -47 21 67 -39 -26 38 2 -14 61 22 -58 21 43 -26 11 33 -49 -24 62 0 -52 11 -18 -56 21 46 -36 -39 11 -8
3113 -8 -5 43 -8 -41 19 19 -15 23 28 -32 4 40 -8 -33 5 2 -4 33 5 -30 -10 -22 -17 38 18 -37 -20 20 0 2 27 -19 -33 3
3147 3 10 2 31 15 -26 15 24 -30 7 53 -8 -27 25 2 -43 20 23 -25 -6 -3 -43 -1 40 -19 -24 40 -10 -56 40 44 -31 4 45 -15
3181 -15 -21 50 15 2 43 3 -47 20 35 -23 24 38 -72 -61 45 18 -38 23 -1 -66 -13 37 -12 3 18 -36 -8 51 1 -36
3211 -36 40 37 -29 4 46 -26 3 68 23 -34 1 -16 -12 47 32 -34 -14 -6 -41 7 50 -2 -54 -9 -7 -25 19 19 -28 -13 1 -1 6 25
3245 25 -13 -13 20 8 -26 20 27 -3 17 25 -20 -19 15 2 12 14 -18 -34 2 11 -12 22 -4 -37 -6 18 4 -5 7 -12 -4 25 2 -14
3279a4L1rj9J6Oj3QJ9k6k1K2nj2L4j1k6NK8k3QJ7j4j2J9j1kJ3Mk2J7Nk1PL1l0
3314aj6K4Ok8QK3k7LLllQqpK9pk2J7J7k2QRjj8K6klRk4KJ1kj6J3Qk4qJ5%j8LJ4
3356dRk0pJ0Pj7J1jK4j7mK1Qk5kK8j0KrQRrj1J4okj9J7mj5KJ9j7j1J0PqPoMRN
3398Gj2J1pj1MK4nnKMj8nJ5pOkjLjj7J4J1j3j1RJ4j1j0J3Kj1KJ2j2QknJ5Oj5M
3439EJ2j9JNoqJ0jj6J7%rQJ7k6MJ2Jl3L5Nk4K0J2j9mJ3%k4L1ok6K7Pl4PJ5k3l
3478a7K7j8j5K1kk1J9J8k9NK6k6lJ8m%K3nl5K7J4k4J6J4l7pL0nl5L1nj3K0pk2
3513b1JJ7rQK2k9j0K5qj7J8MoQJ4k3kK7l1J9L3l8k1L6mk1L8j6m1J7K9l3J9K2n5
3548b8lM2%l2M8k1o5N9M6n8jM7n4j1R3l6p4O1J3o3M6M2q3j1R6n0m6O6j8p2R5L6
$$ plain form
3279 -14 17 8 -11 5 11 -2 6 25 -1 -22 0 -5 -17 17 6 -20 -15 13 -10 -2 15 1 -11 8 -3 -5 8 12 -10 7 12 -9 -2 29 -1
3314 -1 -17 7 13 -15 -7 16 -11 -8 -5 -8 -11 -3 -11 -18 11 4 -18 -1 16 -6 2 11 10 -8 18 16 13 22 -2 0 11 9 -7 6 14 -10 -18 -3 -3 -21 -18 -4
3356 -4 5 -15 -22 -12 -5 -22 -11 -12 12 -5 -9 12 20 -5 -7 21 11 13 4 12 21 12 1 15 9 7 -12 5 1 -14 -12 7 -10 -21 -11 -4 -12 -5 -11 -7 2 7
3398 7 -5 6 -1 -12 -8 16 11 6 8 12 -6 -11 4 -3 3 1 0 3 2 -15 -1 10 -3 -14 -5 9 -2 -12 1 3 -8 -6 6 -6 2 0 -5 10 16 1 5
3439 5 17 -2 -1 4 -2 -10 0 -1 -17 0 0 -9 -1 16 -10 -6 6 7 -26 9 14 -10 10 22 3 -1 12 12 -12 19 13 -13 14 21 -13 -6 9 -14 -17
3478 -17 10 -8 -23 -2 -4 -25 -6 12 -17 -12 14 -12 -15 3 -1 -1 22 17 -18 9 23 -1 15 29 -8 -15 15 10 -25 6 1 -12 8 1 -21
3513 -21 -20 -3 -12 -4 18 -11 -21 4 -4 -21 -3 1 -5 3 17 -6 -8 19 -12 7 40 2 -19 17 13 -8 30 14 -27 -10 19 -14 5 27 -28
3548 -28 -31 11 11 -21 27 6 -59 0 46 -12 -13 34 -20 -31 62 26 -48 13 26 -37 9 51 -32 -43 53 3 -43 23 5 -67 28 64
3580F4r9J0O4p6PJ12n9q5Q0J4p7P1N3j16j0R8n5l8J03l3j10J01K3j07M1R6r5m1
3608f4J04m8p5J22J7j10N4M7j02K2J01n9m2R3n7p2R4N3j05L3M7q5j2J09m0l9L8
3635B4j7p2N3O1p1J9M1q0j1P9j1l1M5k0n9M4L5l1K1J4n7rN1j0qL4k1l4J9j0j3
3666b5M7J7m1j7ok3L7O8m7k9Nk6J0O6mn4ORm8O2N5o8j4L7l3j9N5lm8M8Pq1L0P1
3700D4n9%P0o5o6P1M2o7O3Rj01RQ1k9jO2n5q2R3K0o6M2M3j15%R3k7n2Q6k1q3N1
3732a0K6n6L0O7q5k5Q4l9n1J04Qq6J6N3n3MP7m9n2M7%l9O5K2r5K1M7p6RQ4l4o4
3764e0L5K9n3K4L6l0mJ6l6J7M7k2l4N1k3l4K2L8j0k5L6k5k0K2Oj5%ppJ5J6m0K1
3797dJ0k0j9L0K4j9nQ%k6J0MJ5jj9J2J5k2J1K2j7k9PJ8pJkl%JrRJ8j7j7K4Kk2
$$ plain form
3580 64 -35 -25 39 -37 -30 82 23 -62 18 32 -45 26 79 -37 -47 51 -4 -42 61 28 -82 19 42 -65 -24 72 -23 -64
3608 -64 40 -8 -83 39 56 -54 0 47 -55 -33 68 9 -33 60 3 -69 25 78 -27 6 53 -32 -44 65 25 -14 24
3635 24 7 -65 -12 49 -22 -3 38 -42 -53 26 15 -16 29 9 -50 -6 29 -2 19 33 -24 -33 18 8 0 34 13 -21 -2 -12 -25
3666 -25 22 39 -2 -19 -25 -48 -11 57 10 -19 -14 -40 -30 36 32 -22 -16 -7 -55 7 62 -6 -20 17 -16 -35 20 17 -31 17 24 -57 -27 44
3700 44 -15 -15 55 -10 -76 -5 37 -30 33 42 -59 -50 31 2 1 63 8 -74 19 39 -27 15 58 -57 -57 36 9 -43 43 22 -61 -10
3732 -10 16 -40 -10 57 -28 -53 31 -8 -59 45 53 -33 -17 36 -17 -13 64 15 -37 10 10 -29 36 58 -37 -16 31 -45 -36 48 14 -50
3764 -50 -15 14 -39 -15 21 -9 -13 3 -33 -16 31 9 -25 26 3 -31 -9 29 19 -6 30 5 -15 7 13 -2 -2 -9 -16 -1 15 -25 -4
3797 -4 6 -14 -33 -3 21 2 -3 5 5 -21 -11 -7 8 7 -12 0 15 -7 4 26 9 -20 -13 5 -2 -1 -3 -6 -6 -5 -14 -5 13 -4 -21 3 5 -17
3835a7J3OrlJ2j4jK3j9J2mOj0jJ3l0J8Oj3%QOj6OPrPJ5j6pNl%J6pk%J2j2QJ0n
3877A1qQpj8QJ1j2NjpJnlQNoj1J8Kj9J4J1j4QK3j0lj3J0QknkJ6j5mmNj2MK%j3
3920a6KJ7kk0NJ1kjj0J0Rj4%J5J0j8MJ4%j5kJ3Nj9%Ooq%L1qj4mJ4j3%jJ0Mrj1
3961a3J7kmjJ5mk2NK8j3pPJjLj2%Pjj5J2Qk4kL2k0j9L3j2pJ4Rj8RJ4j7j9L5j0
4000Fj3K6jn4L5K8l8%L0k9j0K4Kk5K1Rk9J4K3l4oL9ml3L3ql6L5K8l3j7K6j3mM8
4035D0j9m4L6jk7K0K1m6oL8j8j9L9j3l5K3K6m0J9L9l3rK0j6j1K3J2q%j0pMK5o
4069A7mLj6j9K7OkQj1l4J6J4%J1ml1JJ5mK1kj3j4J2jqM1j3k5QMk2J6N0l8k2J8
4106Ek5j6N5J0m8J7Pn0L1O4l6k8L6k3n1O9L1n3J2K4p6jR3k3m7M4k1p2O7N3o9J1
$$ plain form
3835 -17 -4 2 -7 -10 2 -12 -13 10 -9 3 -1 5 -5 -6 7 -23 -5 1 -12 -12 -4 2 -14 -8 -1 -10 -3 12 -4 -11 -6 -9 -9 7 0 -2 -2 10 -2 6 16 11
3877 11 3 11 4 -14 -6 5 -7 -2 -3 -10 -9 -14 -17 -9 -4 -10 -21 -3 -1 -20 -6 5 -9 -1 22 12 9 -4 6 14 12 7 5 21 6 2 -2 3 -9 -5 -3 -3 -16
3920 -16 -14 3 1 -19 -14 -3 -5 -6 -16 -6 3 -11 -11 4 14 -4 0 14 14 -1 -3 10 15 -4 -4 2 -4 -12 -12 19 11 -3 -7 7 -6 -6 -7 3 7 -2 -13
3961 -13 4 2 -2 -3 12 8 -14 -9 19 6 -1 6 7 6 9 -3 -3 4 3 -12 0 8 -16 -18 14 -6 -25 8 -4 -11 3 12 -6 3 17 0 -19 16 6
4000 6 -7 19 18 -36 -1 27 -11 -11 19 -10 -20 4 6 -19 2 11 -18 -4 19 -15 -21 18 14 -19 14 6 -30 5 33 0 -17 9 -4 -8 40
4035 40 21 -23 13 12 -15 5 26 -20 -26 12 -6 -25 14 1 -34 -11 15 -25 -6 33 0 -9 11 -5 -16 7 19 11 11 1 -6 -2 23 17
4069 17 13 16 0 -19 8 14 12 20 9 -25 -9 5 5 16 12 -19 -18 -3 -7 14 12 -1 -15 -3 -4 -12 29 16 -9 -1 3 -19 -3 47 9 -13 5
4106 5 -20 -36 19 29 -19 -2 5 -45 -14 50 14 -14 22 -1 -52 17 48 -5 7 31 -45 -46 47 24 -23 21 0 -72 -5 48 -21 -10
4138a0N6p9l1J00j2n3O2rr4M0P6o1J1O1p0n4P9K3n3N5K1r9lQ3l7lO2m8p7O1J5
4169A2m3N0K9q7k2O7j3j7O9j3q5K8L7l8M0M7o8l0M1jk7P3rn6OJ8k9K2L9k0k6L
4201ck6MM5Ql8J1j7j7K1L4qpj7j2JK8NoK8m1l0K6K4PJ0j8l7RK1j5K3J3l0k8L1
4236aJ2k2L4Nn6J7K0j8OL8l8k0K8j1k9N4J5n2%L2m9J6N8l0k9K5j0m2M7L7o1LK8
4269Gl1JN0nn2L3Jl9L8L2l5k1M3k9k5N3qm0L8J2m5jN4l0j9L4j6m5L2J4j9K1Nm1
4303c3jN5j9j8L3kl9L5J9j5k4L0rk1K0Mj6J3pk3K9nk1nK3rk1K1%oPKrQj1RJ4m
4341DrrJ0Rj4J2Nj9j2K2%P%oL%j7NMjj1J4Oj5KJ7lj5NmOJ0j4MJ8j4k5K8Ooj1K0
4383A2j0j0PpOmQpJKrOPrqJ7Kj5J4J2j4lM%OjjpQLj2%Kj0MRolnKJKJ1lpkPmJ2
$$ plain form
4138 -10 46 -33 -64 36 24 -29 33 24 -70 -30 46 -15 -4 57 -13 -67 12 35 -18 37 58 -41 -44 39 2 -1 61 13 -64 -3 12
4169 12 -31 19 48 -39 -61 6 -7 -24 45 32 -53 -25 12 -26 14 61 -7 -37 4 3 -24 49 40 -16 -10 8 -21 1 40 20 -6 -3
4201 -3 -29 -25 20 28 -10 1 -16 -33 -12 22 14 7 -10 -22 -21 7 12 6 34 -7 -37 -11 13 20 30 12 -25 -16 5 -10 13 26 -4 -32 -1
4236 -1 11 -11 23 28 -28 -11 9 -9 -3 35 -3 -23 5 -6 -35 19 34 -18 -18 14 -35 -19 39 9 -20 5 -5 -47 0 37 -24 -21 7
4269 7 -24 -23 27 22 -30 3 4 -35 3 35 0 -21 22 -7 -32 21 13 -27 11 23 -22 -23 31 1 -18 16 0 -45 -13 1 -18 3 8 -33
4303 -33 -34 21 2 -16 17 15 -24 11 30 15 -9 21 12 -9 11 15 -1 12 5 -18 11 6 -15 -20 3 -6 -27 -6 -6 -12 -5 -3 -12 -4 -15 -6 8 4
4341 4 -5 -14 -4 5 -9 3 8 -11 -23 -1 -1 6 6 0 3 3 -14 -9 -5 -6 -17 -3 3 -12 -10 7 4 -11 -6 -10 -4 6 -8 -4 14 0 -25 3 9 3 -8 12
4383 12 2 -8 -1 -8 -2 -6 2 -5 -4 -2 -11 -5 2 -7 -15 2 4 -11 3 15 1 -2 2 2 8 7 6 -1 7 10 -2 -2 0 -10 -6 3 -3 -6 -11 -9 -8 -6 5 2 -5 -7 0 -4 8
4432HrlJ1lklJ6jmJj6MKj0J3RqrJ3lj8OJrJ0Nj3kJ1Lj3J0J0k2LJ3oJ3oJ4j5Lk
4475BkRJj2JJ7k0%O%oj0J8pKPpj0nJ5oJ1Mj4J3pj5MK5j0oqMLJoRJ3k8oK1qJJ4
4519Hj2j2Rj0J3J4qrJ4%j9RJ8k3j3K5Kk3J2K0l0jJ6j7jL6k8rK6jm3K7M3m2pK0
4555Dk0mK6K4m7J5J3l3J9L8m7OL8l4m5N9J8m9QL5m3j9O2k0j8K7j2m8M5L1m5J1
4587eL9o4j8N8jk5M1mm9J1M4j7lL8l9m0N0jk6L9Rn7kM1l1OM5l3l6OJ1j6L3L2n4
4622a8j4K6k0J8M6j7l1nJ1j0K8K2l6j0lpJ4K5Jqj5oj6K9K2rKk1k0QJ5K5Kj6k3
4657a1k0J3L1Mkj3k8J3J4mK1J2m0k2J9J3lL6k0m2J1J9j0L1J9m9j6K0j0MM9j0m9
4690b0J9Mk4K6L7m4k0J5j2j0M9Pn5K3nn2L4O2k3k4J0k4j4N0L2m0rNk6J4N8k3l0
$$ plain form
4432 8 -1 -4 7 4 2 -1 15 14 10 11 -5 -1 1 -9 4 13 5 -4 9 6 -12 -6 -5 -14 -4 1 -12 -14 -3 0 -13 -3 7 -15 -12 1 -5 8 2 16 1 4 2
4475 2 0 9 10 -2 -1 16 -4 -4 2 2 -4 -14 4 -3 -1 6 -1 -11 -16 -1 -7 4 8 -6 7 0 -15 -11 14 4 -2 -10 -6 -3 -2 -8 1 14 -14 -20 1 -7 -6 8
4519 8 -4 -16 -7 -17 -4 10 2 -7 7 7 -12 -3 15 -8 -21 4 6 -17 -5 15 -15 -16 0 -17 -18 18 -10 -19 7 6 -37 -10 33 -9 -16 4
4555 4 -16 -20 6 30 -17 -2 11 -22 -3 35 -12 -6 32 -2 -47 12 30 -19 -11 24 -19 -38 24 4 -14 13 1 -47 -2 29 -16 -5
4587 -5 34 -30 -48 10 9 -16 25 21 -28 -17 27 10 7 45 6 -34 16 15 -11 28 37 -20 -22 19 -12 -6 39 6 -30 -24 -13 -29 4 36 -18
4622 -18 -32 -6 -26 -8 38 21 -10 -15 -4 -14 14 36 0 -10 -13 -20 -6 19 20 12 -3 -9 -25 4 26 17 19 -2 -22 -14 1 26 28 12 -11
4657 -11 -31 -18 13 17 15 2 -26 -13 1 -3 18 30 -10 -32 -13 0 -3 33 13 -29 -18 1 -9 22 41 -8 -24 -4 -14 -10 39 29 -20
4690 -20 -1 3 -21 5 42 -2 -22 -7 -19 -29 20 27 -28 -5 -10 -62 -28 34 11 -13 -3 -27 -41 9 41 1 -8 -3 -29 -15 43 20 -10
4723a0L0j4k9L8K6l8mK7l6j9N5k8j8L9qm5K2J5j3J0L1m4k4L4J0j7L2ln7J2M8j3
4755ILJ1l1k2L8Rl0L0nk4lL6k0j1K9j8j4J5j0j4L5Lk6OLj5J3K2j1k0K1k0MJ2J0
4790A5k0JKoJ1J8j6JJj0j1K8rlkLrj0K7j5kJ4rlJ4kj1J5Jj9pJ7qJ7Rk3k6K2Rn
4830aj3J6j0LJ7k0MJ1j1oL0j4rJ6%k0J8Qj2jQj1lRkj1KJ9k8OPnKJ2roMNpMNoq
4873gJ0JqkJ1pPMLnmlLJ1k0J0Okk2J3J5k1jRJ0j2oJ1Jmj2POj1J2lJ8j5%JLLpM
4917GmMKMKj3%pJ8lj3JJ1klnQqkJNkLNjNoKjj4MKMmJj1NJ1j3ROkonJ3oKRnoNj
4969FLoPj0jMJ%J0j2LqJ6j5kRjJLLj6mLMOqlJ4j0MK%JmOMmmJ4rJLn%Rj3qJ9j8
5018ekJ6j6lRLj7J2J0oNNj7JOnkJ8nj7QJ1j6J3J5rk2K3qrJ8jk3QMrJ0J3j7j8K7
$$ plain form
4723 -10 20 6 -23 15 41 3 -1 26 -10 -29 26 -2 -20 19 11 -34 -12 3 -10 0 31 -13 -37 -3 7 -10 22 19 -38 -26 22 9
4755 9 12 23 -8 -30 8 17 -13 17 12 -12 -15 21 1 -10 19 1 -13 2 -8 -22 13 16 -10 -4 -1 -16 -3 19 8 -12 9 -11 -7 5 15
4790 15 -5 -4 -2 -8 3 21 5 6 7 -3 -14 14 5 2 0 3 -6 -16 11 -4 -6 8 -1 -4 10 8 -3 12 13 -6 -13 4 -4 13 22 -1 -27 -5 4 -1
4830 -1 -14 2 -8 -5 12 -8 -4 7 -4 -10 20 6 -3 13 13 -7 11 19 7 6 14 3 0 9 7 -4 -2 17 -11 -5 2 -3 -1 11 2 -4 0 5 -2 2 7 1 -7
4873 -7 3 4 -4 -6 5 -2 5 9 12 7 3 0 3 14 -6 4 10 8 -14 -1 14 -7 -8 1 11 -1 -7 4 5 1 -11 -4 2 -9 3 0 18 3 3 4 7 10 3 7
4917 7 3 7 9 13 15 2 2 -5 13 10 -3 -2 9 7 4 -1 7 -1 -3 -2 3 1 4 9 8 13 7 9 8 -6 -2 0 4 0 1 -10 -5 6 -7 2 8 6 0 -5 8 2 4 13 8 2 7 6
4969 6 9 3 10 0 -1 3 4 4 14 2 5 -3 13 -2 -4 5 4 5 8 11 -5 -9 -6 -2 4 -4 -7 7 -3 1 3 3 4 0 6 10 6 2 16 7 8 11 6 6 15 2 -6 13 -5
5018 -5 -7 9 -7 -10 -1 2 -15 -3 7 1 6 11 -6 -5 1 -4 -6 12 7 -10 -2 9 -7 6 21 12 -10 13 5 -4 14 13 -10 -2 2 -7 3 16 -1 -19 8
5059Hk0pK6J6l2J1J3l1LM0k3j7Poj5N1ml3J1Kk5KM3j2j8K1jm0L2J6k3NJ4k6j3
5094b5L5lj6L3mn0K2M0j5j1K1k1l5L9kmjRm7K3K0j4LL1l2m2M5loK6J9m9LJ2Rj
5130IL2k7l0J8pmL0J2l6k4J9MnJ7Mqj1pqK2J3j4j0Oj6LL0Opk3J2rJ6P%j4lk0K9
5169FJ0mMJk6jQJ0Njpk6K0j1kK5J2l4kJ1j7RL7k3k8J7Oj4L0Ql2j4L4j7lK9km6
5207b8J4J8moL0l2rK2j0k5M5Pl0RJ3l3mN9j9l0L4j5l8M1K2m8J0J9m1PL8pl6K1
5241fJk2J1L7k6pL3k8j9M1Jk7J1K4l9kK4%j6K6j4j5J2J5k7J3J1k7j1L0j6mK3m
5275Ck5J6J7l1J0K4j7j0J7qoJ8lj9J0J8j3%J6j1k0PQKjJ0j9j1J6JOLj0mJMpnJ2
5314alJ%O%Mj0J0j0nJ2kJJLj4PPj3%OnkJ1pOnjMjKk%J2j7%NJ1j8jNKkOmj9J6N
$$ plain form
5059 8 -12 -19 7 23 -9 2 15 -16 -13 27 4 -13 -6 -12 -27 24 20 -13 -2 0 -25 -23 20 8 -10 11 10 -30 2 18 -5 0 14 -12 -25
5094 -25 10 7 -9 24 20 -30 -8 32 17 6 27 6 -29 10 8 4 3 12 -35 -12 8 -6 -3 28 -4 -46 -1 -4 -10 16 35 -14 -11 1 10 9
5130 9 41 14 -16 2 -5 -9 21 33 -3 -27 -8 -4 -9 8 12 4 -7 -14 -22 0 13 -1 -11 -5 -21 -18 12 18 11 -12 0 -9 7 14 14 0 -3 -23 6
5169 6 16 12 16 17 -9 -10 -2 8 13 12 5 -21 -1 -12 -14 11 23 -11 -13 -2 -19 -10 27 4 -24 -7 -1 -15 15 23 -9 -23 11 -6 -9 20 18 -28
5207 -28 -14 4 0 -6 24 -8 -17 5 -5 -30 15 22 -8 1 14 -19 -23 36 17 -13 21 6 -32 9 31 -17 -7 12 -29 -22 16 9 -27 -6
5241 -6 -5 -27 -16 21 -5 -12 21 -7 -26 15 16 -11 0 24 -15 -17 7 7 -9 17 3 -12 0 15 -12 1 12 -15 -26 4 -12 -16 7 3
5275 3 -22 -6 11 -20 -10 14 -3 -13 4 -4 -10 8 5 -14 -4 14 1 1 17 6 -14 -7 1 3 2 12 -7 -18 -2 -1 5 8 -2 -6 -5 -1 -8 -13 -1
5314 -1 -4 -3 -3 3 3 7 -3 7 -3 -8 4 2 3 4 7 -7 0 7 -6 -6 0 -5 -7 4 -3 3 -2 -3 1 0 2 0 0 12 -5 -5 0 11 -7 -8 -3 -1 -3 3 -1 -20 -4 1
5362Aj3kJ4qK%%nmJ9pMJpJ2jolO%poJ6mnNrkJ3nmJ1lpJMplOJ2j4MoPj3J4m%J1
5411HJj1QJkpMOnLqK%nM%jk%JrJ5j1oQmKNplPkPjJ0nj0KP%JkpJ3pOkklLpLMmO
5466DpOqkPKrLPkNmllQoKM%j1LJjMMjmOpj0J2JrJ8j5mMJ0nnJ0rKJ1opoNoJJ0m
5518dLPpkPploJ1kj0J0NjJLj7OJ8j0oJ6%j8J1KrkJ7nj0J0j2pJ7Pk4KK1k2oK6j7
5561gj0K1ok0L1Mk3mJ7k2J7J4j2j2K0oj6K2JqjKorK3kj3kPlj1L6j4j3J1j9mK4
5599GlJj2Pj5j5L8mLmlj7QK6k1J1j2mJQNrJ3pjj0OJ2lrMj1OJ7%j4Rpj0LJ5J2j6
5642Ekj2mJK7onkpmK3noJ0kk8j6N7j4j1K1j2k3QK2k4J9J2l8JK8nj9J5J1m3K0K5
5680A7j6j3L4k2k4L0Jk3NL0m5J4L0j6j8L8ql3J9K9l9JL5k1k6L7ok1L2Lm2K1J0
$$ plain form
5362 1 -12 -14 0 -8 -6 -6 -6 -11 -15 4 -3 1 2 -5 7 6 0 -3 3 3 -4 -10 6 2 -3 2 -7 -9 4 -1 -5 6 3 -4 -3 1 -6 -9 -3 9 -5 -1 -7 0 -13 1 -3 -3 8
5411 8 9 -2 6 7 5 -2 2 8 3 6 -2 0 0 -5 -1 -1 -2 -4 -4 -3 -12 3 -8 -14 -6 -10 -8 -3 -10 -13 -6 -8 -1 -2 8 3 -7 -5 2 2 3 1 -6 7 0 6 4 2 -1 2 -5 -2 2 -2 4
5466 4 -3 3 -5 -7 0 2 -7 -4 3 1 6 2 -1 -4 4 -2 0 4 4 -7 -4 -3 -4 0 4 3 -1 5 -2 -12 0 1 -8 10 -5 -9 -5 5 0 -5 5 -4 -2 9 3 -4 -10 -5 -11 -10 0 -4
5518 -4 -1 6 -1 -3 4 -3 -6 -12 -1 -3 -13 -3 2 1 2 5 -12 -6 12 2 -4 12 12 -6 5 7 -2 -4 13 8 -2 8 -4 -11 6 13 -11 -9 12 -10 -16 10 -7
5561 -7 -17 4 -2 -22 9 13 -10 -14 3 -19 -2 12 0 -12 8 2 -14 8 9 1 0 2 -4 -13 10 8 -5 -7 0 -3 -14 22 8 -5 6 -13 -17 7
5599 7 4 5 -7 0 -15 -30 8 4 7 3 0 -17 -9 17 -4 7 -5 -9 -8 0 5 -4 9 2 1 -9 -3 9 6 -3 1 -10 -4 13 13 -1 8 1 -9 -6 9 21 5
5642 5 3 -9 -13 -12 15 9 4 2 -5 -9 14 9 3 13 11 -17 -33 24 10 -1 20 8 -15 -7 15 -9 10 22 -16 -15 13 8 -11 4 15 -28 -8 17
5680 17 1 -12 22 0 -24 6 7 -16 -11 19 -26 -12 18 2 -16 22 14 -19 0 29 -10 -9 26 5 -21 16 10 -11 21 24 -18 3 13
5713A3l1J0L4l5k0L4mj9J6K7m1j1M0j5rL0k3k1L4Jl5K4J9l0JL0j5j7M0k4j9J6
5745@Ok4J5J9l5PJ1qj0K2Lk9J7J4rj1K0Jk4J1Oj0KJ5k2QJoQJ1j0pNNMj0NLrPL
5786Ej0J2J3j6pMlLJ1pj4jKJ9j5J0rKj2J0%qRnmKJ5j1qK0oj5K1Lk3K0Pj0%Mpm
5828cJ8Kj4Kjj3NJ1j0k4L0rpMJ9k6LJ8j4%OlpK2mrJ1J3l1OJ4okRqmLOj1OJ1oj3
5871fJ7pj0MKrLPjrJ7pqMJ1j3KNj2jJ5j4oJ8kmQlj1NQlnOpJ0lJpJ0%lmJ3Jj5R
5918FJj2lKJ5nkmJPj0lJ0npOJ0j1jkJ5oN%qnjJ4%%olRlj%lK%Jm%nOoj%KmMPj0
5970hkJ5j7mK7k9J4j4J5kLJ2j2RjpjOlpJ4j0NrjRoLJpJ0q%LQk1J4LlnjOrONmj7
6017b0K2JqJ4opNnjOJ4oj1JPk2ROkKOj4NJ1%j0Qkj3J2LqkJ4k0rJ9Oj5OOlj3K2
$$ plain form
5713 13 -18 -8 26 -9 -29 5 1 -18 -2 25 -16 -27 13 -2 -11 19 -4 -25 9 10 -25 -1 18 -12 -11 19 4 -13 27 3 -16 0
5745 0 6 -18 -3 16 -19 -12 -1 -9 -19 3 6 -23 -6 8 -1 -12 8 9 -15 -4 2 -8 -6 9 -13 -5 -4 -10 -2 9 -1 -8 -3 2 6 -4 1 4 -5 2 5
5786 5 -5 7 20 4 -3 1 -2 1 12 5 -9 -10 -8 11 -4 6 -3 -1 -13 -3 -3 -11 -2 -7 -11 -9 6 -5 -13 7 1 -14 7 10 -13 7 14 4 4 8 1 -3
5828 -3 15 17 3 5 4 -9 -4 7 -3 -27 3 -6 -13 -9 10 -16 -13 5 -9 -9 -3 -6 -13 9 5 -4 7 20 -11 -5 9 3 1 10 2 -2 1 7 -4 2 13 7 -6
5871 -6 11 4 -6 -2 0 -9 -6 1 0 -9 8 1 -7 -3 8 -5 -3 2 -10 -11 4 -10 -16 2 0 -4 4 1 -10 -5 3 0 -5 1 -6 4 1 2 -5 5 5 2 -2 11 12 -3 6
5918 6 7 -5 -8 -6 9 4 2 -2 -1 6 -4 -7 3 -2 -9 -3 7 -4 -5 -7 8 2 7 7 -1 -6 -7 7 7 7 1 -2 7 4 3 3 0 2 2 3 -1 -1 -6 0 -6 -7 -7 -5 -9 -5 2 -8
5970 -8 -10 5 -12 -16 11 -18 -4 -18 -3 -5 -2 10 -2 7 6 -1 -2 4 1 -6 8 -2 3 -6 -7 2 -4 -1 0 -7 3 -5 -5 -2 6 -15 -1 2 -1 -6 -7 -1 -10 -4 1 -3 -20
6017 -20 2 3 -5 9 3 -4 1 -4 -5 1 15 9 -2 -1 6 -16 -7 -1 -3 -1 5 -9 -4 7 7 -3 5 3 -10 2 5 -3 -5 9 -11 -20 -1 5 -10 -4 2 -1 -14 8
6061H%nnlmJ2Pjj1J5j6KJ4Kj5LOk0MJ0orJ2lj2RJkJKkp%RjNMj4KJ6%j3MJ4k2K
6107gJ0lJLnqPRrOJ1l0Q%%j2J5J1k3lK3j5pK2jk0J1KljK0j0j8K2mpJ1J3l3QJ8
6148A2j5RKkl1L0Nk4RJ4k1pL5k2j2L4kl0J7J4l4OL4l2j3K9Lk9K1Qk9NK0j7j2L6
6184A1ok4K6jj6NK5k9lK6j4j5L1pj0nJ2j7rK4j4oJ6rk0L0Mj3LJ3j7KL2k3k1J3
6220fJ0k1K0J4k7NJ5pj5J9J3k6J6nj7QK1jj3Omj1RjLokmj1J5Npm%pLJ9lj4J2j
6261@pkJ4PplmlOKoQMqj9K0J0k3JJ5j7oK7mj0Rj5JJ6Jj2jJ2k4lL5j3j5K4pk7K1
6303cL%nLJ4k2LJ6rkJ4k0lK6nk0K6qj6QJ0j2mNkmJ2onQOrj6K3j1oJ5Mk1J5%j6
6345a4OK4k3NLmrJ7lo%K0j7PkJqJ4Jk0L%nJ1rRLj4MOnj1NNKJmMoQqQJllRkjj0
$$ plain form
6061 8 8 3 -2 -5 -9 3 10 9 -2 13 -3 -1 13 15 0 3 9 -11 -7 3 -3 -12 0 -3 -15 -6 -5 -7 -6 -4 -6 -13 -13 -4 -5 0 4 -10 -8 8 8 -5 -1 13 -9 -7
6107 -7 3 0 1 4 -1 -9 -2 7 -2 4 15 -15 -7 -7 -7 -19 -4 7 -16 -19 4 -11 -18 4 3 -17 -6 -4 -7 -8 12 2 -16 6 2 -5 6 19 -14 -6 12
6148 12 -3 6 8 6 -25 5 10 -14 -5 9 -12 -19 16 -6 -18 16 14 -16 1 15 -19 -13 21 -11 -24 5 8 -21 0 8 -21 -16 4 -13 -25 11
6184 11 5 -19 7 6 -10 -5 20 -9 -12 14 0 -15 16 9 -1 -6 6 -11 -20 4 -10 -16 0 -9 -29 1 5 -8 -5 8 -9 -7 25 2 -19 -6
6220 -6 4 -17 3 17 -10 -5 10 3 -12 7 20 -6 10 5 -12 -4 17 16 3 9 5 -6 3 2 5 -1 -3 -7 -18 -3 2 -5 -9 -9 -16 -13 6 3 -11 1 0
6261 0 -7 -9 5 12 5 2 -2 -5 1 3 -3 5 9 1 -18 2 12 -11 -10 5 -12 -18 9 5 -5 4 -11 -10 6 7 -5 -6 6 -18 -21 14 1 -14 10 3 -24 -3
6303 -3 0 0 -5 -2 12 -10 -7 9 0 -2 12 -8 -11 15 10 -10 16 8 -8 0 10 -2 -6 -1 -3 -7 5 -1 -6 2 8 -1 -17 6 -5 -11 4 8 -13 2 2 -14
6345 -14 -8 16 -7 -2 1 -3 -12 5 2 -4 -4 16 -1 6 4 5 -3 11 12 -8 -5 -5 -10 1 -8 1 4 -10 -6 0 -5 -16 -11 -6 -4 -3 -7 -3 -9 -1 -9 -1 0 -3 -6 3 1 0 -10
6394a0QjkKjJ4j0lPQj0KqKmJ0qnOoLPj1J1mRj2KMmJ4j2pJ0nJ2rQr%j2RJ2j1lO
6440aoNj4P%jKjJ3k%j0KM%Okj6QNMk3J4kNl%oJ2JmNrJ1nPkOj4J0Pk0QJ2nj0Lm
6488cPoqJ2Rk0kJ2nnKNpLKRpQqjLQrL%%oMj1KJ5plKKjNJj9J4L%oLpOlpMNoJj4
6541b1OJ5LOplJjmRJjj3J5nLlLqOj1kMOjjJ2pj6J6lqJ4p%nRnJ1Joj3J2qkLmQL
6590BJ2j4QnpLNM%lJmNjqKMjNploLKLJ3j8PjpLMjoJ0j0nJ6j1lmK1Jj2OojnJ8q
6640A%PrnK2mj6MQj8NJ1j2JQpj3J2%j8J8Rk6J8J1oj9K3rqJ7Qk1RJ7j6nJ5kk2K3
6681A1J0m0NJ0Rj1K3j0k3K0K0k4Pmj7MJ8lj2NOk1J3J3j5KJ2j0pR%k7K4K1k2j2
6717a6K6pj4K8nj8ONj1QJ1j2mJ2rj2K8nk2J0J0kj6K5j5qJ4opMNMk0J4J2j8KRj3
$$ plain form
6394 -10 -2 -3 -5 -3 -4 10 0 -3 4 12 2 4 -4 -2 -6 4 -4 -9 -3 -9 -6 1 -10 1 -3 6 -6 -4 0 -4 10 -2 -9 1 -4 8 -1 7 -2 -2 -14 -5 7 -4 -7 -1
6440 -1 -7 -2 -16 -9 -9 -10 -8 -9 4 2 2 -8 -6 -2 -2 4 2 -14 -6 -1 3 -20 -6 -8 -3 -6 -6 -12 0 1 -3 2 -7 4 -1 6 4 10 -4 6 13 -7 1 13 8 -2 1 -3
6488 -3 4 -2 -10 2 11 -9 -11 1 -4 -9 -7 -2 -9 -6 -4 5 -2 6 -2 -3 0 8 -1 2 2 2 -4 0 -11 -9 6 -1 -4 -2 0 -1 4 5 -14 0 3 3 -3 0 -7 -1 -4 -11 -7 -2 -8 -7 -21
6541 -21 -15 0 3 9 2 -1 0 -1 -5 4 5 4 -9 6 1 4 1 4 -4 2 -9 -11 -7 -1 -2 -3 9 2 -14 2 -1 -9 5 -2 -2 -7 2 -3 8 9 3 -10 2 -6 -8 -5 -9 -1 2
6590 2 14 0 8 3 -4 -1 4 8 8 5 6 2 7 6 -2 0 4 3 8 1 -2 -8 -5 -3 0 13 -5 2 1 -6 -3 1 0 -6 4 -6 -11 5 -6 -9 -13 8 9 -3 3 -3 -4 -9 9 1
6640 1 1 8 -1 -6 16 12 -4 0 8 -10 -5 6 -6 -5 3 -4 -17 -5 -5 -23 -5 4 -22 -4 7 1 -18 5 -4 -12 5 13 -8 1 18 2 -3 12 10 -12 11
6681 11 21 -19 -14 -4 5 -6 17 7 -16 4 24 0 7 3 -14 -10 8 5 -7 -2 4 -17 -4 9 -6 -4 8 -2 -9 0 0 -27 -3 18 -4 -16
6717 -16 10 3 -11 17 12 -6 0 5 -6 2 13 1 -3 9 0 -12 16 11 -11 -1 9 7 -9 16 1 -7 7 1 -6 -2 3 7 -13 1 13 -5 -3 6 -7
6756gKLoNQKj5PJ8j1qJ6pj2Rkj3J5%j5J1oNqJ0mk%Qj1%K3j5nK4j1j8J5Qj4%J3
6798A2oj1K2qj9J3J0k4J2J1qjJ1qj8K4lj5LJ1j9KL0k0j2K6qk1J5Pj2rK6j0j5J7
6834ElnNJ1j6JQKqPJj4RPj3MJjmJ7j4lJ0Mj8KL%PolnQljj4K4j1MKlmJ2nO%rNo
6883dMPj0J2j4LJ0qoJ0J4k1nNNnlKMj1J3rJLJ1j8PQrmLJqQRpJLnkMJ3qMorJ5j0
6931b%MlOj1Qj0LmmJ0mLqoJ3JmOmjJJ5j1LJJ1kk1J6JmjNj5J3jJmllkRrkQMpMj
6981aNmJ1j5LLplJ2Jj5J2Plj6LQljOrJ1N%j2J3orJ5jj0Pjj0J8Koj2RLoMqJ1k1
7026a0J2j1LLKj2J9nKJRj7lJ4Kr%J6k5QRoNNlpjJ3p%Lj6kJ6rqNMMmMppRlqOJ1
7074Ej2PJ2rjNkj2J6ooJ0K2k1j1J6qoJRj0pJ3Kj8K1oj0Pkj3RJ3j3oK4qj2J1mj4
$$ plain form
6756 -7 -5 -2 -8 -3 5 7 -8 -1 17 6 -2 14 7 -5 4 2 -11 4 4 -11 0 -6 -1 -9 1 -3 -5 -5 3 -8 -8 15 0 -5 19 8 -10 5 13 -1 -1 12
6798 12 6 -5 17 9 -10 3 13 -11 1 12 4 3 14 6 -12 12 9 -6 -3 8 -11 -9 21 1 -11 15 7 -14 1 8 -4 -13 13 3 -12 5
6834 5 2 -3 2 13 -3 -2 6 8 0 7 8 -6 3 10 -3 1 2 1 -3 14 0 -3 7 11 -7 -5 -2 -2 5 -1 -4 -9 -1 -4 -5 -19 5 -6 -2 0 -3 -7 5 0 6 6 -3 2 -4
6883 -4 0 7 -3 9 -5 -2 8 0 -6 4 18 -3 -8 -3 2 -3 -6 -4 0 -11 2 -7 -6 -3 8 -10 -3 5 -4 -8 -5 -4 -12 -4 5 -2 -1 2 -3 -5 -1 12 4 8 2 -7 8 -2
6931 -2 -2 2 -1 5 -6 2 -8 -5 -9 -13 -3 -7 -4 -12 -18 -5 -4 -8 -2 -6 -7 -6 9 -2 1 2 13 11 -10 6 7 3 2 7 -8 5 4 5 1 -2 -5 -7 2 -7 -9 -1 3 -4 0 -1
6981 -1 4 0 11 -4 -1 2 -5 -8 4 5 -10 2 9 6 -10 -7 1 -2 -3 3 -6 5 10 10 -2 11 5 -4 11 10 0 7 6 -4 14 16 10 -2 7 10 4 8 0 11 -10
7026 -10 2 -9 -6 -3 -1 -13 6 1 3 4 13 -4 -7 7 9 0 0 16 -9 -1 8 2 7 12 9 2 1 14 7 7 10 -6 -8 8 -1 -9 -4 0 4 0 4 -3 -10 -1 -4 -12 -6 5
7074 5 -7 0 12 3 2 7 5 -7 9 3 -3 7 29 8 -3 13 5 -1 0 9 -1 -8 5 7 -11 10 4 -6 1 -1 -14 -5 8 -5 -11 13 5 -7 4 0 -14
7115a4J8jj3%J9j3j5J7Lj3J4J4k5mK2j3rK0Nk7J8J8l0kJ7Nj8K0j5oLJ6k6RJ5j6
7151gpK3jj3QNk3K0Kk0%K0Kk0K0j1nMJ5j0jJ4j9rJ7J8l4K2%j8J1J5k1j0K6j6j5
7188a8J9kj5J1Njj0J8njLJ3k4QQkmQQj4NK%j2Pj6QQJpQkj2oK0j8PMPk1KJ2lpK2
7233A4j7j2RJ3j2KJ4j9%J7Lj1NOj4J1J4j9KjQk2J1Jj0K3ok1POnqJ2%qNQrmK1r
7274EqKPk3J7J2j6KJ6j3jNOk7K9nn%J6k1JJ7oj7J0J1j9kJ2mJjJrJ6pmkPj0mJ7
7316Frj0J0J2k9J0J3n%J7j6KQj0KlNjkPMj4J8j2JLpo%LlJ2j1Lj2J1MnRoj0kJ6
7359ClqKLLMj0MnJ1jKrnJ0nJ2nj4K1j1pLJ4p%jLNj2mPqQOj1lJ4j9PNnLPj2k%J2
7407BlPpKj3MJJ2j0MJ1Jloj1J3j2NMkj0PkmLoPj%LoOJjLkkNRj4%J3lNoqJLJ0n
$$ plain form
7115 -14 4 3 -10 -10 9 -4 -19 -2 1 -12 2 16 -9 -13 9 -4 -13 7 12 -15 3 21 -9 -11 6 11 -7 13 -2 -8 -5 11 -15 -6 9 -7
7151 -7 -14 9 8 -5 3 8 -15 5 7 -13 -13 7 9 -11 9 -2 -7 -3 12 2 1 15 -4 -13 4 22 -12 10 10 -8 3 18 -3 -13 13 -3 -18
7188 -18 1 -1 -16 -5 0 -1 -11 7 2 1 4 17 -7 1 9 7 3 11 19 5 10 12 12 0 7 -9 -1 7 8 1 9 7 -5 -11 9 -9 -2 2 9 -12 -10 2 -1 -8 14
7233 14 -3 -15 -6 7 -5 -3 11 -8 -8 9 12 1 6 12 -2 9 23 4 6 5 13 -9 2 3 -7 16 10 -11 -4 2 -3 -11 1 1 -7 -2 6 -3 -7 14 5
7274 5 -3 -1 6 -17 0 12 -4 -2 14 1 0 5 11 -16 13 8 3 3 19 -2 -1 16 10 -7 3 14 -5 -7 5 1 2 1 2 -7 9 2 -2 -4 3 -7 -11 6
7316 6 -3 -13 -3 9 -20 -10 3 -2 -2 15 -1 1 9 -1 1 -2 3 2 0 7 11 -3 15 3 4 7 0 -6 -6 -3 -6 6 -5 -2 -14 -3 1 -4 5 -1 -11 -13 3
7359 3 0 -8 -6 -3 0 4 -6 -2 -7 4 3 5 -4 -9 1 -4 8 3 -11 10 -1 -8 -5 9 2 2 1 4 9 -3 -7 0 -8 0 6 -5 -8 6 -13 -6 -1 -6 -3 4 -8 -10 -10 2
7407 2 -1 6 -1 1 -12 -8 -7 5 -5 -1 10 11 8 2 -9 4 -8 -3 1 -1 -11 -4 -6 -10 -7 -13 -6 -7 -7 -4 -10 -4 -3 -4 -1 -3 -5 0 9 -5 -5 8 5 10 4 -4 -3 0 10 5
7457Enj0J2jQlj1J%KjJjnKPj3Rj0kRkmKJ2LoOj0OlJ0nO%jkpoKJ7pnlJ0Mj6LnJ
7507fJ3j0kPj8OJ6j6J0KqJPoKQprPNnj%JPrLmLPlLMJj0J%nJ5pljKj8J5Nj0PLj2
7557iKMLqJ1JoOnKnOpKJ3j3NOkoPk%%MpQn%LoJ2j1LnmjonONjmRlkOJnQqRj4J6
7611HLmPqnJ4oKj5J0oJPkkj4KPlJ2j4Rj2J2qOOpj1J4qoJ6j1OlJ2qmOmJJ4k0NK
7657AQj1nJ3Jj2J9j5JJjJqjLnJ4j1LJnJ4j3PJjKq%J4j4mPJL%lLrNlRkJ3j9POP
7705A5k5J5JkmKlj0PjjMl%M%nMJkrMNLM%nOLnlJ3kj2MLlJJ2k0PKpnJ0qlMPj0%
7756gJ2mj1RkjJJ3j0qJkmJ3knMNJ%%mjNKrOQqmJ3rJLlnk%mNJ2j6MlpJ0KKj1J4
7806DnkrJ9pj4J8%pnO%koJ3j2LJ0lnOoMPnpkNQn%j0OMnj0J2nJ4ok%JLj4RLPj2
$$ plain form
7457 5 0 -10 2 1 9 6 -5 -4 -4 -2 -3 -2 -3 -8 -6 1 -12 -3 -13 -15 -6 -8 -12 -10 2 5 -1 5 -5 1 -2 8 3 9 9 8 6 -1 -7 -5 12 5 0 -3 7 11 -5 -2 -7 -6
7507 -6 7 -3 -5 2 -16 -10 6 -10 0 2 -6 -5 2 -4 -2 6 -1 -10 -3 2 -3 -4 -4 -3 4 -5 -2 -6 -3 4 1 4 8 9 -1 0 0 -5 10 3 0 -1 1 -17 -2 3 -7 0 3 -9
7557 -9 -7 -3 0 -8 3 4 -2 4 -1 1 -4 2 -5 -3 10 -3 2 8 6 0 7 5 5 5 9 2 10 5 5 8 2 14 3 6 1 -3 -4 -10 -15 -9 -4 -5 -9 0 -3 -5 1 2 -3 5 -3 6 -8 8
7611 8 11 7 14 6 1 15 9 11 -4 6 0 1 8 6 4 -10 -8 -1 -4 8 -6 3 -9 3 -5 1 7 0 -11 3 -5 -11 5 -6 0 -3 9 1 -3 3 -1 0 14 -6 -1 1
7657 1 9 -2 -7 6 7 -5 14 -1 0 1 0 1 -7 -8 -5 -10 4 -7 -4 -3 -8 6 -7 0 1 0 2 -6 -6 8 -6 -10 -3 -2 1 1 -2 1 -8 -3 -6 3 1 14 -5 2 8 15
7705 15 -10 5 6 4 0 2 -1 -11 -4 -5 -6 -2 -5 -5 -1 -1 -6 -2 -1 -3 -12 -8 -3 0 4 4 -1 5 8 3 0 13 11 -1 3 6 3 4 16 -4 3 5 -2 -7 3 -5 -8 -4 3 -7 -7
7756 -7 5 1 -10 -1 -3 -4 -3 10 0 -8 -7 -9 -13 0 -2 -7 -3 2 3 3 3 -1 -2 3 5 -4 2 10 2 -2 11 2 3 6 3 -2 -4 -4 -8 -3 9 -7 -3 -6 -13 -3 -1 1 -10 4
7806 4 -1 -3 -12 7 0 -14 4 4 -3 -8 -2 -2 -4 -10 3 -9 -6 4 1 -4 2 -4 0 7 2 -5 -7 -2 6 1 1 -9 -3 1 -4 -14 -2 -7 7 1 -1 -1 0 3 -11 -2 1 8 -4
7855dRmPomkLQKonjO%l%LpJ5j0LqKjmnJ0MMk5J1nMOJOoLkLj2J7oJ3njpRpnNJl
7908AkqLRj5J2KnnJ3q%l%J4%pjJ0nj3J5kmL%%%nMrRoJlmJ0kMj0J1Nnk%MqknMm
7959iLKnOOjpJnkL%kMpJJ4qPkRj2KNj1J4njpRMj2J5j0Kn%LrPJj0J5j5jNNljmJ
8010a0Rmj6K5pkJRQj0RrJjJokJ0JoKM%pmmRj4J2lj2J5Lj3J1j1QoJ%Pj5J5Rk5J8
8056ApJ3Pj5PkrJ1Qj2kkKRkknJ0j1%LrKKj3LOjQj0kQjpLRKkkPmmJ3j4Q%qjRLJ
8107HqKJJQJj5Rj8PqNlOJ0rJ1j7QqMj1mJ1Pj0MmRoPMLqLjnOoPj0J5JrRqMNLoq
8158cRnmJ0pkMjpJMoRm%mPkLkJjnJ0jNMj1j3NJ5n%
$$ plain form
7855 -4 5 1 8 2 -2 -4 -1 7 9 3 -2 -3 3 3 0 0 3 -4 11 1 4 -4 -2 -3 -7 -12 -2 2 6 -19 -8 -13 -9 -3 -2 4 -2 1 -1 2 -10 7 1 14 9 8 1 10 3 -2 3 4 1
7908 1 -1 -9 -6 3 -12 0 2 -3 -8 5 -3 -3 -6 -6 8 8 1 0 10 5 -8 7 5 1 4 4 4 4 -1 3 -6 3 -3 -2 -5 -9 1 -1 3 -7 4 9 4 2 2 6 -2 -4 -9 -5 -9
7959 -9 -6 -4 -9 -3 3 2 -5 -4 -9 -11 -8 -8 -10 -6 -13 -12 2 -6 1 -1 8 -4 -2 3 -8 6 1 0 -7 2 6 -6 9 -1 1 -4 -4 -1 -10 -3 -2 -12 3 -12 -13 -8 -3 -6 -7 -11 -10
8010 -10 -1 -5 -21 4 -3 -5 -4 5 13 3 12 3 4 3 4 -2 -4 6 7 1 3 7 7 0 -4 -8 1 -13 -1 -4 -16 -1 2 -11 0 -11 -3 -9 -8 -8 -1 -16 -1 8 -17 1
8056 1 -6 7 14 -1 6 4 -5 6 14 2 0 -2 0 9 7 5 0 10 -1 -1 2 -7 -5 -3 -16 -13 -7 -8 0 -10 -12 -4 -5 -12 -9 0 2 0 -2 5 1 -3 10 -4 4 4 -4 -5 4 7 8
8107 8 0 2 3 4 12 13 -2 7 -11 -4 -12 -7 -10 -4 6 -3 8 -9 -1 -9 -5 -16 -20 -9 -2 -12 -8 -12 -3 -9 -2 2 5 -3 0 -1 -6 0 -6 1 -9 6 7 -2 7 -1 3 8 11 5 -3
8158 -3 6 1 -3 7 0 -2 2 1 -6 -5 -1 -7 2 -2 -2 -6 1 -1 2 0 1 0 -5 5 4 9 13 2 -11 -6 9 4 4
8191D
$$ Imaginary data points
##PAGE= N=2
##DATA TABLE= (X++(I..I)), XYDATA
0@%%%%%%%%%%%%%%%%%%%%%kJ0j6J6j6J6j6J7k5L2l2L7m5M8n6O4p2Q0q8R7j05J20
43F4j36J49j62J81k00K17k38K62k90L22l54L89m29M77n30N89o61P47q51R80j145
64f19J367j679K151k963M740j5358J0110K1779k4377P738Q173k4335k552K9400
78A3575p814j3207J4647m672j8554J9612J0671k2159M059J8852j9187r889K1743
91G677l355j5633J8384P523k2339p12J1794r578L372J7479j1394j5496J1842K052
105A616r006J3787O983k1196l910J5593l205l910J2705l031j4755M563O548o031
119c249L740O978q145l474P491l540n479Q381K747q428N76M294m960m74Q037L12
135D807n959j050k57j468L791M720j455l221r50j119j20L417K425k550k751J094
$$ plain form
0 0 0 0 0 0 0 0 0 0 0 0 0 0 0 0 0 0 0 0 0 0 0 -2 8 -8 8 -8 8 -8 9 -16 16 -16 21 -24 24 -32 32 -40 40 -48 49 -56 64
43 64 -72 77 -85 96 -104 113 -125 137 -153 169 -185 204 -225 252 -278 311 -350 397 -454 526 -619
64 -619 748 -931 1220 -1743 2997 -12361 -2251 19528 -4849 2889 11062 -13273 -15825 13575
78 13575 5761 -7446 7201 2529 -16025 3587 14258 -7901 -3842 15010 -4177 -14066 7677
91 7677 4322 -11311 7073 14596 -7743 -8455 3339 -6239 -2867 14612 3218 -12278 -436 1616
105 1616 -7390 6397 13380 -7816 -11726 3867 662 -3248 9457 6426 -8329 -3766 2782 -3249
119 -3249 491 7469 -676 -4150 3341 -199 -5678 2703 5450 -2978 -2402 1892 -3068 -3542 4495 4807
135 4807 -1152 -2202 -2459 -3927 -136 4584 3129 -92 -1042 -2161 -2281 1136 3561 1011 -1740 -646
151f46P08j068K112K593l306l428K020L91j600L791K755m683k017K564k175r09
167b898N765o5n499K081K584m220J360N003m142l146M996j128m196N371K376o278
183b036J260M154n936j535P557j279n142M378O80o151K973M769m935q94M574l723
199a286k325O682m80n922L793K503o349J215O200l707k947N222q53m623L290J632
215B045m089J892K820m278j02M638k895k924M708k04n167K670L590l737n09L704
231B162j914k381K588j3j779K305L27k871J641K119l034l86L251j598k558K738
247E97J274k693J78J757j151o81R30n53k35J118o50p65J443n0j833Q52J602j349
265b09r27J553L46j123K26P27l45l80N5J40L50j03n88L10O85o25p23O32M17p38
$$ plain form
151 -646 62 -1006 1106 3699 393 -3035 -1015 -624 -2224 1567 4322 -361 -2378 186 -1989 -2898
167 -2898 2867 2802 -2697 -616 1968 -2252 -892 4111 -31 -3177 1819 691 -3505 1866 4242 -2036
183 -2036 -776 3378 -2558 -4093 3464 2185 -2957 1421 2101 -4050 -1077 3692 -1243 -2137 2437 -1286
199 -1286 -3611 3071 2591 -3331 462 2965 -3384 -2169 4031 324 -2623 2599 1746 -2877 413 2045
215 2045 -2044 -152 2668 -1610 -1712 2926 31 -2893 1815 1611 -3556 -886 2704 -1033 -1542 2162
231 2162 248 -2133 455 442 -1337 968 1295 -1576 65 2184 -850 -1236 2015 417 -2141 597
247 597 1871 -822 -644 1113 -38 -719 211 -342 -577 541 -109 -874 569 519 -1314 -462 1140 -209
265 -209 -1136 417 763 -360 -134 593 248 -132 -77 63 413 310 -278 32 717 92 -631 1 418 -320
285c20j99O97P2o13l9N01L4n09j03N29K59m11j59M43J59l89q6L86N4l53LM00Q
308C64m19o6L37j2l68n6K80pk71JK18p8k25N8K27m5j96Q7K44Oj46K6J59mp0P7
334A21J10n7p4Q8M2r7p7k4K6K2j00q7R7j0j99L0J32j68l5K47q1j91K36Q7k44J68
360c8K04k82M7M15j94k37M20o4m62L83K79n67O3M94n24k45O49k80o22O56K28q24
382e01K53N29p81OJ019n22p15Q95P1q54P78N85j188M1J050o84l39J194m20j118
402g01R43L43j204O25R43j319k87J338p11r75J327K03j252O35N62j288K62J319
420G63p19m60R95p09r50J520O31j360K70P16j217j65J509j63q58M56k35q11O93
439i4O05n38J82J94j143j79J236R5m94L79j35r16J09Q96L93j40m06l25Q4RJ22
$$ plain form
285 -320 -519 178 250 -363 -402 99 133 -376 -479 50 309 -102 -261 182 341 -48 -134 252 306 -47 -44 356 364
308 364 -55 -121 216 204 -164 -220 60 53 -218 -217 1 -77 -302 -244 -17 -62 -258 -171 73 79 -67 -41 118 114 44 121
334 121 231 174 100 188 230 133 56 32 58 80 -20 -107 -10 -20 -219 -189 -57 -225 -260 -13 -94 -285 -49 38 -206 -38
360 -38 166 -116 -69 346 152 -85 335 271 -191 192 471 -96 -33 461 -63 -308 341 61 -561 95 323 -501
382 -501 -248 281 -500 -494 525 3 -712 183 254 -600 178 763 -425 -384 666 -18 -357 837 417 -701
402 -701 242 585 -619 6 949 -370 -657 681 -30 -1005 322 525 -727 -92 470 -818 -556 763
420 763 44 -416 579 -130 -1080 440 1071 -289 -19 697 -520 -685 824 661 -197 259 24 -787 -94
439 -94 511 -27 155 349 -794 -973 263 358 -136 243 108 -808 -699 197 590 450 44 -281 -197 -188 -66
460f6P02K06p50l86O1j15M09N52j43p7l68j297J53J948J36j077M45n50j875J255
480h37K525p40j132K40j274l89K646N74j712N25k28k238J591K788k095j258K414
497A400j087k390K392R98k455J354J828l083q38K467j168j85L685j667m643K028
513a364K297j977K216K625n038k654M296N60j355L098j060n116K117L501k647
528e01N14K980l867k260M635m46l627L487J823m439O94K655l788k20N423j272
544A791l560K280p88l365M391L623m533j448K263k753K8N830q48m858J504O15
560A72l041L116L664m051j699L046j928j820M108K58l499J878J139l652R33L441
576B065j980p02K765k457l167L465J974k094J262P78l927m84L515jo67J359j913
$$ plain form
460 -66 636 842 92 -294 -233 -348 61 613 470 393 25 -1272 -1119 829 965 -112 333 -217 -2092 -837
480 -837 1688 948 -184 56 -1218 -1607 1039 1613 -99 426 198 -2040 -449 2339 244 -1014 1400
497 1400 313 -2077 315 1313 -1142 212 2040 -1043 -1881 586 -582 -767 2918 1251 -3392 -1364
513 -1364 933 -1044 1172 3797 -1241 -3895 401 961 -394 2704 1644 -3472 -1355 2146 -501
528 -501 13 2993 -874 -3134 1501 1055 -2572 915 2738 -1701 -1007 1648 -2140 -2360 3063 1791
544 1791 -1769 511 -277 -3642 749 4372 -161 -1609 654 -2099 -2071 3759 2911 -1947 -443 172
560 172 -2869 247 3911 -140 -1839 1207 -721 -2541 1567 1825 -1674 204 1343 -2309 -1376 2065
576 2065 85 -617 2148 -309 -3476 -11 1963 -131 1131 1909 -2018 -2502 1013 1012 345 1704 -209
593b09k364K347J515j481R19N97k969m19K720j27q85J441k95j970J94O71r6J181
611G70N94j447m16L96p62O09J980n51j928q4M45J45R48N21o65p39r57k61J636
630B34R31j128m4N51j361n23J666L63q00K21k98o30R44L73o48R79J27k344J44
649a243K302p01q66J952l19k551O19J339q71N14R14j617l25J491r59m86K191q65
667E19k671J751J714k072K65K240j656j537J818j14j273J601L73j675J076P80
683A139k325N07K435j796j502K412j94k226J795J454k301k81J423j259k11J961
699A031p90j164J730k62j991J480J220k197J32K167j223j154J913j0j678Q34M89
716E27j391O45J212j179j29J298j079j049J482L4j453R59J034j279o9J119p80
$$ plain form
593 -209 -2573 -226 1289 -192 727 1324 -1645 -2064 656 529 -356 1085 790 -1180 -986 -315 -411 770
611 770 1364 -83 -499 -103 -865 -256 1724 1173 -755 -839 -394 -249 699 1220 555 -184 -1141 -1402 234
630 234 1165 37 -7 544 -817 -1340 326 689 -111 110 -188 -818 126 499 -149 830 957 -1387 -1243
649 -1243 1059 358 -508 1444 1125 -1426 -807 532 -339 175 1089 -528 -853 638 -321 -807 1384 519
667 519 -2152 -401 1313 -759 -494 1746 90 -1447 371 257 -1016 585 958 -717 359 1139
683 1139 -1186 -679 1756 -40 -1542 870 676 -1550 245 1699 -602 -883 540 -719 -930 1031
699 1031 241 -923 807 545 -1446 34 1254 -943 -811 1356 133 -1021 892 882 -796 38 527
716 527 -864 -219 993 -186 -315 983 -96 -1145 337 371 -1082 -123 911 -368 -437 682 -98
733i8o39R92j84p49R10L57q34M12N43j002j83Q94l85m53Q14L1o69M09K46p71K6
754c33N22m12j69O24o4m01K82P6m36O3J96j50J63K50j96QL26k29l71K15J46k34
776a24J11L52m9k69k8P7n0j99j36K38K36j19j08J77l5l68l9K80M3k04R1L74Q1
799C32l41j77K15N7k68N1L96N2l22M8K77j93m09M5L40Rk32L9K79o5l65k3K64q6
823g7k86K17M02j31l30J26L06j69l19J47L22o4k18J64K40j95l15J58K58k14k78
844b56K46K96k14k58J48J51k33j92J95J95j34j70K20K53k48l13K49K55k67j18
864a95L65J02k59qJ76p2j50m6Q7J89n1k50J19K77l32l17L43J20l64J18L64k29
886a3k41K45K1j44R9j9r0K89N0l44J89L16m11j79M97q5m06L71K43m63m7K62k49
$$ plain form
733 -98 -737 255 71 -678 232 589 -245 167 710 -292 -475 419 34 -419 395 426 -243 166 412 -359 -333
754 -333 189 -223 -392 232 168 -233 49 125 -311 -248 -52 -202 -39 211 15 23 349 120 -251 -36 110 -124
776 -124 -13 339 290 21 -7 70 20 -179 -315 -77 159 40 -68 109 74 -294 -333 -53 -10 -214 -123 251 332
799 332 -9 -186 29 86 -182 -131 265 317 -5 43 320 127 -282 -237 103 112 -120 -81 198 133 -232 -255 9 -77
823 -77 -363 -146 256 125 -205 -79 227 58 -261 -114 208 144 -74 90 330 135 -180 -22 236 22 -256
844 -256 -10 286 72 -186 -38 113 -120 -312 -117 78 -56 -226 -6 247 -1 -314 -65 190 -77 -195
864 -195 170 272 13 5 181 109 -41 -87 0 189 138 -112 7 284 -48 -365 -22 98 -266 -148 216 -13
886 -13 -254 -9 12 -132 -33 -52 -142 147 197 -147 42 358 -53 -232 265 180 -226 145 388 -75 -122 140 -109
909a09m6L58k22k41L26n1l56L57K42n12nM24k81j74N05K9l87J45J30l31J84L80
931C65k56j71J94j51j43L68P0l52j5J11j71K4K59o0j58L3j2j49K4K08R9o5o3n1
955f2j49K2L95J84l31j46O0j76J54N51j41n42J17J6k98M78M73o86k93N25l41l48
977e38Q76O4q78L71M48r02J23J068n23n04R05m03j071J053P46j062K97P37j412
996f05l69J752j96j024R69j60j659R80J434j280k48J236j263r25J933J28j552
1013h49J094O15j936L70J745j230n13J888q14j751J564O08j634J096J331k197
1029f13o12J988p05q27J984l40k397J044J277j489N77J630j906j140K049j82j356
1046a018J694M50k259M87J573j365k08J898q58j414J375O6j500J262J189j670
$$ plain form
909 -109 -155 203 -19 -260 66 15 -341 16 258 -254 -259 165 -116 -290 215 244 -143 2 132 -199 -15 365
931 365 109 -62 132 -19 -162 206 276 -76 -91 20 -151 -127 132 72 -86 -53 -65 -214 -190 18 117 52 -11 -62
955 -62 -211 -189 206 390 59 -87 -27 -203 -49 502 361 -181 -64 -48 -346 132 605 -81 -374 151 -190 -538
977 -538 338 402 -476 -105 343 -559 -436 632 109 -395 510 107 -964 89 835 -227 70 807 -605
996 -605 -974 778 582 -442 527 367 -1292 -312 1122 -158 -406 830 -433 -1358 575 703 -849
1013 -849 245 860 -1076 -706 1039 -191 -704 1184 370 -1381 183 791 -843 253 1584 -613
1029 -613 -1225 763 58 -769 1215 875 -1522 -478 799 -690 -113 1517 -389 -1529 520 338 -1018
1046 -1018 676 1126 -1133 -646 927 -438 -646 1252 394 -1020 355 421 -1079 183 1372 -298
1062b98k51J175j134n36J988L3j660M70L83j155P50J444j024q67P53l65m61J334
1080E79K94j298J36O23p60M7J091l39p38N29R9p24K51N98k39q1K02m78m33M98
1100a43M75p5r2j90n27j00P54N33l84m44l2j64L8P72K82p78k64L72j67RO74k33
1122C16p20M42K90p14K05O94o33k21Q80m80r41Q76M87q17M01N04j236j56J439
1141F16k61p66Q47k41j227R96J031j157j30R34r12m61J465k19j253R19M51j344
1159g12M67J129j223l82J460n18j146J109K76j205P13Q40j279j27J198o94n11
1176f05J320l12j298R55O78j228K81J100j023n60J191k02q66Q25K03j023M79O49
1194E64r70K3R86p04o05J075m6r74O50N92r39m3Q01m17l08O39j75m68N41O2o19
$$ plain form
1062 -298 -549 626 -508 -1044 944 977 -683 -213 170 -985 -235 1209 185 -682 71 -294 -755 579
1080 579 873 -425 -289 334 -426 -379 712 373 -365 164 263 -461 -210 388 149 68 270 -208 -641 -143
1100 -143 332 257 165 -25 -552 -652 102 635 251 -193 -225 -389 -351 421 703 -75 -339 33 -134 -125 549 316
1122 316 -404 38 328 -386 -181 513 -120 -341 539 59 -882 -6 481 -336 65 569 -667 -823 616
1141 616 355 -411 436 195 -1032 -36 995 -162 -292 642 -270 -731 734 515 -738 181 632 -712
1159 -712 -245 884 -339 -721 739 221 -925 184 460 -745 -32 808 -471 -598 600 -94 -605
1176 -605 715 403 -895 60 738 -490 -209 891 -132 -692 499 297 -569 256 459 -564 -85 564
1194 564 -406 -383 603 -101 -706 369 323 -651 -1 591 -348 -391 410 -7 -315 324 149 -319 222 284 -335
1215c35L78L87o98J3P39l54n38N02J56n35J34L47k97o3K21j12j8J88k33j54L91
1236A19M6l86J69K93k64j27L23J0l03QK13O5p2j10%Q0n0r5P4O8j71n4J88R9j57
1261c4j44J19J08j18r3J82Q1j72j1K30l8k11N0J31j1l5LL1L9l2j22N0P7j81n8
1286a59K33L8k18L9J46j40j31J21N2l7K8J2OO2m8q7P4N9j00L1J79m1j38P2M3j02
1312fk9N4qmM1j7k3j5m7n5N4J5m3K9P8j3l4Lk2l1N3K8j0K4M9j5rOl1m1kN3J8j8
1346C2k2J0K5m8p5lM5k6pQ2J4o7j8O1j8p0LQ6O3j1l0L6K7q1o9Q3M7p9J0J22nj38
1378b1l1O0l7m8KO8L1m4l6N5J3j51pJ63L6j16M1J40m6j18K2P4l0m3M3Q2j0r7K
1407cJ00l7j70J7J26k1q1N1O2o3j06L2Q9k3r0Q7J36q9j14J12Q7j07n1P2J4nK9
$$ plain form
1215 -335 43 430 -268 -255 484 130 -408 94 250 -285 -151 196 -101 -164 57 -55 -73 115 -118 -272 119
1236 119 165 -221 -52 241 -23 -150 173 183 -120 -112 101 166 94 -16 -16 64 14 -81 -7 61 -110 -164 24 123 -34
1261 -34 -178 -59 49 -69 -162 20 101 -71 -82 148 110 -101 -51 80 69 34 37 68 107 75 -47 3 80 -101 -159
1286 -159 74 112 -106 -67 79 -61 -192 -71 -19 -56 -28 -16 -10 52 4 -83 -9 50 -50 -19 160 119 -19 53 96 -6
1312 -6 -35 19 11 7 48 31 8 -7 -54 -109 -55 -40 -83 -54 24 11 -23 -20 -42 -73 -20 8 -2 22 71 56 47 53 22 -19 -21 32 50 32
1346 32 10 20 45 -3 -78 -81 -36 -62 -69 13 27 -40 -58 3 -15 -85 -82 4 67 56 26 62 89 8 -61 22 69 -10 0 122 117 -21
1378 -21 -52 8 -29 -77 -75 -7 24 -20 -56 -1 12 -139 -146 17 53 -63 -22 118 72 -46 -24 50 20 -23 20 102 92 -5 -3
1407 -3 97 60 -110 -93 33 12 -69 -18 44 -19 -125 -93 -4 -27 -117 -30 106 17 -97 15 102 -5 -56 16 30 25 54
1434E4K5M4l4j78oJ92n7j56J65R4k51l7K17q5j25J36j7j13J29L1j06J60M6l31
1458b03N1L10j73j08L49l9l88J85J85k74O2K66k52j11K69j57j66L83m7m49K20
1479h7K39m01J03M92l25l44L74j9l05L89J74m80J05L28l78oN15k73l90M40J5m91
1501c25L58L51m97n2M03l77k27N70l9m12L31O6n47K45M84l95j23M22l31l08O03
1522B00J41m84J99J50n08J47N41k99k47L65j64l60M18J49m66J43L16l85o8L61
1542A49k19j69M39n9m42J70J96k07K06K85l88k66K94O0j6K47j28l98J21K51q6
1563D0O3P8k91r2K75Pj29P2k6j11R9K8j21J4R8j6O2j4j70j5J98O6lk2j91p1K24
1590E2J21l5j0j85j76K27K10j52l9J3k06L5L00r1k25J69j3j76K17R7l22P9L01
$$ plain form
1434 54 79 123 89 -89 -95 97 40 -116 49 143 -108 -145 72 -13 -138 -2 -19 -132 -3 28 -78 82 128 -203
1458 -203 -152 158 -15 -123 226 187 -201 -16 169 -105 -43 223 -29 -140 129 -28 -194 189 142 -307 -87
1479 -87 152 -249 -146 346 21 -323 51 32 -273 116 290 -190 -85 243 -135 -141 374 101 -289 151 166 -325
1501 -325 33 384 -113 -165 238 -139 -366 204 165 -247 84 150 -397 -152 332 -63 -186 236 -95 -403 200
1522 200 341 -143 56 206 -302 -155 386 87 -160 205 41 -319 99 248 -218 -75 241 -144 -212 149
1542 149 -70 -239 200 141 -301 -131 65 -142 64 349 -39 -305 -11 49 33 280 152 -246 -125 126 40
1563 40 103 181 -110 -202 73 80 -49 23 -3 -114 -15 13 -108 -94 4 -12 50 36 -134 -149 49 115 112 90 -101 -172 52
1590 52 173 138 128 -57 -233 -6 204 52 13 26 -180 -145 155 64 -161 8 -5 -181 36 133 -189 -110 191
1613A91k18r5K63j67k06M02R5m00R0J95k88J02L84l16k94L50l2k62L45P6m90J10
1635a65L76l01p5L74k33k95M34M8m20K55K33m08P1L94l36j72M46q4l52L27P0m15
1657b28J97L22l85p6L79k34k43M27m3l95K55K18l98P0L31k79j32L80j20k76L14
1678H4P5l29J71K23l26j2L40j66k02K60k2k64K15J29k92J9K05j84m7K49j18k10
1700b02J93N8j90J11J34k03k1K25q0j02J45qj35J23O8j48J7J03q3j4R1o4r3Q4
1724IL7p4J8Op9K3P7j9n5K2nk3N6K7m2mMJ3L7Ok2RNj1MJ5k3J%Rlnm2%M6l4l8M0
1762a5Jn5L6N4m6k5L3J0j4M7j9j4L7j6m1O9K3p8LO3k1n3M4Qo5K0K0l4kJ9k7J2
1794b6L1m5k8O9Lo0L4N9m8j5N1K3l8MPJ0knj8L6No9J1M3l4n0M1K0l8j3J7Pj7j0
$$ plain form
1613 191 -27 -122 141 -26 -232 170 265 -135 -45 150 -138 -36 348 32 -262 88 56 -206 139 215 -275 -165
1635 -165 211 -90 -165 209 -24 -319 115 163 -257 -2 231 -177 -106 288 -48 -220 226 142 -210 117 187 -228
1657 -228 -31 291 -94 -170 209 -25 -268 159 116 -279 -24 194 -204 -134 197 -82 -214 166 46 -230 84
1678 84 159 -170 1 224 -102 -114 226 60 -142 118 96 -168 47 176 -116 -97 108 -76 -123 126 8 -202
1700 -202 -9 49 -141 -30 104 -99 -120 105 25 -77 68 60 -75 48 116 -32 -15 88 5 -9 82 18 -75 9
1724 9 46 -28 -10 -4 -83 -60 17 -2 -57 -35 -40 -63 -7 20 -22 -26 -22 -9 28 34 12 21 26 15 19 34 11 12 12 21 18 13 -29 -29 17 -17 -55 -15
1762 -15 -14 -69 -33 21 -25 -50 -17 -7 -21 26 7 -7 30 14 -27 42 65 -13 -10 53 32 -21 23 31 -34 -14 6 -28 -30 -11 -38 -26
1794 -26 5 -40 -68 1 4 -56 -22 37 -11 -26 25 48 10 14 21 31 29 24 6 42 47 -22 -11 32 -2 -52 -11 9 -29 -42 -25 -18 -35 -45
1828d5J9MMolM7j4l4L8M3l3j7L1J3k8j9K5Mk5j3J7Jj7k1L1Jl0j1K0J7l6JJ6Rj4
1863b5LK1J7k3NK2J7j7k4L0Ok5j0L2j2k9RN%j6OPj0j1j8K0pmQPjQPQokJ9N%j4
1903HPOLj7LKj3MplmMnoRj6j6J4J2j7NJ7PpJ1nnK1Qj4J3K4l1j6N0j9m8L4jpoK2
1945B1m3MJ5m2j4N5j4l6N2K4p2J2O2k9j5M7j2l4M5K0n3M4K2q7K8P1n0m6Q7k9r6
1976f3N8L6p2j0O5m8k4N7k1l4P0j2p1P3K8q3K1J04n5o7Q0qo1O9L5o8jK5n4K8N9
2007E6o9o8P7J3n9M6M2r2j7P5j8k6L6Kl0M2J8n2J3M0l1J8L3m3l2N3J9j9j3on0
2038d2K4M0j4j6qk8KM9Lk1j7KlK4K1j8p%J8K1Ml5J6K0j8lJ3l7j6L1K5k3nj9k7
2073d4L9K2m7rK9k7j1P8j9o9L5L8l4K6M5n9pO1j3m5N4ro2M6M6p4j2O2m2l9O5k8
$$ plain form
1828 -45 -26 -22 -18 -24 -27 20 6 -28 10 53 20 3 34 47 19 0 25 29 4 -9 8 9 -8 -29 2 3 -27 -38 -18 -1 -37 -36 -20 -11 -25
1863 -25 -22 -1 16 -7 -2 20 37 20 -4 26 32 7 -3 29 17 -12 -3 2 2 -14 -8 -1 -11 -22 -40 -20 -27 -31 -23 -16 -17 -9 -2 6 0 -2 17 22 22 8
1903 8 15 21 24 7 10 12 -1 3 -4 -7 -11 -7 -12 -18 -9 -25 -41 -27 -15 -32 -27 -10 -3 -10 1 -4 -9 12 20 6 19 43 12 -4 46 27 -21 13 12 5 -1 21
1945 21 -22 -18 -3 -45 -59 -4 -18 -54 -2 22 -50 -38 24 -5 -20 27 15 -19 26 46 -7 37 59 -28 0 71 21 -25 62 33 -63
1976 -63 -5 31 -41 -51 14 -34 -58 -1 -22 -56 14 2 -69 4 32 -51 -30 74 19 -48 32 24 -37 32 67 -1 -2 23 -31 -3 56
2007 56 -13 -81 -4 9 -50 -4 38 -54 -71 4 -14 -40 -4 -2 -32 10 28 -24 -11 29 -2 16 49 6 -26 27 46 27 14 8 -42
2038 -42 -18 22 8 -8 -16 -44 -42 7 10 -11 -28 -26 -29 -5 16 -2 -9 -9 9 30 34 -1 15 35 17 14 27 -10 -26 5 30 7 2 -17 -44
2073 -44 -5 17 -30 -39 -10 -37 -48 30 11 -58 -23 15 -19 7 52 -7 -14 47 34 -11 43 34 -28 18 64 -10 -22 40 -2 -41 24 -4
2105do8O0J7o4L5L9o9kQ0k6m4P3J2p1M0M9p1PN6n0l2Q5j5o4N1L4r4K2N2o7qM6
2137Ik1m7O0J1o6K7M2n7J1O8m9k5O3Kn6M5K4n5RN1l8j1M5k4m8N2j1m6J8L3m7L
2169b8M3l8j7K9Lk3K0Nk1J3L5j9j4M3k1k0M0lk3OJ5k8LJ4k4PJ3k3nJ8pj9lK7k0
2204b2RJ2j9%J8JkRQoMRj9J9Lj2rJ3mp%nj6MJ0oj1jj5LJ5j5mL0j4JJ6J0qJ1Mq
2246F%J2k%lLj0%Kj5Qkj3jQj4LQJj9J1Kj3PRrPJ0J1j8K1J2j7KJ0ooN%mJ2rk3J6
2290Bmlj1lKkJRnOmpJ4KlJPQj2J4Lj2NPnqJ3pj7Pjj5J0Kk2ROkoOOj0NJ4j5QJ2
2337El%PNqJLMJ1j7%Lmmkj4%llKPlKjjnJ0lJ2rjJ9n%OMLjj1J6nLj7K%j0oOPj5
2387a3lJ4j2kQpjOooPMNJ3nJ0lJ0%oj8J7olnJ7j3KpJMk3KJ3lj5J3Mj1lMK0klm
$$ plain form
2105 -4 -72 -12 5 -59 -24 15 -54 -56 24 -2 -46 27 39 -32 8 57 -14 -7 49 -1 -33 52 37 -27 24 58 -36 -14 38 -29 -37 9
2137 9 -12 -59 1 12 -54 -27 15 -42 -31 37 -12 -37 26 28 -28 17 41 -14 -5 46 8 -3 42 18 -30 22 11 -35 -17 16 -31 -28
2169 -28 15 -23 -40 -11 -8 -31 -11 -6 -27 -14 21 2 -12 31 10 -10 30 27 4 10 25 -3 0 14 -10 -3 10 -13 -18 0 -7 -26 -29 -2 -22
2204 -22 -13 -1 -20 -20 -2 -1 -3 6 14 8 12 21 2 21 24 12 3 16 12 5 5 0 -16 -12 -2 -8 -19 -20 -35 -32 -17 -32 -36 -6 -20 -19 -3 7 -1 10 14 6
2246 6 6 18 16 16 13 16 6 6 8 -7 1 -1 -14 -15 -7 -21 -18 -10 -9 -28 -17 -15 -28 -21 -12 -21 -14 -4 7 -11 10 22 5 7 17 11 5 10 10 6 18 9 -14 2
2290 2 -2 -5 -16 -19 -17 -19 -18 -9 -14 -8 -12 -19 -5 -3 -6 -5 2 10 -2 12 15 3 8 15 10 2 15 8 -9 -2 -3 -18 -8 -6 -28 -19 -13 -15 -21 -15 -9 -19 -14 0 -15 -7 5
2337 5 2 2 9 14 6 7 10 14 25 8 8 11 7 3 1 -13 -13 -16 -19 -17 -10 -13 -11 -12 -13 -18 -8 -11 1 -8 -9 10 5 5 11 15 18 17 6 22 17 20 3 5 5 -5 -11 -5 2 -13
2387 -13 -16 -2 -14 -16 -8 -15 -16 -10 -16 -22 -15 -11 -6 7 2 12 9 19 19 13 -5 12 6 3 -2 15 2 4 -3 -2 2 -21 -19 -6 -9 -24 -11 -7 -18 -21 -17 3 1 -2 -6
2432fJ9kpj2K4nk5K4Mj3%J1Mk1QqnJ5j8k1K2Pk7K0J4j0j7K8oj0J9J1j7O%qJ3K0
2470C1k7JJ9k0j5K1nk9J9J3k4j4K5rj0K6nl8K3K8k5J4J7k7mL8rj9K3nj7J4J8l2
2504dQK5j5l1L0kl7J3J4k7J9%k4%L1poK1rj6J0J5npJ8j0jK6pp%j0LJ7ll6QJ3j5
2543hmMJ0j6KOokk4K0L0qk8K1Jj9L3J0k3KQj4J1K5k2k7K9j1l4N3Pp2K7L8l3l0
2579d4M0%l3L8%n5N6J6n7K5O8o4k2Q2oq4N6K3p4J9O0o1qN5m6k3O4mp3M4M6r7J6
2612d3R8q4m3R3Kp4O2K5o6K2P5q2j2R1o5m1R3kj04N4N9r8PP4m8n1P2j3n5N5J9
2643B0q7N4N0q0j2R7l9m6Q5j0n8K2M1n1RN4m0k6N3k3l0L2Nn6J8M5m8rM3k0k9L2
2675dok2K3J8k2K1Ol2ML4j0j2J9nj7L1mj4KqpJ5jj4J7ok7J7nk6K3J8k6JK3j4j5
$$ plain form
2432 -6 13 11 4 -8 16 11 -14 10 14 1 1 12 16 -5 3 -5 -10 5 -13 -34 -12 -5 -32 -12 2 -8 -25 3 -3 -13 6 17 0 6 6 -2 11 31
2470 31 4 5 24 4 -11 10 5 -24 -5 8 -16 -30 -5 -14 -24 2 -3 -41 -18 10 -15 -1 16 -11 -15 23 14 -5 18 13 -4 10 28 -4
2504 -4 4 29 14 -17 13 11 -26 -13 1 -26 -7 -7 -31 -31 0 -7 -13 8 -1 -17 -7 8 3 -4 14 4 3 29 22 15 15 5 8 25 22 -14 -6 7 -8
2543 -8 -12 -8 2 -14 -12 -6 -12 -14 -38 -18 12 4 -24 -3 -2 -21 12 22 -1 1 9 -5 6 31 9 -18 11 0 -34 19 26 -46 -19 19 -14 -44
2579 -44 -4 -4 -37 1 1 -54 2 18 -39 -14 54 -10 -32 50 44 -40 16 39 -35 -16 44 -17 -25 30 -16 -39 25 21 -52 -8 38 -59 -43
2612 -43 55 -29 -72 21 23 -51 11 36 -30 -8 67 -15 -27 64 -1 -42 51 49 -55 -1 58 -40 -33 41 -7 -58 14 1 -54 1 20
2643 20 -67 -13 37 -43 -55 42 3 -43 42 32 -26 -4 37 -14 -5 49 9 -17 36 13 -17 15 20 -36 -18 27 -21 -30 13 -7 -36 -4
2675 -4 -10 -32 -9 9 -13 8 14 -18 -14 20 10 -2 17 12 -5 26 22 8 10 2 -5 10 9 -5 12 6 -21 -4 -9 -35 -12 6 -20 -19 4 -10 -25
2712b5M4ml2J8J9k9J6L1m1oL4j1l9N2on4K3M1n0oN4l2k7L6%n0N1K0n4K5K8o2N
2745c1P2k5m9M9J7o2M0L7n0k1N9l3k4N8l2n1N4J1o1K1M2m4oM7j7n0M8Ql6L1J6
2776A8k9lM3l0OK9j2m8L3K7m1J4L1m1j4K2kk1J4Lk3J3J2l3K0J7k3lK9qk5L3Qr
2810GoRrJ2J2j8jRj2JJ0%j9kRrKnmj0J0Rj0kNlJ9Pj8kJ5LnOmqOMj0RqRLlj6kJ0
2857@jpkj%Nnj%QkPlrJ2J8j5nJ0mKkMPj6LnJ2qqj3J8Lj5K%KJJ2j5qJ9%j2K0lp
2904bRRk1J3Rj4NMmrQOj8%K2j8pJ2qk4K0Lj8K2Lk9J0K7j3mJ9mj4J3Pj1JL0k9K
2944GRj4j4K5pl1L1Ql4QJ0qk4L7oj7PJ3j8K3Kk4RK5j1j8L2pk1J8J4j7mNj0RPj5
2982aRqj3kK1j1j3LJ9j3LLKJ7rj5J6lkoK8j7j3OJ1j2J4Jl1K1Nk5J5K8m6rL3ol3
$$ plain form
2712 -25 19 15 -17 1 20 -9 7 38 -3 -9 25 14 -25 27 21 -33 -10 31 -19 -25 29 -3 -30 6 6 -44 7 27 -27 -2 26 -36 -31
2745 -31 41 16 -33 16 33 -29 11 48 -2 -23 36 3 -21 37 5 -46 8 19 -42 -21 21 -23 -29 18 1 -49 -1 7 -29 2 18
2776 18 -11 -14 29 -1 5 34 22 -26 7 34 -7 7 38 -3 -17 5 3 -18 -4 -1 -24 -11 1 -32 -12 5 -18 -21 8 0 -25 8 16 7
2810 7 1 10 1 13 25 7 6 15 3 4 14 14 -5 -7 2 -7 -5 -10 -14 -24 -14 -5 -15 -17 -12 -15 4 11 -7 -9 6 9 4 10 6 -2 4 8 -2 7 -1 8 11 8 -8 -10 0
2857 0 -1 -8 -10 -11 -11 -6 -11 -12 -12 -4 -6 1 -2 -11 1 19 4 -1 9 5 7 5 9 16 0 3 -2 10 2 -6 -19 -1 2 -13 -11 -11 -9 -8 4 -11 -19 0 0 -12 8 5 -2
2904 -2 7 16 -5 8 17 3 8 12 8 -1 7 13 -5 -5 17 -1 -8 4 -4 -28 -8 -5 -23 -1 2 -27 -17 10 -3 -7 12 8 -6 7 14 3 4 34 5 7
2944 7 16 2 -12 13 6 -25 6 14 -20 -12 -2 -10 -34 3 -3 -20 -13 0 -18 5 7 -17 -8 17 6 -12 20 13 -8 10 24 7 3 8 -2 7 14 -1
2982 -1 8 0 -13 -15 6 -5 -18 -15 4 -9 -6 -3 -1 16 7 -8 8 5 3 -3 25 8 -5 1 12 0 14 15 -16 5 10 -15 0 28 -18 -27 6 0 -33
3021c3L5J5m1kL8k5j0N5l0j9N2j3o3M9K9o2K5N2o3l1Q8l0n5M6J4p7M2N2o0NN3
3052C6n5l6R3j1q2O3K6p0L9O7q3l6R8l3n8Q1jr3P0M8p8j1O2o1k5R3j8r9P2J9o7
3083e0N3M8r5j4Q8j4n0O3j0p8O8M7o6qN9m9rP8m0o2M9Nm3N2L2q8oN5rj7K5k5m4
3116e5O5Rk8K3ql5J8O2n0j9L3jj6L2j9l8K0J5mL1j3p0K0N2ok8L0l6k8M1K4k4K4
3149B1j9l2K8L0m7J4O3n6l2N3nm7M6L1o1j1M8l8J6M4n7j8N3l4l9O9K4r0J9O4o1
3180b4k1Q4j1n3L8rm0N7L5p4J7K8o6oJ24k3r3N2Nn9K9O5o0k4L5k9j6O3l3m8P4
3211A7Mp1L6O2o8%P0m5m0K5K9rK7jo4RN4l3J5M2o7n5N5K9l3J8Nm3J6L3k0lJ9l6
3245b3%M6j3l5L8J9l6%K4k7jL8j2j4%qj5M3Jl0Jlk1J5M3k5j9J8k2nL3rk3J6J6
$$ plain form
3021 -33 2 17 -24 -26 12 -13 -23 32 2 -17 35 22 -41 8 37 -25 0 52 -11 -42 46 16 -39 7 21 -56 -14 38 -22 -17 36
3052 36 -19 -55 38 27 -55 8 34 -36 3 70 -13 -49 49 16 -42 39 38 -55 15 63 -15 -26 36 -25 -50 43 25 -74 -2 17 -50
3083 -50 3 51 -44 -58 30 16 -34 29 19 -59 9 56 -10 -18 41 -8 -17 61 21 -41 8 13 -30 22 54 -34 -40 15 6 -11 14 -11 -55
3116 -55 10 19 -9 14 6 -29 -11 51 1 -18 15 14 -2 30 11 -27 -7 8 4 35 22 -48 -28 24 18 -10 20 -16 -44 -3 21 -3 21
3149 21 2 -30 -2 28 -19 -5 58 2 -30 23 18 -29 17 48 -13 -24 24 -14 2 46 -11 -29 24 -10 -49 20 44 -46 -27 37 -24
3180 -24 -45 39 28 -25 13 4 -36 21 56 -18 -1 27 -39 -45 79 56 -37 15 20 -39 -10 55 -5 -29 6 -23 -39 24 -9 -57 17
3211 17 21 -50 -14 48 -20 -20 50 5 -35 -10 19 10 37 36 -28 -19 35 2 17 59 -8 -63 -8 21 -12 6 11 -32 -16 17 -3 -6 13 -23
3245 -23 -23 23 10 -25 13 32 -4 -4 20 -7 -8 30 18 4 4 -4 -19 24 25 -5 -4 -7 -28 -13 30 5 -14 4 -18 -23 10 1 -22 -6 10
3280A0k1LL2l3J3K9k4k2K5ooOJ8m7PK4rnK7j8k4J2J1j1J1mj4J1J5j5oM1k4k0J8
3315DJ2j1PRj3j1KKnJ1j2j3K1%k8J2K2k8lJ8Jj6RNMmnPK0j1JLOj1j5K3jj7kK9
3355B2k1nMNqlJlJ6j0j0J4jk2QK1rpJOPmOPj0MrRNj7pL1qk8K0J%j7OllQpoJ9k3
3401b0J4Pkj1PJ9k0MJ1qpJ3nOnomNMk1J5J3j2j2J0qj0J4J4oMMk4K0Mj8LK4k1%
3441eONj5K5Nl3LJ8rNLj4k5L4kk5K5J1k5j2K7j7JK8j3k6K2J0l5L2K1l3PK7k8j0
3477a2L3ol4K7J3l4OK1l1%K9l0rK9Jk3J3nrJ2K6j6j1J4jj5K2Ll3K1J8l4K1Nj7
3512fmJ8Kj3QpqJ3Pk9J1Lj4K2J8k5nJ2j3J3J6j9j4K3Lk7K9Nn0J5M1l4jK8l4j8
3548c4N8Ko3L8Ro0M0N1n1k1N1k6k8P1k2o2M7N0p3K0N7o7k5R0l1p3O4J4o7N4N4
$$ plain form
3280 10 -11 -8 24 -9 4 33 9 -13 12 6 0 6 24 -23 -16 8 -1 -6 21 3 -21 -9 2 -9 2 -2 -16 -5 10 -5 -11 30 6 -14 4
3315 4 16 5 12 21 8 -3 -1 1 -4 7 -5 -18 3 3 -25 -13 9 -19 -22 -4 -3 -19 -10 -5 -1 -5 -10 -3 17 6 7 10 16 5 -10 13 12 -5 -7 22
3355 22 1 -4 0 5 -3 -6 -5 -8 8 -2 -12 2 1 -21 -13 8 -1 -8 -7 -1 6 2 8 15 5 9 0 9 14 -3 -10 21 13 -15 5 6 6 -11 -5 -8 -11 -3 -10 -16 3 -20
3401 -20 -6 1 -1 -12 -5 14 -6 -2 9 1 -6 7 2 8 3 -3 -7 -2 2 -19 -4 9 -3 -15 -5 -13 -23 -9 5 -1 3 7 -17 3 7 -11 -8 16 -5 -5
3441 -5 1 6 -9 16 21 -12 -9 9 0 5 8 -6 -31 3 1 -24 1 12 -13 -25 2 -15 -14 14 1 -25 -3 7 -28 4 25 -8 -1 26 -2 -12
3477 -12 21 15 -19 8 21 -13 -7 14 -17 -17 12 -18 -27 2 3 -20 -7 -12 -21 -9 17 1 -10 4 3 -12 10 13 -20 1 19 -15 6 11 -6
3512 -6 -10 8 10 -3 5 -2 -10 3 10 -19 -8 -5 -19 3 21 -4 -9 3 -10 3 19 0 -14 9 12 -15 14 19 -31 -16 25 -9 -10 18 -16 -34
3548 -34 24 26 -37 1 10 -50 -10 41 -10 -31 20 -6 -34 37 15 -47 0 50 -23 -3 54 -13 -38 52 21 -52 12 26 -41 13 67
3579F7j10k0R1n2l1J22m7j13P6O5q5L2O7r4l7J14j6o9Q6j5r7P1P6j15jJ14p6p7
3607g4J25k2r3Q4M2j20K7P1q4LJ11n5r0R4mq7P4P3r3j1O5n6l2J12j6p5M4J3q0
3636e4N8O8p2oK2m7k3J02qo8K8Km9L3O3n2j2M0m6j2N6kk7K1nl3RK4k5L2K6m6k7
3669c0K1oJ9M4m0n2L0NLM7mo7j6M0j9L5M1n3m1M8kl9N7J5n4K1K4m4qQ2n7l2O2
3702C0l6o8P6N6p1J0L3q1j4J04j1m9M6l3o9Q3N8q4J1O3q5l0J22j8q2N8J3p5K6
3731a7O7o4K5M4o1n3O9Ln7O5L1j15J2Q8m2k2O8l2o8M6M3l7L3K3q2%O4l1k8P5j3
3762C4q1N0L2n4J6L8l2l2L8k4LL8j3l7K6Km3K8N2l1l0L3j2j3J5J9j7jMj2K0J6
3794C2k5j2K3k7kLK6j9KknKQj5J2Jj7NJ4lnK7rk8PJ8l%Lj5OLrNJ2pj6J0J5k0J0
$$ plain form
3579 67 -43 -63 28 -24 -55 67 20 -93 -17 48 -37 -5 62 -32 -69 45 29 -40 46 31 -66 5 81 -34 -35 79 3 -74
3607 -74 51 29 -64 20 62 -58 -31 40 -44 -41 70 15 -75 19 15 -72 2 75 -18 -29 36 -20 -52 60 44 -31 13 26 -54
3636 -54 4 72 0 -6 16 -31 -54 48 40 -28 0 2 -47 -14 49 -3 -15 25 -21 -33 23 21 -6 15 10 -23 -14 10 -15 17 43 -3 -30
3669 -30 -9 -15 4 48 8 -44 -14 -9 -6 41 37 -30 -46 -6 -25 10 51 -2 -43 5 3 -36 21 36 -18 3 27 -17 -25 57 0 -32 30
3702 30 -6 -74 2 58 -13 -3 30 -51 -65 39 28 -21 25 -8 -77 6 64 -20 -9 54 -31 -61 61 43 -39 19 32 -43 -17
3731 -17 50 -14 11 55 -6 -59 10 13 -44 21 52 -63 -51 37 -5 -27 41 9 -59 -13 30 -7 26 49 -33 -33 31 0 -28 47 34
3762 34 -47 3 35 -19 -3 35 3 -29 9 -15 -12 26 13 -24 2 4 -39 -11 41 10 -20 13 1 -12 3 22 5 4 8 -4 16 32
3794 32 7 -5 18 -9 -11 -8 18 -1 1 -1 -6 -4 4 -11 1 2 -15 -10 4 1 -4 23 14 -14 -7 11 8 8 11 -4 2 5 -4 1 13 6 -10 0 15 -5 5
3835EJ3j9j1J6njJ5j0qJ3kj3KJ7joRj6oK0nj8K1j1m%J5Jk2J2j1oK4npmPj1J3L
3875DqlQPrNPJnlQj6LPj1Pj0jMRk8J6J0Kj6RMj9nK3m%oOJ3j5kJ0J3j6j0K3Kj2
3919BmROj5JLKj5NmOmj0J2J7k8MJ1Mj0JJ9j1pJJ1j0pPJ0qkjJ7qk0kK3rj6J6j0
3961a4LKJ0Nmj9QK5j6j3J1MrJ2m%Qoj3K4mj6%K0j8j0J8%k4RJ8k7OJ6rj0J7Lj1
4000hJ3nj9J1L3k6j6L2j0j7J5K5l9jJ9l0J3K9l8j3N2k5l2K9J9m6L3L2n5qL8jj4
4033a0L3qm3K0K9l0J2K5l2k0M5oj7J0J4l9J3K6l8OL3k7k0K1Ok5J4J9k9MJ0j8J2
4066a0L0rj0%j4JJ7J0oorrRJ9Kj1kj2pJ5MNj0lj7J9J7j4K5kn4J7K6k9K4L2l8k8
4104b8K9Lk1M8J2o4nL0l0J6M8l1n3M1km4O1L2n4j8N3n8mQ9j5o8L2J0n5N1O8o9
$$ plain form
3835 5 18 -1 -12 4 -1 -2 13 3 -5 8 6 -7 -5 12 11 5 14 -2 -8 12 7 -11 10 -1 -5 -5 10 11 -11 1 -10 -16 8 3 -4 -8 -1 -12 1 4
3875 4 -4 -7 1 8 -1 4 11 12 7 4 12 -4 -1 6 -5 2 -8 -9 -5 4 -24 -8 2 4 -12 -3 1 -18 -23 0 -4 -4 -10 -4 9 -6 -8 2 15 -1 -11 12 14 2
3919 2 -2 7 13 -2 -1 2 4 -11 -6 -10 -4 -8 -18 -6 11 -17 -13 -2 2 -8 -7 12 1 -6 -5 6 -4 -11 -4 6 -2 -4 -5 12 4 -16 -18 5 -4 -20 -4 -14
3961 -14 -11 -9 1 6 2 -17 -9 16 0 -13 -2 2 -7 5 1 1 9 3 -10 14 10 -6 -6 14 -4 -14 4 4 -20 -11 7 -20 -14 2 -7 -17 0 3 -8
4000 -8 5 0 -19 -8 25 -1 -17 15 5 -12 3 28 -11 -12 7 -23 -10 19 -19 -32 20 -5 -37 -8 11 -35 -2 30 -25 -33 5 4 -10
4033 -10 23 15 -28 -8 21 -9 3 28 -4 -24 21 15 -2 8 22 -17 -4 22 -16 -10 23 -4 -24 -3 3 -22 -8 11 -18 -14 -4 -22 -10
4066 -10 20 11 1 1 -13 -12 5 15 9 3 -6 -15 -6 13 15 4 2 -10 -17 -2 2 7 -3 -6 -23 -4 13 -1 24 22 -32 -15 11 -18 6 38 0 -28
4104 -28 1 4 -17 31 43 -21 -26 4 -26 -10 38 7 -46 -5 -7 -51 10 42 -12 -30 23 -35 -39 50 35 -33 -1 9 -46 5 73 4
4136Dk9N8m6m6J07Kp2K2J7p4K4Q3m0l7P8n7o8Q8M1o9K0K2p5mR3j9l9O0k7q2O4
4167aN6o0J5M0p0l8Q1Mm5N1nq7L3N1l9J8L9o2l8N5J6k7L1J7n2j0M3njL3j5n9K7
4200d%KL9Pn6nJ3oJ7K5j6l2LmKM1mk0Qk7oL1K1j4Kol0lL4PkMl1k7M8Kj0J7mn4
4240c8J4M6l3NK4k1n0M4J9m2M3K3m7j1L9j8j7N7j7o0L1J3k5L4K9m4l0M7j8j7N4
4271C4Jp8J6L6l0PM6l6l2M8pl0M3Rm3J6K8m5kN0ql8L5j0m5M0L3m1OPk9oM9j4l7
4306b7K5Qm4L8L1m1j1K5orJ4Rk2J3K2l6J3J7k5PK3j9k1J2J8j7J0%j7rJ6qRNqr
4342a4J6Mk2J1J1j4kJ1Oj%jmJ3j1oJ7lj3jJ2mmOjj5MNLkj1QRj8mJ7J0qj2J6%r
4384amJ1Kjj4PRpp%J1j2oJ4Rj6lJ8j1j8J6jL%JKJ2j2nKJ0rKJ7j2j3QQk0J3Kj0
$$ plain form
4136 4 -25 33 -13 -59 48 50 -22 0 17 -57 -33 50 10 -27 51 -6 -74 14 55 -14 6 28 -47 -51 42 23 -16 44 17 -65 -1
4167 -1 55 -5 10 50 -20 -58 23 27 -18 33 28 -59 -26 25 -14 4 43 -19 -57 -2 14 -13 18 35 -17 -27 16 11 10 43 28 -31 -4
4200 -4 -4 -2 37 44 -12 -17 -4 -10 7 32 16 -16 -13 -17 -15 26 22 2 10 -17 -23 8 29 15 17 11 -19 -22 12 19 17 21 -10 -37 11 13 3 20 16 -38
4240 -38 -24 22 -11 -6 18 -3 -53 -9 10 -32 11 34 -13 -24 15 -3 -20 37 20 -40 -9 4 -21 13 42 -2 -32 15 -3 -20 34
4271 34 35 -43 -27 9 -21 -14 32 -4 -36 12 5 -25 18 27 -16 0 28 -17 -19 31 23 -15 20 10 -35 5 38 -3 3 10 -19 -25 24 10 -27
4306 -27 -2 6 -38 0 31 -10 -21 4 -2 -11 3 12 -10 3 25 -11 2 19 -6 1 24 5 -16 -4 14 -3 7 7 -10 -19 -3 -11 -2 3 -5 -14
4342 -14 2 6 -16 -5 6 -8 -10 1 7 6 6 5 1 14 3 -3 14 11 -2 -3 9 5 1 7 6 -9 -5 0 3 1 -10 -2 7 -11 -15 2 12 4 -8 8 8 -1
4384 -1 -5 6 8 7 -7 0 9 2 -5 -5 6 -6 -12 2 11 -5 -8 10 -1 -19 -3 -4 -1 -1 0 2 14 2 -3 -1 9 0 2 19 7 -6 2 10 -10 3 5 -5
4426eJ1Lj4LQk3JPQlLLmLNp%J3j3JJ3LrjRj9jK3j9jJ7oqPnj1JOj3mK3nj7J2Pm
4472bL%mNMrmJ9j2QLJ5l1OJ2lj%rmOnQOlj2M%qjK6j1j9KJ1QmMqRj2jJ1Mknkjp
4521fJ1qkMqLJ1j2JK1ol1K4J6k8QJ0rk1K9j1nL5j5k5J6Pl1K3L7m1k1L1ok0L0J6
4558B7m7KK3k7J3L2k6j8K8nl7M0K6m4KL7m9pN3Ml7J0On8M3M9m5mL2m4k0O6Mm8
4592a9K1J2m3J0N6k4l4L9k6k7M3K9m8J7K3o0LN1Nl5L5j6m5K6J7j5LL6n1k7L8K0
4624A4rL0k2n4OM5pJ7J0l7j6J5J8qK2Kl1KJj8K7J2Jk2j4j5J7K2J6j6k4j2PK2K4
4659B5j1kl1j6L3J4%Lmk8qK9J1kJ1j8l5RK8pJ2K1m8j3K2J6rK2rm0JL7j5ML7k9
4695A0m2L4lk4N0J1m9%K6l7J7N1k6m8J4kj2M2L9o5mK0k4lP0k3n4K6kk0L3L4m4
$$ plain form
4426 -5 6 9 -5 -2 6 -17 -16 -9 -1 -4 -1 2 -2 1 6 -1 -1 12 -1 0 13 16 7 6 15 -4 -5 18 -1 -2 15 9 1 8 3 -8 -7 -1 -14 -18 5 0 -17 -5 2 -2
4472 -2 1 1 -3 2 6 -3 -7 12 0 8 11 26 -5 1 13 10 9 9 0 -4 2 -3 5 11 8 -4 0 0 -8 -9 17 6 -13 -11 0 8 4 8 0 9 -3 -4 7 11 9 4 2 1 -6
4521 -6 5 -3 -5 -1 -9 -6 5 -7 -6 15 9 -22 2 18 -10 -2 8 -1 -22 7 -4 -9 26 11 -14 2 9 -22 1 38 -3 -24 7 1 -19 11 27
4558 27 -20 -18 5 -22 -9 23 -3 -21 7 2 -35 5 31 -13 -11 26 -23 -30 23 27 -10 0 6 -52 -9 40 -5 -9 23 -21 -41 25 29 -19
4592 -19 2 14 -29 -19 37 13 -21 18 -8 -35 8 37 -11 6 29 -31 -28 23 28 -7 28 12 -33 -7 10 -5 -2 34 -17 -44 -6 14
4624 14 5 35 13 -41 -35 10 3 20 30 -7 -23 -8 10 2 24 26 -5 -3 -2 -20 7 19 20 -2 -16 -31 -14 8 24 8 -16 -28 -21 1 25
4659 25 14 12 -19 -35 -2 12 12 15 11 -17 -25 4 15 13 24 6 -29 -20 8 1 13 34 -14 -27 -5 11 2 24 15 -25 -24 13 -2 2 39 10
4695 10 -32 2 -1 -25 25 36 -13 -13 13 -24 -7 44 18 -30 -16 -18 -30 12 51 -14 -18 2 -22 -25 45 22 -32 -6 -8 -28 5 39 -5
4728emL0k4j3M9mm5L0Kl8J5M0k9pK8l1l7M6K6j7rnl9J4M4k3lJ8k1l0N9Kj9QOk4
4764a0lL7k4rK4qk3J6Mj4K0J2k7j8K1OpK7k4k4J5RoK8mk4JJ2qoK0kj7PmqRJ6q
4803FrJ2k1NQkpJ0kqNLpKOj2J1OpjNnlLJ8k1RLqMkjmOJj8J1NrQlnPMKmJ4j1j4
4852a0RJ1plLOoJ7j4LmNj2JJmlPpj1L0oj4J4moKloKJ7j2MJ0rmK2j8KLJrj2J7k
4897A%LqmJ0kpOLkj2J7kj7J9nj2PJ1qJ1mj0JOlkK1j2k3J5K1j0j3Rj7J4%oKMj3
4939a1LJ5nqJ0Jj0MJ1Nj4JKNonmKNlqJ5jl%jpQrMmKOKQroJ5j2KJ3rnJJ3j9J1M
4987ILpl%j3J9nqJM%jlllJ8qPm%jnOpOJ1Lj6LJoJ3Qk3QjjnJ0qJ2rj6JJ8lj0K0
5035A2Jl6K4Pp%J3j9mK2j0oJ1Jj5OJ0j0RPj9j0J7j3nK9Lk0rJ8k4J6J5rk9K3ql
$$ plain form
4728 -5 -9 21 -3 -16 33 29 -16 14 16 -22 -7 33 4 -3 25 -6 -43 3 29 12 3 -2 -41 -27 17 -6 -9 9 -12 -42 17 19 0 8 14 -10
4764 -10 -13 24 0 -9 15 7 -16 0 4 -10 10 22 -5 -23 -2 4 -3 24 0 -24 -9 0 -6 22 18 -6 -5 7 -1 -7 13 11 -6 1 -3 -11 -2 14 6
4803 6 -3 9 -12 -7 1 -1 -8 2 0 -8 -3 0 -7 -5 1 -11 0 6 -1 -2 3 -2 -5 -2 16 -5 4 7 -1 3 1 0 -4 2 3 -15 -4 1 -8 0 -3 -8 -1 3 5 1 15 4 -10
4852 -10 -1 10 3 0 3 9 3 20 6 9 5 10 -2 -1 0 -4 -7 0 -7 -18 12 6 -8 6 2 -4 -2 -5 -11 -9 8 -4 0 10 1 -3 19 1 3 6 7 -2 -14 3 1
4897 1 1 4 -4 -8 2 0 -7 -1 2 0 -12 5 3 -14 5 0 -12 -5 6 -2 9 5 -5 -4 2 -1 -3 18 6 -17 -2 19 9 -4 5 -12 2 2 -4 -2 2 -11
4939 -11 -8 7 2 -6 4 5 -5 -1 10 15 1 2 4 9 3 -2 -6 -4 1 -2 -10 5 4 1 1 0 -7 1 -8 -4 -8 -6 0 2 10 1 -5 10 -2 0 13 4 -1 0 13 -6 5 9
4987 9 12 5 2 2 -11 8 3 -5 -4 0 0 -1 -4 -7 -10 8 0 7 3 3 2 -3 3 -4 2 13 16 0 3 4 -2 11 19 -4 4 3 2 -3 7 -1 11 2 -14 -13 5 2 -8 12
5035 12 13 -23 1 8 1 1 14 -5 -9 13 3 -3 8 9 -6 0 10 0 9 16 -3 -13 4 -9 -14 15 18 -2 -11 7 -17 -1 14 5 -24 -1 -9 -12
5073a2K5K1m2pK0noL5ql7J2K0l1PL4j9j2J7j9j7M3Ml3J8ml8J7O0l8pK1j3m3M9
5107A2J8l1J0jl3LM5k7lL3k7k8K6K6l0KJ7k6rK9Mj9L3j9k7J8J4j1J8J7m3j7L2
5140FLqJ7J4m7kJ3J1ORk2j4J1rJ4J0pj7pJJ7J8J1k5mj0j1K8J5j3Lj5qMJ4J6j6
5177FKj0j0J7MojJ3l3lK2KnK2mm1K0PKQJ6k6m6M8%j1K6pm1K3K6k4J0J5j9l0L3
5214EKl8L2J6j8%J7l3NK7ml5K0Kk6L1L5n5kL2j7rM8j5n0K5J6k3J3K5l0k3M4j7
5248@k2K6Rl1J8J5k6kL8k1j5J5kk0K4J9l0LK6l3nM0j7k3K6j4k3K4K2k5rK4j5p
5282a1J6%j5J1Kj2nJ8jpRpMmPkNKj7L%J9rLj7kNJ4npJlqJ1NkJlQmLJjoLMlJmm
5332cNPppLJ2qlM%nMJ5j4N%j2J1KqlJ4j2nJ8jj4J1npJ3J2j5mJ6kj7%KoNRj8P%
$$ plain form
5073 -12 13 34 -8 -15 5 0 -6 29 21 -16 -4 16 -15 -8 26 7 -5 12 -7 -24 19 23 -10 8 4 -34 -17 43 5 -2 19 6 -37 12
5107 12 30 -1 9 8 -25 -22 23 -4 -7 26 -1 -29 -3 23 -7 -5 12 -14 -23 6 10 -9 24 5 -22 -4 10 -1 17 34 -9 -26 6
5140 6 9 1 18 32 -15 -17 -4 7 13 22 0 -14 -3 -12 2 12 5 -12 -19 -18 -1 17 28 3 -1 -11 -22 6 21 8 11 -4 -12 -8 6 22 6
5177 6 8 -2 -12 5 9 3 2 15 -18 -21 1 3 -2 20 16 -25 -5 2 4 12 28 2 -44 4 4 -7 19 12 -29 -6 20 -4 6 21 2 -28 5
5214 5 7 -31 1 17 -1 -1 16 -17 -12 15 11 -24 -4 -2 -28 3 38 -17 -19 13 -4 -13 35 20 -30 -5 11 -12 1 26 -4 -27 17 0
5248 0 -22 4 13 -18 0 15 -11 -13 25 4 -11 4 2 -18 6 25 -5 -2 24 -9 -14 26 9 -14 12 -2 -25 -1 21 -4 -13 11 -4 -11
5282 -11 5 5 -10 1 3 -9 -14 4 3 -4 5 -2 2 -2 5 3 8 10 -7 -4 -4 15 6 9 -8 -10 -5 9 4 -3 -2 -5 -13 -2 3 1 2 -1 7 3 6 7 6 0 3 7 4 5 1 -3
5332 -3 2 9 2 -5 -2 10 2 -1 3 3 -2 2 17 3 8 8 -4 7 9 1 -2 12 0 -5 13 12 -2 9 4 -3 10 22 7 3 19 17 0 0 2 -4 1 10 -8 -1 -1
5377aJKRmlLkj3PMj3J3oOqOJ2j2MMj2Mmjp%NoJ2J2rJjmQoLoQMj0R%lNKmrRJ%o
5429DloKJ2j7J3Mjj1OPqpnJ5j2QqJ3%pRJorNNknLqRmJ1pMp%PqNkjpJ1JmrJ5qJ
5480amJ0Pj0J0rj%%KpjjJ1mLjj0PkloJ4oNmNmPJ2j8mQjnOJ4j9jJ3j1qK5pj6J7
5526A2nqJ2j9nJ3jrJJ8%kJlj2OK1rlOqj7J4J3j1%KplJ6j7J0Lok0K3%j2NOj1kJ9
5569A1mj8K1qj4QK4k2MK4k1j3J8npNK4l2J3jj0KJ6Ok0OnJMJ1j6qJ0ooJ9oj5KQ
5609@kKJ8k4LnljJ2OOrmp%J7Jj0QonJ1Jomjn%mJ8K0k8pJ1nJK2j7j3J4j0j0J8J7
5653B0k5NQj6jK4nk4J1Rl2K3K1j5j6K3nj1K5J0j3pJk7PL3j1j8K5Jl9K0L0l2%K0
5689A9l4oM2j3k0K3Om2L0L6n0JL5k9k2L7J0l3K2Pl1lL7k0mK7k5k0L2J3l8J5J7
$$ plain form
5377 -1 0 2 11 7 4 7 5 -8 -1 3 -10 3 -3 3 -5 1 13 1 5 9 -3 1 -3 -4 -11 -11 -6 -12 0 12 3 4 3 -1 7 1 4 -2 6 10 0 9 9 6 11 13 9 0 9 10 10 4
5429 4 1 -5 -3 9 -8 5 9 8 -3 3 10 2 -5 -10 5 -7 1 -7 6 6 -1 8 9 3 -6 -1 4 2 -3 0 -8 1 -3 8 1 5 -2 -2 5 -3 2 0 -1 -8 3 4 0 -9 6 -2 -1
5480 -1 -5 5 12 2 12 3 2 2 2 4 -3 -4 -5 6 2 5 4 -6 1 -1 -4 -10 4 -2 3 -1 4 0 7 19 1 -3 5 4 -1 5 19 0 -1 12 1 -7 18 11 -5 12
5526 12 7 -1 11 -8 -13 0 -1 -10 -9 9 9 7 8 5 -7 -1 20 11 8 14 6 -11 3 16 5 5 7 0 -3 13 -4 6 9 3 -17 6 6 -6 -1 5 -6 -8 11
5569 11 7 -11 10 2 -12 -4 20 -2 2 26 5 -8 10 5 -2 3 27 -5 8 7 -3 -1 15 21 1 7 2 3 7 18 2 -6 4 -2 -8 11 5 -10 -8 0
5609 0 -2 0 18 -6 -3 -8 -11 -12 0 6 12 3 -1 -8 -8 9 10 0 8 2 -3 8 9 3 -1 -2 -7 -7 -11 7 27 -1 -8 3 -2 -1 21 4 -9 5 -5 -15 3 20
5653 20 -5 0 8 -8 -9 15 10 -14 -3 6 -26 -3 18 3 -13 10 5 -6 19 29 16 9 10 -17 -10 23 12 -6 19 20 -19 1 31 -1 -1 19
5689 19 -15 -21 21 8 -12 11 17 -25 5 41 -9 -8 27 -2 -24 13 23 -10 12 19 -12 -15 22 2 -2 25 0 -20 12 25 -13 2 19
5722A9l7j3M9nl2L8j3k2K4Rl2J7J8l0j2L2mj7J9K2l8OK2k8J1J2k2rJ2NrJ7Mj7
5756dpJ9%rQmj9J5nPRooj2K6pj0J0Qk2jRjR%j0kJ3qlLLKrKQQj4J2mLLKj5MMPj7
5804aJJ1qmJ5qmOJj3OmnNJjjJ0jqOLoJ0Kj9J1J3j5pK0qj0NRj2LJ0k4NNnJJ1mr
5850gMJ7k3RMj3jJ3J0k2J0PKmMrpJ2rjQMj1JJ2j1LPj6KLPkoJ%J0prmK6j2mQoj
5896aO%j2NNnNMj5J1Nj1KlPJo%OkQomQmrQMl%lKlNj1RpQKr%lPj0RLnLMojL%oQ
5951CkrkRJjJ0njnLMqLqlRMK%oNOj0Q%pJ0k0K0ooOlLkJ3j0kP%rNoj6K2Lo%Opp
6003eNJNlkpkJ1kj1K2j0qPKjJ0lj7NRnj1K1nqPQrJMnpLLj0J3Rk0RNqmJ7j2j1K0
6050A1j0j1J1Rj6JJ4oj0J4moJ4Kj6PKlJQj6KOJ1k1RJ1j8lK1Rj4j2Oj2J3QkjPj
$$ plain form
5722 19 -18 -31 18 13 -19 19 6 -16 8 17 -15 2 20 -10 -22 10 6 -11 8 30 -8 -2 20 -8 3 15 -7 -16 -4 1 -8 9 13 -4
5756 -4 -11 8 8 -1 7 3 -16 -1 -6 1 10 4 -2 -14 12 5 -5 5 13 -9 -10 -1 -2 7 7 -3 -5 8 0 -3 0 3 5 -4 -2 6 14 0 12 8 11 14 16 1 5 9 16 -1
5804 -1 0 11 3 -1 14 6 2 8 9 -4 2 -2 -7 -2 -1 -2 -3 7 6 -2 4 7 1 11 13 -6 5 18 3 -4 16 8 -2 3 12 0 3 13 -11 -6 -1 -6 -5 6 2 -7
5850 -7 -3 14 -9 0 4 -9 -10 3 13 -9 1 8 10 6 10 1 -6 6 -3 -4 4 8 -3 -2 10 -1 2 9 -7 -5 -2 5 3 -3 -2 -2 8 1 -8 -12 14 2 -2 6 0 -1
5896 -1 5 5 -7 -2 3 -2 3 7 -8 3 8 -3 -1 -4 3 4 -2 -2 4 2 10 4 0 8 4 -5 3 7 4 4 1 3 0 5 -6 3 -4 4 6 -3 -3 -6 1 -9 0 3 -2 1 5 -1 -2 1 1 -5 3
5951 3 1 -8 -10 -1 0 -1 9 4 3 -2 1 5 -3 0 -8 -11 -2 2 4 4 -2 3 9 -1 7 7 0 10 -10 10 4 -2 4 1 4 2 15 5 3 10 10 1 6 0 -16 6 9 3 3 9 2 -5
6003 -5 0 1 6 3 1 -6 -8 3 1 -10 12 2 -6 1 3 2 12 9 -8 -3 6 1 -10 11 6 -2 5 13 4 5 9 4 -3 0 3 -7 6 15 -5 4 9 1 -3 14 2 -9 11
6050 11 1 -10 1 10 -6 -5 9 3 -7 7 3 -3 11 13 -3 4 6 3 4 12 -4 -2 4 15 -6 3 14 -4 -7 14 23 9 -3 3 -9 4 12 10 9 16 15
6091A5j6LRj0nRj0qJ6mnMJ1j2mKJ3qJ4j3qkJ8oPJ1k6jJ9Lj3QLj6PJ0j0lJ3Jk5
6132iRJknK7k6j2K5Oj3kK3l1RK4j6j6J0J1k4J7J7l3J3K3j6j6K4ll2L2Ll3J5J3
6167A3k2NL1k6j1J8Qk4J4Rk5NK0ml0K8%k8K9Qk6J0Rj9k0M1j6j4K3J2l1MK2k7o
6202b0L5j7k0M0j2j2J2J6l2KJ9j1%J1oj8J6J3j6nJ8j3qRKj7J4OqOJ1oj5J7Kj3
6238@RlqRJ2j5m%KLQ%rj3J0nKljkLQJlk%llJ9j6QJ1j8KOmqJ9%j3%J2j8JJ2Qj8
6285dJ1rlMK1j3j4J6oj3J4Lj8%K0j7j0L6rj7OJ1j8J0J2k1ROj0j0K3Jk3J5Rk3K
6322iJ6pJMonRJqJ1Pj3rJ1lqJ4pj3MJ1oJJ4j5nJ5j2NKKj1QLq%J0j0QJ4nj3NOp
6367BjRj2kJ3j8NRj1lM%kQkkmNpQnJ1mmO%LjKj4OPnJ0lqJ1m%rkJ0rMkKnMqOnJ1
$$ plain form
6091 15 -1 2 11 1 -4 5 -5 -13 3 -1 -6 -2 9 -3 -7 -5 8 0 14 1 -7 -9 9 3 10 21 -5 -6 13 16 3 11 14 -2 5 15 5 2 15 16 -9
6132 -9 0 1 -1 -6 21 -5 -17 8 14 1 -1 22 -9 0 24 8 -8 2 13 -11 6 23 -10 3 26 10 -6 18 15 -17 15 18 -15 0 13
6167 13 -9 -4 27 1 -10 8 16 -8 6 15 -10 -5 15 11 -19 9 9 -19 10 18 -8 2 11 -8 -28 13 -3 -17 6 18 -13 -9 13 -14 -20
6202 -20 15 -2 -22 18 6 -6 6 22 -10 -8 11 0 0 11 5 -13 3 16 0 -5 13 0 -8 1 3 -14 0 6 -2 4 15 9 -6 11 13 0
6238 0 9 6 -2 7 19 4 0 0 2 5 13 13 4 -9 1 -4 -2 -5 -6 -8 -5 3 4 1 -1 -1 -4 -7 12 -4 4 15 -3 -1 5 1 -7 12 12 -1 -1 11 -7 -6 6 14 -4
6285 -4 7 -2 -5 -1 20 7 -7 9 3 -10 4 7 -11 -11 9 -8 -18 18 9 -8 -2 9 -9 1 13 -8 1 7 -3 -13 10 11 -12 3 12 -11 -9
6322 -9 7 0 1 5 -1 -6 3 4 -4 7 14 1 -8 3 0 -8 6 -1 -14 -10 1 -5 -4 10 -5 -10 5 -7 -2 0 2 -9 -1 2 -6 -6 4 -6 2 16 11 -2 3 9 2
6367 2 1 10 -2 -4 9 -9 -4 5 -6 -9 -5 -5 -7 1 -1 -3 -7 -2 -9 -1 -6 5 1 -3 3 3 6 5 7 -7 -1 6 1 11 8 0 11 7 7 -2 -4 6 -3 1 -1 1 -4 0 -8 -2 -7 4
6419DLqMNj0KJK%pOpMkJRpkjMOkjj7Q%lNnJ0npJ0jrRoLMlOLpMqRPj0oRqoLJ0l
6474@ooJ2knJJ4pJ1j2Q%j1nP%nJ1knNKnKlrPP%j8K0qj3J4Mp%Rj3jJ0%nOQj8J7
6521IrnJ0klPlKj6QJj8PK0j2JMmkQLj5OnLMMmjMkmlJ1n%kKmlKJ0nLJLj5PkOnM
6573Aj1NlNPJj4J1rJ0KmnpLJjPKqQjnJ6rplJ1jj1jJ0jlNJlOKrnNmjJ1%oRrkNP
6625Hj8kJ6oj1J4mnjJ1%pJ3ojJ1roJ2Ok6J8Mj2JK1j3j5J2kj4QQj1kJ2qj2K6Jr
6666BnJpNJ6j9kL2k0k0J0J3k2J3J4j2j3K4mj2J2rjJ1J0j3oJ3j8MJ5%k2KJ7k2M
6703iK4j5j1K3nj3K2mk4K1J2k2j2J6lqJ9oj8J0K2j6qJ1Kk3L1rkrPmjJ6pmMj%j0
6743dNkpJ0MqLLj1J4KorPmJRkj6J2MoJjJ0j4nK4j2pK2k0JJ0%LNNk4RPj9OJ4oj9
$$ plain form
6419 4 7 -1 3 8 -2 0 1 3 3 -4 2 -5 -1 -3 -2 7 0 -2 -3 1 7 5 4 -13 -5 -5 -8 -3 -8 2 -3 -10 0 -1 -10 -1 -7 -4 0 -3 3 6 -1 3 -5 4 11 1 -5 4 -4 -10 -7 3 0
6474 0 -6 -12 0 -2 -7 -6 8 1 12 0 8 8 -3 -8 -1 -1 -6 5 3 -2 3 5 0 2 -1 -10 -3 4 4 -14 6 -2 -15 -1 3 -4 -4 5 -8 -9 1 1 -4 2 10 -8 9
6521 9 0 -5 5 3 0 7 4 6 -10 -2 -1 -19 -12 8 -4 -3 1 -3 -5 3 6 -9 -3 -8 -5 -1 3 -1 -2 2 0 -4 -7 4 -1 -1 -3 -1 -5 -8 -6 4 -1 2 3 6 -9 -2 -4 2 -3 1
6573 1 -10 -5 -8 -3 4 5 -9 2 -7 3 5 1 -4 -11 -8 -7 -8 -1 1 -7 1 0 -5 11 2 -5 -8 3 2 -9 -10 0 -1 -4 1 2 -1 5 7 -2 -7 -2 -6 -7 4 4 -2 7 -2 -4 1 8
6625 8 -10 -12 4 -2 -13 1 -3 -8 -9 2 2 -5 8 2 1 12 3 -3 9 15 -11 7 11 -1 0 21 8 -7 5 3 -11 -3 5 -6 -8 4 -4 -16 10 11 2
6666 2 -3 -2 -9 -4 12 -7 -9 23 3 -17 -7 6 -16 -3 11 -1 -14 10 6 -6 6 -3 -4 7 17 4 -2 11 -7 -3 12 12 -10 -8 9 -13 -9
6703 -9 15 0 -11 12 7 -6 16 12 -12 9 21 -1 -13 3 0 -8 11 5 -13 -3 19 3 -5 6 8 -15 16 7 5 -4 3 -1 -2 14 7 3 7 6 6 -4
6743 -4 1 -1 -8 2 6 -2 1 4 -7 7 9 3 -6 1 -3 -2 7 5 -11 1 5 -1 0 -1 9 -5 -10 14 2 -5 17 -3 -2 8 8 11 16 21 -3 6 13 -6 0 14 8 -11
6789a1J4MpKRj1rJ3j1QJ0J0k8KOkrJ9kj7J9Kj3QQj6rJ9rrPQk3J4Oj8MRjjOj0%
6832iQMJlklqJ6Lj3J1Ok5J3J2j9kJ6j2lJ4Pj2MLoj2K3j1oJ6j3%J0Mrj%KmJ4j7
6874cL%jkJ0mlmJ2%pMJppOOj0LjMMNj0jJ1KlkKj6OlPkRLrnMPj3J1mkLklLMljO
6927H%m%MppNMnNMj1NMj3J8mj1mJ2lj1RQj0NKmKojLLKLKRj0nJ0JK%pmJ1pMj6J1
6977FkjJmJ0jj1J%Pj1J1rLKKNmrPkNKqMJjj1J1oLOlj1JMlNMqJ1j3kNoQMjJ2j4
7027@j0J4MqkJLrOqOJ2jkJ8j8pJ0MqkrNlkJ4nRnMpKLoj3K0opRokRqJKRoj1J5o
7077CpmRKjQrNJ2qj8J5Rk3J3J4rrNNj5OQj5QJ4j6j3J6nmJ5lj2%J3oj1L1j6j9K2
7119A0roPJ1j9J0J2j8lJ1%k5J7J2j1PJ6k3jJ0pmJ4jj4J1Oj2j1K9j9KJ9ok2MK0
$$ plain form
6789 -11 3 7 0 2 11 0 -9 4 -7 1 11 21 -7 -5 1 -1 -10 9 7 -10 9 11 -2 6 14 -2 -11 8 -1 -10 -3 5 -18 -4 2 -16 -12 -3 -4 -5 1 -9 -9
6832 -9 -1 3 4 1 -1 -4 -12 4 7 -6 5 11 -14 -1 11 -8 -10 6 -6 -9 5 12 0 4 7 1 -11 12 1 -5 11 -2 -2 8 12 3 2 2 4 0 14 -3
6874 -3 0 0 -1 -3 7 3 0 -4 8 8 1 5 6 -1 -8 -2 4 -6 -3 -4 0 4 9 -1 -2 9 11 8 6 8 -8 -2 -5 2 0 9 12 3 -2 2 9 -4 7 3 1 4 2 -1 2 6 3 2 8
6927 8 8 4 4 8 1 -6 -1 3 -2 3 7 -4 1 5 -8 10 6 -5 -9 3 0 -11 -2 6 -4 1 3 -1 1 -5 -6 -3 0 2 5 7 16 6 1 11 12 14 14 7 3 14 7 11 -5 6
6977 6 4 3 4 0 10 9 -2 -1 -1 6 -5 6 -3 0 2 4 9 5 -4 3 1 6 8 0 4 5 4 -7 4 -2 1 7 4 -7 -6 -2 -5 0 4 -4 7 -6 -8 -3 -9 -1 3 2 14 0
7027 0 -10 4 8 0 -2 -1 2 -7 -1 -9 -3 9 8 6 24 6 -1 9 13 5 3 -6 -1 -4 -6 8 3 12 7 11 4 6 9 3 -10 10 4 -3 6 0 -2 7 -1 0 2 11 5 -6 9 3
7077 3 -4 -8 1 3 2 10 1 6 18 10 -8 7 16 -7 6 20 11 2 7 12 -3 3 11 -4 4 18 2 -11 5 0 -4 11 8 -4 -4 9 3 -8 23 7 -12 10
7119 10 1 -5 2 13 -6 4 16 -2 -5 6 6 -19 -2 10 -1 6 22 -1 -2 8 1 -3 11 10 -4 7 13 1 -10 19 0 2 21 15 -7 -3 17
7156A7k5MJ9j6j0K3qj2J1Nj1pK8k6mRK1k0PJ1k5J6J6k5KJ3jj3J1MpkJ2j4qPmj5
7194a7K1Mj1KMlj0K2%j9QJ1j0KQrjPKj0J8nmj%Jj0J1lj0jQkNMjj3PJj1PRpqLO
7240Ej6K4Mk1PJ2j2rJ5pnJ2mj3J1OqMJ1j2jJPl1K4Jj3KJ3mkJRoKLk0J0J3j9OK0
7282B0j0j4J1Pj5QJqJJ2j4j4K4j9PPJ2j0pJ4j1mJ0Jj7J8Pj8J2J3j9j2J9kj8J7
7318ImnkJ0j4jJ0j0QQLj7J1J0j5MLj0NoKlJ7jppJ7rrR%lJplQj1OnQlkRkpOKNp
7367AQj3J4j3Nn%J0mlQpkJ0mJj6NJ3%Kj2jPOqj5NPj6J1mLQNqLOkJ0j0n%mJ2lj3
7414hOKMRj2KKmjj%JRnJqLRjj2K0rnLqLPj4MpMPKljLKLmlJOj2POj2QPlqMkKJj1
7469fJ0NnmNkMol%KokkJ1pRqJ2jRj0lJ0rMllJ2pmjN%OPj3MKpJqOlkRqjJ0%rj%
$$ plain form
7156 17 -8 -4 15 -1 -11 12 4 -8 3 8 -3 -10 18 -8 -12 -3 18 -2 5 16 -9 7 23 -2 0 13 12 -1 10 14 7 5 17 3 -5 2 -2 -17
7194 -17 4 8 -3 -1 3 0 -10 12 12 -7 1 12 2 4 12 3 2 9 11 1 19 14 10 9 9 10 0 11 8 -2 -3 5 3 8 12 11 -2 5 6 -5 2 11 4 -4 -1 5
7240 5 -11 13 17 -4 3 15 3 -6 9 2 -3 9 5 -8 3 9 1 5 16 4 3 4 11 -20 4 5 -8 -6 7 3 1 2 11 5 7 10 -10 0 13 -6 0 20
7282 20 10 -4 7 14 -1 7 8 0 1 13 -1 -15 9 -10 -3 4 16 6 -1 13 2 -2 8 9 -8 10 17 -1 11 24 5 -7 12 10 -8 9
7318 9 5 0 -2 8 -6 -7 3 -7 1 9 12 -5 6 16 1 5 8 -2 3 -3 -1 -4 13 12 5 -2 15 6 -3 6 6 3 4 -3 -6 2 -9 -3 -8 0 -3 -5 4 2 -5 1 3 8 1
7367 1 9 -4 10 -3 2 -3 -3 7 3 0 8 1 -1 9 5 6 -10 -5 8 8 10 -2 -3 4 10 2 -13 -8 -1 -17 -6 -10 -7 1 6 -2 1 7 5 15 5 0 0 -4 8 5 -8
7414 -8 -2 0 4 13 1 3 5 1 0 -1 -1 0 9 4 5 -3 0 9 8 -4 16 7 2 5 -3 0 7 -7 -3 -10 -6 1 3 0 -1 2 4 7 3 0 1 7 -5 2 8 -4 4 11 8 0 4 2 4 5 -6
7469 -6 4 9 4 0 5 3 7 1 -2 -2 0 -6 -8 -10 1 -6 3 -5 7 6 15 5 2 12 3 7 4 1 13 6 2 1 6 6 12 19 6 10 12 5 6 -2 4 1 -1 8 0 -1 9 9 0 -1 -1
7522aJ2j3kLOLKj6OJ3lpOmjQnqknJ0NmKpNLjrRRj0jnJMJnkONlqjKM%rLJKJqKp
7577a3J6j1nJ0J4j7JJ3nLl%pKkJ2rQj3QKjn%k%LknJ4j1QRkjrMlRqMLk%Qk1J5p
7625BJOrmN%jRnpJ0mmjQJLpNkoLjLRMk3KJ7j2LJnJ1j3kJ0Lm%j%mLLpJkOpK1j4
7677EkkJ0j1jRLqKj1J1KnkkRqJ1j0lOj1NNljQnqRQj0lJ3rLo%JRqmQpQLlkJlq%
7729gMmMLMLoMj0PjPj1J7lpjMn%jJ4j0J1qlqK3k0jNmJ7k2OLKoMnLMqLJlJ0olR
7779IJkjQKk2J4qkPKqkOo%J6mj0LJmjRj5QRoJ%km%KlKnKqJ8pJMjrJ1Poj5RLj6
7831a2J6Nj9RK%JKKj2LKlRj0jjMNkKNkj0Ol%nJ1pnJ4ljNqRqPkoMKj5J3LpJ0rm
7881d%J7j1JppjOJqOJ5nqJ0nmM%mOlJ1oNKj1RLrRj4%JPmL%Pj9QNljj%j2LQRqR
$$ plain form
7522 -1 11 -2 -4 -1 5 8 10 -6 0 13 10 3 9 5 4 12 7 -1 -3 -8 2 7 3 5 -2 3 6 5 -4 5 14 4 3 -2 -1 3 4 -1 -3 3 8 5 -3 -4 -2 2 2 -7 -4 -3 -1 0 -8 -6 -13
7577 -13 3 -8 -13 -3 11 -6 -5 8 3 6 3 3 -4 -2 -4 8 -1 7 -6 2 4 3 -2 -2 -4 -4 -1 -3 -8 6 -5 3 12 10 9 0 4 1 10 2 6 9 7 7 15 -6 9 2
7625 2 3 9 0 -4 1 1 0 9 4 -3 7 3 -1 -2 6 7 10 3 8 6 0 3 2 5 14 18 -5 -3 14 2 5 6 1 12 -1 -3 7 10 6 6 5 5 1 4 7 0 1 -1 5 -2 19 5
7677 5 3 1 11 0 -1 8 11 3 5 -6 5 7 2 0 -2 7 -1 10 0 -3 3 -8 -3 2 -1 -2 6 1 -7 2 10 0 -3 10 1 4 -2 -2 -1 8 0 -4 4 -3 5 8 5 3 4 1 -7 -7
7729 -7 -3 -7 -3 0 4 7 1 5 -5 2 1 8 -3 14 11 4 3 7 2 2 1 15 5 16 8 5 -3 20 0 -1 4 0 17 -5 1 4 6 0 4 -1 2 6 -2 1 2 -1 9 3 0 9
7779 9 10 8 7 15 17 -5 9 1 -1 6 8 0 -2 4 -2 -2 14 10 0 3 4 0 -1 8 -7 1 10 4 5 5 3 -1 -1 1 -2 0 -5 -3 -11 7 0 1 5 4 -5 6 13 7 -8 1 4 -12
7831 -12 4 9 -10 -1 1 1 2 4 6 -6 -3 -1 -4 5 -5 -6 -7 -3 2 0 2 7 5 -5 1 -2 -2 -7 4 -3 -8 6 3 2 7 -1 8 0 7 5 -1 3 5 -10 3 6 -1 9 0 -4
7881 -4 -4 13 2 3 -4 -11 -12 -6 -5 -13 -7 8 3 -5 5 0 -4 0 0 -4 2 -1 10 4 9 11 0 9 12 3 12 -2 -2 -1 6 2 5 5 12 -7 1 6 3 2 1 1 -11 -8 0 9 1 10
7933A0j4NnJ0MLKplmpLPJkLj1%LKKjMj0J1jqRjm%O%o%J0j0kpPJ%pJ1pOkNKj4J4
7984HoKpRj1J1oKn%QmLjkJj2NMkJMj1RnJ3o%Ko%jMqkPNj0RJPKpjolMQpPlnjJ4
8038A2qKoNoKj2J0JKkoJ5qlJ1qP%KmqKNnJ2rNNj4J3ol%jKK%j0JJ0j2OMQj2L%K
8087FqJMqJOj2J4lRj2J0qjLJMj1NLjRqJ0j4LMl%%NLooRpmkQjMOjj1JMnpN%Rjk
8140EpNJJJJrJ1knoQkmJ1lMnjkQrnkPMnQmqKoQj3J2oKoJ0JPqJkoLOKjKJ
$$ plain form
7933 10 -4 1 -4 6 10 13 15 8 5 1 -6 -3 4 5 3 6 -5 -5 -2 0 2 1 5 -5 6 5 -3 6 5 1 1 7 7 1 1 11 1 -1 -8 -1 0 0 -7 4 -3 3 1 6 8 -6 8
7984 8 2 4 -3 6 -5 6 0 2 -3 -3 5 1 4 3 1 2 -10 -5 -1 -3 -2 2 -9 0 -5 8 2 2 4 -2 -2 -3 1 -7 -9 -2 3 -7 2 3 10 12 5 4 -2 -5 -1 7 0 7 4 -1 -2 12
8038 12 4 6 0 5 -1 1 -11 -1 0 2 0 -6 9 1 -2 9 1 8 8 10 6 -2 0 5 0 12 3 8 13 -1 12 6 3 3 2 4 6 6 -4 -3 7 -5 1 5 13 1 4 4 6
8087 6 -2 -1 3 -5 -4 2 -10 4 1 10 -2 8 0 -1 2 3 7 -4 1 4 3 12 4 14 0 3 7 4 4 4 9 12 6 0 9 2 -2 -4 4 3 7 13 12 1 2 6 1 -6 -1 -1 8 7 5
8140 5 -2 3 4 5 6 7 -2 9 7 2 -4 4 2 -2 9 6 10 5 4 2 10 1 -4 -6 1 5 0 8 4 -4 -2 -8 0 -13 -1 -7 -5 -11 -1 0 7 -1 0 -2 -8 -5 1 3 2 4 5
8191E
##END NTUPLES=NMR FID
##END=
