##TITLE=1H_LR-743-R2-B-O
 CDCl3
 8 sc, 
 18.1.2022
##JCAMPDX= 6.0         $$ Bruker NMR JCAMP-DX V2.0
##DATA TYPE= NMR FID
##DATA CLASS= NTUPLES
##ORIGIN= UXNMR, Bruker Analytische Messtechnik GmbH
##OWNER= root
$$ XWIN-NMR		Version 3.5
$$ Tue Jan 18 11:08:01 2022 Russian Standard Time (UT+4h)  she@DPX200
##.OBSERVE FREQUENCY= 200.131346
##.OBSERVE NUCLEUS= ^1H
##.DELAY= (6, 6)
##.ACQUISITION MODE= SIMULTANEOUS
##.ACQUISITION SCHEME= undefined
##.AVERAGES= 8
##.DIGITISER RES= 18
##SPECTROMETER/DATA SYSTEM= spect
##.PULSE SEQUENCE= zg30
##.SOLVENT NAME= CDCl3
##.SHIFT REFERENCE= (INTERNAL, CDCl3, 0, 15.7039)
##AUDIT TRAIL= $$ (NUMBER, WHEN, WHO, WHERE, WHAT)
$$ ##TITLE= Audit trail, XWIN-NMR		Version 3.5
$$ ##JCAMPDX= 5.01
$$ ##ORIGIN= Bruker BioSpin GmbH
$$ ##OWNER= she
$$ F:/spectra/data/she/nmr/H-F/1/audita.txt
$$ ##AUDIT TRAIL=  $$ (NUMBER, WHEN, WHO, WHERE, WHAT)
(   1,<2022-01-18 11:06:37.54 +0400>,<she>,<DPX200>,
      <created by zg, POWCHK disabled, PULCHK disabled
       configuration hash MD5:
       00 E9 B6 7A A2 85 ED C7 34 08 36 98 17 FE 4E 26
       data hash MD5: 16K
       BD 07 EF 62 BE EC 37 6A DA 72 0F 88 A6 5B B4 0F>)
$$ ##END=
$$ 
$$ hash MD5
$$ 3E D7 C4 F8 0D 40 C0 82 00 D6 71 CE 04 BE 17 72
##$RELAX= 
##$RELAX= 
##$RELAX= 
##$RELAX= 
##$RELAX= 
##$RELAX= 
$$ Bruker specific parameters
$$ --------------------------
##$DU= <F:/spectra>
##$EXPNO= 1
##$NAME= <H-F>
##$PROCNO= 1
##$TYPE= <nmr>
##$USER= <she>
##$AMP= (0..31)
100 100 100 100 100 100 100 100 100 100 100 100 100 100 100 100 100 100 
100 100 100 100 100 100 100 100 100 100 100 100 100 100 
##$AQSEQ= 0
##$AQ_mod= 1
##$AUNM= <au_zg>
##$AUTOPOS= <>
##$BF1= 200.13
##$BF2= 200.13
##$BF3= 200.13
##$BF4= 200.13
##$BF5= 200.13
##$BF6= 200.13
##$BF7= 200.13
##$BF8= 200.13
##$BYTORDA= 1
##$CFDGTYP= 0
##$CFRGTYP= 5
##$CHEMSTR= <none>
##$CNST= (0..31)
1 1 145 1 1 1 1 1 1 1 1 1 1 1 1 1 1 1 1 1 1 1 1 1 1 1 1 1 1 1 1 1 
##$CPDPRG= <>
##$CPDPRG1= <>
##$CPDPRG2= <>
##$CPDPRG3= <>
##$CPDPRG4= <mlev>
##$CPDPRG5= <mlev>
##$CPDPRG6= <mlev>
##$CPDPRG7= <mlev>
##$CPDPRG8= <mlev>
##$CPDPRGB= <>
##$CPDPRGT= <>
##$D= (0..31)
0 1.2 0 0 0 0 0 0 0 0.06 0 0.03 0 0 0 0 0.0002 0 0 0 0 0 0 0 0 0 0 0 0 
0 0 0 
##$DATE= 1642489597
##$DBL= (0..7)
120 120 120 120 120 120 120 120 
##$DBP= (0..7)
150 150 150 150 150 150 150 150 
##$DBP07= 0
##$DBPNAM0= <>
##$DBPNAM1= <>
##$DBPNAM2= <>
##$DBPNAM3= <>
##$DBPNAM4= <>
##$DBPNAM5= <>
##$DBPNAM6= <>
##$DBPNAM7= <>
##$DBPOAL= (0..7)
0.5 0.5 0.5 0.5 0.5 0.5 0.5 0.5 
##$DBPOFFS= (0..7)
0 0 0 0 0 0 0 0 
##$DE= 6
##$DECBNUC= <off>
##$DECIM= 32
##$DECNUC= <off>
##$DECSTAT= 4
##$DIGMOD= 1
##$DIGTYP= 9
##$DL= (0..7)
0 120 120 120 120 120 120 120 
##$DP= (0..7)
150 150 150 150 150 150 150 150 
##$DP07= 0
##$DPNAME0= <>
##$DPNAME1= <>
##$DPNAME2= <>
##$DPNAME3= <>
##$DPNAME4= <>
##$DPNAME5= <>
##$DPNAME6= <>
##$DPNAME7= <>
##$DPOAL= (0..7)
0.5 0.5 0.5 0.5 0.5 0.5 0.5 0.5 
##$DPOFFS= (0..7)
0 0 0 0 0 0 0 0 
##$DQDMODE= 0
##$DR= 18
##$DS= 0
##$DSLIST= <SSSSSSSSSSSSSSS>
$$ [...]
##$SUBNAM2= <"">
##$SUBNAM3= <"">
##$SUBNAM4= <"">
##$SUBNAM5= <"">
##$SUBNAM6= <"">
##$SUBNAM7= <"">
##$SUBNAM8= <"">
##$SUBNAM9= <"">
##$SW= 18.0517287032376
##$SWIBOX= (0..15)
0 0 2 0 0 0 0 0 0 0 0 0 0 0 0 0 
##$SW_h= 3612.71676300578
##$TD= 16384
##$TD0= 1
##$TE= 0
##$TE2= 300
##$TE3= 300
##$TEG= 300
##$TL= (0..7)
0 120 120 120 120 120 120 120 
##$TP= (0..7)
150 150 150 150 150 150 150 150 
##$TP07= 0
##$TPNAME0= <>
##$TPNAME1= <>
##$TPNAME2= <>
##$TPNAME3= <>
##$TPNAME4= <>
##$TPNAME5= <>
##$TPNAME6= <>
##$TPNAME7= <>
##$TPOAL= (0..7)
0.5 0.5 0.5 0.5 0.5 0.5 0.5 0.5 
##$TPOFFS= (0..7)
0 0 0 0 0 0 0 0 
##$TUNHIN= 0
##$TUNHOUT= 0
##$TUNXOUT= 0
##$USERA1= <user>
##$USERA2= <user>
##$USERA3= <user>
##$USERA4= <user>
##$USERA5= <user>
##$V9= 5
##$VALIST= <valist>
##$VCLIST= <CCCCCCCCCCCCCCC>
##$VD= 0
##$VDLIST= <DDDDDDDDDDDDDDD>
##$VPLIST= <PPPPPPPPPPPPPPP>
##$VTLIST= <TTTTTTTTTTTTTTT>
##$WBST= 1024
##$WBSW= 4
##$XGAIN= (0..3)
0 0 0 0 
##$XL= 0
##$YL= 0
##$YMAX_a= 526540
##$YMIN_a= -801015
##$ZGOPTNS= <>
##$ZL1= 120
##$ZL2= 120
##$ZL3= 120
##$ZL4= 120
##$ABSF1= 10
##$ABSF2= 0
##$ABSG= 5
##$ABSL= 3
##$ALPHA= 0
##$AQORDER= 0
##$ASSFAC= 0
##$ASSFACI= 0
##$ASSFACX= 0
##$ASSWID= 0
##$AUNMP= <proc_1d>
##$AZFE= 0.1
##$AZFW= 0.1
##$BCFW= 1
##$BC_mod= 2
##$BYTORDP= 1
##$COROFFS= 0
##$CY= 11.3945322036743
##$DATMOD= 1
##$DC= 2
##$DFILT= <>
##$DTYPP= 0
##$F1P= 2.36226072786647
##$F2P= -0.459571619588291
##$FCOR= 0.5
##$FTSIZE= 0
##$FT_mod= 4
##$GAMMA= 1
##$GB= 0.15
##$INTBC= 1
##$INTSCL= 1
##$ISEN= 128
##$LB= 0.24
##$LEV0= 0
##$LPBIN= 0
##$MAXI= 10000
##$MC2= 0
##$MEAN= 0
##$ME_mod= 0
##$MI= 1.114404
##$NCOEF= 0
##$NC_proc= 0
##$NLEV= 6
##$NOISF1= 3.799351
##$NOISF2= 2.8
##$NSP= 1
##$NTH_PI= 0
##$NZP= 0
##$OFFSET= 15.70392
##$PC= 1
##$PHC0= -15872.54
##$PHC1= 15.20078
##$PH_mod= 1
##$PKNL= yes
##$PPARMOD= 0
##$PSCAL= 0
##$PSIGN= 0
##$REVERSE= no
##$SF= 200.130013532006
##$SI= 16384
##$SIGF1= 3
##$SIGF2= 2
##$SINO= 400
##$SIOLD= 16384
##$SREGLST= <1H.CDCl3>
##$SSB= 0
##$STSI= 0
##$STSR= 0
##$SW_p= 3612.71676300578
##$SYMM= 0
##$S_DEV= 0
##$TDeff= 0
##$TDoff= 0
##$TI= <>
##$TILT= no
##$TM1= 0
##$TM2= 0
##$TOPLEV= 0
##$USERP1= <user>
##$USERP2= <user>
##$USERP3= <user>
##$USERP4= <user>
##$USERP5= <user>
##$WDW= 1
##$XDIM= 8192
##$YMAX_p= 0
##$YMIN_p= 0
$$ End of Bruker specific parameters
$$ ---------------------------------
##NTUPLES= NMR FID
##VAR_NAME=  TIME,          FID/REAL,        FID/IMAG
##SYMBOL=    X,             R,               I
##VAR_TYPE=  INDEPENDENT,   DEPENDENT,       DEPENDENT
##VAR_FORM=  AFFN,          ASDF,            ASDF
##VAR_DIM=   8192,          8192,            8192
##UNITS=     SECONDS,       ARBITRARY UNITS, ARBITRARY UNITS
##FACTOR=    0.0002768,     1,               1
##FIRST=     0,             0,               0
##LAST=      2.2672688,     0,               0
##MIN=       0,             -801015,         0
##MAX=       2.2672688,     526540,          0
$$ Real data points
##PAGE= N=1
##DATA TABLE= (X++(R..R)), XYDATA
$$ plain form
0 0 0 0 0 0 0 0 0 8 -8 8 -8 16 -16 24 -32 33 -48 56 -72 81 -97 120 -142 169 -197 225 -265 310 -357 407
30 407 -464 531 -607 687 -774 871 -978 1098 -1229 1368 -1524 1694 -1879 2084 -2304 2544
46 2544 -2808 3098 -3414 3761 -4142 4563 -5030 5548 -6130 6783 -7526 8379 -9367 10529
60 10529 -11919 13620 -15749 18512 -22248 27609 -35992 51023 -86257 344666 -82352 -606424
72 -606424 187549 -153638 -302482 509471 422424 -480184 -115347 208294 -278764 -89
82 -89 526540 -170126 -387785 285358 13517 -462194 257616 426331 -287168 -81611 310121
93 310121 -321128 -380818 341056 225651 -122038 193390 -3572 -476211 -42 393857
103 393857 -34730 -36740 186300 -276748 -339873 346311 314953 -177085 -9985 67180 -305978
$$ packed form
0@%%%%%%%Qj6J6j6K4l2M0n6O5q1J04j28J53j78K17k62L11l66M22m90N75o67P64
30D07q71R95j138J294j461J645j849K076k327K597k892L218l573L963m388M848
46B544n352N906o512P175p903Q705r593J0578j1678J2913j4309J5905j7746J9896
60A0529k2448K5539k9369L4261m0760M9857o3601Q7015j37280M30923m27018n24072
72f06424P93973l41187j48844Q11953q7047r02608L64837L23641m87058K78675
82h9N26629o96666k17659O73143k71841m75711P19810J68715p13499K05557L91732
93C10121o31249n9690P21874j15405l47689L15428j96962m72639M76169L93899
103C93857m28587k010K23040m63048o3125O86184l1358m92038J67100P7165l73158
$$ plain form
114 -305978 -113109 302118 79676 -87977 108724 -43285 -226862 46629 118845 -90883
124 -90883 46144 157220 -127961 -159830 112084 66352 -56991 95371 71349 -177637 -130905
135 -130905 87141 90297 54632 86617 -29372 -165495 -72769 59145 49361 50892 64805 -51045
147 -51045 -124555 3669 81424 -2915 481 49631 -70463 -122800 54382 106667 -10115
158 -10115 24993 50016 -117555 -108571 86306 53323 -27737 87509 37811 -141703 -21283
169 -21283 110843 -39914 -41021 101272 -33384 -118774 82093 69449 -92879 37313 88244
180 88244 -128520 -73050 113483 -27340 -69688 140539 40271 -159699 10888 86559 -93768
191 -93768 -6564 132495 -50220 -86502 93741 7292 -83337 90226 49655 -139379 209
$$ packed form
114c05978J92869M15227k22442j67653J96701j52009j83577K73491P2216k09728
124i0883J37027J11076k85181l1869K71914m5732j23343J52362k4022k48986M6732
135a30905K18046L156l5665L1985j15989j36123R2726J31914r784J531J3913j15850
147e1045p3510J28224P7755q4339L396M9150j20094n2337J77182N2285j16782
158a0115L5108K5023j67571Q984J94877l2983q1060J15246m9698j79514J20420
169b1283J32126j50757j107J42293j34656q5390K00867j2644j62328J30192N0931
180H8244k16764N5470J86533j40823m2348K10227j00268j99970J70587P5671j80327
191i3768Q7204J39059j82715l6282J80243q6449r0629J73563m0571j89034J39588
$$ plain form
202 209 106801 -69753 -27388 135681 -27730 -125540 64920 45191 -103046 17404 82621
213 82621 -57472 -15821 71625 -53380 -53301 84959 -3347 -85062 55510 42706 -89011 21177
225 21177 104208 -50679 -62468 63846 -1943 -64223 43445 45049 -36461 9543 20599 -48880
237 -48880 4323 51940 -39907 -37108 53545 -758 -52299 37958 38493 -57321 -21680 42902 -9783
250 -9783 -29233 20589 12812 -6679 11153 -5474 -18067 18920 9390 -28388 6524 33546 -13076
263 -13076 -17176 27887 8254 -30670 -3182 20763 -4386 -14210 2909 8833 3020 -6790 -11428
276 -11428 2520 7801 -11250 -12008 12293 10494 -10655 -2850 12660 -923 -13287 2320 14675
289 14675 1593 -9954 1074 13505 4132 -9084 -1933 8262 -339 -9661 -166 8929 -641
$$ packed form
202B09J06592j76554M2365J63069j63411r7810J90460j9729j48237J20450O5217
213H2621j40093M1651Q7446j25005P9J38260q8306q1715J40572j2804j31717J10188
225B1177Q3031j54887j1789J26314o5789o2280J07668J604q1510M6004J1056o9479
237d8880N3203M7617r1847K799R0653n4303n1541R0257N35r5814L5641O4582n2685
250i783j9450M9822p777j9491J7832j6627j2593L6987r530l7778L4912K7022m6622
263a3076m100M5063j9633l8924K7488K3945k5149r824J7119N924n813r810m638
276a1428J3948N281j9051p58K4301j799k1149P805J5510j3583j2364J5607J2355
289A4675j3082j1547J1028J2431r373j3216P151J0195q601r322R495R095r570
$$ plain form
302 -641 -9395 -2039 4607 -2779 -8217 -573 4725 -3150 -8132 1662 7642 -693 -6077 1290 5542
317 5542 -530 -2259 5256 6799 -468 -2572 3905 5858 66 -2652 1232 2744 -867 -1534 1659
332 1659 788 -3703 -4204 -1231 -1589 -2992 -1578 42 -1527 -3260 -3098 -173 2377 -1406 -4524 1189
348 1189 5292 823 304 3465 -756 -1136 6425 3070 -3481 3301 5846 -3162 -512 4915 -3918 -3717
364 -3717 6802 -2280 -9486 5190 5000 -9975 -1847 4448 -9438 -2814 11680 -5159 -10651 10719
378 10719 3009 -14061 5049 10751 -9088 2683 13867 -12567 -9832 19890 4332 -13081 9341
391 9341 2718 -18841 8143 19861 -14668 -9015 14599 -10826 -14539 19433 3589 -19142 10103
404 10103 7334 -25067 2333 24180 -13070 -10025 22357 -4583 -20294 16273 8674 -16830 13146
$$ packed form
302f41q754P356O646p386n438P644N298p875m982R794N980q335n384P367M252
317E542o072j729P515J543p267k104O477J953n792k718L884J512l611o67L193
332A659q71m491n01K973l58j403J414J620j569j733J62K925K550l783l118N713
348A189M103m469n19L161m221l80P561l355o551O782K545r008K650N427q833K01
364c717J0519r082p206J4676j90j4975Q128O295j3886O624J4494j6839n492K1370
378A0719p710j7070J9110N702j9839J1771J1184k6434K735K9722j5558j7413K2422
391I341o623k1559K6984J1718l4529N653K3614k5425l713L3972j5844k2731K9245
404A0103k769l2401K7400K1847l7250L045L2382k6940j5711L6567p599k5504K9976
$$ plain form
417 13146 17824 -20711 -7198 16098 -8253 -416 27072 -9625 -32055 10039 12787 -14011 9930
430 9930 16973 -23489 -18604 11915 -293 -1657 18161 -2209 -20511 130 781 -6145 20287
443 20287 19309 -18252 -15116 7298 -1657 1519 21867 8880 -13967 -12487 -6407 4301 17660
456 17660 7073 -5958 -2226 -12471 -18677 9078 21209 342 -4792 -3914 -17585 -9941 8551
469 8551 9267 17837 13160 -29831 -31605 14468 14932 5166 32823 5291 -55147 -21328 33165 17079
483 17079 15494 20180 -36489 -44867 21063 21411 -1123 31559 -814 -64588 -4363 45261 -19222
496 -19222 -12559 46923 -11165 -47457 22759 7911 -40282 30793 49170 -33470 -17160 14491
508 14491 -47297 -3111 97011 15065 -67155 503 -10774 -53693 63615 96562 -50420
$$ packed form
417A3146M678l8535J3513K3296k4351P837K7488l6697k2430M2094K748k6798K3941
430I930P043m0462M885L0519j2208j364J9818k0370j8302K0641O51o926K6432
443B0287r78l7561L136K2414q955L176K0348j2987k2847J480O080J0708J3359
456A7660j0587j3031L732j0245o206K7755J2131k0867n134Q78j3671P644J8492
469H551P16Q570m677m2991j774M6073M64r766K7657k7532o0438L3819N4493j6086
483A7079j585M686n6669q378O5930L48k2534L2682l2373o3774O0225M9624o4483
496a9222O663N9482n8088l6292P0216j4848m8193P1075J8377q2640J6310L1651
508A4491o1788M4186J00122q1946q2220O7658j1277m2919J17308L2947j46982
$$ plain form
519 -50420 -62904 14513 -30944 -7310 97128 12344 -88737 1345 18322 -49620 38937 76948
531 76948 -58665 -45195 57884 -25883 -59810 66914 38819 -51816 30794 30070 -92138 -19611
543 -19611 87028 1519 -12122 53671 -52555 -98925 59982 77813 -27368 14759 9618
554 9618 -107544 -27496 108369 22395 -31762 32583 -41160 -92477 50491 74981 -37803
565 -37803 3944 40601 -64874 -38570 67934 3391 -31973 56052 7285 -78387 7662 40170
577 40170 -30103 28604 70318 -53711 -74677 27145 8699 -11591 67066 26749 -79389
588 -79389 -33858 22078 -8488 26147 53386 -34827 -55936 16178 5272 -9403 51139 25448
600 25448 -56265 -25020 19968 -10726 6231 49579 9634 -29177 -12869 -16365 -11793 30910
$$ packed form
519e0420j2484P7417m5457K3634J04438q4784j01081R0082J6977o7942Q8557L8011
531G6948j35613J3470J03079q3767l3927J26724k8095r0635Q2610p24j22208P2527
543a9611J06639q5509j3641O5793j06226m6370J58907J7831j05181M2127n141
554I618j17162Q0048J35865q5974n4157O4345p3743n1317J42968K4490j12784
565c7803M1747L6657j05475K6304J06504o4543l5364Q8025m8767q5672Q6049L2508
577D0170p0273N8707M1714j24029k0966J01822j8446k0290P8657m0317j06138
588g9389M5531N5936l0566L4635K7239q8213k1109P2114j0906j4675O0542k5691
600B5448q1713L1245M4988l0694J6957M3348l9945l8811J6308l496M572M2703
$$ plain form
612 30910 27808 -7467 -4913 -11627 -33415 2537 43027 13516 -20242 -17305 -17240 -11034 15647 29231
626 29231 18608 -9022 -36898 -22573 14788 14709 6741 20659 3959 -28823 -12842 11919 7813
639 7813 10765 6880 -16095 -8269 6752 -9796 6691 38850 -5006 -44171 -1124 10091 -21680
652 -21680 13915 43867 -10679 -30887 1558 -8290 -8104 28997 6734 -24569 10315 7548 -28152
665 -28152 17368 42109 -28564 -31569 28609 -1529 -29093 30756 29305 -27088 -4361 12882
677 12882 -27929 -7020 28837 -10590 -10468 32075 -10445 -38981 26050 22343 -38504 -822 31925
690 31925 -25739 -18882 40255 8447 -22640 13826 -997 -31380 13321 23403 -18086 7607
702 7607 28486 -24544 -19252 31796 -3315 -33047 17720 17874 -26482 2343 26010 -13799 -11512
$$ packed form
612C0910l102l5275K554o714k1788L5952M0490k9511l3758K937O5O206K6681J3584
626B9231j0623k7630k7876J4325L7361p9p968J3918j6700l2782J5981K4761m106
639G813K952l885k2975P826J5021j6548J6487L2159m3856l9165M3047J1215l1771
652b1680L5595K9952n4546k0208L2445r848J86L7101k2263l1303L4884k767l5700
665b8152M5520K4741p0673l005O0178l0138k7564N9849j451n6393K2727J7243
677A2882m0811K0909L5857l9427J22M2543m2520k8536O5031l707o0847L7682L2747
690C1925n7664O857N9137l1808l1087L6466j4823l0383M4701J0082m1489K5693
702G607K0879n3030N292N1048l5111k9732N0767J54m4356K8825K3667l9809K287
$$ plain form
715 -11512 15289 -13246 -19171 17391 4391 -14461 18136 13221 -24225 -2265 18174 -15027
727 -15027 -11730 22105 3861 -12968 13145 9608 -14279 1180 7605 -14227 -3776 14014 -3063
740 -3063 -4545 13954 -236 -15065 1811 1733 -12848 812 11439 -3389 -2471 8558 -2591
753 -2591 -7957 3606 -753 -8827 3547 9597 639 1349 5067 -2124 -3945 531 -1843 -1741 3772
768 3772 2274 286 4725 1663 -6964 -4878 560 -2929 -3996 2489 4916 664 -2145 -702 439
783 439 -3090 -5830 -882 4943 2854 164 3642 4491 -1950 -4464 67 2354 -1171 -1527 4252 7125
799 7125 664 -4591 -785 1339 -5190 -5908 2750 4941 -1791 -2427 3108 1812 -5658 -6090 356 2216
815 2216 -1629 -1093 5223 5126 -2608 -4121 2232 2107 -4285 -2000 6547 5286 -2007 -720 4615 1159
$$ packed form
715a1512K6801k8535n925L6562j3000j8852L2597m915l7446K1960K0439l3201
727a5027L297L3835j8244j6829K6113l537k3887J5459O425k1832J0451J7790j7077
740c063j482J8499j4190j4829J6876p8j4581J3660J0627j4828R18J1029j1149
753b591n366J1563m359q074J2374O050q958P10L718p191j821M476k374J02N513
768C772j498j988M439l062q627K086N438l489j067O485K427m252k809J443J141
783D39l529k740M948N825k089k690L478Q49o441k514M531K287l525l56N779K873
799G125o461n255L806K124o529p18Q658K191o732o36N535j296p470m32O446J860
815B216l845N36O316r7p734j513O353j25o392K285Q547j261p293J287N335l456
$$ plain form
831 1159 -5850 -3978 2657 2321 -2879 -1070 4370 1290 -5388 -3558 2061 -732 -5344 -555 5557
846 5557 1625 -3424 119 3730 -264 -4630 -1261 4547 3227 -1565 532 5122 1351 -4507 -432
861 -432 3386 -2025 -3916 3001 4217 -2042 -2868 723 534 -2254 -3838 -2348 2152 2134 -3239 -686
877 -686 4778 -868 -5689 1418 3383 -3370 -504 6547 1740 -2591 1665 1871 -793 999 -359 -1826
893 -1826 3159 2728 -4195 -205 5262 -3044 -5835 2042 -185 -5430 2417 4775 -3650 -3373 1499 -2191
909 -2191 -1425 3769 -553 -2431 3665 568 -4334 3133 5844 -2490 -1938 2969 -2164 -2410 5966 3639
925 3639 -3319 -797 -343 -3874 165 3842 -383 -2015 -22 -3025 -3467 2233 2966 -954 -1740 -1587
941 -1587 -1812 30 2512 2625 754 -402 -34 -641 -1601 1703 5085 2029 -1314 -592 -3242 -3861 5002
$$ packed form
831A159p009J872O635l36n200J809N440l080o678J830N619k793m612M789O112
846E557l932n049L543L611l994m366L369N808j320m792K097M590l771n858M075
861d32L818n411j891O917J216o259q26L591j89k788j584J490M500j8n373K553
877f86N464n646m821P107J965o753K866P051m807m331M256K06k664J792j358j467
893a826M985m31o923L990N467q306k791P877k227n245P847K358q425K77M872l690
909b191P66N194m322j878O096l097m902P467K711q334N52M907n133k46Q376k327
925C639o958K522M54l531M039L677m225j632J993l003m42N700P33l920p86J53
941a587k25J842K482J13j871j156L68o07r60L304L382l056l343P22k650o19Q863
$$ plain form
958 5002 6967 -2639 -3684 -867 -5971 -1790 9400 2806 -7002 -1001 -2043 -7967 5301 11577 -5019
973 -5019 -5125 5675 -5311 -6931 12256 5945 -9270 4330 6434 -12654 -1563 14780 -2658
986 -2658 -4690 11988 -5281 -17626 9122 10958 -9425 4959 9026 -20438 -10902 18597 1658
999 1658 -8323 12592 -3690 -24243 7940 18614 -10005 145 14468 -15936 -13363 20938 3769
1012 3769 -13433 14882 7414 -23368 1427 17688 -11786 -2022 22409 -10098 -21303 13922
1024 13922 3818 -16689 15424 15401 -24779 -9266 15681 -9719 -3947 26224 -3803 -26999 7458
1037 7458 9076 -12836 13433 18846 -21739 -12299 18675 -4026 -9361 21934 4261 -22894 4530
1050 4530 10553 -15358 3067 20827 -9888 -13489 10448 -5589 -13894 16672 11194 -16144 -1248
$$ packed form
958E002J965r606j045K817n104M181J1190o594r808O001j042n924J3268O276j6596
973e019j06J0800j0986j620J9187o311j5215J3600K104j9088J1091J6343j7438
986b658k032J6678j7269j2345K6748J836k0383J4384M067k9464R536K9499j6939
999A658r981K0915j6282k0553L2183J0674k8619J0150J4323l0404K573L4301j7169
1012C769j7202K8315p468l0782K4795J6261k9474R764K4431l2507j1205L5225
1024A3922j0104k0507L2113k3m0180J5513K4947k5400N772L0171l0027k3196L4457
1037G458J618k1912K6269N413m0585R440L0974k2701n335L1295j7673k7155K7424
1050D530O023k5911J8425J7760l0715l601K3937j6037q305L0566n478k7338J4896
$$ plain form
1063 -1248 6169 -16163 -2036 22924 1591 -12924 3101 -3565 -11552 13407 16919 -8334 -6607
1076 -6607 3246 -7344 -696 16514 2574 -10978 1448 1490 -9048 2291 10121 -2936 -4763
1089 -4763 2966 -3578 -7501 2714 5247 -221 1019 -453 -7177 -4884 4678 6933 3335 91 -4319
1104 -4319 -7604 -1518 10050 9382 -2109 -5649 -2954 -3742 1692 10762 3420 -8592 -3072 1582 -4098
1119 -4098 1727 7543 -4179 -6406 4802 -1050 -8225 4603 5719 -6796 1768 7748 -9124 -7207
1133 -7207 10890 2941 -4947 7938 500 -14542 3499 14003 -4105 -2276 7939 -8966 -9926
1146 -9926 13484 6084 -10959 3278 3849 -13238 816 13591 -7300 -8097 10231 -2537 -11209
1159 -11209 9951 5610 -13365 3140 12015 -9439 -4823 11854 -3263 -7272 11952 2783 -12373
$$ packed form
1063a248P417k2332J4127K4960k1333j4515J6025o666p987K4959L512k5253J727
1076f607R853j0590O648J7210j3940j3552J2426M2j0538J1339P830j3057j827
1089d763P729o544l923J0215K533n468J240j472o724K293R562K255l598l244m410
1104d319l285O086J1568o68j1491l540K695p88N434R070p342j2012N520M654n680
1119d098N825N816j1722k227J1208n852p175J2828J116j2515Q564N980j6872J917
1133g207J8097p949p888J2885p438j5042J8041J0504j8108J829J0215j6905r60
1146i926K3410p400j7043J4237N71j7087J4054J2775k0891p97J8328j2768q672
1159a1209K1160m341j8975J6505Q875k1454M616J6677j5117m009J9224r169j5156
$$ plain form
1172 -12373 4606 7812 -9209 1399 11385 -8533 -7744 11009 -617 -10205 7699 4950 -12275
1185 -12275 88 8566 -6702 -3183 8694 -3758 -7248 7634 1363 -8279 5356 6077 -8291
1198 -8291 194 9210 -4504 -4731 8870 819 -7735 3456 4423 -4700 1302 4149 -5078 -1762 5271
1213 5271 -2611 -4561 4013 -384 -5738 3132 3852 -5828 -2124 4812 -977 -3190 2436 1218 -1763
1228 -1763 1982 1649 -1467 1016 1780 -1777 514 3402 -863 -1946 2256 1068 -2433 217 1964
1243 1964 -1756 -2719 376 1524 -67 -1039 -1405 -694 83 -94 -458 180 1 -540 515 1922 571
1260 571 -1074 -143 1731 879 -741 755 2216 142 -979 869 939 -1076 -902 233 -15 -406 -193
1277 -193 -692 -570 -258 -1202 -1030 456 -547 -1637 566 1574 -481 -939 660 584 -740 703 1114
$$ packed form
1172a2373J6979L206j7021J0608R986j9918P89J8753j1626r588J7904k749j7225
1185a2275J2363Q478j5268L519J1877j2452l490J4882o271r642J3635P21j4368
1198h291Q485R016j3714k27J3601q051q554J1191R67r123O002K847r227L316P033
1213E271p882j950Q574m397n354Q870P20r680L704O936n789k213N626j218k981
1228a763L745l33l116K483P64l557K291K888m265j083M202j188l501K650J747
1243A964l720r63L095J148j591r72l66P11P77j77l64O38j79n41J055J407j351
1260E71j645R31J874q52j620J496J461k074j121J848P0k015J74J135k48l91K13
1277a93m99J22L12r44J72J486j003j090K203J008k055m58J599p6j324J443M11
$$ plain form
1294 1114 376 687 675 405 462 407 -626 -180 738 -31 -694 432 314 -1201 -884 -138 -1018 -1221 -179
1313 -179 40 -420 0 -18 -355 36 14 -289 381 654 464 457 997 682 271 176 14 31 93 546 321 133
1335 133 62 -352 -655 -782 -691 -808 -693 -65 9 -303 -347 -251 -261 -396 -519 -262 495 674 381 542 712 453
1357 453 196 439 354 4 121 753 665 24 -379 -186 -2 -568 -1077 -564 -20 -85 -625 -357 -43 -547 -672
1378 -672 -180 -272 -196 123 675 654 176 -26 542 711 263 -119 639 1130 438 -14 444 317 -411 -421 -44
1399 -44 -295 -520 -111 -85 -390 -875 -667 -254 -164 -626 -655 183 629 139 76 260 384 -57 15 801 841 172
1421 172 526 777 372 -180 368 465 -187 -551 -443 -200 35 -224 -599 -232 -122 -958 -1025 -81 55 -530 35
1442 35 488 -713 -472 573 496 -114 511 545 -3 800 952 -120 508 833 -403 -649 875 465 -833
$$ packed form
1294A114p38L11j2k70N7n5j033M46R18p69o63J126j18j515L17P46q80k03J042
1313a79K19m60M20j8l37L91k2l03O70K73j90pN40l15m11r5j62J7O2M53k25j88
1335A33p1m14l03j27R1j17J15O28P4l12m4R6j0j35j23K57P57J79k93J61J70k59
1357D53k57K43q5l50J17O32q8o41m03J93J84n66n09N13N44o5n40K68L14n04j25
1378f72M92r2P6L19N52k1m78k02N68J69m48l82P58M91o92m52M58j27p28j0L77
1399d4k51k25M09K6l05m85K08M13R0m62k9Q38M46m90o3J84J24m41P2P86M0o69
1421A72L54K51m05n52N48R7o52l64J08K43K35k59l75L67J10q36o7R44J36n85N65
1442C5M53j201K41J045p7o10O25L4n48Q03J52j072O28L25j236k46J524m10j298
$$ plain form
1461 -833 385 624 -1397 -950 115 -787 -674 357 -604 -1293 134 22 -949 503 894 -853 -494 1245
1479 1245 222 -226 1554 1165 -948 293 1038 -228 436 1386 -430 -920 698 -157 -973 287 255
1496 255 -1546 -607 630 -1137 -1061 877 55 -1188 263 127 -1124 180 1367 -344 64 1251 -126
1513 -126 -535 1559 1072 -384 646 834 -992 -71 1740 -135 -1087 322 -618 -1297 626 574 -1341
1530 -1341 -593 384 -1017 -805 718 -398 -970 763 418 -734 250 800 -440 626 1686 -71 -714
1547 -714 867 317 -100 1314 935 -1061 -773 372 -243 453 718 -1030 -1706 -1 -9 -564 149 -149 -1558
1566 -1558 -326 561 -76 -94 472 -119 109 684 223 -138 494 609 233 1051 575 -873 -57 780 403
1585 403 381 9 -1117 -1087 466 270 -273 11 -1265 -1716 497 1003 -664 -301 25 -1048 -334 1390
$$ packed form
1461h33J218K39k021M47J065r02J13J031r61o89J427j12r71J452L91j747L59J739
1479A245j023m48J780l89k113J241P45j266O64R50j816m90J618q55q16J260l2
1496B55j801R39J237j767P6J938q22j243J451j36j251J304J187j711M08J187j377
1513a26m09K094m87j456J030J88j826R21J811j875r52J409r40o79J923n2j915
1530a341P48R77j401K12J523j116n72J733l45j152R84N50j240J066J060j757o43
1547g14J581n50m17J414l79j996K88J145o15O96K65j748o76J705qn55P13k98j409
1566a558J232Q87o37j8N66n91K28N75m61l61O32J15l76Q18m76j448Q16Q37l77
1585D03k2l72j126L0J553j96n43K84j276m51K213N06j667L63L26j073P14J724
$$ plain form
1603 1390 401 -644 937 293 -432 1203 999 -899 268 1679 -409 -352 1079 -571 -1216 1430 586
1620 586 -1848 -259 332 -1917 100 1639 -1273 -1539 1042 -265 -1494 1698 856 -2053 422 1682
1636 1682 -981 280 2457 -621 -1078 2300 305 -1710 1400 1259 -2055 469 1656 -1837 -1046 2080
1652 2080 -693 -2032 1349 -170 -2597 771 1236 -2546 -360 2063 -1546 -1046 2390 -193 -1805
1667 -1805 2102 1281 -1936 955 1985 -1328 73 2595 -884 -1346 2056 210 -1834 1251 780 -2676
1683 -2676 -102 1939 -1469 -1194 1198 -1099 -1899 1532 408 -1881 362 887 -1583 312 2077 -1002
1699 -1002 -1040 1715 171 -690 1656 865 -1327 386 1303 -780 -78 1045 -618 -914 958 -143 -1289
1716 -1289 197 84 -1073 38 448 -1251 -732 689 -109 -242 672 -307 -691 545 1041 156 430 280
$$ packed form
1603A390r89j045J581o44p25J635k04j898J167J411k088N7J431j650o45K646q44
1620E86k434J589N91k249K017J539k912k66K581j307j229L192q42k909K475J260
1636A682k663J261K177l078m57L378j995k015L110j41l314K524J187l493P91L126
1652B080k773j339L381j519k427L368M65l782K186K423l609N00L436k583j612
1667a805L907q21l217K891J030l313J401K522l479m62L402j846k044L085m71l456
1683b676K574K041l408K75K392k297q00L431j124k289K243N25k470J895J765l079
1699a002l8K755j544q61K346p91k192J713R17k083P02J123j663k96J872j101j146
1716a289J486j13j157J111M10j699N19J421p98j33R14r79l84J236M96q85K74j50
$$ plain form
1734 280 -54 451 985 306 114 98 -484 -24 524 142 -369 25 -395 -638 -171 -308 -605 -236 -131 -263
1754 -263 -2 -125 -647 177 831 -435 -319 956 133 -426 976 914 -196 68 519 108 497 648 -335
1773 -335 -469 450 -474 -874 661 36 -1430 -246 744 -692 -796 449 -123 -747 84 113 -309 312 480
1792 480 -292 737 610 -651 170 1381 98 -653 858 742 -635 -60 683 -118 -584 -158 -219 -247 -112
1811 -112 -878 -415 409 -467 -1332 87 659 -757 -476 847 367 -627 154 848 351 -64 265 688 464
1830 464 163 -146 621 491 -458 -530 502 303 -602 -463 523 -131 -929 -365 -4 -240 -664 -340 218 2
1850 2 -539 -212 641 288 -340 178 856 296 -284 544 807 146 -213 261 645 -61 -476 78 299 -87 -756
1871 -756 -227 320 -545 -803 -129 43 -416 -699 24 82 -206 -83 211 399 79 -108 333 583 313 101
$$ packed form
1734B80l34N05N34o79j92j6n82M60N48l82n11L94m20k43M67j37k97L69J05j32
1754b63K61j23n22Q24O54j266J16J275q23n59J402o2j110K64M51m11L89J51r83
1773c35j34R19r24m00J535o25j466J184R90j436j04J245n72o24Q31K9m22O21J68
1792D80p72J029j27j261Q21J211j283p51J511j16j377N75P43q01m66M26o1k8J35
1811a12p66M63Q24q76q65J419N72j416K81J323m80r94P81O94m97m15L29M23k24
1830D64l01l09P67j30r49p2J032j99r05J39R86o54p98N64L61k36m24L24N58k16
1850Bn41L27Q53l53o28N18O78n60n80Q28K63o61l59M74L84p06m15N54K21l86o69
1871g56N29N47q65k58O74J72m59k83P23N8k88J23K94J88l20j87M41K50k70k12
$$ plain form
1891 101 497 520 64 211 358 181 -94 -75 126 62 -95 -403 15 254 -672 -511 -92 -490 -372 128 1
1912 1 -565 189 215 -167 241 523 -160 -23 640 325 122 989 424 -302 255 362 -493 248 914 -487 -567
1933 -567 832 -240 -1527 182 413 -1217 -198 835 -836 -396 839 -322 -747 739 -226 -1308
1949 -1308 1440 1640 -1266 491 2051 -1390 -1407 2026 639 -1334 1072 842 -1576 -42 1017 -1182
1965 -1182 -339 1159 -1877 -1529 2485 119 -2736 1143 1191 -3140 -698 2916 -627 -1339 1977 383
1981 383 -1446 1559 636 -1644 1468 1875 -2212 236 2979 -1550 -1527 3545 412 -3817 166 1525
1997 1525 -1959 342 2439 -1746 -2380 558 -759 -405 2432 -684 -3398 1110 2417 -1519 294
2012 294 2557 -1946 -2031 2498 1603 -1225 617 1085 -634 681 611 -1896 -524 1497 -390 -133 1589
$$ packed form
1891A01L96K3m56J47J47j77k75J9K01o4j57l08M18K39r26J61M19l98J18N00j27
1912An66P54K6l82M08K82o83J37O63l15k03Q67n65p26N57J07q55P41O66j401q0
1933e67J399j072j287J709K31j630J019J033j671M40J235j161m25J486r65j082
1949a308K748K00k906J757J560l441j7L433j387j973K406k30k418J534J059k199
1965a182Q43J498l036L48M014k366k855L879M8m331K442L614l543p12L316j594
1981C83j829L005r23k280L112M07m087K448K743m529K3N072l133m229L983J359
1997A525l484K301K097m185o34K938j317L54K837l116k714M508J307l936J813
2012B94K263m503q5M529q95k828J842M68j719J315p0k507J372K021j887K57J722
$$ plain form
2029 1589 -1284 -3059 825 2115 -482 -1155 -793 -1128 47 1811 1362 -226 -1926 -1975 820 2716
2045 2716 875 -829 -232 -98 412 1149 270 -480 -337 -348 386 1889 -335 -2349 811 1609 -1561 -688
2063 -688 679 -1972 -1306 2989 992 -2176 -175 -724 -2083 2499 3030 -2645 -1606 2162 -970 -408
2079 -408 4305 -131 -4423 1424 2735 -2285 1017 3122 -2994 -1947 3590 -1012 -3496 2878 542
2094 542 -4158 2080 2580 -4587 -950 4343 -2356 -2421 3954 -903 -4192 3836 2993 -3872 1346 3160
2110 3160 -4411 -901 5669 -1090 -3441 4029 62 -4700 2858 2779 -4851 87 4172 -3530 -2157
2125 -2157 5001 -1223 -4405 3435 725 -5149 1701 3767 -3651 -440 4304 -2680 -2655 4501 58
2140 58 -3563 3278 1838 -4095 1816 4099 -3343 -1524 4019 -1521 -2993 3369 669 -3510 1775
$$ packed form
2029A589k873j775L884J290k597o73L62l35J175J764m49j588j700m9K795J896
2045B716j841j704N97J34N10P37q79p50J43j1P34J503k224k014L160P98l170Q73
2063f88J367k651O66M295j997l168K001n49j359M582N31n675J039L768l132N62
2079d08M713m436m292N847J311n020L302K105o116J047N537m602k484O374k336
2094E42m700O238N00p167L637N293o699o5O375m857l289Q028q43o865N218J814
2110C160p571L510O570o759k351P470l967m762P558p9p630M938M085p702J373
2125b157P158o224l182P840k710n874O850K066p418L211M744o984K5P156m443
2140E8l621O841j440n933N911K283p442J819N543n540j472O362k700m179N285
$$ plain form
2155 1775 1984 -3524 7 2302 -2745 -1007 3199 -1392 -2664 2795 714 -2802 1402 1954 -2639
2170 -2639 -148 2705 -497 -499 2119 -910 -1735 1937 662 -1466 1113 697 -2123 364 2131 -1219
2186 -1219 -1317 1039 -514 -912 738 46 -852 675 327 -1162 263 588 -994 548 1236 -713 -458
2203 -458 1215 -58 -348 1050 64 -597 452 29 -364 1298 688 -1531 -411 486 -932 -8 1396
2220 1396 -916 -1545 774 173 -1062 705 170 -1426 891 1002 -1352 267 1824 -643 -788 1535
2236 1535 -219 -1127 1671 996 -1558 632 1148 -1478 -266 1601 -863 -1072 1357 -627 -1827 1340
2252 1340 766 -1911 50 656 -1655 -175 2088 -762 -1315 1452 -14 -1187 1403 1079 -1515 469
2268 469 1588 -897 -212 1609 -506 -992 1531 172 -1483 637 636 -1232 213 1101 -1307 -1062 924
$$ packed form
2155A775K09n508L531K295n047J738M206m591j272N459k081l516M204N52m593
2170b639K491K853l202kK618l029q25L672j275k128K579m16k820K487J767l350
2186a219r8K356j553l98J650o92q98J527l48j489J425L25j582J542O88j949K55
2203d58J673j273k90J398r86o61J049m23l93J662o10k219J120Q97j418R24J404
2220A396k312o29K319o01j235J767n35j596K317J11k354J619J557k467j45K323
2236A535j754r08K798o75k554K190N16k626J212J867k464k09K429j984j200L167
2252A340n74k677J961O06k311J480K263k850n53K767j466j173K590l24k594J984
2268D69J119k485O85J821k115m86K523j359j655K120jj868J445Q88k408K45J986
$$ plain form
2285 924 -376 -994 834 15 -1644 328 942 -704 164 1025 -644 -277 1464 176 -478 738 281
2302 281 -841 642 834 -502 -287 732 -446 -597 667 -322 -1009 183 301 -962 -341 204 -527
2319 -527 -111 296 -349 -508 398 6 -202 427 586 -161 241 702 -134 10 692 71 -127 221 255 23
2339 23 47 -321 -377 114 82 -441 -353 159 -160 -291 -16 -50 -642 -103 268 157 -45 -51 275 496 85 -279 338
2362 338 707 197 -115 490 291 9 -169 335 -120 -387 -141 105 53 -430 -296 115 124 -663 -504 484 282
2383 282 -427 -118 386 -5 -142 19 229 52 117 149 567 619 -304 -8 645 113 -787 -221 620 -26 -547
2404 -547 146 294 -425 -432 -272 -224 -87 -378 -240 581 12 -851 283 927 -432 -814 730 514 -404 425
2424 425 625 -66 231 130 -426 326 666 -637 -165 1189 -390 -1368 716 579 -1382 -275 1069 -473
$$ packed form
2285I24j300o18J828q19j659J972O14j646Q68Q61j669L67J741j288o54J216m57
2302B81j122J483J92j336K15J019j178j51J264r89o87J192J18j263O21N45p31
2319e27M16M07o45j59R06l92k08O29J59p47M02M61q36J44O82o21j98L48L4k32
2339B3K4l68n6M91l2n23Q8N12l19j31K75l4n92N39L71j11k02oL26K21m11l64O17
2362C38L69n10l12O05j99k82j78N04m55k67K46K46n2m83J34M11Rp87J59R88k02
2383B82p09L09N04l91j37J61K10j77O5L2M18N2r23K96O53n32r00N66Q41o46n21
2404e47O93J48p19pJ60M8J37k91J38Q21n69q63J134O44j359l82J544k16r18Q29
2424D25K00o91K97j01n56P52L40j303M72J354j579r78K084j37j961J107J344j542
$$ plain form
2442 -473 -839 621 -30 -707 631 -333 -1104 550 561 -966 797 1710 -1254 -760 1813 288 -1306
2459 -1306 947 809 -1262 295 1202 -1102 -243 1124 -1123 -821 1461 -498 -1894 1185 815 -1918
2475 -1918 -167 1080 -1762 -1018 2128 75 -1482 1019 66 -1392 1267 1526 -1411 -119 1231 -887
2491 -887 -172 2317 -70 -1874 698 565 -1201 850 856 -1872 -513 1484 -638 -1217 859 -362 -1306
2508 -1306 1100 724 -1443 -173 949 -247 342 896 -811 -821 1395 609 86 717 -73 -1357 18
2525 18 1268 424 -123 -615 -687 101 411 -52 222 -335 -1259 -274 1247 -165 -729 274 -35 -399 599
2544 599 -335 -847 1335 762 -886 886 1135 -1952 -107 2751 -262 -1779 1324 13 -2200 1400
2560 1400 2124 -1718 -399 937 -2339 -273 3277 -1319 -2894 2522 439 -3491 2066 2724 -3678
$$ packed form
2442d73l66J460o51o77J338r64p71J654J1j527J763R13k964M94K573j525j594
2459a306K253j38k071J557R07k304Q59J367k247L02K282j959j396L079l70k733
2475a918J751J247k842P44L146k053j557K501r53j458K659K59k937J292J350k118
2491h87P15K489k387j804K572j33j766K051Ok728J359J997k122n79K076j221r44
2508a306K406l76k167J270J122j196N89N54j707j0K216p86n23O31p90j284J375
2525A8J250q44n47m92p2P88L10m63K74n57r24R85J521j412n64J003l09l64R98
2544E99r34n12K182n73j648J772K49l087J845K858l013j517L103j311k213L600
2560A400P24l842J319J336l276K066L550m596j575N416k083l930N557O58o402
$$ plain form
2575 -3678 -808 4002 -1495 -2119 3359 -51 -2455 2950 1144 -4141 1521 3428 -3548 -396 4919
2590 4919 -2758 -4181 4255 1208 -4411 2111 2540 -4771 -492 4113 -2394 -1683 3733 -2061 -3675
2605 -3675 4442 1331 -5099 2044 3687 -4562 -594 5701 -2255 -3677 4440 823 -3863 2670 2102
2620 2102 -4274 1081 3942 -3422 -1324 4005 -2371 -3565 4532 1041 -5234 1621 2997 -3688 -123
2635 -123 4031 -2463 -2403 3300 231 -2108 2883 641 -3837 1647 3280 -2736 -544 3044 -1636 -2156
2651 -2156 3220 792 -3059 754 1164 -1917 444 1675 -1883 -938 1770 -522 -1321 1324 -253 -1867
2667 -1867 1074 1426 -1235 -195 1202 -411 -159 1055 -197 -745 569 122 -77 894 -11 -653 199
2684 199 -43 -298 505 57 -658 158 -14 -593 530 215 -1105 -137 828 -789 -387 1487 -405 -1027
$$ packed form
2575c678K870M810n497o24N478l410k404N405j806n285N662J907o976L152N315
2590D919p677j423Q436l047n619O522M29p311M279M605o507P11N416n794j614
2605c675Q117l111o430P143J643q249L968O295p956j422Q117l617m686O533n68
2620B102o376N355K861p364K098N329o376j194Q097l491o275O855J376o685L565
2635a23M154o494O0N703l069k339M991k242m478N484J633o016K192L588m680n20
2651b156N376k428l851L813M10l081K361J231l558R45K708k292p99K645j577j614
2667a867K941L52k661J040J397j613K52J214j252n48J314m47j99R71r05o42Q52
2684A99k42k55Q03m48p15Q16j72n79J123l15j320R68R65j617M02J874j892o22
$$ plain form
2702 -1027 1189 -41 -1400 1373 1617 -1836 75 1917 -1106 -472 1988 -689 -1957 1410 943 -1794
2718 -1794 919 1119 -2418 -101 2188 -1509 -1702 2255 -363 -2375 1851 1110 -2897 54 2331 -1398
2734 -1398 -419 2363 -1260 -1668 2564 817 -2028 1343 876 -2851 638 3212 -1524 -1804 2020 -759
2750 -759 -2215 1972 669 -2771 190 1423 -1477 96 1816 -1724 -1439 2260 -53 -2046 1559
2765 1559 1223 -2111 797 2130 -1336 -1303 1512 -77 -645 1509 142 -1649 549 1076 -1200 259
2781 259 981 -1499 -1062 1943 198 -1446 426 247 -1324 3 1025 -641 -489 755 -103 -217 831
2798 831 -212 -633 799 471 -584 363 654 -483 -261 996 108 -877 28 114 -338 225 72 -491 -14
2817 -14 -15 -642 62 327 -521 -566 396 106 -111 93 119 -146 144 -3 128 522 336 -86 142 318 -195 -54
$$ packed form
2702a027K216j230j359K773K44l453J911J842l023O34K460k677j268L367m67k737
2718a794K713K00l537K317K289l697j93L957k618k012M226p41m007K951K277l729
2734a398R79K782l623m08M232j747k845L371m67l727L489K574m736k80L824k779
2750g59j456M187j303l440K961J233k900J573J720l540K85L699k313j993L605
2765A559l36l334K908J333l466L3K815j589n68K154j367j791K198N27k276J459
2781B59P22k480M37L005j745j644J872j79j571J327J022j666J52J244q58j14J048
2798H31j043m21J432l28j055R47K91j137K22J257q88r85R05Q6m52N63j53n63M77
2817a4jo27P04K65q48m5R62k90k17K04K6k65K90j47J31L94j86m22K28J76n13J41
$$ plain form
2839 -54 242 108 -191 207 26 -330 -149 -148 -203 -67 -130 -339 -42 125 -245 -82 173 -32 -119 166 331 -117
2861 -117 325 250 -24 67 216 -45 -30 457 70 -309 188 9 0 41 56 -288 -159 54 -155 -234 21 -132 -484
2884 -484 -24 21 -372 39 310 -293 -25 339 89 -36 515 179 -106 178 355 -156 157 310 -40 11 324
2905 324 -284 -210 244 72 -480 76 164 -591 -6 114 -386 -173 311 -169 -146 374 201 -399 185 344 -212
2926 -212 103 725 -134 -76 654 73 -279 453 218 -522 103 401 -234 -62 455 -363 -373 327 -296 -681 316
2947 316 335 -581 96 713 -324 -283 553 -43 -294 516 312 -360 448 485 -335 177 349 -446 -67 581 -176
2968 -176 -680 271 94 -594 -62 145 -114 -261 -51 -98 106 213 -222 -31 157 -338 -36 457 207 -73
2988 -73 151 515 116 178 -139 43 582 77 -573 467 287 -665 -137 721 -537 -852 416 -9 -574 692
$$ packed form
2839e4K96j34k99L98j81l56J81Jn5J36o3k09K97J67l70J63K55k05q7K85J65m48
2861a17M42p5k74R1J49k61J5M87l87l79M97j79rM1J5l44J29K13k09p9K55j53l52
2884d84M60M5l93M11K71o03K68L64k50j25N51l36k85K84J77n11L13J53l50N1L13
2905C24o08P4M54j72n52N56Q8p55N85J20n00K13M84m80K3N20j73o00N84J59n56
2926b12L15O22q59N8P30n81l52P32k35p40O25K98o35J72N17q18j0P00o23l85R97
2947C16J9r16O77O17j037M1Q36n96k51Q10k04o72Q08L7q20N12J72p95L79O48p57
2968a76n04R51j77o88N32K07k59j47K10m7K04J07m35J91J88m95L02M93k50k80
2988g3K24L64l99O2l17J82N39n05o50J040j80r52N28Q58j258l15J268m25n65J266
$$ plain form
3008 692 308 -942 -57 247 -664 315 1330 -1043 -1032 1377 288 -1277 1007 837 -1535 59 1593
3025 1593 -1006 -373 1658 -596 -1022 1298 -244 -2145 1037 1262 -1955 83 1966 -1879 -1606 2383
3041 2383 173 -1758 1415 261 -2360 1158 2414 -1703 -677 1897 -1505 -1103 2997 244 -2613
3056 -2613 1431 1418 -2282 414 2255 -2273 -1323 2845 -477 -2004 1897 74 -2708 1423 2021 -2514
3072 -2514 -733 2078 -1410 -823 3222 -547 -3167 1201 1301 -1674 1436 2086 -2658 -819 2591 -400
3088 -400 -1344 1650 -330 -2070 1728 1487 -2055 -441 1214 -1344 -167 1992 -1274 -2163 1379 803
3104 803 -915 1176 495 -2429 -291 2004 -27 -309 726 -1084 -609 1794 536 -1051 243 -146
3120 -146 -1105 1088 1280 -1083 -651 803 -88 -318 226 -868 -701 789 130 -340 527 -813 -1678 1056
$$ packed form
3008F92l84j250Q85L04r11R79J015k373J1K409j089j565K284j70k372J594J534
3025A593k599O33K031k254m26K320j542j901L182K25l217K038J883l845K73L989
3041B383k210j931L173j154k621L518J256m117J026K574l402M02M100k753k857
3056b613M044j3l700K696J841m528R50M168l322j527L901j823k782M131N98m535
3072b514J781K811l488N87M045l769k620M368J00k975L110O50m744J839L410k991
3088d00r44K994j980j740L798k41l542J614J655k558J177K159l266q89L542n76
3104H03j718K091o81k924K138K295k031k82J035j810M75K403j258j587J294l89
3120a46r59K193J92k363M32J454q91k30N44j094J67J490o59m70Q67j340q65K734
$$ plain form
3138 1056 1304 -788 74 487 -997 -113 1519 -222 -608 686 -627 -834 1691 561 -1444 936
3154 936 1130 -2055 -477 1913 -700 -1143 1629 -126 -1883 1034 691 -1543 1165 860 -2371 -257
3170 -257 2134 -1195 -999 2492 12 -2550 1287 1435 -1894 459 2227 -1077 -928 1361 -1247 -993
3186 -993 2544 201 -2246 824 694 -2333 870 2714 -2115 -1875 1553 -300 -1229 1793 527 -2092
3202 -2092 593 1026 -1386 369 1777 -1413 -695 2359 -270 -1737 1381 903 -1572 833 1550 -1794
3218 -1794 -1160 1329 109 -40 1051 -1222 -1982 1256 1158 -854 372 172 -1892 -238 2002 -195
3234 -195 -1025 437 -78 -956 989 857 -823 240 392 -764 352 986 -584 -497 1195 -109 -864
3251 -864 279 -71 -768 709 817 -654 -626 103 -563 305 1134 -639 -1035 373 249 -240 1005 283
$$ packed form
3138A056K48k092Q62M13j484Q84J632j741l86J294j313k07K525j130k005K380
3154I36J94l185J578K390k613m43K772j755j757K917l43k234K708l05l231K114
3170b57K391l329J96L491k480k562L837J48l329K353J768l304J49K289k608K54
3186i93L537k343k447L070j30l027L203J844m829K40L428j853r29L022j266k619
3202b092K685M33k412J755J408l190P18L054k629j467L118m78k475K405P17l344
3218a794O34K489j220j49J091k273p60L238r8k012J226k00k064J654K240k197
3234a95q30J462n15q78J945j32j680J063J52j156J116O34j570Q7J692j304p55
3251h64J143l50o97J477J08j471K8P29o66Q68Q29j773l96J408j24m89J245p22
$$ plain form
3269 283 -1117 4 674 -92 388 792 -567 -481 663 -87 -382 597 273 -586 158 337 -832 -150 594
3288 594 -299 -215 502 -319 -688 745 336 -288 168 299 -574 -287 709 106 -25 403 -251 -277 736 463
3308 463 -693 401 388 -565 -30 812 -216 -584 422 45 -661 60 -61 -48 222 -21 -517 -128 492
3327 492 -283 -262 540 -1 -479 310 283 -329 36 435 39 -75 73 -167 390 343 -271 -268 370 -26 -474 -63
3349 -63 67 -357 -151 75 -56 -402 97 231 -84 -92 -60 132 326 166 -549 104 575 36 -79 335 153
3370 153 -169 182 75 -54 -239 -57 95 54 -79 -405 19 172 -283 -338 179 10 -181 -135 99 -45 85
3391 85 -120 78 -24 -105 210 270 146 -132 -108 541 266 -210 -157 283 -61 -305 123 124 23 -116 -117 -436 -39
3414 -39 59 -180 61 122 -382 3 354 56 -243 351 178 39 191 224 -242 282 213 -152 116 271 -39 -210
$$ packed form
3269B83j400J121O70p66M80M04j359Q6J144p50k95R79l24q59P44J79j169O82P44
3288E94q93Q4P17q21l69J433m09o24M56J31q73K87R96o03j31M28o54k6J013k73
3308D63j156J094j3r53N35Q42j028l68J006l77p06P21j21J3K70k43m96L89O20
3327D92p75K1Q02n41m78P89k7o12L65L99l96j14J48k40N57m7o14LO38l96m48M11
3349f3J30m24K06K26j31l46M99J34l15qL2J92J94j60p15O53M71n39j15M14j82
3370A53l22L51j07j29j85J82J52m1j33l26M24J53m55n5N17j69j91M6K34j44J30
3391H5k05J98j02q1L15O0j24k78K4O49k75m76N3M40l44k44M28Jj01j39jl19L97
3414c9R8k39K41O1n04L85L51k98k99N94j73j39J52L3m66N24o9l65K68J55l10j71
$$ plain form
3436 -210 312 -35 -307 302 147 -558 -127 252 -141 -12 137 -330 -282 207 -59 -484 273 171 -174 -85 533
3457 533 -323 -71 548 -52 -266 439 333 -375 298 404 -428 -51 534 -307 -35 450 -217 -459 239 340
3477 340 -265 71 235 -802 -113 399 -247 -448 275 -105 -352 513 113 -353 91 309 -318 22 536 -34
3497 -34 -305 117 50 -84 441 71 -557 -84 240 -181 -106 -46 -445 -74 233 -62 -134 79 93 -104 422 -97
3519 -97 -246 149 257 -164 220 431 -481 -86 362 -134 265 641 -470 -665 531 203 -453 240 3 -923
3539 -923 366 963 -626 -490 359 -396 -246 1236 -13 -1340 380 849 -640 506 933 -1269 -523
3556 -523 1444 93 -769 1075 -89 -1449 804 1227 -1270 -416 887 -1174 -704 1739 -228 -1751
3572 -1751 649 776 -1193 353 833 -1757 -387 1907 -289 -1149 1221 -226 -1685 1471 1381 -1725
$$ packed form
3436b10N22l47k72O09j55p05M31L79l93J29J49m67M8M89k66m25P57j02l45Q9O18
3457E33q56K52O19o00k14P05j06p08O73J06q32L77N85q41K72M85o67k42O98J01
3477C40o05L36J64j037O89N12o46k01P23l80k47Q65m00m66M44K18o27L40N14n70
3497c4k71M22o7j34N25l70o28M73L24m21P5O0l99L71L07k95p2K13J4j97N26n19
3519i7j49L95J08m21L84K11r12L95M48m96L99L76j111j95J196l28o56O93k37r26
3539i23J289N97j589J36Q49p55J50J482j249j327J720M69j489J146M27k202P46
3556e23J967j351q62J844j164j360K253M23k497Q54J303k061M70K443j967j523
3572a751K400J27j969J546M80k590J370K294k196q60K370j447j459L156r0l106
$$ plain form
3588 -1725 -235 1362 -1048 -476 1949 -245 -1618 1091 411 -1469 922 1279 -1721 -501 1555 -943
3604 -943 -1070 1326 74 -1530 1047 654 -1512 24 1335 -834 -366 1201 -753 -1234 1410 588
3620 588 -867 661 624 -1441 -135 1294 -312 -388 913 -448 -1228 530 551 -511 398 320 -1393 -453
3638 -453 800 107 177 748 -402 -1049 256 676 287 394 75 -526 -335 315 -30 406 464 -337 -86 -181
3658 -181 -318 56 532 -109 62 -124 -783 -552 648 440 -156 268 -383 -1423 -54 1018 120 145 302
3677 302 -1218 -840 1491 655 -571 493 0 -1529 354 1297 -431 -470 928 -567 -1184 693 80
3694 80 -934 1045 775 -1714 -385 916 -877 -341 1679 -200 -1634 586 492 -785 1158 1415 -1674
3711 -1674 -804 1287 -359 -30 1762 83 -2035 636 964 -1146 490 1354 -1294 -1089 1224 -419
$$ packed form
3588a725J490J597k410N72K425k194j373K709o80j880K391L57l000J220K056k498
3604i43j27K396j252j604K577l93k166J536J311k169M68J567j954m81K644q22
3620E88j455J528l7k065J306J429j606p6J301j361p80J758K1j062R09p8j713R40
3638d53J253o93P0N71j150o47J305M20l89J07l19o01J91O50l45M36N8q01K51r5
3658a81j37L74M76o41J71j86o59K31J200k08n96M24o51j040J369J072q98K5J57
3677C02j520L78K331q36j226J064m93j529J883R43j728l9J398j495o17J877o13
3694H0j014J979k70k489J329J301j793N36K020j879j434K220r4j277J943K57l089
3711a674Q70K091j646L29J792j679k118K671L28k110J636Q64k648K05K313j643
$$ plain form
3727 -419 -952 1078 457 -1373 294 445 -1298 231 1551 -666 -725 928 -321 -1116 1051 1209 -962
3744 -962 -208 727 -882 -143 1240 152 -919 328 -196 -721 905 741 -845 -241 609 -833 -648
3761 -648 829 214 -690 319 48 -875 47 468 -203 96 280 -430 -172 598 116 -72 411 -9 -521
3780 -521 -43 661 15 54 80 -118 -244 -20 111 183 113 -362 -448 159 11 -109 145 262 -173 -79 2 153
3802 153 172 140 -9 42 89 -215 5 380 161 -263 163 207 -253 103 236 -271 -213 114 -290 -169 238 -131
3824 -131 -240 60 -55 -380 100 172 -218 92 206 -61 -192 284 -26 -157 243 231 -117 262 292 -33 110
3845 110 353 -285 -527 241 158 -303 209 34 -260 -68 102 -162 -232 153 -116 -233 164 129 -208 -85 135
3866 135 -55 -36 270 39 -9 149 149 39 107 219 -142 39 173 -146 33 232 -161 -137 170 69 -231 -83
$$ packed form
3727d19n33K030o21j830J667J51j743J529J320k217n9J653j249p95K167J58k171
3744i62P54R35j609P39J383j088j071J247n24n25J626j64j586O04Q50j442J85
3761f48J477o15r04J009k71r23R22M21o71K99J84p10K58P70m82j88M83m20n12
3780e21M78P04o46L9K6j98j26K24J31P2p0m75q6O07j48j20K54J17m35R4Q1J51
3802A53J9l2j49N1M7l04K20L75k19m24M26M4m60L56J33n07N8L27m04J21M07l69
3824a31j09L00j15l25M80P2l90L10J14k67j31M76l10j31M00j2l48L79L0l25J43
3845A10K43o38k42P68q3m61N12j75k94J92J70k64p0L85k69j17L97l5l37J23K20
3866A35j90J9L06k31m8J58%j10O8J12l61J81J34l19J79J99l93K4L07j01l00J48
$$ plain form
3888 -83 -146 -96 8 96 -174 -14 146 221 -179 143 284 -49 57 116 44 11 209 44 69 47 106 -134 208 -133
3912 -133 -9 147 26 -71 -225 57 64 -48 -200 -47 -148 63 -174 -45 53 -124 2 225 130 -218 92 211
3934 211 69 -111 82 -13 -7 -67 65 85 -208 -131 -13 58 27 -173 -76 -63 -194 -195 132 22 -119 9 -88 65
3958 65 210 77 8 177 65 -39 20 191 -72 -6 232 -65 -112 66 90 -218 -57 193 -144 42 10 -345
3980 -345 -235 240 78 -403 36 114 -127 15 186 -239 -177 206 -26 -96 407 135 -396 246 146 -150 165
4001 165 445 -330 -223 421 -134 -541 413 229 -572 53 392 -294 -101 477 -325 -290 370 -5 -546 406
4021 406 423 -393 1 511 -210 2 557 161 -376 113 66 -298 309 316 -567 -97 188 -68 -202 438 0
4042 0 -510 218 181 -332 106 77 -234 -133 369 -65 -300 468 42 -111 441 215 -335 64 393 110 53 92
$$ packed form
3888h3o3N0J04Q8k70J60J60P5m00L22J41l33J06N9p2l3J98j65K5k2N9k40L42l41
3912a33J24J56j21r7j54K82Pj12j52J53j01K11k37J29R8j77J26K23r5l48L10J19
3934B11j42j80J93r5Oo0J32K0k93P7J18P1l1k00R7J3j31jL27j10j41J28r7J53
3958F5J45j33o9J69j12j04N9J71k63O6K38k97m7J78K4l08J61K50l37J86l2l55
3980c45J10M75j62m81M39P8k41J42J71m25O2L83k32p0N03k72n31O42j00k96L15
4001A65K80p75J07O44n55m07R54j84q01O25L39o86J93N78q02L5O60l75n41R52
4021D06J7q16L94N10p21K12N55l96n37M89m7l64O07Pq83M70K85k56j34O40m38
4042@n10P28l7n13M38k9l11J01N02m34k35P68m26j53N52k26n50L99L29k83n7L9
$$ plain form
4064 92 -166 -201 94 212 101 130 -171 -104 10 57 -128 -125 -60 -397 -160 4 114 171 153 -187 -44 168 -7
4087 -7 79 373 -53 -242 183 -130 -91 371 283 -350 -168 200 -323 -148 477 -217 -430 175 53 -517 235 328
4109 328 -362 -235 246 -374 -226 727 123 -449 279 144 -604 458 805 -157 -241 521 -517 -522 692 322
4129 322 -537 80 42 -808 -157 772 -276 -391 379 -409 -693 380 602 -584 132 231 -801 -263 849
4148 849 158 -173 760 -183 -890 276 623 -385 444 605 -552 -479 602 114 -10 459 34 -895 62
4167 62 545 -313 96 493 -572 -690 367 57 -204 524 82 -591 24 329 -158 67 455 39 -307 70
4187 70 159 -145 571 398 -432 -367 114 -189 38 210 -95 -411 -25 -160 6 364 112 -171 -143 -285 -254 18
4209 18 552 50 24 -82 -105 117 242 284 108 343 -202 -189 112 199 167 116 -89 -648 -161 303 55 139 183
$$ packed form
4064I2k58l5K95J18j11K9l01O7J14M7j85LO5l37K37J64J10N7j8l40J43K12j75
4087gQ6K94m26j89M25l13L9M62q8o33J82L68n23J75O25o94k13O05j22n70P52R3
4109C28o90J27M81o20J48R53o04n72P28j35p48J062L47r62q4P62j038nJ214l70
4129C22q59O17l8q50O51R29j048j15P70p88k84J073K22j186P16R9j032N38J112
4148H49o91l31R33r43p07J166L47j008Q29J61j157P3J081m88j24M69m25r29R57
4167F2M83q58M09L97j065j18J057l10k61P28m42o73O15L05m87K25L88m16l46L77
4187G0Q9l04P16j73q30O5M81l03K27J72l05l16L86j35J66L58k52k83K8j42L1K72
4209A8N34n02k6j06k3K22J25M2j76K35n45J3L01Q7l2n1k05n59M87M64k48Q4M4
$$ plain form
4232 183 -402 -366 212 141 -152 269 29 -276 -155 124 -63 99 414 -105 -168 174 -32 -141 317 310 -390 -110
4254 -110 284 -317 -77 549 -63 -390 175 -208 -381 332 249 -375 -87 142 -261 -71 387 38 -300 67
4274 67 281 -82 299 451 -237 -88 326 -53 -127 383 87 -266 87 347 -240 -133 122 -220 -197 31 -209
4295 -209 -238 -82 185 -296 -63 101 -170 -5 144 -25 127 187 -61 38 278 258 -2 235 98 -67 106
4316 106 219 -114 -14 40 41 -175 -82 49 -156 131 35 -251 -175 -173 136 -82 -11 -67 38 49 143 -108 206 -28
4340 -28 -123 -92 95 143 2 75 64 -135 -45 66 56 54 -76 12 18 82 8 -106 -50 -124 147 40 -95 -83 142 -135
4366 -135 -95 -127 77 178 81 -2 -41 142 105 0 -99 165 92 -42 47 89 -7 -46 8 -91 80 -116 -64 -177 -8
4391 -8 -77 -30 24 65 -18 15 179 -83 -59 188 30 107 107 92 -31 -178 -97 -103 -74 38 -104 20 79 44 -209 -23
$$ packed form
4232A83n85L6N78p1k93M21k40l05J21K79j87J62L15n19o3L42k06j09M58pp00K80
4254a10L94o01K40O26o12l27N65l83j73P13q3o24K88K29m03J90M58l49l38L67
4274F7K14l63L81J52o88J49M14l79p4N10k96l53L53K60n87J07K55l42K3K28k40
4295b09k9J56K67m81K33J64k71J65J49j69J52O0k48R9K40k0k60K37j37j65J73
4316A06J13l33J00N4Jk16R3J31k05K87r6k86P6KL09k18P1n6J05J1R4k51L14k34
4340b8r5L1J87M8j41P3j1j99R0J11j0kj30Q8OO4p4j14N6p4K71j07j35J2K25k77
4366a35M0l2K04J01r7q3l9J83l7j05r9K64p3j34Q9M2r6l9N4r9J71j96N2j13J69
4391ho9M7N4M1q3L3J64k62K4K47j58P7%j5j23j47Q1oK9J12j42J24N9l5k53J86
$$ plain form
4417 -23 67 -170 -66 -26 -159 -193 -168 -48 112 13 -118 126 -60 129 -25 59 85 74 0 73 -107 -62 -3 31 163
4442 163 74 -51 -207 110 -64 -162 51 -166 167 -57 80 -12 35 120 -154 -68 -62 -23 -52 75 -72 26 95 -110
4466 -110 -49 -4 -15 21 -18 155 -3 -87 60 36 -78 -246 24 262 7 -23 -164 -137 -70 -56 -33 -72 -25 17 -142
4491 -142 -32 111 -36 164 49 51 35 103 144 69 61 -36 -50 -41 -100 -2 -36 -70 19 47 -149 -96 13 -138 -139 15 -167
4518 -167 -106 162 75 97 -22 4 71 145 -22 68 55 343 -81 -82 206 131 57 79 -59 -62 19 110 49 -212 -191 -208 -181
4545 -181 -16 -120 -77 126 45 -241 27 209 -60 8 102 -17 -86 -57 31 -27 52 137 -263 -22 199 -39 -88 261
4569 261 -3 -225 -42 -59 -176 -49 37 -43 -136 -19 -96 -227 123 -48 -178 58 -47 -254 35 231 -77 -198
4591 -198 30 -59 26 199 65 38 -61 -50 48 117 120 -129 -127 -57 -108 -136 82 45 -186 -13 -54 36 55 51 77 -83 -82 -49
$$ packed form
4417b3R0k37J04M0j33l4K5J20J60r9j31K44j86J89j54Q4K6j1p4P3j80M5N9L4J32
4442A63q9j25j56L17j74r8K13k17L33k24J37r2M7Q5k74Q6OL9k9J27j47R8O9k05
4466a10O1M5j1L6l9J73j58q4J47k4j14j68K70K38k55l0j41K7O7J4K3l9M7M2j59
4491a42J10J43j47K00j15Kj6O8M1p5qr7j4Rn9R8l4l4Q9K8j96N3J09j51jJ54j82
4518a67O1K68q7K2j19K6O7P4j67R0j3K88m24jK88p5p4K2j38lQ1R1o1k61K1j7K7
4545a81J65j04M3K03q1k86K68J82k69O8R4j19o9K9Q8n8P9Q5m00K41K21k38m9L49
4569B61k64k22J83j7j17J27Q6q0r3J17p7j31L50j71j30K36j05k07K89J96l08j21
4591a98K28q9Q5J73j34k7r9J1R8O9Lk49KP0n1k8K18l7k31J73m1R0J9mK6j60JL3
$$ plain form
4619 -49 -55 -34 150 99 -13 -138 -113 -17 152 71 124 -113 -206 -6 50 257 184 48 -196 -155 67 4 -54 55 20
4644 20 -155 -77 -40 -253 117 83 -143 -107 -3 7 79 275 194 -147 85 40 -60 125 179 -171 -97 60 -257 -165
4668 -165 336 92 -159 -6 -2 -190 -112 250 -211 -118 -76 -317 -232 216 140 -64 26 141 -261 107 271 -11 -147
4691 -147 164 102 -132 172 189 -80 111 136 -344 -208 278 -214 -278 148 -147 -424 95 66 -172 183 121 -403
4713 -403 -143 332 73 158 307 71 -231 84 128 91 45 161 -142 -21 131 -7 -96 142 -59 -56 -135 135 -197
4736 -197 -47 193 -186 -172 136 -13 40 360 41 -334 -14 89 -118 175 194 -119 2 144 4 -17 260
4757 260 -8 -155 82 57 -32 38 131 -122 -89 -114 -168 -87 -22 -160 101 151 -152 -221 -73 234 31 62 140 -85
4781 -85 56 163 85 -54 127 -197 -167 207 68 -90 35 -132 -250 -13 94 -96 30 226 -153 -219 -115
$$ packed form
4619d9oK1J84n1j12j25K5R6J69q1N3k37r3K00N6K07p3j36k44M1K22o3n8J09l5
4644B0j75P8L7k13L70l4k26L6J04J0P2J96q1l41K32m5j00J85N4l50P4J57l17R2
4668a65N01k44k51J53Mj88P8L62m61R3M2k41Q5M48p6k04R0J15m02L68J64k82j36
4691a47L11o2k34L04J7k69J91K5m80J36M86m92o4M26k95k77N19k9k38L55o2n24
4713d03K60M75k59Q5J49k36l02L15M4l7m6J16l03J21J52j38q9K38k01Lp9K70l32
4736a97J50K40l79J4L08j49N3L20l19l75L20J03k07K93J9l13J21J42j40k1K77
4757B60k68j47K37k5q9P0R3k53L3k5n4Q1O5j38K61N0l03o9J48L07k03L1P8k25
4781h5J41J07p8j39J81l24L0L74j39j58J25j67j18K37J07j90J26J96l79o6J04
$$ plain form
4802 -115 -56 -10 -17 33 33 81 -34 36 -58 136 66 -2 -42 2 98 121 154 -14 50 61 -158 -17 93 18 -75 103 12
4829 12 -198 34 8 -164 -32 54 -54 -13 144 -121 -10 121 67 -111 25 25 -87 62 156 -54 -22 72 25 -104
4853 -104 39 -38 -180 45 98 -117 -42 99 0 27 112 -101 -43 148 -121 66 126 59 8 25 98 -33 -146 111
4877 111 60 -35 78 -58 35 -41 -71 18 -44 9 -111 152 62 -81 -98 -4 -116 38 185 -67 -132 17 -14 47 180
4902 180 -4 -92 118 78 29 -30 222 9 89 -41 -158 27 -34 -8 -140 44 144 -13 156 100 -52 -56 -41 -53
4926 -53 4 -93 61 -104 60 70 9 -86 -62 84 56 30 4 -59 115 128 34 92 132 -19 -43 -10 -27 32 -99 -182 -237
4953 -237 204 83 -192 -27 -116 -242 42 13 168 -34 84 85 33 97 57 115 110 -86 -96 103 2 136 -58 181
4977 181 74 40 -85 52 -95 11 43 -40 -14 89 -42 67 -138 -99 -265 83 -12 -7 67 13 122 -57 262
$$ packed form
4802a15N9M6pN0%M8j15P0r4J94p0o8m0M4R6K3L3j68O4J1k19J41J10p5r3J78r1
4829A2k10K32k6j72J32Q6j08M1J57k65J11J31n4j78J36%j12J49R4k10L2R4m7j29
4853a04J43p7j42K25N3k15P5J41r9K7Q5k13N8J91k69J87O0o7n1J7P3j31j13K57
4877A11n1r5J13j36R3p6l0Q9o2N3j20K63r0j43j7R4j12J54J47k52o5J49l1O1J33
4902A80j84q8K10m0m9n9K52k13Q0j30j17J85o1K6j32J84J00j57J69n6j52mJ5j2
4926e3N7r7J54j65J64J0o1r5K4J46k8k6k6o3J74J3r4N8M0j51k4L3j7N9j31q3n5
4953b37M41j21k75J65q9j26K84k9J55k02J18Jn2O4m0N8nj96j0J99j01J34j94K39
4977A81j07l4j25J37j47J06L2q3K6J03j31J09k05L9j66L48r5NP4n4J09j79L19
$$ plain form
5000 262 -2 23 -5 27 23 -29 -9 -28 38 106 -147 -138 -94 -82 -85 -62 17 -241 108 72 -318 -98 110 11 -59 71 2
5027 2 -130 105 136 -144 -149 152 -138 44 193 -69 -208 -29 -69 -10 100 -89 -215 52 174 -103 -126 93 -151
5050 -151 -244 -71 -60 -49 262 198 -199 119 167 -349 -105 538 -28 -184 290 -55 -163 234 275 -124 5 104
5072 104 -203 -54 365 -10 -397 87 -66 -222 67 377 -368 -102 215 -286 -62 7 -89 -285 158 -170 -334
5093 -334 203 174 -129 214 187 -212 -289 397 191 -12 156 -52 -283 -108 60 51 329 206 -485 -273 92 -192
5115 -192 -36 383 71 -292 -82 199 -45 179 168 -118 -165 9 -202 85 416 -47 -214 114 -28 -124 285
5136 285 480 -53 -200 -144 -254 64 257 12 -148 -116 -424 -251 190 302 -273 31 -216 -451 -85 356 121
5157 121 131 -69 -243 -302 344 447 -45 38 71 -475 11 463 49 -130 308 -346 -563 206 202 -339 269 203
$$ packed form
5000B62k64K5k8L2mn2K0j9O6O8k53RM4J2lK3P9k58L49l6l90K20K08r9p0J30o9
5027Bj32K35L1k80nL01k90J82J49k62j39J79m0N9J10j89j26K67J22k77k3K19k44
5050a51r3J73J1J1L11o4l97L18M8n16K44O43n66j56M74l45j08L97M1l99J29R9
5072A04l07J49M19l75l87M84j53j56K89L10p45K66L17n01K24O9r6j96M43l28j64
5093c34N37k9l03L43k7l99p7O86k06k03J68k08k31J75J68rK78j23o91K12L65k84
5115a92J56M19l12l63K10K81k44K24j1k86m7J74k11K87L31m63j67L28j42r6M09
5136B85J95n33j47N6j10L18J93k45j60L2l08J73M41J12n75L04k47k35L66M41k35
5157A21J0k00j74n9O46J03m92Q3L3n46M86M52m14j79M38o54k17P69mn41O08o6
$$ plain form
5179 203 -455 -129 57 -185 42 550 -112 -491 176 90 24 527 393 -719 -338 170 -213 121 632 -139
5199 -139 -602 144 102 -276 444 324 -496 -350 356 -86 -218 494 -71 -522 173 91 -449 139 589 -128 -75
5220 -75 425 -252 -283 539 282 -164 287 -119 -594 189 676 -129 -462 185 -450 -172 604 92 -312 91 72
5241 72 -543 184 426 -135 -50 266 -148 -230 298 208 -227 166 157 -423 -106 399 -40 -10 300 -40 -264 -5
5263 -5 206 -158 84 151 -308 -179 226 -86 4 271 -48 -362 234 83 -50 105 218 -285 167 188 -97 15
5285 15 206 166 -89 92 -88 -179 144 48 -28 -23 -73 -49 -82 230 67 -123 50 -62 -178 382 -21 -242 -30
5308 -30 -177 33 -62 127 -147 3 -95 13 208 217 -58 -71 123 -161 -351 164 114 -223 35 127 -119 -17 127
5331 127 -102 -25 116 246 -244 198 109 -202 10 269 -191 -160 154 63 -300 68 96 -258 11 212 61 -27
$$ packed form
5179B03o58L26J86k42K27N08o62l79O67q6o6N03j34j112L81N08l83L34N11p71
5199a39m63P46m2l78P20j20q20J46P06m42j32P12n65m51O95q2n40N88M50p17N3
5220g5N00o77l1Q22k57m46M51m06m75P83M87q05l33O47o35K78P76n12m04M03j9
5241G2o15P27K42n61Q5L16m14q2N28r0m35L93rn80L17N05m39L0L10l40k24K59
5263eK11l64K42O7m59J29M05l12R0K67l19l14N96j51j33J55J13n03M52K1k85J12
5285A5J91m0k55J81j80r1L23r6p6Nn0K4l3L12j63j90J73j12j16N60m03k21K12
5308c0j47K10r5J89k74J50r8J08J95Rk75j3J94k84j90N15n0l37K58R2k46J02J44
5331A27k29P7J41J30m90M42q9l11K12K59m60L1L14r1l63L68K8l54K69K01j51q8
$$ plain form
5353 -27 224 -95 -231 71 -13 -219 251 47 -103 -20 142 -51 62 116 -81 -155 87 -14 -119 83 76 -135
5375 -135 96 53 -176 -48 236 -84 -156 137 -62 -139 198 171 -260 -50 156 -78 -164 8 -173 97 -37 246
5397 246 -14 -46 -19 -178 -26 87 102 -6 5 -6 122 66 -61 -2 65 119 -198 -7 139 -39 -74 99 26 30
5421 30 68 -61 -216 165 28 -316 167 114 -92 13 21 56 4 -63 -112 -28 284 74 -62 82 -13 -49 177 135
5445 135 -185 59 125 92 -70 130 37 -27 -54 50 -10 -1 73 -132 -52 125 -22 14 49 -18 -124 -54 23 60 96 -88
5471 -88 -99 191 110 112 116 236 132 -7 62 -20 -88 52 69 -78 4 171 -33 77 135 22 -5 -20 170 -277 108
5496 108 154 -137 57 201 -88 141 117 121 -118 259 93 -116 39 91 -38 -137 -8 -155 -73 232 -16 -319
5518 -319 109 -116 -43 252 22 -378 -109 185 -127 -124 125 -44 -242 103 235 -181 64 251 23 67 425
$$ packed form
5353b7K51l19j36L02q4k06M70k04j50Q3J62j93J13N4j97p4K42j01j05K02pk11
5375a35K31m3k29J28K84l20p2K93j99p7L37k7m31K10K06k34q6J72j81K70j34K83
5397B46k60l2K7j59J52J13J5j08J1j1J28n6j27N9O7N4l17J91J46j78l5J73p3M
5421C0L8j29j55L81j37l44M83n3k06J05QL5n2o7m9Q4L12k10j36J44r5l6K26m2
5445A35l20K44O6l3j62K00r3o4k7J04o0RP4k05Q0J77j47L6L5o7j06P0P7L7L6j84
5471h8j1K90q1KMJ20j04j39O9q2o8J40J7j47Q2J67k04J10N8j13k7j5J90m47L85
5496A08M6k91J94J44k89K29k4Mk39L77j66k09J55N2j29r9J29j47Q2L05k48l03
5518c19M28k25P3K95k30m00K69K94l12LK49j69j98L45J32m16K45J87k28M4L58
$$ plain form
5539 425 -117 -161 337 205 -282 237 216 -377 -71 359 41 -133 78 -170 -332 123 286 -109 143 101 -190
5560 -190 -199 332 -134 13 330 -37 -510 -31 134 -124 125 245 -135 -186 142 -118 102 316 49 -399 -181
5581 -181 -39 -155 289 259 -195 -373 -97 -10 73 296 166 -279 -114 -64 -159 252 396 102 21 -28 -78 1 252
5604 252 174 -26 -36 -49 -11 -25 161 289 100 -230 -359 106 32 13 1 -46 -180 -180 110 154 213 244 -78 -325 -11
5629 -11 120 0 328 246 -423 12 -3 -152 168 243 -306 -409 56 153 -142 261 169 -461 -535 208 -72 -54 700
5652 700 -29 -564 229 135 -349 159 439 -260 -213 279 -287 -256 552 334 -481 200 42 -579 177 724 -280
5673 -280 -469 325 -208 -506 515 332 -575 72 133 -562 26 718 -251 -419 116 -120 -433 410 420 -510
5693 -510 268 435 -566 -196 652 -76 -568 411 143 -444 200 340 -203 -135 341 -523 -404 609 27 -277
$$ packed form
5539D25n42m4M98j32m87N19k1n93L06M30l18j74K11k48j62M55J63l95K52m2k91
5560a90rN31m66J47L17l67m73M79J65k58K49J20l80n1L28k60K20K14k67m48K18
5581a81J42j16M44l0m54j78K76Q7Q3K23j30m45J65N0r5M11J44k94q1m9n0P9K51
5604B52p8k00j0j3L8j4J86J28j89l30j29M65p4j9j2m7j34%K90M4N9L1l22k47L14
5629a1J31j20L28q2o69M35j5j49L20P5n49j03M65R7k95M03r2o30p4P43k80J8P54
5652G00p29n35P93r4m84N08K80o99M7M92n66L1Q08k18q15O81j58o21P56N47j004
5673b80j89P94n33k98J021j83r07O47O1o95N88O92r69j68N35k36l13Q43J0r30
5693e10P78J67j001L70Q48p28m92R79k68n87O44J40n43O8M76q64J19J013n82l04
$$ plain form
5713 -277 399 65 -534 149 437 -365 -233 403 -291 -404 502 360 -292 145 109 -409 77 408 -277 68
5733 68 422 -262 -376 279 305 -420 141 59 -364 -221 237 -22 2 200 -94 -90 56 2 7 125 20 -268 -71
5756 -71 151 -83 134 103 6 -48 108 -111 65 -18 -157 -201 -56 -96 -73 87 -15 -58 -26 52 -118 65 -3 -149
5780 -149 34 131 -89 4 201 22 -83 8 -248 -107 100 237 -56 -111 227 -196 -201 395 17 -182 169 -114
5802 -114 -221 99 300 -148 -133 126 -59 -209 250 128 -282 224 293 -19 -20 192 -202 10 450 -135 -332
5823 -332 238 -57 -248 -38 102 -125 -16 276 -145 -70 375 -88 -319 236 149 -144 -50 156 -250 -44 105
5844 105 -159 -70 101 -95 -25 145 301 -236 125 218 -70 -172 78 112 -128 181 -66 -205 -2 -51 -111 24
5866 24 38 -120 -105 -33 -127 -89 174 26 -82 -97 -118 -130 -52 164 123 -22 2 161 185 179 14 -156 -30 -142 63
$$ packed form
5713b77O76l34n99O83K88q02J32O36o94j13R06j42o52M37l6n18M86L31o85L45
5733F8L54o84j14O55K6p25N61q2m23J43M58k59K4J98k94MJ46n4NJ18j05k88J97
5756g1K22k34K17l1r7n4J56k19J76q3j39m4J45m0K3J60j02m3L2P8j70J83o8j46
5780a49J83R7k20R3J97j79j05R1k56J41K07J37k93n5L38m23nN96l78j99L51k83
5802a14j07L20K01m48J5K59j85j50M59j22m10N06O9l12jK12l94K12M40n85j97
5823c32N70k95j91K10J40k27J09K92m21P5M45m63k31N55q7k93R4K06m06K06J49
5844A05k64Q9J71j96P0J70J56n37L61R3k88j02K50L4k40L09k47j39K03m9o0J35
5866B4J4j58J5P2r4L8K63j48j08j5k1j2P8K16m1j45K4J59K4oj65j70J26j12K05
$$ plain form
5891 63 -4 144 -159 -148 206 20 -156 -61 32 -62 1 55 61 47 17 55 -72 45 3 -113 113 124 4 -114 -111 286
5917 286 -74 63 -196 40 -43 -84 -122 -102 -215 -220 -32 57 105 -76 96 -109 -116 -31 97 -150 -74 -107 141 39
5941 39 -4 -191 29 121 -144 -18 4 -97 60 -21 -225 -211 59 -78 -38 193 4 -95 90 -69 -8 217 5
5964 5 -67 36 7 -127 -53 96 144 -143 110 92 -52 17 105 -23 -29 5 -171 52 226 -18 -45 18 79 -182 -67
5989 -67 181 -59 -34 123 -40 -220 187 231 -57 -27 155 -132 41 256 60 -103 155 -37 135 34 125 -192
6011 -192 -38 145 -181 -140 249 -39 -144 168 44 -232 2 107 -242 3 81 -109 -200 60 -32 -228 115
6032 115 19 -353 40 41 -193 62 201 -158 -249 132 21 -122 233 149 -182 15 216 -183 -149 233 -63 -250
6054 -250 65 -170 -193 72 256 -161 -32 111 11 -32 57 22 55 7 43 -161 -4 290 77 -54 70 -33
$$ packed form
5891F3o7J48l03J1L54j86j76R5R3r4O3N4Oj4l0L8j27J17m2j16K26J1j20j18LL97
5917B86l60J37k59K36q3m1l8K0j13nJ88Q9M8j81J72k05pQ5J28k47P6l3K48j02
5941C9m3j87K20R2k65J26K2j01J57q1k04J4K70j37M0K31j89r9J85j59O1K25k12
5964Ep2J03k9j34P4J49M8k87K53j8j44O9Q8j28oL4j76K23J74k44k7O3O1k61J15
5989f7K48k40K5J57j63j80M07M4k88L0J82k87J73K15j96j63K58j92J72j01R1l17
6011a92J54J83l26M1L89k88j05L12j24k76K34J05l49K45P8j90r1K60r2j96L43
6032A15r6l72L93Jk34K55J39l59r1L81j11j43L55q4l31J97K01l99L4L82k96j87
6054b50L15k35k3K65J84m17J29J43j00m3Q9l5L3m8L6k04J57K94k13j31J24j03
$$ plain form
6076 -33 -74 169 259 -177 -235 -234 -29 -118 89 179 -150 -71 -8 85 88 163 163 -144 -81 40 -126 -33 356 145 -286 -14
6102 -14 73 -126 94 398 -145 -253 103 -50 -188 287 363 -359 -53 185 -251 -294 475 87 -437 86 38 -573
6124 -573 88 467 -223 -195 245 -163 -395 334 268 -384 231 164 -648 85 713 -151 -239 473 -131 -651 368
6145 368 527 -471 84 382 -492 -378 555 -22 -220 349 23 -617 277 554 -537 144 472 -291 -483 701
6165 701 230 -435 384 272 -705 118 544 -298 -287 628 -206 -590 469 356 -607 264 391 -578 -283 463
6185 463 -122 -179 457 -1 -475 130 329 -418 120 516 -344 -393 393 -5 -167 351 168 -496 102 463 -184
6206 -184 -89 170 -285 -261 259 130 -450 -27 252 -148 -145 334 161 -202 145 18 -241 -16 14 -100 -89 261
6228 261 -25 -413 -61 96 -38 117 223 -236 -175 124 153 14 -79 -80 -201 40 180 111 -316 66 149 -94
$$ packed form
6076c3m1K43R0m36n8JK05q9K07R0l29P9O3R3LP5%l07O3J21j66R3L89k11m31K72
6102a4Q7j99K20L04n43j08L56j53j38M75P6p22L06K38m36m3P69l88n24N23m8o11
6124e73O61L79o90K8M40m08k32P29o6o52O15o7q12P33O28q64q8P12o04n20J019
6145C68J59r98N55K98q74J14R33n77j98N69l26o40Q94K77j091O81L28p63j92J184
6165G01m71o65Q19j12r77Q23M26q42J1R15q34l84J059j13r63Q71J27r69K95P46
6185D63n85n7O36m58m74O05J99p47N38L96q60m9P86l98j62N18j83o64N98L61o47
6206a84R5K59m55K4N20j29n80M23K79m00LM79j73l63L47j27k59K25L0j14J1L50
6228B61k86l88L52J57j34J55J06m59O1K99K9j39r3jj21K41J40o9m27L82Q3k43
$$ plain form
6250 -94 -39 506 -129 -236 228 91 -345 177 221 -443 195 358 -183 -382 339 81 -329 257 117 -371 171
6271 171 353 -137 -148 344 -626 -419 385 249 -352 71 157 -417 -302 490 -14 -295 379 -113 -323 250 389
6292 389 -676 7 361 -332 -220 407 -180 -380 360 90 -412 125 395 -253 -20 394 -346 -322 162 -40
6312 -40 -482 314 391 -476 -84 421 -150 -114 269 -23 -413 282 198 -101 149 380 -260 -56 182 -186 -291
6333 -291 165 118 -367 84 85 -282 -34 223 -74 -25 157 -45 -104 162 49 -84 12 227 -208 120 176 -49
6355 -49 -189 46 67 8 170 64 132 -164 -71 70 -4 135 -56 -137 76 -101 96 38 -71 -7 73 -14 129 65
6379 65 -34 93 69 -21 73 90 59 153 -31 -106 -61 98 67 32 55 135 145 -90 -87 55 -53 -110 -89 -131 31 25 34 8
6407 8 19 0 -125 -144 13 -33 105 123 -137 -28 261 -87 -60 99 156 -80 -68 16 84 -133 88 -47 -58 74
$$ packed form
6250i4N5N45o35j07M64j37m36N22M4o64O38J63n41j99P21k58m10N86j40m88N42
6271A71J82m90j1M92r70K07Q04j36o01M23Q6n74J15P92n04k81O74m92k10N73J39
6292C89j065O83L54o93J12O27n87k00P40k70n02N37K70o48K33M14p40K4M84k02
6312d0m42P96P7q67L92N05n71L6L83k92l90O95q4k99K50K31o40K04K38l68j05
6333b91M56m7m85M51Jl67K48K57k97M9J82k02n9K66j13j33R6K15m35L28N6k25
6355d9j40K35K1n9J62j06O8k96R3J41p4J39j91q1K13j77J97n8j09O4Q0q7J43o4
6379F5r9J27k4r0R4J7l1R4j84p5M5J59l1l5K3Q0J0k35LJ42j08n7K1m2J62oRk6
6407HJ1j9j25j9J57m6J38J8k60J09K89l48K7J59N7k36J2Q4O8k17K21j35j1J32
$$ plain form
6431 74 21 -34 58 78 -96 38 158 -42 104 106 -119 -102 100 28 -52 -15 120 -139 38 -26 -112 -85 14 29 -22 115
6457 115 50 -81 -37 39 -60 24 39 -1 51 104 -95 -86 -48 43 -126 24 134 -46 20 -30 -64 24 164 137 -93 144
6483 144 16 -63 23 33 -167 10 119 -25 15 29 -3 -126 -9 -20 154 128 32 -33 -119 -53 -128 50 94 -90 15
6508 15 -70 24 -79 -5 -8 -125 -147 6 -99 70 82 124 13 4 -64 -60 28 81 -43 85 117 -55 -23 28 -56 -95 137
6535 137 -220 -119 -19 127 10 258 4 -170 -78 82 114 38 163 43 -211 -15 6 32 15 21 -134 -106 11
6558 11 96 -88 69 -44 -175 154 -32 -167 22 -80 -70 -119 211 -109 140 224 79 -82 -143 -159 -306 -20
6580 -20 184 -70 -91 110 -82 -65 302 46 -44 137 -208 -30 -9 183 -38 -69 -47 -63 -36 146 -23 -82 165
6603 165 14 -360 0 53 -216 29 44 -96 -47 55 87 1 4 -19 -1 256 23 -98 150 -15 -283 61 180
$$ packed form
6431G4n3n5R2K0j74J34J20k00J46Kk25J7K02p2q0L7J35k59J77o4q6K7R9J5n1J37
6457A15o5j31M4P6r9Q4J5m0N2N3j99RL8R1j69J50J10j80O6n0l4Q8J40k7k30K37
6483A44j28p9Q6J0k00J77J09j44M0J4l2j23J17j1J74k6r6o5q6O6p5J78M4j84J05
6508A5q5R4j03P4lj17k2J53j05J69J2M2j11ro8MQ8N3j24J28L2j72L2N1q4l9K32
6535A37l57J01J00J46j17K48k54j74R2J60L2p6J25j20k54J96K1K6j7Oj55K8J17
6558A1Q5j84J57j13j31L29j86j35J89j02J0m9L30l20K49Q4j45j61o1j6j47K86
6580b0K04k54k1K01j92J7L67k56r0J81l45J78K1J92k21l1K2j6K7J82j69n9K47
6603A65j51l74L60N3k69K45J5j40M9J02L2q6Lk3J8K57k33j21K48j65k68L44J19
$$ plain form
6626 180 4 -321 233 -106 -249 44 66 26 244 66 -211 67 231 -153 -82 307 -32 -431 112 215 -199
6647 -199 187 135 -302 6 168 -12 -57 308 -7 -309 -12 178 -168 104 141 -275 22 146 -261 -177 415
6668 415 103 -345 -15 22 -371 264 361 -317 -68 332 -73 -183 244 329 -475 107 221 -194 122 250 -217
6689 -217 -166 240 -57 -238 283 -32 -364 78 198 -309 -125 240 -113 -160 222 75 -203 -46 161 -222 26
6710 26 234 -207 -315 163 87 -221 -83 164 -185 147 370 -131 -51 -17 17 77 137 61 -159 -133 257 101 -5
6733 -5 84 -33 -132 161 95 -8 -136 105 107 -69 43 163 -31 -117 204 -70 -242 22 68 -87 148 344 -97
6756 -97 -167 240 -88 4 243 80 -257 -78 217 -32 -22 305 -63 -164 133 142 -214 2 251 -350 -227 168
6778 168 -41 -134 456 73 -331 65 213 -293 -157 105 -187 -284 160 2 -102 236 254 -330 -89 288 -313
$$ packed form
6626A80j76l25N54l39j43K93K2m0K18j78k77K78J64l84P1L89l39l99N43J03m14
6647a99L86n2m37L08J62j80m5L65l15l02K97J90l46K72L7m16K97J24m07Q4N92
6668D15l12m48L30L7l93O35R7o78K49M00m05j10M27Q5q04N82J14m15L16J28m67
6689b17N1M06k97j81N21l15l32M42J20n07J84L65l53m7L82j47k78J57K07l83K48
6710B6K08m41j08M78p6l08J38K47l49L32K23n01Q0L4L4O0O0p6k20K6L90j56j06
6733eQ9j17r9K93o6j03j28K41Kj76J12J20j94q6L21k74j72K64M6j55K35J96m41
6756i7p0M07l28R2K39j63l37J79K95k49J0L27l68j01K97Rl56K16K49o01J23L95
6778A68k09r3N90l83m04L96J48n06J36K62k92r7M44j58j04L38J8n84K41L77o01
$$ plain form
6799 -313 -140 430 -10 -103 273 -42 -377 90 419 -146 -128 284 -140 -194 251 84 -283 114 212 -346 -198
6820 -198 396 -196 -287 239 -218 -174 239 109 -168 -91 95 -238 -178 221 -32 -225 54 -91 -248 70 175
6841 175 -265 16 169 -167 -14 317 33 -272 14 -104 -190 -206 261 -66 -30 177 -67 -92 216 142 -90 65
6863 65 39 26 -20 100 -58 -62 38 -139 -60 -14 55 -7 43 0 -30 -107 -102 45 -37 -6 59 55 -24 33 99 -112 44 95
6891 95 22 2 172 135 -129 -43 -12 -99 -85 36 68 -26 120 -47 -148 79 -11 170 102 240 47 190 -14 112
6915 112 -189 -64 173 -33 35 162 -169 -143 -59 -78 -64 105 203 -38 40 142 -227 7 202 89 -137 128
6937 128 5 -193 -36 101 -155 -47 163 -192 1 78 -1 -103 -191 126 -53 -16 158 -110 85 33 14 46
6959 46 197 52 39 -189 19 153 -3 263 34 -84 -10 19 -84 54 175 -205 -225 -45 -114 -63 -52 -5 -237
$$ packed form
6799c13J73N70m40r3L76l15l35M67L29n65J8M12m24n4M45j67l67L97R8n58J48
6820a98N94n92r1N26m57M4M13j30k77P7J86l33O0L99k53j93K79j45j57L18J05
6841A75m40K81J53l36J53L31k84l05K86j18q6j6M67l27L6K07k44k5L08p4k32J55
6863F5k6j3m6J20j58mJ00j77P9M6O9o2N0m3l0p7NJ47q2L1O5mp9N7O6k11J56N1
6891I5p3k0J70l7k64Q6L1q7J4J21L2r4J46j67j01K27r0J81o8J38j93J43k04J26
6915A12l01J25K37k06O8J27l31K6Q4j9J4J69R8k41P8J02l69K34J95j13k26K65
6937A28j23j98J57J37k56J08K10l55J93P7p9j02q8L17j79L7J74k68J95n2j9L2
6959D6J51j45j3k28K08J34j56K66k29j18P4K9j03J38J21l80k0J80o9N1J1M7k32
$$ plain form
6982 -237 83 110 -93 27 -13 -125 -150 255 -74 -6 -34 90 -135 -122 131 -53 -66 100 19 -88 25 -10 -176
7005 -176 31 205 12 123 -17 59 -46 150 -2 3 40 -9 -157 -38 -5 -66 48 -26 -75 116 -7 84 0 76
7029 76 207 83 -61 58 -4 -94 47 -55 18 -22 108 35 113 15 -14 -8 -69 169 -126 21 303 73 -142 31
7053 31 -5 -111 -20 58 -109 -150 243 -1 -53 61 72 -104 91 29 -17 -2 235 -12 -199 39 79 101 119 114 -156
7078 -156 -5 124 -50 -92 292 -52 -222 48 114 -304 22 120 -195 32 177 -139 -42 250 148 -190 7
7099 7 260 -233 -46 347 -193 -249 97 65 -213 204 259 -250 73 211 -93 -163 342 -27 -174 212 113 -322
7121 -322 44 214 -152 39 242 -215 -229 222 -37 -269 127 259 -156 -32 218 -151 -61 157 -41 -306 86
7142 86 165 -292 23 185 -110 -3 156 -74 -195 129 203 -240 38 89 -225 37 194 122 -101 251 41 -213
$$ packed form
6982b37L20K7k03J20m0j12k5M05l29O8k8J24k25J3K53j84j3J66q1j07J13l5j66
7005a76K07J74j93J11j40P6j05J96j52NL7m9j48J19L3o1J14p4m9J91j23R1q4P6
7029G6J31j24j44J19o2r0J41j02P3m0J30p3P8r8k9Oo1K38k95J47K82k30k15J73
7053C1l6j06R1P8j67m1L93k44n2J14J1j76J95o2m6J5K37k47j87K38M0K2J8nk70
7078a56J51J29j74m2L84l44j70K70O6m18L26R8l15K27J45l16R7K92j02l38J97
7099GK53m93J87L93n40n6L46l2k78M17N5n09L23J38l04p0N05l69j47L86r9m35
7121c22L66J70l66J91K03m57j4M51k59k32L96J32m15J24K50l69R0K18j98k65L92
7142H6P9m57L15J62k95J07J59k30j21L24P4m43K78N1l14K62J57p2k23L52k10k54
$$ plain form
7164 -213 32 126 -139 -14 113 -187 -152 159 -19 -155 -29 166 -236 -46 118 -53 -75 116 -46 -92 -11 82
7186 82 -31 -62 80 32 -290 53 -13 -119 31 76 -40 -235 39 -107 -50 208 160 -273 -79 149 -93 -125 217
7209 217 28 -91 114 -82 -226 168 194 -38 -102 133 -73 -243 113 128 -175 5 1 -50 -50 298 -27 -265 188
7232 188 62 -145 191 350 -159 -56 214 -307 -83 205 35 -366 54 193 -248 191 191 11 -165 180 -5
7253 -5 -179 258 9 -307 94 206 -150 -135 314 -89 -244 147 64 -109 100 150 -268 40 177 -106 -212 389
7275 389 94 -190 115 100 -206 4 425 -58 -86 149 -143 -251 296 -113 -340 -39 22 -194 -69 70 -163
7296 -163 -195 251 126 -294 89 209 -198 -115 221 -196 -114 242 -89 -138 47 -26 -213 74 40 -117 -290 -78
7318 -78 -38 -55 173 -25 -76 1 -33 -112 -100 199 -195 -122 -32 119 -14 -82 74 -10 -86 30 76 -4 33 93 -124 -32
$$ packed form
7164b13K45R4k65J25J27l00L5L11j78j36J26J95m02J90J64j71k2J91j62m6Q1R3
7186H2j13l1J42m8l22L43o6j06J50M5j16j95K74j46N7K58m8m33J94K28k42l2L42
7209B17j89j19K05j96j44L94K6k32o4K35k06j70L56J5l03J80mn1%L48l25k38M53
7232A88j26k07L36J59n09J03K70n21K24K88j70m01M20J39m41M39%j80j76L45j85
7253ej74M37k49l16M01J12l56J5M49m03j55L91q3j73K09N0m18L08J37k83j06O01
7275C89k95k84L05j5l06K10M21m83k8K35k92j08N47m09k27L01O1k16J25J39k33
7296a63l2M46j25m20L83J20m07Q3L36m17Q2L56l31m9J85p3j87K87l4j57j73K12
7318g8M0j7K28j98n1P7l4p9J2K99l94P3R0J51j33o8J56q4p6J16M6q0L7O0k17R2
$$ plain form
7344 -32 163 -65 -235 134 -157 -186 -141 -50 -71 -192 30 -107 -75 161 100 -120 271 283 95 76 -100 10 6 120
7368 120 228 -70 66 4 -32 -56 183 -26 -21 -123 -72 -32 84 25 -70 -29 15 69 58 -3 98 -168 145 23 14
7393 14 4 121 -56 -53 207 108 -172 -148 205 46 -11 -8 -36 -141 16 -99 -103 7 8 -217 138 211 -62 47 36
7418 36 -125 -82 35 40 -9 -45 -29 -72 157 26 -64 80 173 -13 -139 88 -118 60 66 83 -112 109 104 -45 -3
7443 -3 48 -73 -94 107 41 -130 64 160 -25 -40 -76 -97 -52 -104 -3 -29 -41 76 107 33 84 -42 -119 7 -107 -35
7469 -35 86 -108 88 -194 50 75 -136 -141 71 268 58 3 60 93 185 53 -85 42 -26 24 50 -133 35 -33
7493 -33 65 95 -219 -54 -1 114 15 -27 150 123 14 -36 -114 -22 9 90 7 46 -58 45 18 102 -8 62 159 16
7519 16 18 79 120 -14 -49 100 -126 124 51 -43 -221 95 -55 51 3 91 62 34 -16 -185 89 126 -16 56 -171
$$ packed form
7344c2J95k28j70L69k91k9M5R1k1j21K22j37L2K36o1k20L91J2j88j9j76J10mJ14
7368A20J08k98J36o2l6k4K39k09Nj02N1M0J16n9r5M1M4N4j1o1J01k66L13j22r
7393A4j0J17j77LK60r9k80K4L53j59n7Lk8j05J57j15mJ10Jk25L55P3k73J09j1
7418C6j61M3J17Nm9l6J6m3K29j31r0J44R3j86j26K27k06J78OJ7j95K21nj49M2
7443cN1j21k1K01o6j71J94R6j85j5l6k1M5n2J01k6j2J17L1p4N1j26p7J26j14P2
7469c5J21j94J96k82K44K5k11nK12J97k10n5N7L3R2j32j38J27o8N0K6j83J68o8
7493c3R8L0l14J65N3J15r9m2J77k7j09n0p8R2L1Q1q3L9j04J03k7Q4j10P0R7j43
7519A6KO1M1j34l5J49k26K50p3r4j78L16j50J06m8Q8k9k8n0j69K74L7j42P2k27
$$ plain form
7544 -171 18 -131 158 43 -59 -98 -159 268 161 -44 38 -44 -3 93 -139 88 -26 -55 22 -55 -129 -50 -172 -35
7568 -35 40 -1 -6 -96 76 132 -60 141 -151 66 -13 9 11 -23 42 159 -37 22 65 -63 -8 -93 88 -87 -99 49
7594 49 -155 58 49 -19 -47 -122 73 -97 -52 45 49 71 -3 319 38 113 27 -195 37 -41 -53 -159 -61 -60 -100 108 99
7621 99 52 -88 -82 -36 -83 -36 2 112 63 -11 -171 14 -7 -2 99 9 -31 -82 49 180 -121 156 70 -105 -157 142
7647 142 111 -64 37 -21 -62 -92 93 -127 84 105 -121 -54 8 41 109 25 -35 -60 -17 14 97 87 160 -37 35 179
7673 179 -71 179 91 104 57 -32 -22 134 106 99 63 -72 -121 79 57 76 -128 40 -80 -15 -26 -69 -64 55 -128 -74
7699 -74 -103 67 132 76 64 4 117 -245 32 50 92 51 98 148 -85 86 121 12 -107 -55 18 -105 -171 -121 34
7724 34 -16 -99 -6 18 -78 57 -9 7 215 -21 156 192 14 2 -47 -59 -76 53 36 35 17 52 -16 48 13 -13 132
$$ packed form
7544a71J89j49K89j15j02l9o1M27j07k05Q2q2M1R6k32K27j14k9P7p7p4P9j22J37
7568c5P5m1nr0J72N6j92K01k92K17p9K2Kl4O5J17j96N9M3j28N5q5J81j75j2J48
7594D9k04K13ro8k8p5J95j70M5R7MK2p4L22k81P5q6k22K32p8j2j06R8Jm0K08r
7621I9m7j40OM6m7M7L8J10m9p4j60J85k1NJ01r0m0n1J31J31l01K77q6j75n2K99
7647A42l1j75J01n8m1l0J85k20K11K1k26O7O2L3O8q4o0k5M3L1Q3j0P3j97P2J44
7673A79k50K50q8J3m7q9J0J56k8pl6j35m9K00k2J9k04J68j20O5j1m3NJ19j83N4
7699g4k9J70O5n6j2o0J13l62K77J8M2m1M7N0k33J71L5j09j19N2P3j23o6N0J55
7724C4n0q3R3K4r6J35o6J6K08k36J77L6j78j2m9j2j7J29j7jj8L5o8O4l5k6J45
$$ plain form
7751 132 44 -50 -10 116 -24 -17 47 -123 -28 -42 -50 113 121 -32 -94 -2 -72 104 -132 -45 103 -24 76 39 22 -70
7777 -70 -85 78 -56 58 119 -136 -137 -109 -112 55 -89 91 -1 68 -142 33 -22 -144 89 0 -148 123 -207 -121
7801 -121 -104 -73 -3 82 -95 32 0 -187 129 58 -30 -89 -56 34 -166 -20 62 41 8 73 -79 -86 -45 -113 19 -50
7827 -50 -123 39 13 -33 18 -96 -220 -145 36 31 95 153 10 -155 -22 38 -95 -49 -44 24 37 -86 19 -44 -106 -122
7853 -122 42 49 -109 -86 -1 -152 99 -5 -63 78 -71 -68 17 -104 -78 155 179 -64 -71 59 120 -19 -45 -21 1
7878 1 -42 52 -48 7 52 132 77 40 41 -94 -84 -77 -121 193 -117 -3 -39 -72 96 79 -86 -102 13 70 89 59 -23 -201
7906 -201 129 -149 -35 65 -143 134 83 75 -136 -60 50 33 31 131 -13 -21 131 137 -113 3 70 11 -85 53 15
7931 15 7 124 15 12 -126 31 -78 98 65 -223 -48 -24 -116 -43 102 38 -4 22 -92 161 -15 120 11 30
$$ packed form
7751A32q8r4M0J26j40PO4j70R5j4qJ63Qj53o2R2p0J76k36Q7J48j27J00l7j7r2
7777g0j5J63j34J14O1k55jK8lJ67j44J80r2O9k10J75n5j22K33q9j48K71l30Q6
7801a21J7L1P0Q5j77J27l2j87L16p1q8n9L3R0k00J46Q2k1l3O5j52pM1o8J32o9
7827e0p3J62k6m6N1j14j24P5J81nO4N8j43j65J33O0j33M6NO8J3j23J05o3o2j6
7853a22J64Pj58K3Q5j51K51j04n8J41j49LQ5j21K6K33K4k43pJ30O1j39k6K4K2
7878Am3R4j00N5M5Q0n5l7Jj35J0Pm4L14l10J14l6l3J68j7j65j6J15N7J9l0q2j78
7906b01L30k78J14J00k08K77n1qk11P6J10j7kJ00j44qJ52Ok50J16O7n9r6J38l8
7931A5qJ17j09lj38J57j09J76l3k88J75K4r2P3J45o4m2K6j14K53j76J35j09J9
$$ plain form
7955 30 0 -90 59 -8 24 -174 77 29 -17 -121 69 66 -83 -79 10 -100 -129 -55 -189 -32 -96 -108 86 77 9 25 95
7982 95 84 -54 -173 150 61 165 -5 -42 141 -283 -40 63 -134 51 4 -170 130 -77 -5 91 4 -8 101
8005 101 108 37 -144 221 89 145 -61 64 73 76 162 -106 -21 -82 -34 51 -118 9 -56 18 173 150 -62 -181 -82 -126
8031 -126 -100 -74 -37 -23 15 214 84 6 146 -76 -50 24 -11 -97 73 -12 -37 61 -17 -58 -159 5 -60 -13 145 92
8057 92 32 138 2 -64 -1 -14 2 126 -89 18 11 -3 69 163 -92 21 40 58 41 -99 7 129 48 -177 43
8082 43 204 95 -25 24 8 -39 -109 72 65 142 23 20 132 -35 -31 -91 -3 -55 -102 46 -16 7 153 154 -100 1 10
8109 10 -59 -78 -11 -51 -28 174 107 72 -122 152 -106 -154 136 -211 -17 76 97 -12 18 36 -55 20 23 -167 20 51
8135 51 98 24 56 5 81 74 -23 0 -51 180 157 35 -42 144 28 44 101 -191 -83 -33 79 -62 -64 7 -133 -22
$$ packed form
7955C0l0r0J49o7L2j98K51m8m6j04J90lj49MQ9j10k9P4j34J57o4j2J94ro8J6P0
7982I5j1j38j19L23q9J04j70l7J83m24K43J03j97J85m7j74L00k07P2R6q7j2J09
8005A01Pp1j81L65j32N6k06J25RLQ6k68Q5o1M8Q5j69J27o5P4J55k3k12j19R9m4
8031a26K6K6L7J4L8J99j30p8J40k22K6P4l5q6J70q5k5R8p8m1j01J64o5M7J58n3
8057I2o0J06j36o6O3j3J6J24k15J07pj4P2R4k55J13J9J8j7j40J06J22q1k25K20
8082D3J61j09j20M9j6m7p0J81pP7j19lJ12j67Mo0Q8n2m7J48o2K3J46Jk54J01R
8109A0o9j9O7m0K3K02o7l5j94K74k58m8K90l47J94R3K1j09L0J8r1P5Lj90J87L1
8135E1M7p4L2n1P6pr7K3n1K31k3j22p7J86j16J6N7k92J08N0J12j41kP1j40J11
$$ plain form
8161 -22 62 -196 -88 -67 184 -47 100 25 -105 11 63 -40 -77 78 149 -82 -84 16 -72 -13 -7 -40 -116 57 13
8186 13 35 -129 134 -239 58
$$ packed form
8161b2Q4k58J08K1K51k31J47p5j30J16N2j03l7J55P1k31kJ00q8N9Ol3p6J73m4
8186A3K2j64K63l73K97
8191E8
$$ Imaginary data points
##PAGE= N=2
##DATA TABLE= (X++(I..I)), XYDATA
$$ plain form
0 0 0 0 0 0 0 0 0 0 0 0 1 -8 8 -8 8 -16 16 -24 28 -32 40 -48 56 -64 73 -88 102 -117 133 -151 173 -198 224
33 224 -252 284 -316 357 -401 443 -494 549 -607 675 -744 820 -904 999 -1100 1211 -1332
50 -1332 1467 -1620 1787 -1973 2185 -2425 2704 -3025 3406 -3862 4425 -5130 6048 -7286 9059
65 9059 -11780 16433 -25829 51870 -265092 -801015 147563 212076 -218649 379673 409538
76 409538 -537596 -289812 356264 -77988 -99384 445654 -89218 -489740 230635 215035
86 215035 -384741 150286 481790 -286361 -285571 284356 -157826 -364477 375599 346395 -237150
97 -237150 -30576 26507 -385536 356 483879 2007 -226217 97741 -146951 -276080
107 -276080 354097 371478 -266850 -186729 96930 -175077 -77248 357677 128834 -198227
$$ packed form
0@%%%%%%%%%%JrJ6j6J6k4L2m0N2o0P2q8J04j20J37j61J90k19K50k84L24l71M22
33B24m76N36o00O73p58Q44r37J043j156J282j419J564j724J903k099K311k543
50a332K799l087L407l760M158m610N129n729O431p268Q287r555J1178j3334J6345
65I059k0839K8213m2262P7699l16962n35923R48578O4513m30725N98322K9865
76D09538r47134K47784O46076m34252k1396N45038n34872m00522P20375j5600
86B15035n99776N35027L31504p68151P90N69927m42182k06651P40076k9204n83545
97b37150K06574N7083m12043L85892M83523m81872k28224L23958k44692j29129
107b76080O30177J7381o38328Q0121K83659k72007R7829M34925k28843l27061
$$ plain form
117 -198227 1046 -5444 -196033 52810 199447 -59588 -36721 119241 -105514 -169665 132760
128 132760 125106 -88097 4902 47386 -154609 -97619 157505 132668 -8778 -9192 -62279 -144305
140 -144305 -20032 130523 79897 6408 9375 -56565 -101614 27223 108285 -2239 -45583
151 -45583 21525 -39493 -89227 68082 124297 -32591 -49392 19982 -86685 -91498 107902
162 107902 94856 -49174 23304 33027 -128696 -39830 131799 -3573 -71291 81548 6722
173 6722 -116812 62073 105627 -85763 -14713 92152 -95867 -92262 129700 34097 -86837
184 -86837 90983 49937 -172505 -26724 126920 -51877 -43810 120141 -29353 -122017 76133
195 76133 53141 -91345 42908 65352 -126671 -25343 138949 -25312 -63266 108502 -4922
$$ packed form
117a98227J99273o490j90589K48843J46637k59035K2867J55962k24755o4151L02425
128A32760p654k13203R2999M2484k01995N6990K55124k4837j41446m14n3087q2026
140a44305J24273J50555n0626p3489K967o5940m5049J28837Q1062j10524m3344
151d5583O7108o1018m9734J57309N6215j56888j6801O9374j06667m813J99400
162A07902j3046j44030P2478R723j61723Q8866J71629j35372o7718J52839p4826
173F722j23534J78885M3554j91390P1050J06865j88019L605K21962r5603j20934
184h6837J77820m1046k22442J45781J53644j78797Q067J63951j49494r2664J98150
195G6133k2992j44486J34253K2444j92023J01328J64292j64261l7954J71768j13424
$$ plain form
206 -4922 -140980 50267 93702 -84419 -10777 98137 -42128 -51375 70433 -21374 -71227
217 -71227 67566 22017 -91999 32366 69291 -76574 -14443 97089 -41365 -87555 61318
228 61318 30973 -67465 26627 60248 -39327 -13956 32742 -32945 -10527 55329 -18865 -41939
240 -41939 53176 19943 -57262 18737 46496 -49767 -30800 49972 1025 -40142 16665 22248
252 22248 -15305 -2540 -4301 -21585 10731 17043 -21442 -37 31617 -12065 -26342 23904
264 23904 16099 -27698 -4526 26063 162 -13680 8896 14173 -689 -10242 -9977 3872 11690
277 11690 -5241 -10963 9041 7961 -14066 -7264 11389 -1266 -16364 -1230 13110 1132 -9864
290 -9864 1002 10974 -33 -11445 -751 12747 4348 -7426 511 9962 1775 -5871 1616 6850
$$ packed form
206d922j36058J91247M3435j78121P3642J08914j40265r247J21808r1807m9853
217g1227J38793m5549j14016J24365L6925j45865O2131J11532j38454m6190J48873
228F1318l0345r8438R4092L3621r9575K5371M6698o5687K2418O5856p4194k3074
240d1939R5115l3233p7205P5999K7759r6263J8967Q0772m8947m1167N6807N583
252B2248l7553J2765j761j7284L2316O312l8485K1405L1654m3682j4277N0246
264B3904p805m3797K3172L0589k5901j3842K2576N277j4862r553K65J3849P818
277A1690j6931n722K0004j080k2027O802J8653j2655j5098J5134J4340j1978j0996
290i864J0866R972j1007j1412J0694J3498q399j1774P937R451q187p646P487N234
$$ plain form
304 6850 -2174 -8004 883 7488 -688 -7882 -1106 3731 -4124 -8197 238 4182 -3776 -6825 1150
319 1150 4860 -1448 -3872 1545 3337 -1661 -1796 4687 6509 1385 -1267 2381 3598 480 309 2622
335 2622 1146 -1499 422 2994 492 -2843 -3917 -2172 -131 -1932 -4320 -330 2293 -3627 -5386
350 -5386 62 -571 -2488 2660 1073 -5514 1609 7841 -577 -1956 4983 -858 -2710 8790 3963
365 3963 -6736 4097 7526 -7624 -2623 8713 -3901 -5527 8845 -2853 -12771 7669 6067
378 6067 -15133 -1334 11371 -8242 -4531 11816 -8835 -13771 17243 8766 -15628 4115 9592
391 9592 -14365 3576 22204 -10209 -13653 16247 -981 -15475 16756 10692 -20098 2332 11962
404 11962 -21142 -4251 25961 -8122 -18965 16905 290 -24765 10828 16106 -17060 2198
$$ packed form
304F850r024n830Q887O605q176p194O776M837p855m073Q435L944p958l049P975
319A150L710o308k424N417J792m998j35O483J822n124k652L648J217l118j71K313
335B622j476k645J921K572k502l335j074J745K041j801k388L990K623n920j759
350e386N448o33j917N148j587o587P123O232q418j379O939n841j852J1500m827
365C963j0699J0833L429j5150N001J1336j2614j626J4372j1698r918K0440j602
378F067k1200J3799J2705j9613L711J6347k0651m936L1014q477k4394J9743N477
391I592k3957J7941J8628l2413l444K9900j7228j4494L2231o064l0790K2430R630
404A1962l3104J6891L0212l4083j0843L5870j6615k5055L5593N278l3166J9258
$$ plain form
416 2198 17483 -18849 -12374 22430 2707 -6896 19331 -5067 -31052 12217 26656 -9970 -360
429 -360 15245 -19519 -19162 19668 10147 -7517 8076 -3467 -23838 -355 11087 -3486 9294
442 9294 11234 -23281 -20171 12857 7664 -1268 13750 3406 -19636 -10310 5719 11131 15986 3789
456 3789 -12226 -5048 -2862 -7230 13662 23492 -4275 -14781 -4492 -9755 -4081 15477 11231 3263
470 3263 -1250 -29169 -27124 22594 27414 -3075 7681 -3540 -50002 -14400 50591 25121 -6977
483 -6977 856 -30093 -36012 33486 41102 -7487 6006 -1229 -53319 -3254 60082 -3831 -28954
496 -28954 33830 -2739 -54174 15706 29557 -32143 12972 46176 -38797 -40548 23971 -13661
508 -13661 -5938 79061 8959 -91661 -12123 31335 -22507 46285 82914 -62534 -88975 33016
$$ packed form
416B198J5285l6332O475L4804j9723r603K6227k4398k5985M3269J4439l6626R610
429c60J5605l4764L57L8830r521j7664J5593j1543k0371K3483J1442j4573J2780
442I294J940l4515L110L3028n193q932J5018j0344k3042R326J6029N412M855j2197
456C789j6015P178K186m368K0892R830k7767j0506J0289n263N674J9558m246p968
470C263m513k7919K045M9718M820l0489J0756j1221m6462L5602O4991k5470l2098
483f977P833l0949n919O9498P616m8589J3493p235n2090N0065O3336o3913k5123
496b8954O2784l6569n1435O9880J3851o1700M5115L3204q4973j751O4519l7632
508a3661P723Q4999p0102j00620P9538M3458n3842O8792L6629j45448k6441J21991
$$ plain form
520 33016 20357 -5568 73034 10897 -102907 -10200 56518 -24390 13699 68082 -54292 -70562
532 -70562 57027 8644 -61040 52083 53400 -65169 -8839 38654 -67189 -23973 100650
543 100650 15172 -53038 24185 -24747 -80390 65408 100681 -43457 -35896 15018 -67286 -16013
555 -16013 121880 31326 -75672 -863 -12232 -69222 51627 93671 -44746 -40136 35651
566 35651 -42486 -44070 72440 25067 -51651 26722 17192 -74209 1218 67354 -14823 -3499
578 -3499 51654 -47844 -79100 45397 50515 -13364 34619 17505 -83645 -35405 54605 16551
590 16551 5696 33378 -36940 -63526 24928 33475 -11184 24722 14611 -62829 -30875 39629
602 39629 10818 -1695 34844 -636 -46184 -14637 6502 4139 31424 25836 -19626 -19126 -3818
$$ packed form
520C3016j2659k5925P8602o2137j13804R2707O6718q0908L8089N4383j22374j6270
532g0562J27589m8383o9684J13123J317j18569N6330M7493j05843M3216J24623
543A00650q5478o8210P7223m8932n5643J45798L5273j44138P561N0914q2304N1273
555a6013J37893r0554j06998P4809j1369n6990J20849M2044j38417M610P5787
566C5651p8137j584J16510m7373p6718P8373r530r1401P5427O6136q2177J1324
578c499N5153r9498l1256J24497N118o3879M7983j7114j01150M8240R0010l8054
590A6551j0855K7682p0318k6586Q8454Q547m4659L5906j0111p7440L1954P0504
602C9629k8811j2513L6539l5480m5548L1547K1139k363K7285n588m5462N00J5308
$$ plain form
615 -3818 -14314 11025 43680 6395 -34960 -18948 -247 4838 21870 23265 -1496 -25392 -34649
628 -34649 -10963 27679 23251 -1543 2368 -4838 -29711 -10459 22307 12528 977 881 -14622
641 -14622 -8706 14342 3239 2481 26061 -6986 -46031 527 30460 -6673 5850 35666 -15377
654 -15377 -43396 3561 10210 -5306 21258 8371 -30246 -117 16683 -20356 4706 36166
666 36166 -25386 -40454 29605 17530 -27209 20485 32167 -31311 -19012 20611 -12599 -8910
678 -8910 33369 667 -20174 22116 -743 -39067 17655 31682 -34821 -13323 36089 -13727
690 -13727 -26414 35079 13069 -35734 565 9310 -25102 8711 31542 -14466 -7369 24888
702 24888 -17184 -25696 29928 9447 -32286 13298 28411 -21832 -6240 28428 -9387 -20707
$$ packed form
615c818j0496K5339L2655l7285m1355J6012J8701N085J7032J395k4761k3896r257
628c4649K3686L8642m428k4794L911p206k4873J9252L2766r779j1551r6j5503
641a4622N916K3048j1103p58K3580l3047l9045M6558K9933l7133J2523K9816n1043
654a5377k8019M6957O649j5516K6564j2887l8617L0129J6800l7039K5062L1460
666C6166o1552j5068P0059j2075m4739M7694J1682o3478J2299L9623l3210L689
678h910M2279l2702k0841M2290k2859l8324N6722J4027o6503K1498M9412m9816
690a3727j2687O1493k2010m8803L6299Q745l4412L3813K2831m6008P097L2257
702B4888m2072q512N5624k0481m1733M5584J5113n0243J5592L4668l7815j1320
$$ plain form
714 -20707 14200 -2418 -18900 16859 13224 -16695 6333 12593 -25200 -10965 20408 -7465
726 -7465 -15514 20565 8844 -18196 5503 11417 -15377 -4599 12036 -7151 -3939 17552 2744
739 2744 -8336 9585 1825 -16130 486 8849 -7434 654 13539 -2354 -8035 5132 -2314
752 -2314 -10930 1501 2411 -6979 2741 10436 -1706 -4856 1240 -3071 -5279 1727 2163 290 4975
767 4975 4256 -302 2149 722 -6407 -3756 4121 2127 -748 4089 5013 -1519 -4806 -2395 -755 -2936
783 -2936 -4492 613 5350 1931 -2485 -293 699 -4435 -5785 577 3877 815 -239 4365 5521
798 5521 -1107 -5520 -642 3384 -1550 -2578 5505 7197 -1298 -3283 1971 533 -5944 -4982 2341
813 2341 3796 -1235 -2095 2641 2204 -5265 -6259 879 2075 -3541 -1289 6393 4662 -3484 -2692 3274
$$ packed form
714b0707L4907j6618j6482L5759l635k9919K3028O260l7793J4235L1373k7873
726g465q049L6079j1721k7040K3699N914k6794J0778J6635j9187L212K1491j4808
739B744j1080J7921p760j7955J6616Q363j6283Q088J2885j5893n681J3167p446
752b314q616J2431R10r390R720P695j2142l150O096m311k208P006M36j873M685
767D975p19m558K451j427p129K651P877j994k875M837R24o532l287K411J640k181
783b936j556N105M737l419m416K192R92n134j350O362L300l062j054M604J156
798E521o628m413M878M026m934j028Q083J692q495j985N254j438o477R62P323
813B341J455n031q60M736m37p469r94P138J196n616K252P682j731q146P92N966
$$ plain form
829 3274 1237 -4438 -1506 5363 4619 -1454 -512 4379 1472 -5187 -3177 3091 900 -3716 269 5180
845 5180 288 -5620 -2100 2087 -1406 -5183 -1190 4088 2201 -2651 -741 3605 397 -4833 -830
860 -830 4748 538 -2056 4031 5242 -1716 -2966 1753 1902 -1477 -2406 -195 2835 2191 -2735 -2089
876 -2089 2542 -1556 -6798 -183 4210 -2672 -2114 4665 294 -4969 6 2361 -1131 -196 677 -791
892 -791 3142 4081 -2767 -995 5313 -990 -5311 3151 3530 -3298 1529 5171 -3757 -4827 2197 -356
908 -356 -2927 2210 -70 -3797 1783 1210 -5222 557 5270 -2829 -3809 2732 -1 -1884 5284 4261
924 4261 -4006 -1775 1952 -1076 1161 5132 775 -2631 -63 -1117 -1938 2865 3186 -2059 -3534 -1531
940 -1531 -1342 65 2243 1128 -1766 -2869 -1706 -570 -84 2051 4370 346 -3545 -1377 -299 -258
$$ packed form
829C274k037n675K932O869p44o073R42M891k907o659K010O268k191m616L985M911
845E180m892n908L520M187l493l777L993N278j887m852J910M346l208n230M003
860h30N578m210k594O087J211o958j250M719J49l379r29K211L030o44m926O46
876b089M631m098n242O615M393o882N58O779m371n263M975K355l492R35Q73j468
892g91L933R39o848J772O308o303m321Q462L79o828M827L642q928j070P024k553
908c56k571N137k280l727N580n73o432N779M713q099r80O541k733j883P168j023
924D261q267K231L727l028K237L971m357l406K568j054q21M803L21n245j475K003
940a531J89J407K178j115k894j103J163J136M86K135K319m024l891K168J078M1
$$ plain form
956 -258 6032 6795 -3654 -5768 1171 -238 609 9003 2515 -9781 -3079 2296 -3765 3749 9635
971 9635 -6594 -10481 4430 -589 -7045 8845 6629 -11873 -1331 7808 -8881 -3736 15337
984 15337 147 -9779 8013 240 -14892 8879 16592 -8505 -2700 9604 -13689 -10712 21176
997 21176 7316 -14145 4770 991 -21159 5354 22816 -9353 -10379 11454 -10088 -15851 19488
1010 19488 10020 -17673 5689 10437 -20829 -2918 23181 -5046 -9050 18668 -4415 -23342
1022 -23342 13220 14885 -14449 6790 16248 -22638 -13750 21848 507 -9980 18155 -1776
1034 -1776 -30282 5074 19189 -10296 2200 15855 -20165 -17390 21600 5227 -13781 14195
1046 14195 6917 -24001 526 18794 -8966 -2685 19992 -6721 -18164 10986 4706 -11948
$$ packed form
956b58O290P63j0449k114O939j409Q47Q394o488j2296O702N375o061P514N886
971I635j6229l887J4911n019o456J5890k216j8502J0542R139j6689N145J9073
984A5337j5190r926J7792p773j5132K3771P713k5097N805J2304k3293K977L1888
997B1176j3860k1461J8915l779k2150K6513J7462l2169j026K1833k1542n763L5339
1010A9488r468k7693K3362M748l1266J7911K6099k8227m004K7718k3083j8927
1022b3342L6562J665k9334K1239R458l8886Q888L5598k1341j0487K8135j9931
1034a776k8506L5356J4115k9485J2496J3655l6020K775L8990j6373j9008K7976
1046A4195p278l0918K4527J8268k7760O281K2677k6713j1443K9150o280j6654
$$ plain form
1058 -11948 12576 13369 -17932 -7622 10719 -8605 -4351 20679 1216 -20507 -798 3660 -8009
1071 -8009 9386 15320 -11999 -13331 5447 -360 -974 14130 2813 -14192 -654 6628 -4722
1084 -4722 2340 11794 -1929 -7752 2526 134 -5478 4161 7378 -1661 -3312 -1925 -5830 -2872
1098 -2872 6408 6275 -1349 -5245 -5777 -4673 2141 10280 6298 -6601 -8885 -843 1994 3969 8896
1113 8896 1674 -10266 -3580 5721 747 1164 6686 -2917 -7853 4445 2726 -7181 2627 6997 -6705
1128 -6705 -2958 6808 -6515 -8521 10143 5094 -8931 2004 2331 -12056 1692 15732 -3220
1141 -3220 -8210 6595 -3181 -8920 12984 9600 -12121 -1007 8096 -8633 -1360 14584 -4238
1154 -4238 -11673 8766 2452 -11967 5925 8329 -12839 -1775 12668 -7426 -9770 10650 855
$$ packed form
1058a1948K4524P93l1301J0310J8341j9324M254K5030j9463k1723J9709M458j1669
1071h009J7395N934k7319j332J8778n807o14J5104j1317j7005J3538P282j1350
1084d722P062R454j3723n823J0278k392n612R639L217r039j651J387l905K958
1098b872R280j33p624l896n32J104O814Q139l982j2899k284Q042K837J975M927
1113H896p222j1940O686R301m974M17N522r603m936J2298j719r907R808M370j3702
1128f705L747R766j3323k006J8664n049j4025J0935L27j4387J3748J4040j8952
1141c220m990J4805r776n739K1904l384k1721J1114R103j6729P273J5944j8822
1154d238p435K0439o314j4419J7892K404k1168J1064J4443k0094k344K0420r795
$$ plain form
1167 855 -10069 7938 5150 -12988 1313 11370 -6695 -2518 11409 -4942 -9650 11048 4828
1180 4828 -10335 4591 7958 -10558 -2499 10999 -3570 -6530 7684 -1180 -9172 5575 4124
1193 4124 -9235 1141 7011 -7581 -3535 9158 -2677 -7418 7097 3053 -8226 2082 6915
1206 6915 -3818 -1123 5422 -2644 -2383 6214 -69 -4964 3567 2589 -4955 1818 4692 -5310 -3924
1221 -3924 4914 -31 -4694 1392 1651 -2933 -61 1621 -2194 -485 1538 -1631 -432 3450 111
1236 111 -2359 2002 2020 -1958 205 2969 -599 -1897 1664 2341 -144 -1240 -855 -486 330 -339 -964
1253 -964 -451 -365 -886 -472 426 -482 -2076 -881 1300 420 -1227 269 1822 144 -1162 889 1350
1270 1350 -462 -315 1517 1420 338 368 -51 -172 190 -363 -525 461 -273 -1482 116 1308 -1270 -2247
$$ packed form
1167H55j0924J8007k788j8138J4301J0057j8065M177J3927j6351m708K0698o220
1180D828j5163J4926L367j8516Q059J3498j4569k960J4214q864p992J4747j451
1193D124j3359J0376N870j4592M046J2693j1835m741J4515m044j1279J0308M833
1206F915j0733K695O545q066K61Q597o283m895Q531r78p544O773K874j0002J386
1221c924Q838m945m663O086K59m584K872J682l815J709K023l169J199L882l339
1236A11k470M361J8l978K163K764l568j298L561O77k485j096L85L69Q16o69o25
1253i64N13Q6n21M14Q98r08j594J195K181q80j647J496J553j678j306K051M61
1270A350j812J47J832r7j082L0m19j21L62n53j62R86p34j209J598J192k578r77
$$ plain form
1288 -2247 -70 75 -1178 -118 803 -199 -326 338 -89 28 354 -192 204 1288 861 -24 882 1041
1306 1041 -532 -490 714 176 -462 380 442 -420 -482 -518 -909 -523 -612 -761 -436 299 -105 -408 -40 -50 -429
1327 -429 9 329 238 506 1103 893 411 618 330 196 237 433 188 363 614 154 -136 -721 -793 -359 -536
1348 -536 -786 -602 -94 -7 -361 -405 -215 -459 -295 -53 120 152 420 667 649 162 55 315 700 164 100 393
1370 393 1009 408 -315 -51 -90 -452 -738 -312 -143 -492 -280 42 -213 -859 -745 -259 22 -256 -535 398
1390 398 929 220 -165 465 598 111 254 705 606 348 338 546 6 -370 -295 71 67 -493 -599 -24 -6 -489
1412 -489 -996 -633 -315 -728 -578 308 358 -169 103 509 -87 -319 372 807 473 276 593 705 664 416 103
1433 103 23 451 -350 -575 576 369 -906 -532 -13 -880 -1203 72 118 -772 -216 -100 -477 111 471 -180
$$ packed form
1288b247K177J45j253J060R21j002j27O64m27J17L26n46L96J084m27q85R06J59
1306A041j573M2J204n38o38Q42O2q62o2l6l91L86q9j49L25P35m04l03L68j0l79
1327d29M38L20r1K68N97k10m82K07k88j34M1J96k45J75K51m60k90n85p2M34j77
1348e36k50J84N08Q7l54m4J90k44J64K42J73L2K68K47j8m87j07K60L85n36o4K93
1370C93O16o01p23K64l9l62k86M26J69l49K12L22k55o46J14M86K81k78k79R33
1390C98N31p09l85O30J33m87J43M51r9k58j0K08n40l76P5L66mn60j06N75J8m83
1412d89n07L63L18m13J50Q86N0n27K72M06n96k32O91M35l34j97L17J12m1k48l13
1433A03q0M28q01k25J151k07j275L74N19q67l23J275M6q90N56J16l77N88L60o51
$$ plain form
1453 -180 -42 798 -78 -459 1212 1237 -252 351 1108 -624 -230 1184 461 -529 568 171 -1077 -37
1471 -37 322 -1041 -317 424 -1367 -1358 715 -4 -930 396 421 -1466 -126 1116 -15 68 1368 25
1489 25 -630 1156 1012 -394 734 1242 -938 -216 1118 -276 -852 761 62 -1417 -168 213 -1345
1506 -1345 -429 930 -716 -1206 491 -516 -1168 1030 1121 -844 55 862 -567 -39 1923 514 -973
1523 -973 762 606 -361 947 1204 -885 -628 856 -526 -787 635 -38 -1353 153 273 -1340 -537
1540 -537 457 -691 -581 823 -519 -1067 367 771 -193 785 663 -1104 -436 1375 719 541 1072 -366
1558 -366 -934 750 874 -82 -33 -238 -1347 -490 607 -354 -869 -104 -555 -871 173 -43 -664 -94 496
1577 496 38 196 254 -653 29 1356 770 324 295 -365 -184 1118 1117 -119 11 -482 -854 528 1325 -813
$$ packed form
1453a80J38Q40q76l81J671K5j489O03P57j732L94J414p23r90J097l97j248J040
1471c7L59j363P24P41j791RK073p19r26J326K5j887J340J242j131Q3J300j343
1489B5o55J786j44j406J128N08k180P22J334j394n76J613o99j479J249L81j558
1506a345R16J359j646m90J697j007o52K198R1j965Q99Q07j429N28J962j409j487
1523i73J735j56r67J308K57k089K57J484j382k61J422o73j315J506J20j613Q03
1540e37R94j148J10J404j342n48J434M04r64R78j22j767O68J811o56j78N31j438
1558c66n68J684J24r56M9k05j109Q57J097r61n15P65m51l16J044k16o21N70N90
1577D96m58J58N8r07O82J327n86m46k9o60J81J302jj236J30m93l72J382P97k138
$$ plain form
1597 -813 -1023 18 -1089 -812 1027 14 -1496 89 253 -816 577 1005 -1023 62 1742 -119
1613 -119 -634 1305 458 -726 1732 1415 -1635 -287 1444 -546 -65 1865 -976 -2249 1058 358
1629 358 -1708 792 521 -2489 -594 1657 -1318 -1022 1721 -464 -1940 1841 891 -1789 1070 2077
1645 2077 -1380 -161 2375 -716 -1005 2367 463 -1991 1263 1223 -2000 417 1854 -1915 -1150 1919
1661 1919 -1078 -2029 1623 54 -2534 856 1284 -2399 -414 1981 -1263 -966 2184 -371 -1655 1711
1677 1711 1237 -1571 935 1893 -1612 -67 2659 -541 -1648 1449 -233 -1882 1263 952 -2343 -624
1693 -624 1047 -1432 -844 1374 -1244 -1874 989 597 -1243 878 917 -1537 110 1889 -222 -370 1423
1710 1423 126 -574 1261 848 -911 376 947 -457 -75 657 -678 -877 594 -46 -750 -69 -518
$$ packed form
1597h13k10J041j107K77J839j013j510J585J64j069J393M28k028J085J680j861
1613a19n15J939q47j184K458l17l050J348J731j990M81J930k841j273L307p00
1629C58k066K500k71l010J895K251k975K96K743k185j476L781r50k680K859J007
1645B077l457J219K536l091k89L372j904k454L254m0l223K417J437l769P65L069
1661A919k997r51L652j569k588L390M28l683J985K395l244K97L150k555j284L366
1677A711m74k808K506R58l505J545K726l200j107L097j682j649L145l11l295J719
1693f24J671k479N88K218k618o30K863l92j840K121L9k454J647J779k111j48J793
1710A423j297p00J835m13j759J287N71j404L82P32j335j99J471o40p04O81m49
$$ plain form
1727 -518 -1105 137 686 -579 -588 -166 -318 57 826 170 -156 241 134 483 939 217 -67 400 277 -34
1747 -34 333 299 -277 -87 87 -457 -457 -238 -774 -252 411 -687 -866 166 -29 -987 376 501 -684 -327
1767 -327 615 357 236 778 -55 -125 834 206 -292 906 642 -877 -20 1230 -442 -985 565 125 -911
1786 -911 -301 109 -519 -367 10 -697 -240 192 -1037 -366 1059 157 -884 637 1082 -548 -196 1165
1804 1165 392 -276 282 588 257 176 -98 -172 443 17 -992 -25 703 -811 -794 588 45 -1233 -509
1823 -509 500 -235 -619 -167 87 164 -188 -117 401 786 -76 -59 729 762 -548 107 860 272 -551 21 692
1844 692 -129 -560 -324 244 -122 -560 -594 83 -233 -948 -226 320 -264 -620 245 633 -38 -338 338 796
1864 796 124 -133 271 804 265 25 293 526 76 -429 128 408 -437 -498 34 34 -532 -484 -118 32 -365
$$ packed form
1727e18n87J242N49j265rM22j52L75P69o56l26L97j07L49M56p22k84M67j23l11
1747c4L67l4n76J90J74n44%K19n36N22O63j098j79J032j95r58J363J25j185L57
1767c27R42k58j21N42q33p0R59o28m98J198k64j519Q57J250j672n43J550m40j036
1786i11O10M10o28J52L77p07M57M32j229O71J425r02j041J521M45j630L52J361
1804A165p73o68N58L06l31q1k74p4O15m26j009R67P28j514J7J382n43j278P24
1823e09J009p35l84M52K54P7l52P1N18L85q62J7P88L3j310O55P53n88q23N72O71
1844F92q21m31K36N68l66m38l4O77l16p15P22N46n84l56Q65L88o71l00O76M58
1864G96o72k57M04N33n39k40K68K33m50n05N57K80q45o1N32%n66M8L66J50l97
$$ plain form
1885 -365 -870 -139 216 -353 -369 182 323 -80 26 206 114 354 290 557 546 326 152 418 435 -193 -288 141
1907 141 83 -411 118 -109 -577 -289 -171 -640 -355 232 -400 -558 115 89 -463 224 225 -626 -113 666 -68
1928 -68 252 1129 119 -400 950 323 -970 522 1312 -692 -477 834 -518 -682 607 -226 -1343
1945 -1343 299 -238 -1448 607 1191 -1528 -720 1741 -943 -1662 1824 1390 -1633 589 1574 -1166
1961 -1166 44 1931 -375 -544 1509 -637 -1414 2375 1139 -2541 186 1643 -2541 -1194 2897
1976 2897 -192 -2451 1237 531 -2235 434 1034 -1785 497 2015 -1921 -744 2781 -609 -1825
1991 -1825 2919 1293 -3583 44 3066 -656 -183 2457 -1143 -2614 1293 921 -590 1585 -360
2006 -360 -3551 638 2784 -1761 -1500 1723 -1419 -2628 2260 1838 -1983 -189 1491 -497 43 1011
$$ packed form
1885c65n05P31L55n69j6N51J41m03J06J80r2K40o4K67j1k20j74K66J7o28r5M29
1907A41n8m94N29k27m68K88J18m69K85N87o32j58O73k6n52O87Jq51N13P79p34
1928f8L20Q77j010n19J350o27j293J492P90k004K15J311j352j64J289q33j117
1945a343J642n37j210K055N84k719Q08K461k684p19L486m34l023K222R85k740
1961a166J210J887k306j69K053k146p77L789j236l680K727J457m184J347M091
1976B897l089k259L688p06k766K669O00k819K282J518l936J177L525l390j216
1991a825M744j626m876L627L022l722M73K640l600j471L907l72j511K175j945
2006c60l191M189K146m545K61L223l142j209M888m22l821J794J680j988N40R68
$$ plain form
2022 1011 -1003 -180 2203 363 -496 1142 -606 -2232 1271 2793 -800 -1898 -426 -281 442 1341
2038 1341 201 -1552 -2054 -1141 1045 2260 78 -1857 -723 81 284 921 108 -675 42 472 439 1459
2056 1459 56 -1844 688 2201 -945 -1224 1190 -371 -961 2565 1123 -3068 -1381 346 -1174
2071 -1174 1280 2450 -3031 -2794 2364 90 -1528 2604 72 -4832 827 4290 -1434 -471 3059
2086 3059 -1968 -2475 3861 697 -3363 2321 2254 -3650 964 3521 -3751 -2194 4294 -1079 -3583 2994
2102 2994 504 -4773 2262 3565 -4392 -1266 3528 -3038 -2163 5432 148 -4522 2961 2037 -4260
2117 -4260 1679 4338 -3772 -1204 4927 -1900 -3051 4567 552 -4985 2438 2537 -5017 253 4492
2132 4492 -3130 -2627 3972 -1559 -3872 3652 1356 -4376 1598 2822 -3773 -27 4559 -2474 -2702
$$ packed form
2022A011k014Q23K383j840q59J638j748j626L503J522l593j098J472J45P23Q99
2038A341j140j753n02R13K186J215k182j935J134Q04K03O37q13p83P17M30l3J020
2056A459j403j900K532J513l146k79K414j561n90L526j442m191J687J727j520
2071a174K454J170n481K37N158k274j618M132k532m904N659L463n724R63L530
2086C059n027n07O336l164m060N684o7n904M614K557p272J557O488n373k504O577
2102B994k490n277P035J303p957L126M794o566Q75P595n284m670P483r24o297
2117d260N939K659q110K568O131o827j151P618m015n537P423R9p554N270M239
2132D492p622N03O599n531k313P524k296n732N974J224o595L746M586p033k28
$$ plain form
2147 -2702 4071 236 -3260 2896 2189 -3504 910 3018 -2652 -979 3067 -1390 -1944 3131 -508
2162 -508 -3595 2094 1730 -3334 -75 2266 -2527 -1184 2874 -239 -1829 1460 -247 -1995 1635
2177 1635 1736 -1591 404 1347 -1598 267 2548 -638 -1607 1250 284 -991 874 609 -977 198
2193 198 488 -1354 -52 679 -977 -330 889 -1029 -1019 938 218 -973 658 305 -795 468 628
2210 628 -239 796 831 -1265 -154 1432 18 -210 1255 -434 -1355 1084 553 -1090 64 588 -1366
2227 -1366 47 940 -1213 -516 1279 -809 -1506 1179 267 -1594 1156 1236 -1464 -96 1629 -868
2243 -868 -477 1874 -7 -1104 1384 406 -1634 1227 1439 -1741 -595 1276 -1037 -629 1809 -529
2259 -529 -2039 992 547 -1683 529 1194 -1549 -250 1488 -783 -1044 1765 170 -1138 1181 913
$$ packed form
2147b702O773l835l496O156p07n693M414K108n670J673M046m457n54N075l639
2162e08l087N689l64n064L259K341m793J343M058l113j590L289j707j748L630
2177A635J01l327J995R43k945J865K281l186r69K857r66j275J865k65j586J175
2193A98K90j842J302P31j656O47J219j918J0J957p20j191J631l53j100J263J60
2210F28q67J035L5k096J111J586j414k28J465j689r21K439n31j643J154N24j954
2227a366J413Q93k153O97J795k088o97K685r12j861K750Q0k700J368J725k497
2243h68L91K351j881j097K488r78k040K861K12l180J146J871k313M08K438k338
2259e29j510L031m45k230K212O65k743J299J738k271k61K809j595j308K319k68
$$ plain form
2275 913 -1301 543 1458 -904 -240 1400 -649 -1119 1259 254 -1289 688 331 -1524 -23 997
2291 997 -905 -715 490 -650 -791 987 378 -1180 169 445 -611 213 1041 -392 -188 934 201
$$ packed form
2275I13k214J844R15k362O64J640k049m70K378j005j543J977l57j855J501J020
2291I97j902J90J205j140j41J778o09j558J349K76j056Q24Q28j433K04J122p33
$$ [...]
8191A23
##END NTUPLES=NMR FID
##END=
