##TITLE=1H_LR-743-M5
 D2O
 8 sc, 
 9.02.2022
##JCAMPDX= 6.0         $$ Bruker NMR JCAMP-DX V2.0
##DATA TYPE= NMR FID
##DATA CLASS= NTUPLES
##ORIGIN= UXNMR, Bruker Analytische Messtechnik GmbH
##OWNER= root
$$ XWIN-NMR		Version 3.5
$$ Wed Feb  9 13:57:59 2022 Russian Standard Time (UT+4h)  she@DPX200
##.OBSERVE FREQUENCY= 200.131346
##.OBSERVE NUCLEUS= ^1H
##.DELAY= (6, 6)
##.ACQUISITION MODE= SIMULTANEOUS
##.ACQUISITION SCHEME= undefined
##.AVERAGES= 8
##.DIGITISER RES= 18
##SPECTROMETER/DATA SYSTEM= spect
##.PULSE SEQUENCE= zg30
##.SOLVENT NAME= D2O
##.SHIFT REFERENCE= (INTERNAL, D2O, 0, 15.7039)
##AUDIT TRAIL= $$ (NUMBER, WHEN, WHO, WHERE, WHAT)
$$ ##TITLE= Audit trail, XWIN-NMR		Version 3.5
$$ ##JCAMPDX= 5.01
$$ ##ORIGIN= Bruker BioSpin GmbH
$$ ##OWNER= she
$$ F:/spectra/data/she/nmr/H-F/1/audita.txt
$$ ##AUDIT TRAIL=  $$ (NUMBER, WHEN, WHO, WHERE, WHAT)
(   1,<2022-02-09 13:56:35.59 +0400>,<she>,<DPX200>,
      <created by zg, POWCHK disabled, PULCHK disabled
       configuration hash MD5:
       00 E9 B6 7A A2 85 ED C7 34 08 36 98 17 FE 4E 26
       data hash MD5: 16K
       D0 AE 86 16 9F FC 04 47 06 F4 3E 69 25 A0 45 6A>)
$$ ##END=
$$ 
$$ hash MD5
$$ F8 CE C8 8F 22 82 F9 18 61 18 2C 5B 0A DC B4 9F
##$RELAX= 
##$RELAX= 
##$RELAX= 
##$RELAX= 
##$RELAX= 
##$RELAX= 
$$ Bruker specific parameters
$$ --------------------------
##$DU= <F:/spectra>
##$EXPNO= 1
##$NAME= <H-F>
##$PROCNO= 1
##$TYPE= <nmr>
##$USER= <she>
##$AMP= (0..31)
100 100 100 100 100 100 100 100 100 100 100 100 100 100 100 100 100 100 
100 100 100 100 100 100 100 100 100 100 100 100 100 100 
##$AQSEQ= 0
##$AQ_mod= 1
##$AUNM= <au_zg>
##$AUTOPOS= <>
##$BF1= 200.13
##$BF2= 200.13
##$BF3= 200.13
##$BF4= 200.13
##$BF5= 200.13
##$BF6= 200.13
##$BF7= 200.13
##$BF8= 200.13
##$BYTORDA= 1
##$CFDGTYP= 0
##$CFRGTYP= 5
##$CHEMSTR= <none>
##$CNST= (0..31)
1 1 145 1 1 1 1 1 1 1 1 1 1 1 1 1 1 1 1 1 1 1 1 1 1 1 1 1 1 1 1 1 
##$CPDPRG= <>
##$CPDPRG1= <>
##$CPDPRG2= <>
##$CPDPRG3= <>
##$CPDPRG4= <mlev>
##$CPDPRG5= <mlev>
##$CPDPRG6= <mlev>
##$CPDPRG7= <mlev>
##$CPDPRG8= <mlev>
##$CPDPRGB= <>
##$CPDPRGT= <>
##$D= (0..31)
0 1.2 0 0 0 0 0 0 0 0.06 0 0.03 0 0 0 0 0.0002 0 0 0 0 0 0 0 0 0 0 0 0 
0 0 0 
##$DATE= 1644400595
##$DBL= (0..7)
120 120 120 120 120 120 120 120 
##$DBP= (0..7)
150 150 150 150 150 150 150 150 
##$DBP07= 0
##$DBPNAM0= <>
##$DBPNAM1= <>
##$DBPNAM2= <>
##$DBPNAM3= <>
##$DBPNAM4= <>
##$DBPNAM5= <>
##$DBPNAM6= <>
##$DBPNAM7= <>
##$DBPOAL= (0..7)
0.5 0.5 0.5 0.5 0.5 0.5 0.5 0.5 
##$DBPOFFS= (0..7)
0 0 0 0 0 0 0 0 
##$DE= 6
##$DECBNUC= <off>
##$DECIM= 32
##$DECNUC= <off>
##$DECSTAT= 4
##$DIGMOD= 1
##$DIGTYP= 9
##$DL= (0..7)
0 120 120 120 120 120 120 120 
##$DP= (0..7)
150 150 150 150 150 150 150 150 
##$DP07= 0
##$DPNAME0= <>
##$DPNAME1= <>
##$DPNAME2= <>
##$DPNAME3= <>
##$DPNAME4= <>
##$DPNAME5= <>
##$DPNAME6= <>
##$DPNAME7= <>
##$DPOAL= (0..7)
0.5 0.5 0.5 0.5 0.5 0.5 0.5 0.5 
##$DPOFFS= (0..7)
0 0 0 0 0 0 0 0 
##$DQDMODE= 0
##$DR= 18
##$DS= 0
##$DSLIST= <SSSSSSSSSSSSSSS>
$$ [...]
##$SUBNAM2= <"">
##$SUBNAM3= <"">
##$SUBNAM4= <"">
##$SUBNAM5= <"">
##$SUBNAM6= <"">
##$SUBNAM7= <"">
##$SUBNAM8= <"">
##$SUBNAM9= <"">
##$SW= 18.0517287032376
##$SWIBOX= (0..15)
0 0 2 0 0 0 0 0 0 0 0 0 0 0 0 0 
##$SW_h= 3612.71676300578
##$TD= 16384
##$TD0= 1
##$TE= 0
##$TE2= 300
##$TE3= 300
##$TEG= 300
##$TL= (0..7)
0 120 120 120 120 120 120 120 
##$TP= (0..7)
150 150 150 150 150 150 150 150 
##$TP07= 0
##$TPNAME0= <>
##$TPNAME1= <>
##$TPNAME2= <>
##$TPNAME3= <>
##$TPNAME4= <>
##$TPNAME5= <>
##$TPNAME6= <>
##$TPNAME7= <>
##$TPOAL= (0..7)
0.5 0.5 0.5 0.5 0.5 0.5 0.5 0.5 
##$TPOFFS= (0..7)
0 0 0 0 0 0 0 0 
##$TUNHIN= 0
##$TUNHOUT= 0
##$TUNXOUT= 0
##$USERA1= <user>
##$USERA2= <user>
##$USERA3= <user>
##$USERA4= <user>
##$USERA5= <user>
##$V9= 5
##$VALIST= <valist>
##$VCLIST= <CCCCCCCCCCCCCCC>
##$VD= 0
##$VDLIST= <DDDDDDDDDDDDDDD>
##$VPLIST= <PPPPPPPPPPPPPPP>
##$VTLIST= <TTTTTTTTTTTTTTT>
##$WBST= 1024
##$WBSW= 4
##$XGAIN= (0..3)
0 0 0 0 
##$XL= 0
##$YL= 0
##$YMAX_a= 107676
##$YMIN_a= -139549
##$ZGOPTNS= <>
##$ZL1= 120
##$ZL2= 120
##$ZL3= 120
##$ZL4= 120
##$ABSF1= 10
##$ABSF2= 0
##$ABSG= 5
##$ABSL= 3
##$ALPHA= 0
##$AQORDER= 0
##$ASSFAC= 0
##$ASSFACI= 0
##$ASSFACX= 0
##$ASSWID= 0
##$AUNMP= <proc_1d>
##$AZFE= 0.1
##$AZFW= 0.1
##$BCFW= 1
##$BC_mod= 2
##$BYTORDP= 1
##$COROFFS= 0
##$CY= 11.3945322036743
##$DATMOD= 1
##$DC= 2
##$DFILT= <>
##$DTYPP= 0
##$F1P= 2.36226072786647
##$F2P= -0.459571619588291
##$FCOR= 0.5
##$FTSIZE= 0
##$FT_mod= 4
##$GAMMA= 1
##$GB= 0.15
##$INTBC= 1
##$INTSCL= 1
##$ISEN= 128
##$LB= 0.24
##$LEV0= 0
##$LPBIN= 0
##$MAXI= 10000
##$MC2= 0
##$MEAN= 0
##$ME_mod= 0
##$MI= 1.114404
##$NCOEF= 0
##$NC_proc= 0
##$NLEV= 6
##$NOISF1= 3.799351
##$NOISF2= 2.8
##$NSP= 1
##$NTH_PI= 0
##$NZP= 0
##$OFFSET= 15.70392
##$PC= 1
##$PHC0= -15949.08
##$PHC1= 5.80078
##$PH_mod= 1
##$PKNL= yes
##$PPARMOD= 0
##$PSCAL= 0
##$PSIGN= 0
##$REVERSE= no
##$SF= 200.130013532006
##$SI= 16384
##$SIGF1= 3
##$SIGF2= 2
##$SINO= 400
##$SIOLD= 16384
##$SREGLST= <1H.CDCl3>
##$SSB= 0
##$STSI= 0
##$STSR= 0
##$SW_p= 3612.71676300578
##$SYMM= 0
##$S_DEV= 0
##$TDeff= 0
##$TDoff= 0
##$TI= <>
##$TILT= no
##$TM1= 0
##$TM2= 0
##$TOPLEV= 0
##$USERP1= <user>
##$USERP2= <user>
##$USERP3= <user>
##$USERP4= <user>
##$USERP5= <user>
##$WDW= 1
##$XDIM= 8192
##$YMAX_p= 0
##$YMIN_p= 0
$$ End of Bruker specific parameters
$$ ---------------------------------
##NTUPLES= NMR FID
##VAR_NAME=  TIME,          FID/REAL,        FID/IMAG
##SYMBOL=    X,             R,               I
##VAR_TYPE=  INDEPENDENT,   DEPENDENT,       DEPENDENT
##VAR_FORM=  AFFN,          ASDF,            ASDF
##VAR_DIM=   8192,          8192,            8192
##UNITS=     SECONDS,       ARBITRARY UNITS, ARBITRARY UNITS
##FACTOR=    0.0002768,     1,               1
##FIRST=     0,             0,               0
##LAST=      2.2672688,     0,               0
##MIN=       0,             -139549,         0
##MAX=       2.2672688,     107676,          0
$$ Real data points
##PAGE= N=1
##DATA TABLE= (X++(R..R)), XYDATA
$$ plain form
0 0 0 0 0 0 0 0 0 0 0 0 0 0 0 0 0 0 0 0 0 0 0 -8 8 -8 8 -8 8 -8 16 -16 16 -18 24 -24 28 -32 36 -40 44 -48 55 -60
42 -60 68 -73 82 -92 100 -108 119 -132 147 -161 178 -195 217 -241 267 -301 336 -381 437 -506 597
63 597 -717 892 -1163 1624 -2591 5406 -31137 -139549 -89148 11883 27516 -9310 22635
76 22635 93602 83581 -19242 -94126 -82024 -34924 -2025 33778 69313 65043 19432 -16176
88 -16176 -30841 -57451 -81599 -37918 60988 107676 52591 -16911 -20791 -6052 -43871 -86570
100 -86570 -43446 57376 99768 52712 -3181 -16699 -25420 -55187 -62720 -16306 42235 62330
112 62330 49970 29849 -3422 -50577 -73232 -43341 7598 34437 39527 45648 40504 461 -52615
125 -52615 -69669 -40397 1397 30796 48336 50384 26308 -13338 -41174 -47178 -39999 -18556 22735
$$ packed form
0@%%%%%%%%%%%%%%%%%%%%%qJ6j6J6j6J6j6K4l2L2l4M2m8N2o0O8p6Q4r2J03j15
42f0J28j41J55j74J92k08K27k51K79l08L39l73M12m58N08n68O37p17Q18r43J103
63E97j314J609k055K787m215P997l6543j08412N0401J01031J5633l6826L1945
76B2635P0967j0021j02823p4884J2102M7100L2899L5803L5535m270m5611l5608
88a6176j4665k6610k4148M3681R8906M6688n5085o9502l880J4739l7819m2699
100h6570M3124J00822M2392m7056n5893j3518q721k9767p533M6414N8541K0095
112F2330j2360k0121l3271m7155k2655K9891N0939K6839N090O121n144m0043n3076
125e2615j7054K9272M1794K9399J7540K048k4076l9646k7836o004P179K1443M1291
$$ plain form
138 22735 61707 60218 16997 -25869 -39191 -35666 -32550 -19359 15536 52383 58475 27483 -17279
151 -17279 -48271 -50278 -26163 3567 20160 28240 40281 41815 5737 -51903 -71818 -30106 22295
164 22295 32176 17566 23952 39384 15370 -42417 -69986 -37161 13194 34427 32076 29300 21713
177 21713 -2504 -30672 -42435 -35392 -13928 21406 53505 49374 7379 -28046 -27408 -17300 -27000
190 -27000 -30170 8977 60013 58903 5867 -33994 -29218 -16644 -24367 -23384 12258 50404 46844
203 46844 10967 -17522 -28189 -34167 -31084 -5907 26618 37699 26828 14429 1248 -24956
215 -24956 -48579 -36932 5065 34338 30853 19098 16668 5095 -26498 -48484 -31900 5320
227 5320 26898 28373 26928 20689 -3703 -33913 -40527 -20217 2237 14762 26702 36259 24010
$$ packed form
138B2735L8972j489m3221m2866j3322L525L116J3191L4895L6847O092l0992m4762
151a7279l0992k007K4115K9730J6593Q080J2041J534l6078n7640j9915M1712N2401
164B2295R881j4610O386J5432k4014n7787k7569L2825N0355K1233k351k776p587
177B1713k4217k8168j1763P043K1464L5334L2099m131m1995l5425O38J0108r700
190b7000l170L9147N1036j110n3036l9861M776J2574p723R83L5642L8146l560
203D6844l5877k8489j0667n978L083K5177L2525J1081j0871j2399j3181k6204
215b4956k3623J1647M1997K9273l485j1755k430j1573l1593k1986J6584L7220
227E320K1578J475j445o239k4392l0210o614K0310K2454J2525J1940R557j2249
$$ plain form
240 24010 -10888 -38185 -35341 -15198 277 11664 27113 35892 21325 -9825 -32695 -34306 -21174
253 -21174 -2239 18056 31654 29319 12862 -6682 -22679 -32596 -28986 -6265 23395 36713 26185
266 26185 6918 -7186 -18329 -29205 -29061 -8618 20749 36305 28937 9027 -9839 -22459 -27508
279 -27508 -22464 -6622 14557 30725 31784 14962 -10321 -27957 -28747 -17351 -2797 12085 26000
292 26000 30648 17471 -8076 -28060 -30227 -18050 -1465 14097 25638 27207 14949 -5925 -23922
305 -23922 -29817 -21343 -2749 16904 27591 24610 11407 -5374 -20450 -28305 -22715 -3864 17493
318 17493 28092 23853 10411 -5643 -20144 -27418 -21379 -3400 16131 26371 23866 11512 -5737
331 -5737 -21311 -27192 -19328 -2134 15011 24662 23597 12064 -5783 -21541 -26568 -18312 -1928
$$ packed form
240B4010l4898k7297K844K0143J5475J1387J5449Q779j4567l1150k2870j611J3132
253b1174J8935K0295J3598k335j6457j9544j5997r917L610K2721K9660J3318j0528
266B6185j9267j4104j1143j0876J44K0443K9367J5556p368j9910j8866j2620n049
279b7508N044J5842K1179J6168J059j6822k5283j7636p90J1396J4554J4882J3915
292B6000M648j3177k5547j9984k167J2177J6585J5562J1541J569j2258k0874j7997
305b3922n895Q474J8594J9653J0687k981j3203j6781j5076p855N590J8851K1357
318A7493J0599m239j3442j6054j4501p274O039J7979J9531J0240k505j2354j7249
331e737j5574n881P864J7194J7145R651j065j1533j7847j5758n027Q256J6384
$$ plain form
344 -1928 14440 24127 23208 11502 -6097 -20915 -25436 -17791 -2234 14076 23964 22806 10845 -6300
358 -6300 -20409 -24653 -17252 -2085 13770 23294 22143 10595 -6110 -20023 -24221 -16810 -1803
371 -1803 13623 22742 21475 10136 -6120 -19380 -23316 -16483 -2259 13167 22768 21408 9473
384 9473 -6583 -18726 -22007 -15921 -2831 12438 22579 21344 9181 -6730 -18373 -21441 -15429
397 -15429 -2460 12299 21656 20343 9175 -5926 -18059 -21883 -15346 -1398 12855 20531 18810
410 18810 9103 -4878 -17505 -22143 -15332 -828 13101 19963 18054 8721 -4916 -17187 -21323
423 -21323 -14624 -1080 12291 19823 18512 8462 -5937 -17301 -19901 -13401 -1553 11067 19573
436 19573 19064 8436 -6614 -17403 -19062 -12618 -1523 10660 19092 18549 8206 -6263 -16925
$$ packed form
344a928J6368R687r19j1706j7599j4818m521P645J5557J6310R888j158j1961j7145
358f300j4109m244P401J5167J5855R524j151j1548j6705j3913m198P411J5007
371a803J5426R119j267j1339j6256j3260l936O833J4224J5426R601j360j1935
384I473j6056j2143l281O086J3090J5269J0141j235j2163j5911j1643l068O012
397a5429J2969J4759R357j313j1168j5101j2133l824O537J3948J4253P676j721
410A8810r707j3981j2627m638O811J4504J3929O862j909r333j3637j2271m136
423b1323O699J3544J3371P532j311j0050j4399j1364k600O500J1848J2620Q506
436A9573n09j0628j5050j0789j659O444J1095J2183Q432n43j0343j4469j0662
$$ plain form
449 -16925 -19096 -12766 -1034 11295 18649 17161 7606 -5300 -15847 -19303 -13485 -796 12133
462 12133 18515 15926 6873 -4622 -14726 -19058 -13990 -1027 12397 18554 15366 6280 -4524 -14025
476 -14025 -18447 -13925 -1313 12208 18504 15167 5914 -4710 -13754 -17824 -13449 -1438 11631 18143
490 18143 15335 6036 -5156 -14166 -17215 -12208 -1208 10355 17135 16038 7058 -5816 -15628 -16819
504 -16819 -10009 -328 8661 15450 16734 8621 -6137 -17243 -16932 -8286 779 7782 14058 16441 9159
519 9159 -5653 -17053 -17076 -8676 872 8776 14537 14991 7274 -5075 -14501 -16345 -10838 -480 10683
534 10683 16583 13455 4310 -4939 -11674 -15209 -12621 -1772 11732 17654 12647 3133 -4685 -10839
548 -10839 -15043 -12497 -1271 11512 16415 12181 4272 -3897 -11777 -15878 -11374 195 10810 14534
$$ packed form
449a6925k171O330J1732J2329P354j488r555j2906j0547l456N818J2689J2929
462A2133O382k589r053j1495j0104m332N068J2963J3424O157l188r086j0804r501
476a4025m422M522J2612J3521O296l337r253j0624r044m070M375J2011J3069O512
490A8143k808r299j1192r010l049N007J1000J1563O780j097q980j2874r812j191
504a6819O810R681Q989O789J284q113j4758j1106L11Q646R065P003O276K383p282
519I159j4812j1400k3Q400R548P904N761M54p717j2349r426j844N507J0358J1163
534A0683N900l128r145r249o735l535K588J0849J3504N922n007r514p818o154
548a0839m204K546J1226J2783M903m234p909q169p880m101M504J1569J0615L724
$$ plain form
562 14534 11892 5513 -3425 -12348 -15800 -10636 50 9946 14639 12610 4853 -4883 -11810 -13365 -9937
577 -9937 -2236 8338 16251 14573 3709 -7441 -11776 -10781 -8408 -3406 6408 15781 15646 4936 -7536
592 -7536 -13434 -11944 -6736 -341 6295 11746 13315 8127 -3552 -15074 -16771 -6824 4829 8784
606 8784 7619 8823 9631 1001 -14195 -19980 -8911 6348 11331 8117 6839 7026 584 -11197 -16782
621 -16782 -10314 1604 10379 13218 10262 2574 -5412 -9029 -9245 -9015 -5071 6477 17846 15362 193
636 193 -10788 -8990 -4814 -7163 -7140 4649 17928 15684 661 -9618 -9159 -7304 -7976 -3546 7611
651 7611 14641 10516 1987 -3682 -8357 -12934 -10497 1211 11546 11349 5832 3269 330 -8451 -15687
666 -15687 -10322 3292 10900 9295 6823 5499 -1171 -11639 -14240 -5655 3264 5716 7467 11384
$$ packed form
562A4534k642o379q938q923l452N164J0686R896M693k029p757r736o927j555L428
577i937P701J0574P913j678j0864j1150m335R95K373N002R814R373j35j0710j2472
592g536n898J490N208O395O636N451J569n188j1679j1522j697R947J1653L955
606H784j165J204Q08q630j5196n785J1069J5259M983l214j278J87o442j1781n585
621a6782O468J1918Q775K839k956p688p986l617k16K30L944J1548J1369k484j5169
636A93j0981J798M176k349K3J1789J3279k244j5023j0279M59J855o72M430J1157
651G611P030m125q529n669m675m577K437J1708J0335j97n517k563k939q781p236
666a5687N365J3614P608j605k472j324o670j0468k601Q585Q919K452J751L917
$$ plain form
680 11384 8650 -4585 -15642 -12274 -1390 3185 2483 6442 12861 9248 -4890 -15010 -12130 -3220
694 -3220 2522 5455 8594 9310 4691 -2640 -8713 -11886 -9700 -218 11051 13495 5688 -1637 -2071
709 -2071 -2787 -9641 -13465 -3636 12186 16578 6712 -3272 -4583 -3600 -7051 -9793 -4095 7192 14063
724 14063 11165 1710 -7270 -10324 -7109 -2695 -734 1809 8431 13496 7521 -6834 -14945 -9496 -102
739 -102 2549 1909 5957 11192 7544 -4186 -12507 -10917 -4006 2097 6358 8676 7259 2583 -2411
754 -2411 -6667 -10085 -8996 -414 9950 12052 5272 -914 -2196 -4177 -9347 -9802 -583 9834 11091
769 11091 5343 931 -1756 -6788 -10836 -6845 2529 7764 6811 5691 5042 -808 -10219 -12556 -4274
784 -4274 4666 6296 4962 6225 5753 -1625 -10202 -10707 -4056 2072 5381 8060 8173 2451 -5163 -7761
$$ packed form
680A1384k734j3235j1057L368J0884M575p02L959O419l613j4138j0120K880Q910
694c220N742K933L139P16m619p331o073l173K186R482J1269K444p807p325m34
709b071p16o854l824R829J5822M392r866r984j311R83l451k742N698J1287O871
724A4063k898r455q980l054L215M414J961K543O622N065n975j4355q111N449R394
739a02K651o40M048N235l648j1730q321J590O911O103M261K318j417m676m994
754b411m256l418J089Q582J0364K102o780o186j282j981n170m55R219J0417J257
769A1091n748m412k687n032m048L991R374N235r53j120o49n850r411k337Q282
784d274Q940J630j334J263m72p378q577n05O651O128L309K679J13n722p614k598
$$ plain form
800 -7761 -5774 -4511 -2873 4034 12161 10721 -386 -8444 -6511 -2660 -4073 -4602 3078 12319 10992
815 10992 294 -7620 -7406 -4667 -3625 -1275 4215 8542 7743 2947 -3034 -8314 -9674 -4561 3349
830 3349 6942 5193 3730 4068 667 -7672 -12134 -5931 4496 8387 5361 2917 2891 20 -6528 -10039
846 -10039 -5845 2029 7114 7619 5236 1242 -3290 -6301 -6525 -4432 -491 4931 8937 7475 868
861 868 -5241 -6763 -5205 -3470 -744 4246 8389 7242 1292 -4435 -6810 -6294 -3861 537 5302 7364
877 7364 5543 1511 -2793 -6298 -7423 -4519 1254 5953 6937 4913 1571 -2549 -6294 -7147 -4000 1067
893 1067 5065 6760 5833 1962 -3479 -7034 -6325 -2823 830 3885 6410 6531 2359 -3869 -7354 -6118
909 -6118 -2518 957 3968 6222 5924 2041 -3273 -6619 -6427 -3395 1034 4992 6483 4803 1220 -2582
$$ packed form
800g761J987J263J638O907Q127j440j1107q058J933L851j413n29P680R241j327
815A0992j0698p914K14K739J042K350N490M327p99m796n981n280j360N113P910
830C349L593j749j463L38l401q339m462O203J0427L891l026k444k6k871o548l511
846a0039M194P874N085N05k383l994m532l011k24K093L941N422M006j462o607
861H68o109j522J558J735K726M990M143j147n950n727k375N16K433M398M765K062
877G364j821m032m304l505j125K904N773M699R84k024l342m120l745q53L147N067
893A067L998J695r27l871n441l555P09L502L653L055K525J21m172o228l485J236
909f118L600L475L011K254k98l883n314l346J92L032M429L958J491j680l583l802
$$ plain form
925 -2582 -5491 -6493 -4276 858 5612 6794 4371 764 -2494 -5100 -6196 -4182 679 5310 6686
940 6686 4618 931 -2797 -5412 -5896 -3585 716 4733 6346 4853 1157 -2942 -5607 -5723 -3290 711
956 711 4534 6199 4805 1093 -2957 -5457 -5552 -3240 689 4464 6082 4726 1116 -2930 -5522 -5509
972 -5509 -2922 940 4174 5567 4716 1614 -2755 -5940 -5722 -2456 1410 3915 4973 4592 1965 -2525
988 -2525 -5981 -5811 -2482 1399 4015 5088 4355 1413 -2594 -5256 -5254 -2992 611 4253 5961 4327
1004 4327 395 -3008 -4408 -4431 -3288 -141 4237 6429 4417 98 -3173 -4359 -4335 -3012 246 4049
1020 4049 5651 4142 878 -2521 -4962 -5240 -2587 1474 4107 4376 3491 1724 -1663 -5324 -5966 -2480
1036 -2480 2056 4202 4051 3251 1573 -1791 -5039 -5354 -2498 1220 3847 4882 3948 774 -2920 -4599
$$ packed form
925b582k909j002K217N134M754J182k423l607l258k606j096K014M861M631J376
940F686k068l687l728k615m84K311M301M017J613j493l696m099k665j16K433M001
956G11L823J665j394l712m050k500r5K312L929L775J618j356l610m046k592J3
972e509K587L862L234J393q51l102m369l185K18L266L866K505J058l81k627m490
988b525l456J70L329L881K616J073p33k942m007k662KK262L603L642J708j634
1004D327l932l403j400k3J143L147M378K192k012m319l271j186K4J323L258L803
1020D049J602j509l264l399k441k78K653M061K633K69q85j767l387l661o42L486
1036b480M536K146j51q00j678l364l248l15K856L718K627J035r34l174l694j679
$$ plain form
1052 -4599 -3910 -2238 8 3173 5668 4724 348 -3702 -4519 -3303 -1994 -107 3031 5391 4408 571
1068 571 -3041 -4530 -4137 -2259 926 3843 4509 3034 818 -1630 -4210 -5286 -2905 1760 4691 4113
1084 4113 2136 640 -1160 -3852 -5200 -2995 1416 4392 4433 2776 426 -2211 -4061 -3943 -2066 556
1100 556 3079 4741 4125 618 -3425 -4670 -3052 -1058 300 2210 4507 4499 928 -3404 -4851 -3356
1116 -3356 -1137 805 2745 4058 3439 832 -2272 -4193 -4230 -2132 1357 3938 3912 2165 350 -1321
1132 -1321 -3440 -4616 -2783 1458 4397 3988 1935 208 -1414 -3440 -4274 -2326 1284 3727 3851 2625
1148 2625 551 -2128 -4033 -3690 -1408 1138 2832 3715 3280 804 -2627 -4322 -3311 -1091 900 2580
1164 2580 3838 3292 493 -2714 -3878 -3045 -1487 484 2901 4277 3036 -130 -2641 -3239 -2806 -1891
$$ packed form
1052d599O89J672K246L165K495r44m376m050q17J216J309J887L138K360r83l837
1068E71l612j489L93J878L185K917O66j475k216k448k580j076K381M665K931n78
1084D113j977j496j800k692j348K205M411K976M1j657k350k637j850J18J877K622
1100E56K523J662o16l507m043j245J618J994J358J910K297ql571m332j447J495
1116c356K219J942J940J313o19k607l104j921l7K098L489K581k6j747j815j671
1132a321k119j176J833M241K939m09k053j727j622k026q34J948L610K443J24j226
1148B625k074k679j905L43K282K546J694Q83m35k476l431j695J011K220J991J680
1164B580J258n46k799l207j164Q33J558J971K417J376j241l166k511n98M33R15
$$ plain form
1180 -1891 196 3128 4483 2867 -348 -2589 -3133 -2822 -1774 425 3023 4052 2743 131 -2287
1195 -2287 -3542 -3250 -1410 1111 2893 3269 2469 728 -1772 -3858 -3789 -1305 1700 3037 2742 2027 936
1212 936 -1310 -3762 -4063 -1475 1853 3295 2720 1738 688 -1193 -3416 -3866 -1667 1581 3359 3072
1228 3072 1781 245 -1515 -3075 -3309 -1683 993 3125 3584 2189 -200 -2171 -2859 -2487 -1483 275
1244 275 2636 3981 2752 -441 -2869 -2898 -1816 -1091 -117 2108 3999 3134 -275 -3103 -3215 -1808 -704
1261 -704 252 1927 3425 2924 247 -2538 -3520 -2539 -606 1203 2280 2580 2107 711 -1547 -3533 -3448
1278 -3448 -935 1938 2898 2153 1321 641 -965 -3145 -3644 -1358 1795 3174 2507 1226 97 -1278
1294 -1278 -2690 -2962 -1454 1034 2916 3127 1729 -381 -1956 -2505 -2230 -1290 519 2596 3369 1972
$$ packed form
1180a891K087K932J355j616l215k241n44L11J048K199K598J029j309k612k418
1195b287j255K92J840K521J782L76q00j741k500k086O9K484L005J337k95p15j091
1212I36k246k452l01K588L328J442n75r82j050j881k223m50K199L248J778k87
1228C072j291j536j760j560k34J626K676K132M59j395k389j971o88L72J004J758
1244B75K361J345j229l193k428k9J082P25R74K225J891q65l409k828j12J407J104
1261g04R56J675J498n01k677k785r82R81J933J809J077L00m73j396k258j986Q5
1278c448K513K873R60p45q32o80j606k180m99K286L153J379o67j281j129j375
1294a278j412k72J508K488J882K11j398k110j575n49K75R40J809K077P73j397
$$ plain form
1310 1972 -467 -2085 -2445 -2189 -1265 672 2728 3137 1601 -382 -1616 -2344 -2584 -1426 1026 2978
1326 2978 2860 1265 -287 -1453 -2422 -2594 -1198 1029 2538 2703 1801 40 -2066 -3029 -2025 -204
1342 -204 835 1386 2424 2819 668 -2792 -3828 -1643 713 937 752 2062 2992 956 -2607 -3834
1358 -3834 -1982 331 1244 1582 2072 1834 296 -1546 -2595 -2581 -1261 1289 3249 2667 340 -950 -671
1375 -671 -1126 -2746 -2556 915 4076 3220 -31 -1556 -804 -901 -2301 -2165 673 3294 3010 913 -756
1392 -756 -1607 -2158 -1918 -548 981 1747 2063 2010 515 -2147 -3450 -1868 581 1362 1033 1546 2218 816
1410 816 -2124 -3404 -1857 292 1157 1465 2023 1783 -59 -1997 -2359 -1565 -641 542 2143 2795 1379
1427 1379 -892 -1929 -1689 -1383 -971 456 2284 2679 1234 -594 -1670 -2059 -1817 -527 1238 2092 1703
$$ packed form
1310A972k439j618l60K56R24J937K056M09j536j983j234p28k40J158K452J952
1326B978j18j595j552j166r69j72J396K227J509J65r02j761k106r63J004J821
1342b04J039N51J038L95k151l460j036K185K356K24j85J310R30k036l563j227
1358c834J852K313R13L38M90k38j538j842j049J4J320K550J960n82k327j290K79
1375f71m55j620J90L471L161q56l251j525P52r7j400J36K838K621k84k097j669
1392g56q51n51K40J370J529P66L16n3j495k662j303J582K449P81l29N13O72j402
1410H16k940j280J547K149Q65L08N58k40j842j938l62P94R24J183J601O52j416
1427A379k271j037K40L06M12J427J828L95j445j828j076l89K42J290J765Q54l89
$$ plain form
1444 1703 1001 294 -1140 -2715 -2512 -186 1985 2071 1101 714 490 -882 -2587 -2505 -421 1653 2235 1689
1462 1689 751 -339 -1355 -1804 -1570 -827 515 2186 2762 1239 -1188 -2128 -1336 -669 -809 -180 1840
1479 1840 3068 1606 -1123 -2305 -1612 -756 -407 362 1666 2212 1328 -294 -1639 -2203 -1724 -169 1442
1496 1442 1839 1224 710 325 -882 -2430 -2367 -211 1859 1996 1035 526 229 -920 -2230 -2013 -251 1363
1514 1363 1812 1544 962 -204 -1559 -2011 -1248 -141 703 1467 1987 1365 -456 -1935 -1889 -925 -126 554
1532 554 1476 1993 1183 -497 -1642 -1748 -1229 -377 839 1869 1788 636 -544 -1170 -1529 -1565 -640 1038
1550 1038 2107 1684 420 -569 -1101 -1489 -1474 -518 980 1883 1663 701 -452 -1384 -1704 -1195 -133 857
1568 857 1469 1605 1028 -262 -1580 -1903 -1101 55 879 1315 1473 1008 -221 -1477 -1847 -1195 -63 940
$$ packed form
1444A703p02p07j434j575K03K326K171Q6r70l87k24j372j705Q2K084K074N82n46
1462A689r38j090j016m49K34P43J342J671N76j523k427r40P92O67j40O29K020
1479A840J228j462k729j182O93Q56L49P69J304N46q84j622j345n64M79J555J611
1496A442L97o15n14l85j207j548O3K156K070J37r61n09k97j149j310K17J762J614
1514A363M49k68n82j166j355m52P63J107Q44P64N20o22j821j479M6R64P99O80
1532E54R22N17q10j680j145j06N19Q52J216J030q1j152j180o26l59l6R25J678
1550A038J069m23j264r89n32l88J5R56J498R03k20r62j153r32l20N09J062R90
1568H57O12J36n77j290j318l23Q02J156Q24M36J58m65j229j256l70O52J132J003
$$ plain form
1586 940 1504 1439 741 -333 -1269 -1643 -1279 -261 962 1657 1468 586 -420 -1204 -1533 -1222 -228 938 1612
1605 1612 1435 649 -385 -1246 -1584 -1141 -105 952 1500 1381 682 -363 -1271 -1580 -1120 -128 901 1501
1623 1501 1403 604 -474 -1241 -1426 -1054 -244 798 1554 1465 557 -561 -1250 -1366 -995 -193 788 1465 1397 626
1643 626 -429 -1264 -1506 -1021 2 932 1312 1172 662 -216 -1200 -1635 -1074 116 1024 1281 1082 595 -237
1662 -237 -1161 -1532 -1033 -32 872 1364 1275 533 -514 -1209 -1242 -833 -218 625 1427 1493 532 -710 -1283 -1117
1682 -1117 -709 -193 613 1375 1391 559 -531 -1176 -1281 -898 -39 916 1313 1012 419 -214 -941 -1475 -1164 59
1702 59 1166 1310 805 303 -168 -876 -1437 -1118 6 1004 1292 1008 412 -409 -1131 -1237 -712 -25 581 1130
1722 1130 1338 665 -630 -1426 -1136 -392 64 427 1024 1366 718 -554 -1328 -1197 -584 44 703 1151 1050
$$ packed form
1586I40N64o5o98j074r36l74L64J018J223O95j89q82j006p84l29L11R94J166O74
1605A612j77p86j034q61l38M43J036J057N48j19o99j045r08l09M60R92J029O00
1623A501r8p99j078p67j85L72Q10J042P56q9r08j118o89j16L71Q02R81O77o8p71
1643F26j055q35k42M85J023R30L80j40n10q78r84m35N61J190R08K57j99m87q32
1662b37r24l71M99J001R04M92q9p42j047o95l3M09O15Q43Q02O6r61j242n73J66
1682a117M08N16Q06P62J6q32j090o45j05L83Q59R55L97l01n93o33p27n34L11J223
1702E9J107J44n05n02m71p08n61L19J124R98K88k84n96q21p22j06N25O87O06N49
1722A130K08o73j295p96K90P44M56L63N97L42o48j272p74J31O13O28O59M48j01
$$ plain form
1741 1050 383 -345 -884 -1202 -1044 -117 1060 1440 790 0 -288 -570 -1116 -1209 -242 1078 1482 845 60
1760 60 -398 -754 -1073 -891 -105 757 1159 1058 498 -442 -1208 -1166 -446 218 488 788 1130 807 -372 -1394
1780 -1394 -1275 -350 323 527 769 1026 665 -348 -1167 -1186 -608 90 720 1079 934 263 -438 -818 -959 -830
1800 -830 -166 814 1326 890 45 -494 -720 -873 -820 -148 800 1228 870 187 -397 -847 -1033 -683 102 780
1820 780 980 771 370 -260 -941 -1155 -637 220 787 898 722 351 -278 -909 -1067 -646 74 714 1014 835
1840 835 215 -487 -845 -814 -575 -121 588 1144 990 164 -637 -859 -702 -470 -108 503 1052 996 289 -543 -956
1861 -956 -848 -418 103 577 832 798 412 -299 -968 -1088 -496 309 725 707 591 394 -147 -887 -1179 -608 322
1882 322 813 745 499 269 -163 -776 -1047 -639 177 789 890 607 146 -331 -695 -815 -589 -6 669 1026
$$ packed form
1741A050o67p28n39l18J58R27J177L80o50p90k88k82n46r3R67J320M04o37p85
1760F0m58l56l19J82P86Q62M02j01n60r40p66M2P20O64K70L00L42l23j179j022
1780a394J19R25O73K04K42K57l61j013q19j9N78O98O30L59j45o71p01l80j41J29
1800h30O64R80N12m36q45n39k26j53N3O72R48M28l58o83n84m50j86L50P85O78
1820G80K00k09m01o30o81k14N18Q57N67J11j76l71o29o31j58M21P20O40L00j79
1840H35o20p02l58L1K39M54P09N56j54q26q01k22J57K32L62O11N49n6p07q32m13
1861i56J08M30N21M74K55l4l86p11o69j20N92Q05M16j8j16j97n41p40k92N71R30
1882C22M91o8k46k30m32o13k71M08Q16O12J01k83m61m77l64j20K26N83O75L57
$$ plain form
1902 1026 770 86 -520 -705 -628 -463 -118 509 1058 900 97 -636 -786 -557 -363 -111 433 974 902 157
1922 157 -599 -833 -636 -345 -5 465 851 763 215 -431 -804 -787 -414 147 628 755 570 218 -225 -718 -925
1943 -925 -521 260 769 717 427 199 -135 -672 -966 -536 279 729 671 443 229 -197 -760 -905 -414 254 586
1964 586 618 560 273 -318 -840 -804 -302 200 486 660 637 210 -405 -756 -663 -338 52 521 838 650 19 -455
1986 -455 -553 -509 -472 -116 595 1023 636 -142 -524 -434 -418 -486 -167 549 963 634 -57 -521 -608 -527 -314 48 430
2009 430 640 633 264 -367 -870 -757 -118 374 403 356 510 470 -187 -909 -907 -171 473 512 381 399 317 -143 -681
2032 -681 -788 -368 214 638 715 396 -48 -308 -396 -495 -523 -92 620 940 483 -207 -459 -359 -383 -469 -120 532
2054 532 830 482 -58 -384 -524 -549 -327 152 505 538 396 186 -193 -667 -747 -228 353 505 401 365 264
$$ packed form
1902A026k56o84o06j85P7J65L45O27N49j58q03p33j50K29J94K52N44N41p2p45
1922A57p56k34J97K91L40M70L86q8n48o46l73J7L73N61M81J27j85l52m43m93k07
1943i25M04P81N09n2k90k28l34n37k94M30Q15M50n8k28k14m26n63j45M91O68L32
1964E86L2n8k87n91n22L6N02N02K86J74k3m27o15l51R3L25L90M69L17j88o31m74
1986d55r8M4L7L56P11M28l87p78l82R0J6o8L19P16M14l29o91m64q7Q1K13L62L82
2009D30K10pl69o31n03J13O39M92K9m7J54m0o57p22KP36O44L9j31J8q2m60n38
2032f81j07M20N82M24P7l19m44k60q8r9k8M31P12L20m57o90k52J00k4q6L49O52
2054E32K98l48n40l26j40k5K22M79L53L3j42k10l79m74q0N19N81J52j04l6j01
$$ plain form
2075 264 -198 -678 -681 -200 242 418 506 489 140 -418 -636 -411 -136 2 262 661 660 32 -595 -625 -264 -109
2097 -109 -63 235 669 599 44 -465 -568 -427 -213 131 477 535 309 53 -143 -436 -670 -380 319 719 474
2118 474 77 18 15 -353 -708 -455 270 686 507 151 -29 -172 -408 -520 -282 116 425 549 436 16 -446
2139 -446 -570 -321 -55 32 187 523 582 94 -506 -621 -288 -8 77 246 479 458 73 -351 -499 -408 -163 158
2161 158 454 491 248 -28 -200 -368 -473 -298 176 542 478 177 -60 -217 -386 -459 -240 171 436 431 275 32
2183 32 -290 -501 -409 -67 214 316 365 362 108 -310 -550 -399 -32 206 318 374 323 54 -284 -455 -367 -137 144
2206 144 415 467 247 -92 -268 -317 -338 -231 101 448 508 217 -134 -293 -325 -315 -190 109 387 437 243 -39
2228 -39 -289 -414 -338 -88 186 338 364 270 37 -263 -457 -356 -62 196 328 350 252 9 -271 -419 -338 -98
$$ packed form
2075B64m62m80lM81M42J76Q8j7l49n58k18K25K75J38K60L99jo28o27l0L61J55
2097a09M6K98M34p0n55n09j03J41K14L44L46N8k26k56j96k93k34K90O99M00k45
2118D74l97n9ll68l55K53P25M16j79l56j80j43k36j12K38L98L09J24j13m20m62
2139d46j24K49K66Q7J55L36N9m88o00j15L33K80Q5J69K33k1l85m24j48R1K45L21
2161A58K96L7k43k76j72j68j05J75M74L66o4l01k37j57j69p3K19M11K65nj56k43
2183C2l22k11R2L42K81J02M9lk54m18k40J51L67K38J12N6n1k69l38j71Q8K30K81
2206A44K71N2k20l39j76m9k1J07L32L47O0k91l51j59l2J0J25K99K78N0j94k82
2228c9k50j25P6K50K74J52K6r4k33l00j94J01K94K58J32K2r8k43k80j48Q1K40
$$ plain form
2250 -98 151 335 393 241 -55 -290 -374 -302 -109 127 334 397 221 -53 -292 -374 -327 -85 177 328 317 195 9
2273 9 -230 -388 -358 -63 248 364 301 174 16 -197 -383 -328 -79 191 351 355 193 -67 -287 -329 -234 -94 80
2296 80 291 417 243 -110 -350 -320 -179 -76 61 279 386 233 -84 -295 -335 -264 -69 172 317 283 143 -13
2318 -13 -172 -344 -364 -87 267 382 242 85 9 -128 -333 -349 -94 234 352 282 148 -35 -247 -329 -222 -31
2340 -31 113 227 329 254 -69 -372 -369 -134 44 71 171 333 269 -57 -335 -343 -189 -17 141 282 302 143 -69
2363 -69 -178 -256 -285 -143 197 415 295 11 -111 -105 -191 -311 -171 189 408 294 38 -104 -185 -264 -241 -65 128
2386 128 231 250 199 -17 -330 -405 -164 95 151 106 197 282 70 -318 -425 -180 110 181 176 209 179 -5 -222 -285
2410 -285 -217 -64 160 353 282 30 -172 -150 -128 -231 -213 106 421 341 -11 -216 -178 -137 -193 -146 101 297 281 90
$$ packed form
2250i8K49J84N8j52k96k35q4P2J93K36K07O3j76k74k39q2M7K42K62J51j1j22j86
2273Ik39j58L0K95L11J16o3j27j58k13j86N5K49K70J60Mj62k60k20m2R5J40J74
2296H0K11J26j74l53k40L0J41J03J37K18J07j53l17k11m0P1J95K41J45l4j40j56
2318a3j59j72k0K77L54J15j40j57p6j37k05j6K55L28J18p0j34j83k12q2J07J91
2340c1J44J14J02p5l23l03LK35J78K7J00J62o4l26k78qJ54J72J58J41K0j59k12
2363f9j09p8k9J42L40K18j20k84j22Oq6j20J40L60K19j14k56j42q1p9K3J76J93
2386A28J03J9n1k16l13p5K41K59N6m5R1Q5k12l88j07K45K90P1nL3l0j84k17o3
2410b85O8J53K24J93p1k52k02K2K2j03J8L19L15q0l52k05L8M1n6M7K47J96j6j91
$$ plain form
2434 90 -105 -229 -291 -178 18 169 164 156 190 59 -236 -404 -202 130 242 139 126 176 55 -219 -343 -188 44
2457 44 163 217 227 117 -101 -235 -202 -136 -94 54 258 328 87 -208 -259 -139 -93 -99 49 269 305 75 -149 -211
2481 -211 -188 -152 -20 166 238 151 56 -9 -131 -273 -258 26 283 266 84 30 39 -84 -278 -254 10 242 240 126 29
2506 29 -53 -162 -219 -153 -22 88 202 246 101 -157 -284 -172 -17 5 3 159 297 152 -154 -312 -199 -21 33
2529 33 61 152 226 133 -82 -223 -230 -119 42 171 190 131 30 -35 -127 -225 -213 7 230 247 81 -26 -35 -107 -218 -213
2555 -213 -12 197 228 117 -11 -84 -151 -183 -124 3 130 204 178 63 -108 -207 -174 -71 40 100 170 194 76 -99
2579 -99 -204 -176 -77 25 103 176 166 49 -113 -185 -168 -92 4 114 192 160 21 -113 -171 -156 -110 -7 124 188 138 11
2605 11 -101 -161 -164 -106 16 131 169 134 40 -63 -160 -177 -83 73 149 138 119 68 -49 -179 -213 -82 91 151 118 97
$$ packed form
2434I0j95j24o2J13J96J51nqL4j31k95j68K02L32J12j03j3N0j21k74j24J55K32
2457D4J19N4J0j10k18j34L3O6M2J48K04P0k41k95n1J20M6oJ48K20L6k30k24o2
2481b11K3L6J32J86P2q7r5o5j22j42J5K84K57j7j82n4Rj23j94K4K64K32kj14r7
2506B9q2j09n7O6J31J10J14M4j45k58j27J12J55K2kJ56J38j45l06j58J13J78N4
2529C3K8R1P4r3k15j41pJ11J61J29J9n9j01o5r2r8J2K20K23J7j66j07rp2j11N
2555b13K01K09L1j11j28p3o7l2N9J27J27P4k6j15j71r9L3J03J11O0P0K4j18j75
2579i9j05K8R9J02P8P3j0j17j62p2J7P6R6J10P8l2j39j34n8J5M6J03J31O4n0j27
2605A1j12o0lN8J22J15L8l5r4j03r7j7R4J56P6j1j9n1j17j30l4J31J73O0l3k1
$$ plain form
2631 97 51 -43 -181 -206 -96 48 128 146 100 23 -71 -160 -168 -98 10 137 194 135 -19 -129 -131 -93 -76 -33 107 235 170
2658 170 -22 -153 -133 -63 -55 -19 87 203 175 0 -136 -162 -122 -62 19 106 125 99 30 -77 -174 -212 -81 106 148 90
2684 90 49 39 -24 -158 -222 -94 109 169 105 53 43 -38 -128 -167 -71 66 140 138 108 5 -101 -147 -98 -28 16 86 167 158
2712 158 5 -144 -167 -84 -34 3 83 149 114 -23 -124 -146 -124 -59 32 134 148 56 -34 -57 -88 -133 -92 66 182 155
2738 155 43 -20 -40 -79 -125 -78 62 154 143 73 -19 -97 -134 -95 1 59 82 111 123 41 -128 -194 -100 37 62 42 83 115
2766 115 46 -108 -177 -106 3 63 85 108 68 -12 -68 -113 -106 -60 59 171 161 43 -58 -50 -44 -82 -89 35 175 172 45 -58
2794 -58 -67 -71 -88 -51 47 115 113 62 -18 -101 -155 -109 -1 82 64 61 87 34 -94 -180 -107 22 89 72 70 57 7 -87 -130 -85 -13
2825 -13 56 113 137 64 -34 -107 -73 -49 -42 17 121 157 68 -53 -106 -86 -52 -29 20 106 108 37 -47 -95 -119 -97 -13 66 97 67
$$ packed form
2631I7m6r4j38k5J10J44Q0J8m6p7r4q9qP0J08J27N7n9j54j10kL8J7M3J40J28o5
2658A70j92j31K0P0QL6J06J16k8j75j36k6M0O0Q1Q7J9k6o9j07r7l8J31J87M2n8
2684I0m1j0o3j34o4J28K03O0o4n2j0q1r0l9R6J37P4kl0j03j06m6M9P0M4P0Q1r
2712A58j53j49k3Q3N0L7Q0O6l5j37j01k2K2O5R1J02J4r2r0k3l1m5M1J58J16k7
2738A55j12o3k0l9m6M7J40R2j1p0r2p8l7L9R6N8K3K9J2q2j69o6R4J37K5k0M1L2
2766A15o9j54o9P1J09O0K2K3m0q0n6m5PM6J19J12j0j18j01QOl8pJ24J40lj27j03
2794e8rmj7L7R8O8kn1q0q3n4M6J08Q3j8lK6n3j28q6P3J29O7j7kj3n0r4m3M5P2
2825a3O9N7K4p3r8p3L4K4PN9J04L6q9j21n3K0L4K3M9Q6Kp1q4m8k4K2Q4P9L1l0
$$ plain form
2855 67 40 6 -61 -126 -116 -3 101 104 54 27 14 -52 -120 -97 -6 87 101 80 40 -33 -92 -98 -53 -6 32 84 118 58 -52 -118
2885 -118 -92 -42 -17 14 77 112 46 -59 -106 -107 -67 -16 48 93 80 29 -27 -67 -104 -81 -14 88 108 77 20 -10 -46 -88 -80 -4
2915 -4 64 102 75 15 -28 -83 -102 -48 6 61 86 84 48 -22 -107 -117 -50 13 39 74 74 29 -46 -104 -97 -64 -1 56 95 86 24 -35 -70
2948 -70 -75 -62 -3 70 108 86 31 -24 -66 -70 -46 13 69 91 76 21 -42 -87 -102 -58 5 53 70 67 31 -46 -91 -101 -53 12 60 88
2980 88 77 21 -48 -84 -82 -50 7 69 100 71 12 -42 -81 -66 -57 1 72 105 82 18 -31 -77 -71 -42 12 58 82 63 22 -29 -84 -99
3012 -99 -52 20 74 65 39 14 -28 -90 -101 -57 24 60 80 68 20 -37 -74 -74 -46 11 67 103 86 16 -62 -77 -54 -25 11 53 96
3043 96 84 21 -52 -75 -70 -36 13 54 73 50 8 -40 -90 -94 -54 25 75 68 36 -2 -26 -88 -101 -50 30 82 78 44 19 -20 -51 -73
3075 -73 -32 24 77 93 69 18 -48 -73 -55 -18 15 43 83 83 12 -78 -94 -72 -32 3 38 78 68 8 -58 -95 -85 -42 9 60 85
$$ packed form
2855F7k7l4o7o5J0J13J04Ln0k7j3o6o8K3R1R3J4k1m0p3n9oM5M7L8N2L4o0j10o6
2885a18K6N0K5L1O3L5o6j05m7jM0N1O4M5j3n1n6m0l7K3O7J02K0l1n7l0l6m2QP6
2915dO8L8k7o0m3n5j9N4N4N5K5kl6p0q5j0O7O3K6L5%m5p5n8PL3O3N7L9ro2n9l5
2948g0nJ3N9P3L8k2n5n5m2mK4N9N6K2j5n5o3m5j5M4O3M8J7ll6p7m5j0M8O5M8K8
2980H8j1n6o9l6KL2N7O2L1k9n9n4l9J5RN8P1L3k3o4m9m6OK9N4M6K4j9m1n1n5j5
3012i9M7P2N4rk6k5m2o2j1M4Q1L6K0j2m8n7l7%K8N7N6L6j7p0p8j5K3K9L6M2M3
3043I6j2o3p3k3NL4M9M1J9k3m2m8n0mM0P9N0pl2l8k4o2j3N1Q0N2ml4k5l9l1k2
3075g3M1N6N3J6k4n1o6k5J8L7L3K8M0%p1r0j6K2M0L5L5M0j0o0o6l7J0M3N1N1K5
$$ plain form
3106 85 39 9 -42 -71 -79 -50 26 73 77 49 0 -32 -68 -75 -31 27 82 88 62 15 -38 -68 -70 -22 33 66 66 59 13 -57 -96 -86 -34 27
3140 27 61 62 55 7 -51 -83 -79 -31 18 63 79 59 -2 -57 -76 -72 -38 22 86 95 56 0 -53 -67 -74 -25 22 77 101 61 5 -42 -66
3173 -66 -64 -36 21 66 82 44 0 -61 -93 -79 -31 15 58 71 51 -11 -55 -86 -80 -21 31 60 77 49 10 -39 -75 -65 -6 50 75
3204 75 82 57 18 -50 -77 -72 -26 37 87 75 34 -2 -47 -80 -77 -36 26 73 75 33 -14 -66 -85 -76 -47 10 58 85 47 -24 -76 -84 -63
3237 -63 -24 14 73 97 59 -7 -55 -63 -49 -19 31 71 87 54 12 -57 -88 -76 -13 44 75 65 33 1 -43 -85 -95 -22 31 77 62
3268 62 38 1 -46 -87 -81 -30 28 60 78 54 -1 -72 -82 -53 -11 25 54 93 71 6 -57 -72 -49 -21 44 76 87 58 7 -53 -80
3299 -80 -65 -22 34 82 72 28 -15 -43 -69 -98 -62 38 86 69 18 -22 -33 -63 -82 -33 37 74 80 47 -4 -68 -85 -67 -5 29
3329 29 40 89 86 6 -74 -95 -35 8 32 39 70 74 22 -73 -96 -71 -13 30 65 66 31 -18 -55 -78 -81 -60 19 94 82 17 -35 -34 -44
$$ packed form
3106H5m6l0n1k9qK9P6M7Mk8m9l2l6pM4N8N5Ok6m7n3l0kM8N5L3%pm6p0l9J0N2O1
3140B7L4Jpm8n8l2MM8M9M5J6k0o1n5j9ML4O0O4Rl9n6n3j4pM9M7N5K4m0n6m7k4
3173f6KK8N7M5J6l8m4o1l2J4M8M6M3J3k0o2m4l1ON9N2K9J7k8l9m9l6J0N9N6K5
3204G5Pk5l9o8k7NM6O3N0j2m1l6m5l3LM1O2M7Km2m7n2j9RK9N7M8K7l8p1n2qK1
3237f3L9L8N9K4l8o6m8qJ4L0N0M0J6l3m2o9l1J2O3N7L1j0l2l2m4m2j0P3N3M6j5
3268F2k4l7m7m1ON1N8L2J8k4n5p1j0K9M2L6K9L9k2o5o3j5K3K8O5L2J1k9n1o0k7
3299h0J5M3N6M8j0m4m3k8k6k9L6J00M8j7n1m0j1l0j9M9P0L7Ol3n1o4j7J8O2L4
3329B9J1M9lq0q0k1O0M3K4PL1Mn2r5k3K5N8M3L5Jl5m9l7k3lK1P9P5j2o5n2Jj0
$$ plain form
3362 -44 -70 -55 16 98 103 32 -17 -31 -61 -64 -15 42 77 77 59 21 -56 -107 -72 1 55 48 40 57 22 -60 -109 -69 7 43 54 58 42
3395 42 -16 -61 -90 -66 -27 15 59 97 29 -40 -57 -35 -41 -44 19 101 116 42 -35 -48 -31 -28 -18 28 85 87 49 -9 -44 -93 -73 -6
3427 -6 50 69 40 47 21 -37 -114 -93 -13 66 56 28 27 7 -47 -93 -82 -12 40 65 74 41 -18 -65 -67 -30 -19 16 75 103 61 -41
3459 -41 -68 -32 -7 -24 8 69 96 55 -36 -71 -64 -53 -24 32 66 63 11 -14 -41 -85 -88 -23 58 80 42 13 10 -24 -72 -85 -18 58
3491 58 73 59 29 -3 -44 -66 -48 -14 40 67 91 61 -6 -84 -64 -17 7 6 42 98 78 -13 -87 -81 -37 -7 19 42 58 41 -20
3522 -20 -55 -83 -77 -30 45 82 68 13 1 -30 -61 -74 -33 64 102 70 16 -7 -23 -58 -66 -21 46 86 77 54 -19 -50 -75 -38 7 41
3554 41 56 73 59 -9 -72 -90 -37 4 31 33 62 48 -6 -73 -97 -48 -16 35 66 78 34 -19 -37 -56 -56 -13 43 92 82 26 -24
3585 -24 -36 -48 -52 -19 39 87 80 34 -11 -50 -78 -60 -15 34 53 62 34 -5 -62 -91 -67 -6 32 45 55 38 6 -64 -94 -62 3 41
$$ packed form
3362d4k6J5P1Q2Np1m9j4l0lM9N7L5%j8l8p7n1L5P3N4pqJ7l5q2m9M0P6L6J1Mj6
3395D2n8m5k9K4L9M2M4L8o8o9j7K2olO3Q2J5p4p7j3J7LJ0M6N7Kl8n8l5m9K0O7
3427fN6J9k9Pk6n8p7K1Q0P9j0k8jk0n4m6J1P0N2K5Rl3n9m7kL7J1L5N9K8m2j02
3459d1k7L6K5j7L2O1K7m1r1l5PJ1K9N6L4ln2k5k7m4lO5Q1K2l8k9ll4m8j3O7P6
3491E8J5j4l0l2m1k2J8L4N4K7K4l0o7p8K0M7K4jL6N6k0r1p4OM4L0K6K3J6j7o1
3522b0l5k8OM7P5L7j4n5j2l1l1j3M1R7L8l2n4k3j6l5qM5O7M0rk3p3l1k5L7M5L4
3554D1J5J7j4o8o3j8N3M1K7KK9j4n4o7k4M9L2N1L1J2m4n3j8j9%M3N6M9j0n6n0
3585b4j2j2mL3N8M8pm6m5l9k8J8M5M9J9Rk8l9n7k9K4O1L8J3J0j7l2p0l0L2O5L8
$$ plain form
3617 41 58 63 41 -7 -48 -67 -51 -11 39 82 92 32 -23 -47 -49 -41 -23 32 75 88 34 -35 -62 -56 -58 -29 31 67 61 34 -16 -59 -80
3650 -80 -51 -8 48 57 55 37 -3 -41 -73 -58 4 55 69 59 43 -1 -40 -72 -49 7 44 69 57 46 -15 -47 -65 -41 -11 33 65
3681 65 61 30 -30 -58 -64 -48 -27 27 51 63 28 -31 -60 -69 -46 -6 31 73 66 36 -7 -47 -50 -39 4 52 80 60 33 5 -30 -57 -53
3714 -53 -3 52 68 59 31 -9 -43 -59 -47 1 44 72 50 31 -22 -68 -75 -48 -10 24 58 61 29 -30 -55 -77 -47 -16 27 52 62 34
3746 34 -21 -47 -57 -36 5 50 69 77 34 -10 -41 -51 -40 -14 36 77 69 23 -17 -51 -61 -49 -7 37 64 61 29 -13 -49 -64 -46 -18
3778 -18 35 65 60 31 -11 -56 -67 -33 0 44 55 53 39 -6 -43 -51 -29 21 47 65 68 38 -20 -37 -65 -49 -12 34 61 61 12 -29 -63
3811 -63 -67 -53 -21 30 65 49 12 -28 -60 -61 -41 -10 37 67 56 15 -9 -49 -60 -47 1 48 67 59 34 -11 -40 -57 -33 9 46 62
3843 62 51 32 -9 -46 -67 -36 -2 42 74 60 9 -30 -60 -73 -50 -24 29 58 49 23 -24 -52 -68 -49 -3 34 74 56 25 -10 -47
$$ packed form
3617D1J7Nk2m8m1j9J6M0N0M3J0o0n5k4kQJ8N5M3J3n4o9k7OkK9O0L6ok7n0m3k1
3650h0K9M3N6Rkj8m0l8l2J5O2N1J4j0j6m4l9l2K3N6L7K5j2j1o1l2j8K4L0M4L2
3681F5ml1o0k8oJ6K1N4K4J2l5n9k9rK3M0L7M2pl0m3m0lJ1M3M8K8k0k7k8l5k7M
3714e3N0N5J6rk8m0l4j6J2M8M3K8k2j9n3m6pK7L8L4L4Ll2n9k5k2L0L1M3K5J0k8
3746C4n5k6j0K1M1M5J9Qm3m4l1j0J1K6N0M1qm6m0l4j0J2M2M4K7ll2m2l6j5J8K8
3778a8N3L0nk9m2m5j1L4L3M4J1kj4m5l7qK2N0K6J8Ll0n8j7k8J6L7M6K7%m9m1l4
3811f3mJ4L2N1L5j6l7m0l2jK0L1M7L0j1m1k4m0j1J3M8M7J9qk5m5k9j7K4M2L7J6
3843F2j1j9m1l7k1L1L4M4L2j4n1l9l0j3K3K6N3K9rk6m7k8j6J9M6L7M0j8l1l5l7
$$ plain form
3874 -47 -54 -44 2 39 65 61 26 -5 -50 -65 -54 0 45 60 56 30 -24 -53 -68 -46 -14 44 55 60 23 -22 -68 -71 -49 -18 20 51 68
3907 68 23 -26 -61 -62 -45 -13 31 74 63 29 -7 -42 -58 -35 3 43 59 51 32 -7 -50 -79 -55 -7 42 63 53 17 -14 -56 -81
3938 -81 -48 -5 39 60 57 17 -16 -58 -75 -38 -4 26 70 48 36 -34 -55 -53 -32 -1 34 69 74 41 -13 -61 -64 -45 10 42 69 59
3970 59 25 -23 -52 -79 -56 -7 33 66 42 5 -18 -49 -67 -67 -26 40 62 53 14 -19 -61 -61 -34 -1 36 65 71 46 -14 -54 -70 -29
4002 -29 26 26 46 63 47 -12 -52 -71 -28 9 51 59 62 30 -11 -52 -60 -48 -12 45 70 45 10 -24 -46 -55 -62 -36 39 65 62 17 -23 -38
4036 -38 -53 -40 0 48 67 68 34 1 -48 -73 -35 20 40 64 59 55 -3 -68 -83 -45 14 42 49 46 33 -14 -54 -85 -55 -6 25 54 47
4069 47 20 -29 -61 -58 -50 -36 23 74 73 17 -27 -36 -36 -37 -11 41 80 77 27 -11 -45 -61 -35 4 39 53 48 30 -3 -52 -86 -58 -2 51
4103 51 43 36 26 -1 -47 -89 -57 1 46 55 54 28 -20 -52 -51 -46 -12 22 71 83 29 -25 -58 -36 -25 0 37 81 86 37 -24 -47 -58 -28
$$ packed form
3874d7pJ0M6L7K6ml5l1m5j5J1N4M5J5mk6n4k9j5K2L2N8J1Nl7m5m6lK2L1L8L1J7
3907F8m5m9l5jJ7L2M4M3j1l4l6l5j6K3L8M0J6qj9l9m3k9K4M8M9K1j0l6l1m2k5
3938h1L3M3M4K1lm0l3m2j7L7L4L0M4k2j2p0k1KK1L1L5L5Nl3n4m8lJ9N5L2K7j0
3970E9l4m8k9k7K3M9M0L3k4l7k3l1j8%M1O6K2rl9l3m2%K7L3L7K9Ok5o0m0j6M1
4002b9N5%K0J7j6n9m0j9M3L7M2QLl2m1m1qJ2L6N7K5k5l5l4k2rpK6P5K6lm5m0j5
4036c8j5J3M0M8J9Jl4l3m9k5L8N5K0K4nmn8o5j5L8N9K8Plj3m7m0l1L0M9L1K9p
4069D7k7m9l2LQJ4N9N1jn6m4r%jK6N2L9ln0l8l4j6K6L9L5J4nj8l3m9l4K8N6N3
4103E1qpj0k7m6m2L2N8M5Rjk6m8l2JNL4L4M9J2n4n4l3K2J1K5L7M4Nm9o1k3j1L0
$$ plain form
4137 -28 4 47 63 65 23 -17 -52 -72 -56 -12 57 42 40 6 -13 -43 -75 -67 1 45 72 38 7 -2 -43 -72 -46 1 37 67 72 37 -20
4170 -20 -54 -51 -26 9 34 56 76 32 -23 -64 -52 -20 11 31 52 65 24 -27 -56 -69 -52 -13 37 49 36 24 -20 -45 -69 -65 -7
4201 -7 57 73 62 20 -18 -37 -56 -42 4 53 79 59 33 -10 -49 -55 -25 11 32 41 66 36 -15 -71 -65 -35 4 33 51 51 35 -26 -72
4234 -72 -73 -56 -9 26 50 59 22 -22 -59 -66 -52 -14 42 66 54 23 -18 -53 -49 -34 0 50 85 71 32 -26 -48 -64 -48 -8 35 49
4266 49 53 30 -27 -56 -82 -44 -8 31 56 47 26 -30 -70 -76 -36 4 37 56 47 26 -23 -63 -71 -49 -2 45 61 55 22 -19 -48 -56 -40 1
4300 1 45 77 68 30 -20 -54 -56 -54 -19 39 50 50 9 -26 -64 -68 -63 -17 19 56 47 13 -25 -60 -72 -51 -2 38 60 55 23 -23 -49 -65 -44
4335 -44 1 38 65 57 33 -6 -43 -66 -42 -4 32 67 59 28 -21 -53 -60 -39 0 33 71 45 23 -25 -48 -64 -52 -14 22 48 54 17
4367 17 -21 -63 -71 -44 5 40 70 60 30 -12 -53 -57 -37 4 46 51 66 39 -8 -57 -61 -38 -12 44 59 56 19 -10 -40 -59 -45 -4 28
$$ packed form
4137b8L2M3J6Km2m0l5k0J6M4O9j5kl4j9l0l2QO8M4K7l4l1rm1k9K6M7L6L0Nl5n7
4170b0l4LK5L5K5K2K0m4n5m1J2L2L1K0K1J3m1n1k9j3J7L9N0J2j3j2m4k5k4MN8
4201gO4J6j1m2l8j9j9J4M6M9K6k0k6m3l9oL0L6K1RK5l0n1n6OL0L9K9J8%j6o1m6
4234g2jJ7M7L5K4Rl7m4l7pJ4L8N6K4j2l1m1l5MJ5L4N0L5j4l9n8k2j6J6M0M3J4
4266D9Mk3n7k9k6L8L6L9K5rk1n6m0oM0M0L3J9rk1m9m0qK2M7M7J6ol3m1k9qJ6M1
4300AM4L2rl8n0l4kKL5N8J1%m1l5l8mNM6L6L7rl4l8l5j2K1M9M0K2nl2m6k6j6K1
4335d4M5L7K7qk4l9l7k3K4L8L6L5ql1m9l2pK1L9L3L8k6k2m8k3j6J2L8L6K6Ol7
4367A7l8m2qK7M9L5L0j0l0m2m1mK0M1M2NJ5k7m7m9mK3K6N6J5ll7k9l0j9J4M1L2
$$ plain form
4400 28 57 50 18 -31 -57 -63 -48 -15 32 48 57 17 -12 -56 -63 -33 4 38 62 59 28 -8 -60 -55 -26 8 38 68 58 42 -16 -39 -63
4433 -63 -43 -12 24 57 54 22 -23 -54 -65 -47 -13 32 66 58 2 -26 -62 -69 -53 -17 37 48 51 15 -13 -48 -52 -38 -5 38 56 56 40
4466 40 -3 -51 -67 -33 5 48 64 63 25 -16 -38 -62 -36 -12 37 54 47 25 -16 -56 -63 -52 -16 39 62 55 16 -19 -47 -52 -39 -2 50
4499 50 75 64 30 -9 -40 -50 -38 2 44 56 57 30 -10 -43 -46 -37 1 42 57 59 32 -16 -49 -64 -46 0 33 52 40 25 -24 -54
4531 -54 -71 -45 -2 34 53 54 17 -14 -39 -57 -28 7 40 69 65 38 -3 -34 -56 -30 1 37 60 58 32 -13 -41 -59 -38 -3 34 65
4563 65 58 33 -19 -49 -61 -54 -10 34 56 49 15 -21 -53 -60 -53 -7 24 61 47 28 -19 -50 -60 -47 1 46 51 62 38 -4 -44 -58 -48
4596 -48 -4 45 56 64 29 -16 -56 -59 -36 1 19 51 47 29 -22 -58 -73 -47 -14 29 54 60 25 -17 -53 -65 -46 -6 23 66 49 30
4628 30 -10 -36 -55 -25 9 36 72 56 28 -14 -36 -46 -41 0 44 73 54 20 -17 -41 -68 -50 -25 26 43 45 11 -19 -56 -74 -49
$$ packed form
4400B8K9pl2m9k6oJ5L3M7J6Rm0k9m4pL0L7L4K4ll1l6n2NK9L4L0L0j0j6n8k3k4
4433f3K0L1L6L3ll2m5l1j1J8L4M5L4qn6k8l6pJ6L6N4J1Ll6k8l5mJ4L3M3J8%j6
4466D0m3m8j6L4L8M3J6jl8m1k2k4K6K4M9J7pk2m1m0pJ1L6N5K3pl9l5k8nJ3L7N2
4499E0K5j1l4l9l1j0J2M0M2J2Jk7m0l3lRL8M1J5Kk7m8l3j5J8M6L3J9j2j5m9l0
4531e4j7K6M3L6J9Jl7l1k5j8K9L5L3K9mk7m1l1k2K6L1L6K3kk6m5k8j8K1L5L7L1
4563F5pk5n2l0j2PM4M4K2pl4l6l2pPM6L1L7j4j9m7l1j0J3M8M5NJ1k4m2m0j4J0
4596d8M4M9J1Ql5m5m0lK3L7J8L2mj8n1l6j5K6L3M3K5Ol5m2l6j2J9M0K9M3j7j9
4628C0m0k6j9L0L4K7L6j6k8m2k2j0NM1M4K9j9l4l7k4k7J8K5N1J7Kl4l0l7j8K5
$$ plain form
4659 -49 -15 31 55 54 24 -12 -62 -59 -35 11 36 51 56 35 -5 -49 -50 -29 -2 26 61 59 28 -7 -43 -50 -42 7 45 62 46 20 -29 -44
4693 -44 -56 -48 -24 18 57 39 10 -30 -41 -63 -46 -10 36 61 56 17 -11 -47 -58 -29 10 48 65 64 34 11 -50 -62 -31 13 37 47
4725 47 43 28 1 -50 -56 -32 -6 36 54 46 15 -28 -48 -60 -58 -17 24 56 49 22 -28 -49 -49 -46 -15 36 44 52 14 -14 -41 -47 -29 11 43
4760 43 70 55 35 2 -39 -53 -38 4 40 53 37 25 -13 -53 -68 -44 -4 29 57 35 7 -21 -57 -54 -37 -12 27 61 62 21 -24
4791 -24 -48 -46 -19 -7 21 55 54 31 -17 -37 -42 -26 2 45 61 63 41 -4 -34 -55 -38 -1 42 46 31 9 -11 -38 -62 -45 -13 28 36
4824 36 35 9 -20 -44 -55 -38 -10 33 47 55 25 -19 -49 -54 -28 7 31 44 53 29 -5 -50 -37 -28 -1 24 50 57 20 -15 -47 -52 -26 -8
4858 -8 24 56 41 10 -12 -50 -50 -45 -7 30 46 33 2 -17 -42 -57 -33 -5 37 62 42 20 -7 -41 -45 -25 17 27 59 57 27 -7 -42
4891 -42 -43 -19 8 25 40 46 26 -26 -56 -58 -30 3 34 49 43 16 -17 -47 -54 -42 -3 30 52 48 3 -22 -41 -36 -29 -2 38 61 55 14 1
$$ packed form
4659d9L4M6K4jl0l6n0LK4M6K5J5Nk1m0m4jK1K7K8L5kl1l5l6pQM9L8J7j6k6m9j5
4693d4j2QK4M2L9j8k9m0j1k2J7L6M6K5nl9k8l6j1K9L9L8J7jl0k3o1j2L1M4K4J0
4725D7mj5k7n1oK4K6M2J8ql1m3k0j2KM1M1L2pk7n0k1%LL1N1QQl8k8k7oJ8M0L2
4760D3K7j5k0l3m1j4J5M2L6J3j6j2l8m0j5K4M0L3K8k2k8k8l6LJ7K5L9L4Jm1m5
4791b4k4KK7J2K8L4jk3m8k0nJ6K8M3J6Kk2m5l0k1J7L7M3Mj5k2k0k7k4J7L2M1Q
4824C6jk6k9k4j1J7K8M3J4Ql0m4l0nK6L5K4J3Rk4l4m5J3RK7K5K6Pl7l5l2nK6J8
4858hL2L2j5l1k2l8%NL8L7J6j3l1j9k5j5K4K8M2K5k0k2k7l4mK0M2J0L2kl0l4l5
4891d2jK4K7J7J5Ok0n2l0kK8L3L1J5ok7l3l0pJ2L9L3K2mm5k5j9NPK7M0K3om1j3
$$ plain form
4926 1 -31 -40 -30 0 40 61 58 21 -11 -31 -42 -26 6 38 50 25 15 -21 -47 -59 -33 -8 36 39 50 23 -23 -45 -54 -45 -5 25 50
4959 50 44 15 -12 -40 -41 -16 7 38 58 51 31 -6 -38 -27 -25 3 41 62 57 24 -8 -38 -52 -43 3 29 41 33 7 -27 -38 -51 -39 -5
4993 -5 25 49 40 13 -16 -43 -48 -28 -3 41 54 58 29 -18 -36 -38 -25 11 37 55 48 24 1 -31 -35 -20 -5 38 54 41 21 -20 -42 -45
5027 -45 -35 -7 22 36 35 8 -38 -47 -50 -26 1 20 37 41 13 -17 -44 -47 -26 -5 28 56 52 23 -11 -41 -45 -17 1 44 51 32 8 -21
5061 -21 -42 -56 -41 6 30 42 41 12 -14 -45 -59 -41 -5 28 39 29 19 -19 -52 -55 -33 1 26 44 38 8 -21 -45 -35 -24 10 36
5093 36 52 53 16 -14 -32 -30 -30 17 31 59 52 21 -3 -38 -48 -24 1 34 48 31 5 -23 -55 -53 -44 -6 30 38 40 10 -21 -34 -39 -33 1
5128 1 19 44 49 7 -18 -39 -42 -16 13 38 40 59 22 -4 -27 -39 -30 4 37 47 32 27 -12 -38 -52 -39 -11 24 30 27 3 -24 -46 -57
5162 -57 -40 -4 21 45 38 7 -25 -42 -40 -18 -7 35 47 47 23 -14 -34 -40 -11 3 36 48 38 14 -8 -30 -48 -13 -2 28 45 38 17
$$ packed form
4926Al2rJ0L0M0K1ll7l2k0j1J6L2L2J2k5j0l6k6j2K6K5M4LJ1k7m6k2rRM0L0K5
4959E0ok9k7k8jK5K3L1K0pk0l7l2J1KK8L8K1nl3l2l0j4RM6K6J2qk6l4j1j3J2L4
4993eL0K4rk7k9k7nK0K5M4J3Mk9m7j8kJ3L6K6J8pk4k3l2mJ5J5M3J6j3k0m1k2l
5027d5J0K8K9J4jk7m6rlK4K7J9J7Mk8l0k7lK1K1L3K8mk9l4l0mK8J8M3Pj9k4k9
5061b1k1j4J5M7K4J2jk9k6l1j4J8L6L3J1j0j0l8l3lK2L4K5J8ol0k9k4J0J1L4K6
5093C6J6Jl7l0j8K%M7J4K8pl1k4l5j0K4K5L3J4j7k6k8l2KRL8L6QKl0l1j3nOL4
5128AJ8K5Nm2k5k1lK6K9K5KJ9l7k6k3j2RL4L3J0j5nl9k6j4J3K8L5Olk4k7k2j1
5162e7J7L6K5K4pl1l2j7KK2J1M2J2%k4l7k0oK9J4L3J2j0k4k2k2j8L5J1L0J7pk1
$$ plain form
5195 17 -22 -49 -46 -25 0 15 29 32 -5 -25 -41 -42 -30 -5 30 40 42 18 -12 -35 -32 -21 6 28 51 53 21 -18 -34 -27 -19 19 27 44 39
5230 39 16 -18 -39 -40 -22 7 26 41 40 16 -15 -36 -55 -35 -2 32 35 29 7 -15 -38 -41 -30 0 27 36 31 5 -3 -33 -34 -4 11 43 54
5265 54 44 24 -3 -29 -35 -16 6 34 34 36 11 -23 -38 -45 -31 -7 12 24 18 11 -30 -45 -39 -32 -10 27 29 21 15 -9 -28 -47 -13 13 29 47
5301 47 32 11 -9 -37 -36 -26 16 37 49 38 6 -14 -33 -41 -32 1 27 41 31 12 -26 -41 -39 -21 -1 20 22 21 0 -40 -44 -51 -28 3
5335 3 29 38 33 24 -24 -37 -37 -11 10 37 42 32 8 -19 -25 -30 -15 4 37 43 38 27 -19 -41 -37 -38 3 25 37 29 11 -23 -37 -38 -29 -4 32 35
5373 35 22 2 -23 -47 -44 -29 16 27 37 30 17 0 -17 -24 -25 10 22 44 36 12 -18 -24 -34 -19 13 27 41 28 19 -22 -30 -32 -21 -11 17
5408 17 28 26 9 -20 -35 -32 -28 0 21 37 31 2 -17 -27 -22 -19 5 34 36 31 19 0 -18 -38 -13 21 40 33 24 11 -2 -21 -26 -28 17 33
5444 33 45 24 4 -30 -42 -35 -14 5 14 38 26 2 -18 -36 -27 -13 5 21 32 29 9 -20 -28 -26 -20 6 29 42 29 9 -20 -36 -31 -15
$$ packed form
5195A7l9k7LK1K5J5J4Ll7k0j6jJ2K5L5J0Kk4l0k3LJ1K7K2K3Kl2l9j6PQL8QJ7n
5230C9k3l4k1jJ8K9J9J5jk4l1k1j9K0L3L4Lok2k2k3lJ1L0K7Rnk6ql0jL0J5L2J1
5265E4j0k0k7k6oJ9K2K8%Kk5l4j5pJ4K4J9J2opm1j5OPK2L7Kqok4j9j9L4K6J6J8
5301D7j5k1k0k8JJ0M2K1J2j1l2k0j9qRL3K6J4j0j9l8j5KJ8K0K1Kjk1m0mpK3L1
5335CK6Rnrm8j3%K6K1K7Nj0k4k7onJ5J9L3Onj1m6k2MjM1K2J2qj8l4j4jRK5L6L
5373C5j3k0k5k4LJ5M5J1J0pj3j7j7pjL5J2K2qk4l0oj0J5L2J4J4j3rm1qkJ1J0K8
5408A7J1kj7k9j5LMK8K1J6ok9j9j0NLK4K9Knj2j9j8k0K5L4J9prj3j3j9nkM5J6
5444C3J2k1k0l4j2PK1J9RK4j2k4k0j8RJ4J8J6J1lk0k9qKOK6K3J3j3k0k9j6NJ6
$$ plain form
5478 -15 16 45 46 37 11 -17 -22 -35 -12 11 29 35 16 -8 -24 -38 -38 -24 1 16 18 25 6 -23 -38 -31 -17 5 17 33 30 13 -18 -31 -29
5513 -29 -14 12 40 35 30 11 -5 -27 -40 -14 11 33 34 28 -5 -16 -33 -36 -22 5 27 36 23 3 -16 -35 -39 -25 -2 28 25 20 -1 -21 -30
5548 -30 -33 -10 14 41 42 37 22 -4 -29 -21 -11 9 35 32 28 9 -20 -32 -30 -5 11 25 37 20 1 -12 -24 -31 -27 -5 6 35 28 4 -21
5583 -21 -27 -35 -23 -1 18 30 22 8 -26 -28 -27 -4 17 28 37 27 16 4 -24 -18 -4 10 25 35 24 12 -20 -36 -29 -12 0 10 28 13
5617 13 -11 -29 -42 -39 -27 -1 10 25 18 11 -17 -25 -28 -16 6 25 29 23 12 -8 -24 -21 -9 12 23 37 27 23 0 -30 -34 -10 8 14 36 27
5653 27 19 6 -25 -37 -14 -1 18 15 24 -3 -19 -34 -40 -22 -2 18 29 30 3 -16 -26 -17 -12 8 19 38 23 2 -10 -23 -10 -10 8 37
5687 37 40 19 5 -9 -27 -23 -11 12 28 30 19 1 -14 -19 -32 -24 -4 14 10 12 8 -20 -34 -34 -27 -3 12 21 25 13 -9 -22 -18 -7 11 36 43
5724 43 31 21 -7 -20 -16 -7 15 23 32 21 3 -7 -23 -24 -20 -1 21 33 11 -4 -23 -17 -29 -22 6 22 19 10 0 -22 -42 -28 -9 6 18
$$ packed form
5478a5L1K9Jrk6k8nj3K3K3J8Oj9k4j6j4%J4K5J5KPj9k9j5PJ4K2J2J6lj7l1j3K
5513b9J5K6K8nnj9j6k2j3K6K5K2Jol3j1j7lJ4K7K2Rj3k0j9j9mJ4K3L0lnk1k0r
5548c0lK3K4K7Jnj5k6k5QJ0K0K6lmj9k9j2KK5J6J4J2j7j9j3j2pMK2J1K9pk4k5
5583b1oqJ2K2J9J2qj4l4kJK3K1J1Rj0j1j2k8OJ4J4J5J0j1j2l2j6PJ7J2J0J8j5
5617A3k4j8j3LJ2K6J1J5ppk8qlJ2K2J9Moj1k0j6LJ2K1J1J4j0mk3l0mK4J8OK2r
5653B7qj3l1j2K3J3J9lRk7j6j5oJ8K0K0J1Jk7j9j0RNK0J1J9j5k1j2j3J3%J8K9
5687C7Lk1j4j4j8MJ2K3J6Kj1j8j5nj3QK0J8mKmk8j4%PK4J5RMj2k2j3MJ1J8K5P
5724D3j2j0k8j3MRK2QRj1j8j0j6jMJ9K2J2k2j5j9Oj2PK8J6lrj0k2k0J4J9J5J2
$$ plain form
5759 18 30 24 0 -22 -33 -24 -12 20 17 29 26 17 1 -17 -27 -5 7 28 39 23 0 -17 -29 -32 -12 -3 19 24 21 -6 -9 -28 -29 -16 -6 21
5795 21 30 18 7 -19 -22 -29 3 9 20 23 24 11 -9 -33 -30 -8 13 32 28 25 23 -3 -21 -25 1 28 14 28 14 0 -21 -28 -26 -21 3 9 30 13
5833 13 -8 -31 -40 -34 -25 -6 19 30 25 10 -10 -14 -14 -7 5 38 35 32 13 -5 -23 -19 -3 16 29 32 21 14 1 -18 -23 -3 9 11 15 20 1 -14
5871 -14 -30 -38 -17 3 9 20 9 -9 -26 -37 -25 -6 5 19 31 27 9 -14 -18 -10 -4 -2 24 30 36 12 -9 -18 -5 -4 11 33 30 28 12 -17 -29
5908 -29 -32 -20 2 31 24 2 3 -12 -21 -39 -31 2 25 27 13 -12 -21 -26 -26 -12 7 24 29 31 15 -12 -15 -14 1 7 11 27 32 13 -3 -26 -11 -3 16
5947 16 24 25 25 1 -18 -33 -25 -29 -9 6 12 4 -11 -11 -24 -26 -14 -3 24 27 11 -8 -12 -4 -21 -17 -3 25 29 23 3 -3 -18 -22 1 9 27 20 26 2
5987 2 -6 -25 -18 -2 14 12 12 16 -10 -33 -47 -30 -24 -9 11 26 12 -5 -18 -21 -26 -14 -2 18 25 8 -2 -13 -3 -6 -17 3 35 26 20 1 -18
6024 -18 -19 -22 -16 9 24 25 10 15 -19 -21 -20 -9 4 17 6 -1 1 -16 -39 -31 -17 -1 6 17 -2 -10 -14 -37 -32 -8 6 15 25 25 3 -5 -4 -7 -1 -2 18
$$ packed form
5759A8J2ok4k2j1RJ2L2lJ2lrj6j8j0K2J2K1J1j6k3j7j2lK0RK2Nlk7lj9jJ3J0K7
5795B1Rj2j1k6lpL2OJ1LJj3k0k4LK2K1J9mlkk6j8mK6K7j4J4j4j4k1pKNK4OK1j7
5833A3k1k3rORJ9K5J1nj5k0m%PJ2L3llj9j8j8MJ6J9J3Lj1pj3j9nK0J2KMNj9j5
5871a4j6qK1K0OJ1j1j8j7j1J2J9J1J4J2mj8k3mQOKK6OOk4k1rJ3JJ5K2lkj6k9j2
5908b9lJ2K2K9pk2Jj5rj8QL3K3Kj4k5rn%J4J9J7NKj6k7lJJ5OMJ6Nj9j6k3J5QJ9
5947A6QJ%k4j9j5QmK0J5Oqj5%j3kJ2J1K7Lj6j9mQj7MJ4K8Mok0oj5mK3QJ8pOk4
5987Bqj9PJ6J6k%Mk6k3j4J7OJ5K0J5j4j7j3lnJ2J2K0Pj7j0j1J0lj1K0L2roj9j9
6024a8jlOK5J5Jj5Nl4kJJ1J3J3j1pKj7k3QJ4J6PJ1j9qmk3NK4J4RJ0%k2qJlOjK0
$$ plain form
6065 18 31 32 3 -12 -24 -17 -8 4 12 27 13 2 -19 -23 -26 -22 -3 5 17 2 1 -16 -14 -30 -16 8 8 11 8 11 -13 -25 -24 -4 -1 18 19 20 7
6104 7 -6 -18 -16 -11 16 21 27 16 4 -7 -23 -26 3 4 7 24 11 -7 -22 -29 -23 -16 0 13 17 22 -5 -9 -11 -17 -16 6 19 22 10 3 -5 -13 -24 -3 10
6145 10 29 30 10 8 -7 -7 -2 0 7 20 30 18 -8 -7 -8 -19 -8 0 6 15 13 14 -30 -32 -23 -4 1 12 14 16 2 -10 -18 -17 -13 20 19 15 17 5 5 -15 -17
6188 -17 -5 11 30 31 21 1 -1 -6 -18 -17 3 17 24 7 -6 -6 -13 -7 -2 6 3 9 9 -9 -13 -26 -31 -11 6 8 12 7 -1 -14 -17 -12 -2 14 27 22 18 12
6230 12 1 1 -7 -6 4 26 27 15 7 -14 -6 -17 -15 -7 7 7 4 5 -11 -26 -18 -7 1 8 9 -3 -4 -15 -25 -19 -19 13 16 17 5 7 -9 -26 -19 -9 22
6271 22 17 12 12 9 -5 -9 -5 11 6 10 17 15 -11 -7 -21 -20 -5 2 -1 15 11 -10 -23 -23 -13 -10 -5 1 12 3 -9 -14 -15 -21 0 -3 13 8 -4 -4 -5 -17 -13 -6 13
6316 13 20 16 12 2 -8 -7 -5 -8 12 12 10 5 -3 -20 -19 -29 -18 -3 1 14 10 -2 -24 -21 -31 -16 -6 -4 14 12 -6 -8 -6 -9 -1 11 20 18 4 -1 0 -5 -13
6359 -13 -3 -4 19 14 2 4 -3 -10 -12 4 12 9 12 -3 -7 -8 -13 -13 -7 2 10 8 10 -4 -9 -30 -25 -6 4 10 15 11 4 -6 -18 1 -1 9 25 12 11 7 4 -7
$$ packed form
6065A8J3Jk9j5j2PRJ2QJ5j4j1k1mlMJ9QJ2j5jj7Kj6J4K4%LlLk4j2JK0LJ9JJj3
6104Gj3j2KNK7NOj1j2j1j6lK9JLJ7j3j8j5pOPJ6J3MNk7mkoJK2J3Lj2pqqj1K1J3
6145A0J9Jk0kj5%NKPJ3J0j2k6Jjj1J1QORkJm4kRJ9NJ1KKj4j2qJML3jmKj2%k0k
6188a7J2J6J9Jj0k0knj2JK0J4Pj7j3%pONQlO%j8mj3nK0J7KMnqj3lNJ0J6J3nmo
6230A2j1%qJJ0K2Jj2qk1Qj1KQJ4%lJj6j5QJ1QPJj2jj1j0O%L2LJj2Kj6j7PJ0L1
6271B2nn%lj4mMJ6nMPkk6Mj4JJ5PlJ6mk1j3%J0LNOJ1rj2njoK1lJ6nj2%jj2MPJ9
6316A3Pmmj0j0JKlK0%knqj7Jj0J1J5MJ3mj2k2Lj0J5J0KJ8kj8kKlQJ2Rkj4nJnq
6359a3J0jK3nj2KppkJ6QlLj5mjn%ORQkKj4nk1NJ9J0ONmpj0j2J9kJ0J6j3jmlj1
$$ plain form
6403 -7 -15 -10 14 21 13 7 -8 -4 -19 -31 -14 -4 17 11 -3 -4 -23 -13 -13 -8 1 -3 -4 4 -5 -15 -32 -14 -11 0 6 13 8 13 4 -22 1 -3 2 15 24 15 0
6446 0 -8 -7 -6 -11 2 9 16 11 -4 -6 -6 -20 -31 -8 2 17 7 -5 -14 -7 -17 -8 8 11 8 6 -7 -15 -2 -8 -10 7 9 13 15 3 -6 -5 -13 -3 9 12 10 12
6490 12 0 -4 -13 -8 0 17 19 8 5 -13 -14 -23 -20 -16 -9 0 5 2 -9 -19 -8 -14 -2 -3 1 13 10 1 -11 -3 -1 7 10 15 22 4 4 -10 -9 -15 8 10 10 1 -2 -7 -8
6537 -8 -13 -7 -7 8 15 5 7 -4 -17 -17 -8 -11 -9 -2 10 1 -5 -16 -15 -12 -1 1 18 17 19 5 -1 -3 14 8 17 21 11 20 0 1 -10 -13 -3 -1 7 7 2 -5 -8 -16 -15
6584 -15 -15 6 2 3 -9 -12 -14 -16 -16 -8 -3 1 8 5 1 -2 -21 -10 -1 5 8 11 12 6 -3 -2 -4 3 12 19 11 8 -1 -1 -19 -9 -11 0 4 12 1 -8 -15 -25 -10 -19 2 8 1
6633 1 -4 -5 -9 -4 -4 -10 5 13 13 15 2 9 -3 -14 -5 6 17 19 19 8 0 -4 -5 1 13 10 20 20 10 0 -8 -3 8 1 9 8 -1 -12 -14 -13 -18 -17 -5 -5 3 -5 4
6680 4 -5 5 2 1 11 11 13 2 1 -9 -9 -2 5 9 23 24 15 7 5 1 -5 -4 0 16 8 12 -4 -10 -11 -15 -5 9 13 -2 4 -20 -9 -9 -15 -15 -9 6 -4 -2 -5 -8 -2
6727 -2 1 -6 14 15 15 13 12 -8 4 5 2 11 11 8 2 -13 -7 -7 -13 -6 -5 -2 3 -5 0 -27 -22 -11 -6 -9 -3 -1 -11 -12 -13 -11 -16 -12 6 -3 4 -9 0 0 -14 -7 0 4 4 10 0
$$ packed form
6403gqNK4Pqoj5Mj5j2J7J0K1oj4jj9J0%NRmjQrj0j7J8LJ1OPnNrk6K3mNJ3Rrj5
6446@qJJnJ3PPnj5k%j4j1K3J0J5j0j2rPj0RJ6Llkj3qJ3okJ7KMKj2rJqJ0J2LkK
6490A2j2mrNQJ7Kj1lj8jrLMPRNlj1j0J1oJ2jMJ2lrj2QKQLNPj8%j4JoK3K%rlnj
6537hnO%J5Pj0Kj1j3%RlKPJ2roj1JLJ1KJ7jKj4okJ7oRMj0Rk0Jj1lJ0KQ%nplqJ
6584a5%K1mJj2lkk%QNMPlmlj9J1ROLLJorJkPRPqlr%j8J0kJ1MQj1rpj0J5rK1Op
6633AnjmN%oJ5Q%Kj3Pj2j1RJ1J1K%j1qmjOJ2lJ0%j0j0qNJ1pQjrj1kJnJJ2%QqR
6680DrJ0ljJ0%Kj1jj0%PPMJ4JrqkmoJMJ6qMj6ojmJ0J4Mj5Ok4J1%o%OJ5j0KllO
6727bLpK0J%kjk0J2JlR%loj5O%oPJLNqNk7NJ1NlOKj0jjKnMJ8rPj3R%j4PPM%Oj0
$$ plain form
6778 0 5 -8 -9 4 9 -4 10 8 3 0 -8 0 -10 -4 -7 -7 1 10 -10 -10 -20 -8 -5 11 -9 3 0 -6 -12 -14 -10 0 13 12 11 13 -1 -6 -8 3 -3 -2 6 20 2
6823 2 -2 3 -5 -4 0 4 18 13 1 5 5 -21 -16 -1 0 1 -1 4 -8 -4 -10 -18 3 -13 4 11 1 -6 -4 -12 -1 0 4 21 21 5 3 -3 -3 1 -6 1 11 4 1 0 3 5
6871 5 0 -7 6 5 4 -5 -17 -7 -8 -9 -10 -1 3 2 4 -3 -5 -11 -6 -15 3 -2 4 1 7 1 2 5 1 10 23 16 8 6 5 -7 -6 -9 6 16 3 7 4 -12 5 -9 -12 -1
6919 -1 3 -4 -2 5 -8 -8 -4 -7 7 2 -1 -4 -14 -9 -10 4 -6 6 4 -4 7 0 1 -10 -4 -6 -1 6 7 11 9 6 -1 5 2 12 10 6 1 -11 -9 -14 -10 -3 -8 -1 -7 -16 -8 -8 -10
6970 -10 -9 -1 -4 13 1 -2 -3 4 -4 -2 2 -2 14 9 9 6 -2 -10 -5 -1 2 3 1 4 3 0 -7 -3 -5 -3 11 8 1 -10 -1 -18 -16 -15 -13 -5 -10 -18 -2 -21 -17 -14 -9 -1 11 16 -7
7021 -7 0 -9 4 -16 12 10 8 14 17 9 14 4 -4 0 16 6 -5 0 -5 -13 -8 -1 4 -2 0 7 6 -7 -12 -8 -4 -4 -2 -3 5 -8 -8 -13 -7 -12 -7 3 -2 10 10 1 -1 7 3 16
7071 16 2 12 12 9 1 8 -2 2 5 -2 -9 0 -6 -2 -1 -2 -5 -16 -4 7 0 -2 -7 -5 -8 -13 0 7 14 -6 -7 -1 -10 -13 -6 8 -2 13 14 -6 -2 -6 5 4 7 17
7117 17 17 19 8 13 -4 -3 0 3 3 1 -8 5 -5 -14 -7 -11 -10 -8 0 -1 -8 -3 1 -10 -7 11 10 9 3 1 1 -3 10 9 -1 -2 1 8 10 15 2 5 -3 -1 8 0 3 -4 -1 -7 -1
$$ packed form
6778@Nj3jJ3Nj3J4knlqQj0Ol%QRk0%j0J2LJ6k0J2lookMJ0J3jjKj4nkJ1oJQJ4j8
6823BmNqJMMJ4nj2M%k6NJ5JJkNj2MoqK1j6J7Pj0pKqJ1JMJ7%j6ko%MpPJ0pljLK
6871EnpJ3jjrj2J0jjjRMjKpkoNrJ8nOlOoJLmRJ3pqkjj2JlJ5J0j3Mlj6J7j4lJ1
6919aMpKPj3%MlJ4nllj0NjJ4j0J2kqJ1pJj1OkNPJMklpOlJ0kmnj2KnMPnPorQ%k
6970a0JQlJ7j2ljPqKMmJ6n%lqqNMLJkLjlpMkKJ4lpj1Rj7KJKQnqJ6j9MLNQJ2Nk3
7021gPrJ3k0K8kkOLqNj0qMJ6j0j1NnqNPNoKPjj3nMM%KjQj3%nOnNJ0nJ2%rkQmJ3
7071A6j4J0%lqPj0MLppRoMJjlj1J2J1pknKlnJ3PPk0jOrlPJ4j0J5Jk0MmJ1jLJ0
7117A7%Kj1Nj7JLL%krJ3j0rPmJKQjpNMj1LJ8jjok%mJ3jj0jLPKNj3LqKRqLpLoO
$$ plain form
7168 -1 10 2 11 -7 1 -10 -13 -11 -17 -2 -4 -9 -14 6 -9 4 -3 -7 -2 -14 10 14 16 6 1 2 2 -1 10 6 4 8 -4 1 -9 -5 -2 2 -12 -15 -3 -5 -4 -2 -5 -19
7214 -19 -2 -3 0 -13 -13 -14 -12 -6 -10 -8 -13 -2 -2 -14 -4 -7 -7 -8 -4 12 15 13 0 2 9 -10 2 11 12 11 3 12 6 0 3 -6 0 1 0 -7 -6 -2 -13 -14 -14 -9 -1 1 6 2
7264 2 -5 -9 -17 -3 2 0 -5 -5 2 4 -1 4 0 7 2 7 7 1 5 4 4 -3 -5 17 19 14 1 1 6 -7 -10 -3 -5 -2 -4 -3 -6 -13 -15 -9 -13 -8 -4 9 4 -3 0 -1 1 17 12 17 12 9 5
7319 5 13 2 7 8 -1 5 6 -2 -3 1 -10 4 11 14 4 16 14 -1 0 -6 -1 0 -8 -3 -14 -6 0 -17 -7 6 -7 1 -4 2 6 -2 -4 9 3 13 12 17 11 13 16 2 4
7366 4 10 7 1 -11 4 -1 -3 2 -2 9 6 -2 2 -4 -3 -3 -12 -1 -13 -8 -9 4 -4 -11 -7 -9 -3 0 0 -5 0 -7 -9 -7 -2 6 -6 8 8 13 14 8 -2 7 -2 1 5 5 9 9 5 4
7418 4 -4 -4 3 -11 -6 -6 -8 -4 -7 -14 -8 -8 2 7 -2 3 -2 -3 -4 -3 -1 -11 1 -4 -2 -6 3 5 -5 0 -1 10 8 17 5 4 7 1 0 2 1 3 6 7 -7 -3 2 0 -4 0 -6 -1 -4
7471 -4 -9 -6 -9 -7 3 6 0 2 8 10 -1 -1 -5 5 14 15 1 7 8 6 6 15 13 2 6 -3 2 -3 4 7 0 5 3 22 5 10 -5 -14 -9 0 -16 0 0 -15 -3 -4 2 10 -3
7520 -3 8 -2 2 12 -1 11 10 13 20 13 18 13 20 8 1 0 7 12 5 12 -1 2 -1 -2 -7 -10 2 4 5 6 -5 -8 -4 -7 -9 -5 -6 -2 -5 2 -10 -5 -5 0 3 1 2 -3 -7 -5 4
$$ packed form
7168aJ1qRj8Qj1lKoJ5knnK0j5J3pmNj2K4MKj0nJ%lJ1mkMj2Nj0MLMj4lJ2kJKlj4
7214a9J7jLj3%jKOmKnJ1%j2J0l%jMJ6Lkj3KPj9J2RJjqRooLrOJjpJMj1j%NQKNm
7264BpmqJ4Nkn%PKnNmPnN%oMj%pkK2Knj3%Nj3lPkLkJlpkOmNMJ3npLjKJ6nNnlm
7319EQj1NJrOJqjMj1J4PLj0J2kj5JoNJqNj1QOj7J0J3j3QnOMqkJ3oJ0jNoKLj4K
7366DOloj2J5nkNmJ1lqMoJ%rJ1j2NjJ3qpMkOL%nNpkKNQj2J4%NJoj0RrLM%M%mj
7418Dq%Pj4N%kMlpO%J0NrNnjjJKj0J2nKmRKj0NjJ1kRj2jLojKjKLJj4MNkmMoNl
7471dnLlKJ0LoKOKj1%mJ0RJj4OJk%Rkj1MrNnPLpNkJ9j7Nj5rNRj6J6%j5J2jOQj3
7520cJ1j0MJ0j3J2jLPpNnPj2pjPNpPj3LljnlJ2KJJj1lMlkMjMlPj2N%NLkJnmKR
$$ plain form
7571 4 0 -5 3 -5 5 4 22 11 12 -2 4 2 -5 0 1 0 -12 -12 -2 -13 -3 -1 -6 -5 -3 -3 -1 -7 -7 2 -10 8 2 5 2 3 0 4 -1 5 -1 0 -2 0 4 -4 0 7 -1 1 13
7622 13 7 10 8 2 2 5 -8 -3 1 -10 -5 -10 -3 -9 -5 -7 -14 -11 -12 -9 -10 -7 -6 -13 -11 -3 2 6 8 -2 -5 2 -4 -3 -5 3 3 4 -3 1 -4 -4 1 13 -9 11 -2 -6 2 2 -12 5
7674 5 1 -7 6 -4 -7 -16 -15 -6 -2 2 -13 -15 -12 -9 -11 -11 1 -2 -7 -10 12 -6 11 -2 2 4 2 5 6 -2 -14 7 -1 1 -5 3 -5 -15 -9 -13 -3 -7 -4 -4 -15 -8 -3 -1
7722 -1 -3 -10 -11 -11 -5 -10 -8 -16 -3 -5 -6 -3 -2 6 1 -3 0 10 0 3 1 7 6 3 9 9 9 7 -7 0 -5 -6 -10 -9 -6 -12 -14 -11 -7 -1 5 -1 -13 -6 -5 1 3 -4 5 -9 -5 -3 -8 2
7776 2 0 7 -3 -2 -1 6 3 4 -2 5 3 4 2 8 7 1 -5 9 1 -1 7 -3 -3 -3 -16 -3 -7 -10 -9 -22 -6 -4 -12 -11 -17 -2 -3 -11 5 1 2 -4 3 -5 6 4 4 -5 6 6
7826 6 3 -1 -9 3 -4 -5 -8 -7 0 -8 5 -4 3 2 0 -4 -12 -14 -20 -14 -12 -8 -9 -10 -18 -3 -1 -12 -4 -3 -16 -6 -9 -14 -6 -4 5 9 5 5 10 3 2 6 -4 7 3 2 10 -5 1 -2
7878 -2 -8 -6 -3 -2 -8 7 7 3 -2 -10 -2 1 -4 -1 2 -5 -7 -15 -5 -5 -10 -3 -3 -5 -3 0 -6 -3 -8 -8 12 11 -10 4 9 0 11 1 -6 7 3 2 -5 -6 -3 2 -7 -3 -2 -2 -9 -14 -7
7931 -7 -6 -11 -3 -1 -5 -10 -8 1 -3 -12 5 5 0 -2 4 2 -9 -6 -2 -3 -1 8 7 1 -3 4 -4 -6 5 8 8 -5 -3 2 -7 -6 -11 -7 -5 -12 -13 -15 -10 -21 -13 -13 0 -11 -5 -5 0 0 -1 9
$$ packed form
7571DmnQqJ0jJ8j1Jj4OkpNJjj2%J0j1J0KnJK%Ko%Rj2J8oLlJlMnOoJkKMqMPqKJ2
7622A3oLko%Lj3NMj1NnPoMkpLjLjLJpKQNMKj0lPoJkQ%JpMn%NJ2k2K0j3mQ%j4J7
7674EmqJ3j0lrJRMMj5kLLk%J2lnlK2j8J7j3MKkLJqj2K1qKoQqj0OmJ0mL%j1PNK
7722akpj%OnKqJ3kjLJQnmLJ0j0LkOjlO%%kj4PnjmJLokLMOOoj2PJOKpRj4MKnJ0
7776BkPj0JJPlJoPkJkOjooJ4qkQj0%%j3J3mlJj3J6KqJoJ5jqJ6mJoPqJ1k%rJ1%
7826FlmqJ2pjlJPqJ3rPjkmqkoOKMjjqJ5Kj1QJj3J0lnQKRMm%NpjMj0J1mjQj5Ol
7878boKLJoJ5%mnqQLnLLpkqJ0%nP%kKLoLn%K0jk1J4NrJ1j0pJ3mjpjLNrMJ%pnP
7931gJnQKmnKRmrJ7%nkOkj1LMjKRjomPqkJ1L%j3KNrJnMKpjkNj1Q%J3j1O%N%jJ0
$$ plain form
7985 9 3 -5 -2 2 -1 -4 9 -1 0 2 -6 2 4 3 3 0 6 4 -8 -13 -8 -3 -6 -8 -6 2 -1 -10 -9 -7 -12 -14 -14 -19 -15 -10 -10 -15 7 1 1 4 -3 10 3 -2 -5 3 10 16 -1 4 15 8
8039 8 12 -1 3 4 10 0 -7 -12 1 -3 10 0 -1 -4 -2 -1 -5 4 -1 -7 0 1 -12 -2 0 -5 -11 4 -7 -1 -5 -5 -3 -15 -1 6 1 10 8 5 -3 3 0 13 -1 10 -1
8086 -1 -3 -1 -2 -2 1 -4 -5 -6 -9 -9 -9 -13 -13 2 -2 -12 -10 -1 -7 2 0 10 0 1 -10 11 -1 -6 1 17 -7 2 -7 12 -1 5 -4 11 0 9 8 1 2 -2 4 3 -8
8133 -8 -2 -8 0 -6 -10 -12 -16 -5 -4 -4 -12 -1 -3 -10 -3 -3 0 1 5 -2 3 10 5 4 2 5 -2 -6 1 2 7 -6 0 8 -2 6 3 0 0 -8 5 0 -3 4 -7 -5 -3 -7 1 2 1 0 -11 -3
8187 -3 -6 -1 0 -10
$$ packed form
7985IoqLMllJ3j0JKqQKj%lOkj2nNNlkKQlrJKnk%nMN%nK2o%LpJ3pnlQPOj7NJ1p
8039HMj3MJOj0pnJ3mJ3j0jlKJmRnoPJj3J0KnoJ5j1Om%Kj2J4PnRklqOlJ3j4J1j1
8086akKj%Lnjjl%%m%J5mj0KRoRkJ0j0Jj1K1j2nPJ6k4RrJ9j3OrJ5j1RjpJmOjj1
8133hOoQomkmJ1J%qJ1kpP%LJMpNPnjkLpmPJNj3OQj0Qll%qJ3nlPj1KKmQJjjj1Q
8187clNJj0
8191a0
$$ Imaginary data points
##PAGE= N=2
##DATA TABLE= (X++(I..I)), XYDATA
$$ plain form
0 0 0 0 0 0 0 0 0 0 0 0 0 0 0 0 8 -8 8 -8 8 -16 16 -16 24 -24 32 -32 40 -48 48 -58 68 -80 88 -100 112 -128
36 -128 144 -160 176 -200 224 -248 272 -304 336 -370 408 -450 496 -547 603 -660 732 -806 892
55 892 -987 1094 -1221 1365 -1537 1742 -1993 2310 -2726 3295 -4119 5445 -7896 14027 -62905
70 -62905 -61275 86274 72003 19208 15535 62669 19938 -77038 -117684 -47730 29034 59932
82 59932 59775 57908 21760 -33361 -62587 -48836 -37818 -25304 25967 97558 94103 3188 -72601
95 -72601 -57612 -17477 -25904 -40744 15213 95493 92867 5284 -60558 -55784 -33210 -32790 -17874
108 -17874 33632 74244 58575 11620 -24042 -46258 -62069 -48392 4452 54733 59648 33608
120 33608 12285 -6615 -40438 -67010 -48411 6332 49206 55969 40584 15833 -18266 -48741
$$ packed form
0@%%%%%%%%%%%%%%Qj6J6j6J6k4L2l2M0m8N6o4P2q8R6j06J26j48J68j88K12k40
36a28K72l04L36l76M24m72N20n76O40p06P78q58R46j043J150j263J392j538J698
55H92j879K081k315K586k902L279l735M303n036O021p414R564j3341K1923p6932
70f2905J630J47549j4271n2795l673M7134m2731r6976m0646O9954P6764L0898
82E9932j57j867l6148n5121k9226J3751J1018J2514N1271P1591l455r0915p5789
95g2601J4989M0135q427j4840N5957Q0280k626q7583o5842M774K2574M20J4916
108a7874N1506M0612j5669m6955l5662k2216j5811J3677N2844N0281M915k6040
120C3608k1323j8900l3823k6572J8599N4743M2874O763j5385k4751l4099l0475
$$ plain form
132 -48741 -52532 -29152 498 26676 50621 56998 24963 -29541 -59803 -46160 -16022 3666
144 3666 19570 41609 51730 27998 -18726 -54079 -55793 -27202 12094 38503 39662 26614 15994
157 15994 1359 -32170 -64301 -49786 11808 58901 47522 10904 745 5478 -17858 -56965
169 -56965 -53501 2799 52865 52259 22732 1632 -11248 -29131 -40854 -29699 -2499 24305 44156
182 44156 47203 18391 -29479 -52288 -31514 -3247 527 2868 32499 58097 29769 -33013 -59997
195 -59997 -31699 472 3421 6015 31997 48889 21899 -24984 -45019 -33572 -16603 -280
207 -280 23797 42367 32960 3991 -16785 -24818 -33096 -33234 -5129 36376 49147 23804 -4171
220 -4171 -12435 -18607 -34274 -34700 -2041 35953 42564 22385 3477 -9185 -26874 -39645 -25810
$$ packed form
132d8741l791K3380K9650K6178K3945O377l2035n4504l0262J3643L0138J9688
144C666J5904K2039J0121k3732m6724l5353j714K8591L9296K6409J159j3048j0620
157A5994j4635l3529l2131J4515O1594M7093j1379l6618j0159M733k3336l9107
169e6965L464N6300N0066o06k9527k1100j2880j7883j1723J1155K7200K6804J9851
182D4156L047k8812m7870k2809K0774K8267L774K341K9631K5598k8328o2782k6984
195e9997K8298L2171K949K594K5982J6892k6990m6883k0035J1447J6969J6323
207b80K4077J8570r407k8969k0776q033q278j38K8105M1505J2771k5343k7975
220d171q264o172j5667m26L2659L7994O611k0179j8908j2662j7689j2771J3835
$$ plain form
233 -25810 7691 30051 29986 22720 14275 -6428 -34978 -43379 -19474 12503 26444 25545 23456 15591
247 15591 -7585 -33730 -39023 -19559 6588 24513 31605 26714 8830 -14017 -28394 -29238 -20118
260 -20118 -2588 21288 38039 31217 4489 -19640 -26944 -23629 -17802 -4877 17937 36330 32167
273 32167 7366 -18270 -29589 -26561 -15312 583 17787 29397 28048 11970 -12180 -31001
285 -31001 -32200 -15605 6020 20320 25296 23357 12516 -8297 -28912 -33289 -17492 5650 21655
298 21655 26509 22243 9588 -9250 -25711 -29584 -18246 1779 20566 29360 23678 6729 -12037
311 -12037 -23935 -25735 -17535 -685 18996 30069 24331 5995 -12743 -23546 -24832 -16730 -107
324 -107 18604 28415 23005 6637 -11216 -23387 -25718 -16364 1577 19040 26573 21229 6916 -10040
$$ packed form
233b5810L3501K2360o5p266q445k0703k8550q401K3905L1977J3941q99k089p865
247A5591k3176k6145n293J9464K6147J7925P092m891j7884k2847j4377q44R120
260b0118J7530K3876J6751o822k6728k4129p304L315N827J2925K2814J8393m163
273C2167k4801k5636j1319L028J1249J5895J7204J1610j349j6078k4150j8821
285c1001j199J6595K1625J4300M976j939j0841k0813k0615m377J5797K3142J6005
298B1655M854m266j2655j8838j6461l873J1338K0025J8787Q794n682j6949j8766
311a2037j1898j800Q200J6850J9681J1073n738j8336j8738j0803j286Q102J6623
324a07J8711R811n410j6368j7853j2171k331R354J7941J7463P533n344j4313j6956
$$ plain form
338 -10040 -23070 -25881 -15874 2217 18713 25568 20639 6899 -9988 -22832 -25039 -14974 2186
351 2186 17845 24891 20490 6750 -10206 -22579 -24246 -14310 2226 17379 24222 19871 6487
364 6487 -9924 -21948 -23708 -14039 2299 17237 23750 19272 6160 -9817 -21422 -22921 -13435
377 -13435 2125 16401 23172 19357 6287 -10094 -21480 -22062 -12412 2030 15271 22299 19411
390 19411 6594 -10061 -21350 -21545 -11933 2140 15045 21758 18554 6078 -9511 -20267 -21226
403 -21226 -12431 2046 15728 21813 17237 4928 -8942 -18789 -20718 -12983 1786 16048 21797
416 21797 16525 4347 -8807 -18269 -20137 -12386 1994 15409 20875 16451 4881 -8879 -18921
429 -18921 -19899 -11019 2661 14321 19459 16404 5732 -8720 -19430 -19807 -10148 3162 13850 18671
$$ packed form
338a0040j3030k811J0007J8091J6496O855m929j3740j6887j2844k207J0065J7160
351B186J5659P046m401j3740j6956j2373j667R936J6536J5153O843m351j3384
364F487j6411j2024j760R669J6338J4938O513m478j3112j5977j1605j499R486
377a3435J5560J4276O771l815j3070j6381j1386n82R650J4442J3241P028k888
390A9411j2817j6655j1289j95R612J4073J2905O713l204j2476j5589j0756r59
403b1226Q795J4477J3682O085m576j2309j3870r847j929P735J4769J4262N749
416B1797n272j2178j3154r462j868P751J4380J3415N466m424j1570j3760j0042
429a8921r78Q880J3680J1660N138l055j0672j4452j0710l77R659J3310J0688M821
$$ plain form
443 18671 15963 5612 -8503 -18845 -19308 -10246 2884 14049 18943 15350 4503 -8554 -17546
456 -17546 -18327 -10762 1963 14203 19619 15059 3433 -8801 -16425 -17237 -10908 1104 13844 19881
470 19881 15106 2978 -9050 -15964 -16455 -10580 750 13274 19605 15117 2931 -9198 -15876 -15995
484 -15995 -10073 840 12796 18947 14910 3278 -8915 -16088 -16132 -9425 1707 12518 17550 14191
498 14191 4241 -7870 -16681 -17261 -8764 3597 12715 15432 12753 5389 -6206 -17122 -18783 -8582
512 -8582 5338 13314 13993 11345 5623 -5166 -16583 -18857 -8875 5043 13415 14587 11373 4273
526 4273 -6340 -15434 -16479 -8740 2634 12305 16608 13009 2473 -8853 -14484 -13371 -8113 325
540 325 10968 17921 14184 1550 -9962 -13886 -12256 -8055 -31 11018 17604 13192 1439 -8691
$$ packed form
443A8671k708j0351j4115j0342m63R062J3130J1165M894l593j0847j3057q992
456a7546p81P565J2725J2240N416m560j1626j2234p624q12O329J2012J2740O037
470A9881m775j2128j2028o914m91N875J1330J2524O331m488j2186j2129o678j19
484a5995N922J0913J1956O151m037j1632j2193p173m4O707J1132J0811N032l359
498A4191r950j2111q811n80Q497J2361R118K717k679p364j1595j0916j661J0201
512h582J3920P976O79k648n722j0789j1417k274R982J3918Q372J172l214p100
526D273j0613r094j045P739J1374R671M303l599j0536j1326n631J113N258Q438
540C25J0643O953l737j2634j1512l924J630M201Q024J1049O586m412j1753j0130
$$ plain form
554 -8691 -13177 -13248 -8837 1003 12096 16551 11409 1635 -7015 -12642 -14045 -9044 1581 11888 15661
569 15661 11470 2362 -7388 -13601 -13289 -7004 1583 9376 14401 13392 4168 -8782 -15853 -12551 -4248
584 -4248 2385 7360 12470 13683 5732 -7822 -16399 -13994 -4691 4180 9468 11354 9883 4607 -4047
599 -4047 -13097 -16438 -9155 5006 14556 12564 4991 976 -1162 -8304 -16618 -13137 3421 16950
613 16950 14954 4406 -1504 -2789 -7343 -13534 -11242 1032 12770 15200 9447 631 -7698 -12095
627 -12095 -9965 -4215 594 5410 12404 15156 5270 -11201 -17431 -8718 879 1663 2080 10283 16067
642 16067 6418 -10869 -16972 -9089 -944 1454 5180 12059 12378 2237 -8417 -11216 -9322 -6794
656 -6794 -257 10439 15320 8242 -2182 -6128 -6678 -9834 -10151 -214 12761 14896 6216 -1386 -4053
$$ packed form
554h691m486p1M411R840J1093M455n142r774q650n627j403N001J0625J0307L773
569A5661m191r108r750o213L12O285Q587P793N025j009r224j2950p071L302Q303
584d248O633M975N110J213p951j3554q577K405R303Q871N288J886j471n276q654
599d047r050l341P283J4161R550j992p573m015k138p142q314L481J6558J3529
613A6950j996j0548n910j285m554o191K292J2274J1738K430n753q816q329m397
627a2095K130N750M809M816O994K752r886j6471o230Q713R597P84M17Q203N784
642A6067r649j7287o103P883Q145K398L726O879L19j0141j0654k799J894K528
656f794O537J0696M881p078j0424l946n50l156l17R937J2975K135q680p602k667
$$ plain form
671 -4053 -7916 -12431 -8521 3712 11881 9809 5264 3559 -1485 -11930 -16040 -5784 7952 10852
685 10852 5837 4616 5923 -519 -12695 -16059 -5647 6716 10522 8271 5861 2488 -3820 -9548
699 -9548 -10449 -6700 182 8988 14432 9742 -2243 -9588 -7338 -3990 -5722 -4800 5928 16867 13154
714 13154 -2221 -12090 -9259 -3479 -2940 -2489 4187 12261 12114 2673 -8242 -12949 -9440 -1495 4615
729 4615 5918 5716 7346 6573 -2290 -13794 -14787 -2993 8329 8890 4417 4227 5203 -928 -11058 -13493
745 -13493 -5146 5032 9427 8737 5767 826 -4831 -8015 -7832 -5540 -514 7625 13067 8775 -1983
760 -1983 -8369 -6920 -4654 -5134 -2139 7007 13241 8384 -1814 -6941 -6799 -6922 -5983 730 9294 10555
776 10555 4531 -595 -2655 -6398 -10724 -7368 3749 11270 8503 2415 320 -1313 -6939 -10964 -6045
$$ packed form
671d053l863m515L910J2233Q169k072m545j705n044j0445m110J0256J3736K900
685A0852n015j221J307o442j2176l364J0412J2363L806k251k410l373o308n728
699i548r01L749O882Q806N444m690j1985p345K250L348j732R22J0728J0939l713
714A3154j5375r869K831N780N39M51O676Q074j47r441j0915m707L509P945O110
729D615J303k02J630p73q863j1504r93J1794J1322N61m473j90R76o131j0130k435
745a3493Q347J0178M395o90k970m941n657l184J83K292N026Q139N442m292j0758
760a983o386J449K266m80K995R146O234m857j0198n127J42j23R39O713Q564J261
776A0555o024n126k060l743m326L356J1117P521k767o088k095j633n626m025M919
$$ plain form
791 -6045 3741 8999 7970 5265 1657 -4570 -9633 -7899 -1707 2270 3882 7448 9859 3677 -8084
806 -8084 -12598 -5780 1679 1953 1340 6534 10739 4368 -7730 -12360 -6640 266 2721 4046 6730
821 6730 6986 2161 -4352 -8264 -8429 -4600 2678 8942 8591 2874 -1318 -2097 -4225 -8533 -7742 1582
837 1582 10753 10067 2372 -2595 -2880 -4044 -7162 -6263 978 8333 9340 4771 -801 -4852 -6887 -6151
853 -6151 -2708 1624 5210 7395 6645 1453 -5681 -9048 -6215 -1025 2423 4411 6449 6400 1701 -5096
869 -5096 -8445 -6451 -1992 2267 5613 7135 5183 284 -4454 -6659 -6224 -3364 1626 6519 7804
884 7804 4602 -388 -4210 -6182 -6172 -3303 1838 6207 7033 4587 539 -3907 -7084 -6712 -2390 2817
900 2817 5594 5747 4484 1489 -3485 -7608 -7061 -2069 3151 5538 5578 4258 1130 -3512 -6924 -6480
$$ packed form
791f045R786N258j029k705l608o227n063J734O192L977J612L566K411o182j1761
806h084m514O818P459K74o13N194M205o371j2098m630N720O906K455J325K684
821F730K56m825o513l912j65L829P278O264l51n717m192p79k128m308P91R324
837A582R171o86p695m967k85j164l118Q99P241P355J007m569n572m051k035P36
853f151L443M332L586K185p50n192p134l367K833N190L448J988K038m9m699o797
869e096l349J994M459M259L346J522j952m899m738k205M35K860M990M893J285
884G804l202m990l822j972J0K869N141M369Q26k446m048m446l177L72M322N207
900B817K777J53j263k995m974m123N47M992N220K387M0j320l128m642l412M44
$$ plain form
916 -6480 -2533 2322 5745 6519 4306 10 -4037 -5931 -5416 -2892 1286 5639 7252 4551 -522 -4430
932 -4430 -5638 -4940 -2765 1102 5345 6985 4544 -259 -4281 -5899 -5152 -2428 1578 5174 6337 4315
948 4315 147 -3959 -6062 -5328 -2239 1817 5069 6050 4208 218 -3902 -5979 -5175 -2130 1771 4934
964 4934 5948 4139 214 -3806 -5890 -5180 -2073 1973 4997 5588 3740 370 -3284 -5778 -5613 -2256
980 -2256 2407 5310 5168 3147 426 -2780 -5550 -5793 -2428 2396 5337 5211 3170 223 -3096 -5402
996 -5402 -5078 -2108 1747 4628 5577 4004 71 -4029 -5550 -4082 -1442 1180 3798 5668 4597 150
1012 150 -4402 -5675 -3874 -1268 1305 3904 5362 3966 111 -3582 -5190 -4573 -2034 1842 4958
1027 4958 5123 2651 -271 -2514 -4386 -5145 -2844 2040 5608 5125 2175 -477 -2416 -4274 -4850 -2452
$$ packed form
916f480L947M855L423P74k213m296m047j894N15K524M178M353J613k701n073l908
932d430j208O98K175L867M243J640k441m803m022j618P47K724M006L596J163k022
948D315m168m106k103P34L089M056L252R81j842l990m120k077Q04L045L901L163
964D934J014j809l925m020k084P10L107M046L024N91j848l370l654k494J65L357
980b256M663K903j42k021k721l206k770k43L365M824K941j26k041k947l319k306
996e402L24K970L855K881R49j573l933m100j521J468K640K622K618J870j071m447
1012A50m552j273J801K606K573K599J458j396l855l693j608O17K539L876L116
1027D958J65k472k922k243j872p59K301M884L568m83k950k652j939j858n76K398
$$ plain form
1043 -2452 1869 4847 4938 3025 44 -3235 -5146 -4192 -1116 1789 3496 4414 3979 800 -3822 -5926
1059 -5926 -3945 -380 1896 3090 4152 3851 721 -3532 -5414 -4042 -1139 1768 4028 4634 2837
1074 2837 -428 -2961 -3960 -3935 -2435 1264 5010 5412 2206 -1362 -2850 -3246 -3639 -2597 1001 4738
1090 4738 5289 2550 -871 -3141 -4052 -3551 -1384 1596 3648 4096 3124 504 -3179 -5357 -3979 -282
1106 -282 2434 3051 3117 3091 1150 -2841 -5516 -4241 -438 2506 3457 3391 2542 310 -2647 -4342 -3796 -1487
1124 -1487 1645 4158 4469 2164 -1004 -2823 -3194 -3149 -2136 884 4386 5031 2173 -1348 -2941 -3111
1140 -3111 -3023 -1891 1115 4066 4399 2174 -644 -2699 -3813 -3476 -1204 1903 3694 3467 2126 122
1156 122 -2459 -4339 -3721 -749 2237 3379 3162 2291 275 -2659 -4350 -3309 -570 1780 3017 3541
$$ packed form
1043b452M321K978R1j913k981l279j911R54L076K905J707R18m35l179m622k104
1059e926J981L565K276J194J062l01l130m253j882J372K903K907K260O06j797
1074B837l265k533r99K5J500L699L746M02l206l568j488l96l93J042L598L737
1090D738N51k739l421k270r11N01K167K980K052M48r72k620l683k178J378L697
1106b82K716O17O6k6j941l991k675J275L803K944R51o6q49k232k957j695N46K309
1124a487L132K513L11k305l168j819l71M5J013L020L502O45k858l521j593j70
1140c111Q8J132L006K951L33k225k818k055j114L37K272L107J791k27j341k004
1156A22k581j880O18K972K986J142k17q71k016k934j691J041K739K350J237N24
$$ plain form
1172 3541 2718 -28 -3180 -4154 -2647 -443 1228 2723 3812 2962 -227 -3386 -4026 -2473 -457 1245
1188 1245 2800 3661 2598 -229 -2918 -3850 -2919 -828 1634 3345 3376 1823 -321 -2185 -3407 -3385 -1382
1205 -1382 1846 3908 3354 1229 -635 -1797 -2919 -3392 -1755 1702 4111 3569 1132 -921 -1900 -2672
1221 -2672 -3049 -1693 1407 3852 3674 1428 -947 -2317 -2841 -2627 -1208 1210 3241 3564 1961 -626
1237 -626 -2798 -3369 -2264 -443 1198 2444 3191 2526 -79 -3112 -3961 -2140 278 1437 1892 2693 2724
1254 2724 413 -3015 -4252 -2354 438 1804 2054 2372 2223 384 -2426 -3877 -2790 -216 2027 2907
1270 2907 2466 1250 -249 -1740 -2939 -3026 -1196 1845 3721 2941 646 -989 -1568 -2211 -2758 -1612 1408
1287 1408 3729 3274 900 -1174 -2017 -2291 -2211 -1075 1121 2989 3197 1605 -779 -2574 -2878 -1856 -327
$$ packed form
1172C541q23k746l152r74J507K204J671J495J089q50l189l159o40J553K016J702
1188A245J555Q61j063k827k689r32R31K091K462J711L1j553k144j864j222K2K003
1205a382L228K062n54k125j864j162j122m73J637L457K409n42k437k053r79p72
1221b672l77J356L100K445j78k246k375j370n24K14J419K418K031L23j603k587
1237f26k172n71J105J821J641J246P47o65k605l033q49J821K418J159M55Q01L1
1254B724k311l428j237J898K792J366K50L18j49j839k810j451J087K574K243Q80
1270B907m41j216j499j491j199q7J830L041J876p80k295j635n79o43n47J146L020
1287A408K321m55k374k074q43k74Q0J136K196J868K08j592k384j795l04J022J529
$$ plain form
1304 -327 1113 2336 2919 1967 -488 -2709 -3057 -1791 -232 1106 2377 2946 1745 -754 -2534 -2624 -1784
1321 -1784 -666 960 2737 3154 1405 -1052 -2362 -2349 -1814 -732 1096 2729 2809 1345 -549 -2122
1337 -2122 -2921 -2259 -116 1926 2317 1687 1300 570 -1629 -3774 -2967 452 2823 2167 882 1015 985 -1274
1355 -1274 -3747 -3125 172 2625 2513 1462 812 -78 -1588 -2590 -2166 -697 1164 2827 3099 1078
1371 1078 -1710 -2537 -1377 -731 -1185 -256 2707 4151 1577 -2315 -3138 -1262 -280 -835 -181 2327 3563
1388 3563 1612 -1387 -2632 -2163 -1316 -209 1295 2243 1913 945 -55 -1490 -2971 -2613 66 2515
1404 2515 2430 974 447 402 -1037 -3023 -2752 28 2344 2328 1341 785 -79 -1717 -2692 -1733 125 1329
1422 1329 1866 2157 1477 -604 -2519 -2461 -947 233 834 1703 2351 1466 -739 -2309 -2256 -1294 -97 1261
$$ packed form
1304c27J440J223N83r52k455k221l48J266J559J338J271N69j201k499j780r0Q40
1321a784J118J626J777M17j749k457j310J3N35J082J828J633Q0j464j894j573
1337b122p99O62K143K042L91o30l87p30k199k145Q07L419K371o56j285J33l0k259
1355a274k473O22L297K453j12j051o50q90j510j002M24J469J861J663K72k021
1371A078k788q27J160O46m54R29K963J444k574l892q23J876R82n55O54K508J236
1388C563j951k999j245M69Q47J107J504R48l30r68j000j435j481L58K679K449
1404B515q5j456n27m5j439j986K71K780K316j6r87n56q64j638r75R59J858J204
1422A329N37K91o80k081j915N8J514J180O01Q69O48q85k205j570N3R62J197J358
$$ plain form
1440 1261 2273 1999 535 -767 -1358 -1863 -2060 -740 1759 3008 1808 -172 -916 -948 -1554 -2063 -877
1457 -877 1542 2852 2032 298 -1008 -1656 -1781 -1225 -166 926 1789 2200 1431 -724 -2643 -2408 -530
1474 -530 746 714 953 1970 1937 -316 -2728 -2696 -725 779 1072 1238 1634 1214 -373 -1876 -2214 -1451
1492 -1451 -59 1493 2291 1607 115 -793 -1037 -1485 -1861 -775 1559 2810 1737 -179 -978 -980 -1375 -1662
1510 -1662 -576 1423 2373 1660 338 -668 -1464 -1905 -1320 160 1362 1625 1382 888 -286 -1819 -2313
1527 -2313 -1154 527 1327 1375 1346 930 -377 -1810 -2070 -1052 210 1108 1675 1665 669 -859 -1701 -1528
1545 -1528 -897 -199 877 1933 1935 528 -1087 -1664 -1357 -843 -167 910 1836 1739 553 -826 -1631 -1659 -999
1564 -999 126 1200 1621 1318 559 -448 -1473 -1908 -1198 276 1392 1563 1122 490 -386 -1369 -1827 -1196
$$ packed form
1440A261J012k74j464j302n91n05j97J320K499J249j200j980p44l2o06n09J186
1457h77K419J310q20j734j306o48j25N56J059J092Q63M11p69k155j919K35J878
1474e30J276l2K39J017l3k253k412L2J971J504K93J66L96m20j587j503l38P63
1492a451J392J552P98o84j492r08k44m48l76J086K334J251j073j916p99kl95k87
1510a662J086J999R50p13j322j006p96m41N85J480J202K63k43m94j174j533m94
1527b313J159J681Q00M8k9m16j307j433k60J018J262Q98N67j0r96j528q42J73
1545a528O31O98J076J056Kj407j615n77L07N14O76J077R26r7j186j379q05k8O60
1564i99J125J074M21l03p59j007j025m35P10J474J116J71m41o32q76r83m58O31
$$ plain form
1582 -1196 168 1304 1655 1271 419 -621 -1404 -1566 -993 20 1095 1694 1440 427 -766 -1461 -1452 -887
1600 -887 28 1063 1652 1395 404 -719 -1413 -1490 -935 94 1138 1606 1250 360 -650 -1375 -1516 -936 124
1619 124 1117 1549 1265 393 -689 -1441 -1447 -791 157 987 1455 1355 477 -733 -1513 -1429 -704 185 963 1429
1639 1429 1275 448 -661 -1405 -1444 -830 186 1134 1489 1067 253 -553 -1169 -1430 -1012 116 1250 1566 995
1658 995 150 -575 -1131 -1365 -942 102 1110 1456 1115 314 -655 -1353 -1346 -634 249 869 1219 1215 560 -674
1678 -674 -1545 -1388 -470 354 826 1142 1175 510 -636 -1406 -1323 -649 214 982 1373 1037 140 -667 -1054 -1141 -893
1699 -893 -53 1104 1625 980 -106 -742 -910 -1033 -891 -59 1070 1518 1009 82 -661 -1138 -1201 -658 291
1718 291 959 1095 942 478 -444 -1405 -1468 -479 602 943 848 834 568 -364 -1375 -1446 -553 442 951 1078 874
$$ packed form
1582a196J364J136L51l84q52j040p83j62N73J013J075N99k54j013j193o95RN65
1600h87R15J035N89k57r91j123o94p7N55J029J044M68l56q90j010p25j41N80J060
1619A24R93M32k84q72j082p52oO56R48Q30M68j00q78j210p80Q4P25Q89P78M66
1639A429j54q27j109p44l9O14J016R48L55m22q14q06o16k61M18J128J134L16n71
1658I95q45p25n56k34M23J044J008L46l41q01r69o98PP12Q83O20L50mo55j234
1678f74q71J57R18Q24M72L16L3o65j146p70Q3O74Q63P68L91l36q97q07l87q7K48
1699h93Q40J157N21o45j086o36j68j23J42Q32J129M48n09r27p43m77o3N43R49
1718B91O68J36j53m64r22r61o3R89J081L41r5j4k66r32j011p1Q93R95N09J27k04
$$ plain form
1739 874 250 -601 -1094 -1039 -668 -34 872 1480 1105 -70 -942 -932 -687 -626 -263 749 1575 1204 -39 -934
1759 -934 -1021 -788 -539 12 809 1235 959 253 -538 -1143 -1232 -567 476 1017 871 594 389 -176 -1151 -1486
1779 -1486 -655 620 1114 837 512 309 -257 -1057 -1289 -625 354 942 1051 778 154 -618 -1038 -894 -438
1798 -438 67 705 1202 1052 105 -838 -1063 -722 -358 24 672 1203 986 89 -714 -994 -853 -476 155 854
1818 854 1103 712 50 -491 -871 -1001 -627 239 977 1073 592 1 -466 -848 -974 -572 209 860 1045 740
1838 740 107 -609 -995 -832 -319 220 627 936 910 261 -679 -1156 -827 -171 296 571 833 853 301 -576 -1099
1859 -1099 -939 -294 353 757 830 613 155 -396 -873 -1008 -541 315 967 937 434 -49 -330 -673 -944 -672
1879 -672 231 1027 1049 433 -135 -418 -635 -810 -569 150 883 1055 590 -64 -554 -756 -693 -366 144 671 941
$$ packed form
1739H74o24q51m93N5L71O34R06O08l75j175q72J0K45O1L63J012Q26l71j243q95
1759i34q7K33K49N51P97M26k76p06p91o05q9O65J043N41j46k77k05n65r75l35
1779a486Q31J275M94k77l25k03n66q00k32O64R79N88J09k73o24p72m20J44M56
1798d38N05O38M97j50r47r43k25L41L64L82O48N31k17q97q03k80J41L77O31O99
1818H54K49l91o62n41l80j30L74Q66P38R6m81n91m67l82j26M02P81O51J85l05
1838G40o33p16l86J63N13N39M07L09k6o49r40m77L29O56M67K75K62K0n52q77n23
1859a099J60O45O47M04P3k17m58n51m77j35M67Q56O52l0n03m83k81l43k71K72
1879f72R03P96K2o16n68k83k17j75K41P19P33J72m65o54m90k02O3L27N10N27K70
$$ plain form
1900 941 756 77 -651 -946 -676 -171 210 503 794 813 223 -666 -1072 -705 -82 304 468 693 749 262 -578
1921 -578 -1051 -771 -127 347 552 685 636 186 -479 -879 -769 -296 299 731 815 513 -8 -427 -675 -725 -460
1942 -460 184 836 939 418 -161 -435 -555 -689 -540 145 854 924 386 -151 -389 -590 -738 -463 249 810
1962 810 780 367 -7 -343 -700 -798 -336 366 730 665 423 89 -371 -775 -725 -220 304 587 698 574 72
1983 72 -562 -805 -516 -121 127 423 783 738 15 -753 -839 -377 -46 60 335 759 739 45 -692 -839 -506
2004 -506 -89 246 494 615 460 97 -357 -742 -774 -273 472 788 504 147 58 -83 -577 -908 -443 481 902
2025 902 584 102 -71 -191 -475 -705 -410 229 707 734 385 -145 -537 -586 -380 -186 21 399 796 673 -74
2046 -74 -739 -711 -249 -27 46 329 724 636 -17 -595 -664 -423 -139 203 551 626 333 -52 -310 -506 -626 -340
$$ packed form
1900I41j85o79p28k95K70N05L81K93K91J9n90q89m06L67O23L86J64K25N6m87q40
1921e78m73K80O44M74K05J33m9m50o65m00J10M73N95M32Q4l02n21m19k48n0K65
1942d60O44O52J03n21n79k74j20j34J49O85P09P0n38n37k38k01j48K75P12N61
1962H10l0m13l74l36l57r8M62P02L64o5k42l34m60m04N0N05N24K83J11j24n02
1983G2o34k43K89L95K48K96L60m5p23p68q6M62L31J06K75M24k0o94p37j47L33
2004e06M17L35K48J21j55l63m54l85l2N01P45L16k84l57q9j41m94l31M65R24M21
2025I02l18m82j73j20k84k30K95O39M78K7l49n30l92m9K06J94K07L78L97j23p47
2046g4o65K8M62K22P3K83L95q8o53n78o9K41K84L42L48P5k93l85k58j96j20K86
$$ plain form
2068 -340 315 748 583 145 -83 -216 -477 -650 -317 326 655 522 244 18 -332 -673 -560 -54 322 394
2088 394 398 457 186 -453 -830 -490 125 336 283 365 487 183 -439 -743 -482 -15 269 464 530 305 -98 -365
2110 -365 -408 -413 -323 112 666 730 188 -339 -359 -225 -341 -425 17 652 759 232 -293 -405 -349 -330 -222 132 468
2133 468 529 336 -13 -390 -630 -432 29 348 328 301 349 176 -327 -728 -505 72 392 351 294 290 82 -322 -576
2156 -576 -440 -69 259 440 474 251 -139 -390 -403 -300 -169 105 481 577 241 -210 -398 -374 -291 -155 161 459
2178 459 499 229 -99 -325 -440 -387 -77 297 459 358 164 2 -245 -483 -460 -63 338 454 334 159 -31
2199 -31 -283 -449 -370 -68 232 406 418 223 -125 -398 -411 -240 -58 127 346 479 282 -142 -439 -402 -209 -23
2221 -23 158 361 429 242 -90 -346 -412 -286 -39 262 399 345 162 -67 -260 -413 -348 -48 278 414 322 128
$$ packed form
2068c40O55M33j65m38k28j33k61j73L33O43L29j33k78k26l50l41J13N06L76P2
2088C94MN9k71o39l77L40O15K11n3Q2J22l04o22l04K61M67K84J95O6k25m03k67
2110c65m3nR0M35N54O4n42n27k0J34j16q4M42O35J07n27n25j12N6J9J08L54L36
2133D68O1j93l49l77k40J98M61L19k0k7M8j73n03m01K23N77L20m1n7mk08m04k54
2156e76J36L71L28J81L4k23l90k51j3J03J31K74L76R6l36m51j88K4Q3J36L16K98
2178D59M0k70l28k26j15N3L10L74J62j01j94j62k47k38K3L97M01J16j20j75j90
2199c1k52j66P9L02L00J74J2j95l48k73j3J71J82J85K19J33j97m24k97L7J93J86
2221b3J81K03O8j87l32k56o6J26K47L01J37n4j83k29j93j53O5L00L26J36r2j94
$$ plain form
2243 128 -77 -277 -399 -320 -53 231 365 349 181 -102 -335 -407 -266 -11 202 350 363 197 -85 -338 -381 -256
2265 -256 -15 245 379 342 131 -108 -261 -333 -292 -65 255 429 346 81 -139 -252 -317 -276 -73 226 385 325
2287 325 135 -113 -323 -368 -224 9 183 280 321 231 -73 -375 -422 -189 88 206 244 278 215 -57 -319 -385 -220
2310 -220 24 222 337 318 111 -119 -242 -271 -248 -104 198 431 346 30 -193 -229 -225 -241 -112 175 402 316 57
2333 57 -155 -258 -308 -224 7 218 278 231 158 -16 -296 -430 -223 126 271 217 177 182 16 -274 -402 -218 94
2356 94 238 276 241 108 -112 -269 -258 -161 -51 122 348 375 90 -249 -295 -166 -111 -102 58 344 386 90 -226 -297
2380 -297 -217 -138 -19 169 295 232 95 -48 -213 -359 -263 81 321 255 98 61 60 -155 -390 -306 79 341 286
2403 286 118 30 -40 -183 -301 -207 -2 169 290 294 94 -200 -320 -184 -41 -32 28 248 391 145 -249 -362 -177
$$ packed form
2243A28k05k00j22P9K67K84J34j6j68k83k33p2J41K55K13J48J3j66k82k53m3J25
2265b56K41K60J34l7k11k39j53p2M1K27L20J74q3k65k20j13o5M1K03K99J59o0
2287C25j90k48k10m5J44K33J74R7M1r0l04l02m7K33K77J18L8L4o3k72k62o6J65
2310b20K44J98J15j9k07k30j23k9K3J44L02K33q5l16k23l6Mj6J29K87K27q6k59
2333E7k12j03n0Q4K31K11O0m7p3j74k80j34K07L49J45n4m0Nj66k90j28J84L12
2356I4J44L8l5j33k20j57J1R7J10J73K26K7k85l39m6J29N5RJ60K86M2k96l16p1
2380b97Q0P9J19J88J26o3j37j43j65j46R6L44K40o6j57l7jk15k35Q4L85K62n5
2403B86j68q8p0j43j18R4K05J71J21Mk00k94j20J36J43RO0K20J43k46l94j13J85
$$ plain form
2426 -177 -7 -1 57 242 310 133 -141 -269 -247 -135 51 236 273 151 33 -19 -133 -301 -287 28 332 313 76
2449 76 -33 -15 -114 -278 -250 25 258 273 156 40 -92 -239 -262 -97 60 115 176 255 160 -132 -340 -253 -8 92
2473 92 93 150 255 162 -132 -288 -213 -67 43 150 253 209 23 -134 -160 -167 -187 -49 207 350 176 -83 -154 -105
2497 -105 -128 -203 -79 201 336 182 -47 -151 -170 -170 -128 24 159 190 173 95 -91 -269 -262 -43 162 144 99 153 164
2522 164 -21 -292 -315 -55 169 168 109 120 102 -50 -224 -256 -110 69 196 224 128 -24 -134 -155 -147 -131 -28 170
2546 170 288 162 -64 -170 -132 -105 -118 -31 167 265 181 -20 -155 -157 -134 -72 32 159 209 152 36 -111 -196 -187 -65
2571 -65 91 158 138 120 48 -86 -221 -217 -65 95 149 150 122 32 -106 -210 -181 -55 73 128 174 145 21 -129 -190 -147
2597 -147 -37 53 142 179 159 19 -121 -182 -134 -53 55 156 189 129 9 -96 -156 -161 -82 62 168 181 78 -11 -72
$$ packed form
2426a77J70ON8J85O8j77k74j28K2J12J86J85L7j22j18n2j14j68J4L15L04j9k37
2449G6j09J8r9j64K8K75K33J5j17j16j32j47k3J65J57N5O1P9r5k92k08Q7K45J00
2473I2JN7J05r3k94j56P5J46J10J07J03m4j86j57k6pk0J38K56J43j74k59p1M9
2497a05k3p5J24K80J35j54k29j04j9%M2J52J35L1j7p8j86j78PK19K05j8m5N4J1
2522A64j85k71k3K60K24jn9J1j8j52j74l2J46J79J27K8r6j52j10k1QJ6J03J98
2546A70J18j26k26j06L8K7j3Q7J98R8q4k01j35kK3O2J04J27N0n7j16j47q5RJ22
2571f5J56O7k0j8p2j34j35MJ52J60N4Jk8r0j38j04K9J26J28N5M6k9j24j50o1M3
2597a47J10R0Q9L7k0j40j40o1M8Q1J08J01L3o0j20j05o0nP9J44J06J3j03q9o1
$$ plain form
2622 -72 -145 -185 -104 70 200 180 50 -39 -68 -119 -172 -99 51 188 183 91 -20 -96 -141 -129 -51 49 142 181 144 18 -138
2649 -138 -175 -95 5 52 87 157 167 34 -159 -216 -99 32 56 66 111 156 36 -141 -208 -135 -21 81 120 130 81
2674 81 -6 -94 -141 -139 -76 76 187 174 40 -60 -66 -91 -137 -117 73 219 183 42 -55 -67 -93 -124 -72 63 169 154 70
2701 70 -30 -105 -151 -125 -8 75 101 92 93 23 -121 -195 -127 29 97 89 91 90 17 -123 -176 -111 -8 60 132 146 80 -46 -124
2730 -124 -105 -61 -40 29 132 192 77 -75 -123 -84 -68 -56 28 136 158 65 -50 -114 -143 -112 -21 79 108 87 44 13 -68
2757 -68 -178 -150 8 137 129 45 42 23 -48 -162 -141 5 128 142 93 45 -18 -75 -105 -68 -11 60 128 161 72 -76 -136 -82
2785 -82 -12 -15 -1 104 162 80 -86 -148 -103 -40 -19 41 110 120 55 -42 -101 -112 -97 -9 101 123 67 8 -4 -41 -120 -133 -5
2814 -5 134 139 64 12 -10 -64 -117 -94 7 88 103 88 50 -37 -118 -120 -47 25 42 69 104 74 -47 -154 -133 -43 23 47 74 104
$$ packed form
2622g2p3m0Q1J74J30k0j30q9k9n1n3P3J50J37nr2j11p6m5J2P8J00R3L9l7j26j56
2649a38l7Q0J00M7L5P0J0j33j93n7J17J31K4J0M5M5j20j77o7P3J14J02L9J0m9
2674H1q7q8m7KO3J52J11j3j34j00ok5m6K0J90J46l6j41r7j2k6l1N2J35J06j5q4
2701G0j00p5m6K6J17Q3K6rJp0j44p4O8J56O8qKjp3j40n3O5J03O8P2J4o6j26p8
2730a24J9M4K1O9J03O0j15j52m8L9J6J2Q4J08K2r3j15o4k9L1R1J00K9k1m3l1q1
2757f8j10K8J58J29qq4lj9p1j14K1J46J23J4m9m8o3n7l0L7N7P1O8L3q9j48o0N4
2785h2P0lJ4J05N8q2j66o2M5O3K1O0O9J0o5r7n9j1J5Q8J10K2n6n9j2l7p9j3J28
2814eJ39Np5n2k2n4n3K3J01Q1J5j5l8q7q1kP3P2J7K7L5l0j21j07K1R0O6K4K7L0
$$ plain form
2844 104 65 -42 -107 -112 -58 7 81 122 95 12 -38 -49 -76 -87 -30 90 160 87 -6 -46 -53 -67 -70 -12 79 132 94 18 -49 -93
2874 -93 -108 -61 15 67 76 67 43 -45 -118 -127 -45 40 62 63 69 52 -32 -105 -117 -43 28 87 98 78 36 -41 -85 -76 -57 -5 72 111 78
2907 78 1 -64 -78 -81 -62 -10 60 98 81 12 -62 -91 -99 -53 9 67 83 55 6 -41 -97 -98 -54 20 79 81 59 20 -41 -82 -86 -50 25
2940 25 74 105 67 12 -49 -83 -75 -41 10 67 95 73 10 -62 -88 -72 -42 8 54 80 64 5 -55 -89 -93 -46 23 62 74 49 3
2971 3 -38 -89 -83 -54 23 82 90 51 2 -48 -75 -75 -36 28 76 95 68 11 -47 -84 -55 -26 17 66 87 71 21 -59 -96 -68 -32 23
3003 23 60 83 60 0 -59 -85 -74 -36 23 83 92 35 -12 -40 -65 -67 -33 39 99 99 54 -6 -50 -82 -65 -23 37 71 87 67 16 -62
3035 -62 -94 -70 -12 23 55 66 64 2 -70 -106 -89 -15 24 57 71 47 -2 -71 -85 -73 -38 29 89 96 48 -26 -54 -57 -70 -46 21 101
3067 101 105 52 -21 -54 -61 -70 -48 36 76 80 52 -3 -63 -92 -73 -13 31 63 59 51 6 -58 -111 -78 1 45 51 57 47 6 -51 -90 -74 -24
$$ packed form
2844A04l9j07o5nN4O5P4M1k7q3n0j1k7j1N7J20P0p3r3m0pj4lN8R1N3l8p6o7m4
2874i3j5M7P6N2Rrk4q8p3rQ2Q5K2JOj7q4p3j2P4P1N9J1k0m2p7m4RJ9N2P7L9l3
2907G8p7o5j4lJ9N2P0L8j7o9p4k9qM6O2N8J6k8m9m7n6jM4P4N9Kk2l9o1m1mL6P5
2940B5M9L1l8n5o1l4QL4N1N7K8k2o3p2k6J6L0N0M6K6j6n9o0l4mM7O9L9J2k5m6
2971Cm1n1OK9P7N9Ql9m9n0k7%L9O4M8J9k7n7n8l7K9K9M3M9K1j6n0q0l7K8L6N5
3003B3L7K3k3o0n9k6J1L8N9O0Rn7m7k8k5kL4P2O0%m5o0m4l2J7M2O0L4J6k0n1p8
3035f2l2K4N8L5L2J1ko2p2l6J7P4L9L3J4k4m9o9j4J2L5O7O0Pm8p4k8lj3K4O7Q0
3067A01Mn3p3l3prK2Q4M0Mk8n5o0k9J9O0M4L2mqm5o4n3L3P9M4OOj0m1n7l9J6N0
$$ plain form
3101 -24 39 64 78 49 -1 -61 -76 -55 -21 30 88 84 45 -15 -57 -65 -61 -29 29 83 83 40 -19 -51 -77 -73 -25 31 82 79 37 -12 -54
3134 -54 -86 -83 -22 42 80 77 40 -6 -44 -87 -61 -29 52 78 91 51 -13 -67 -76 -55 -13 38 73 93 54 -16 -76 -73 -57 -20 24 68
3166 68 74 44 -13 -73 -80 -58 -15 28 65 81 41 -18 -65 -91 -53 -15 49 79 67 39 -6 -54 -86 -62 -12 51 87 77 36 -4 -42
3197 -42 -78 -64 -8 42 88 77 24 -21 -57 -83 -74 -18 37 74 80 31 -29 -63 -87 -69 -18 33 77 82 22 -33 -80 -81 -50 -13 46 69
3229 69 88 51 -19 -80 -84 -40 12 44 73 83 53 -5 -65 -91 -55 -7 47 68 70 45 -23 -58 -92 -62 -23 27 85 80 22 -30 -55 -73
3261 -73 -65 -42 40 80 75 27 -28 -59 -76 -71 -21 52 80 76 44 -10 -51 -96 -59 2 40 68 65 45 2 -64 -111 -65 3 46 53 59 28 -18
3295 -18 -71 -85 -62 -25 29 73 81 22 -48 -69 -69 -58 -25 16 88 102 28 -39 -80 -54 -38 -19 30 88 92 37 -18 -56 -76 -58 4 67
3327 67 66 48 25 11 -49 -110 -82 2 77 62 32 31 2 -51 -100 -83 -7 58 72 70 28 -22 -65 -75 -51 -14 21 88 101 41 -47 -75
$$ packed form
3101b4O3K5J4k9n0o0j5K1L4N1N8ml9o0m2qML2N8N4%m3n9l2k6MM8N6N1lm2m9m2
3134e4l2LO1O4L8ll7m6l8m3K6L2Q1K6J3m0o4n4rK1M2N1L5K0l9p0o0LJ6L7M4M4
3166F8Ol0n7o0pK2M3M3L7J6m0n9m7k6L8L8O4L0j2k8m5m8l2K4N0O3L6j0m1m0l8
3197d2l6J4N6N0M6j1n3m5l6k6RN6N5L7Om9o0l4k4J8N1N1M4No0n5m7jL1L7N9K3
3229F9J9l7p0o1mM4N2L2K9J0l0n8o0k6L6M8N4K1Kk5o8l5l4L0L9N0N8nn8n2k5j8
3261g3QK3Q2M0nm8n5l1j7NN0P3K8ml2n4m1m5L7O1L8K8lk0m3o6m7M6O8M3POl1m6
3295a8n3j4K3L7N4M4Qn9p0k1%J1L3M1P2J4p4o7m1K6J6J9M9N8Mn5n5l8k0J8O2O3
3327F7jj8k3j4o0o1K8Q4P5j5l0jk9n3m9J7P6O5J4km2n0m3j0K4L7L5O7J3o0q8k8
$$ plain form
3359 -75 -54 -17 -14 9 80 106 50 -35 -72 -76 -42 -14 36 66 65 19 -16 -48 -86 -79 -12 68 92 43 17 3 -31 -87 -93 -8 68 80 49
3392 49 29 -5 -51 -65 -55 3 53 64 83 52 -24 -89 -67 -6 16 21 45 94 67 -32 -103 -76 -28 4 27 62 70 44 -31 -71 -79 -68
3424 -68 -13 52 87 57 -3 -22 -31 -74 -93 -33 66 108 49 -12 -22 -34 -53 -75 -14 52 88 65 27 -20 -59 -62 -37 19 32 54 79
3455 79 65 -6 -92 -96 -24 33 29 37 68 53 -20 -91 -82 -44 4 37 57 59 21 -30 -53 -53 -60 -23 55 98 77 -3 -46 -36 -32 -48 -19 55
3489 55 108 80 12 -24 -51 -51 -49 -7 47 60 59 38 -16 -76 -98 -58 27 42 17 35 43 1 -87 -117 -65 11 53 55 47 31 -21 -64 -81
3522 -81 -51 5 49 93 81 25 -47 -57 -43 -46 -25 34 102 91 19 -58 -65 -61 -31 -22 33 86 70 19 -37 -75 -76 -61 -4 50 58 29 19
3555 19 5 -58 -107 -69 19 68 61 37 15 -1 -58 -87 -58 14 62 81 68 35 -24 -62 -68 -34 -5 34 77 89 26 -55 -76 -60 -29
3586 -29 -17 18 75 79 14 -53 -79 -72 -45 -6 46 67 52 18 -21 -63 -77 -49 12 70 71 49 17 -10 -35 -70 -64 8 72 87 57 13
$$ packed form
3359g5K1L7LK3P1K6n6q5l7mL4K8N0L0jm6l5l2l8PO7Q0K4m9k6j4l4n6oQ5P6J2l1
3392D9k0l4m6j4J0N8N0J1J9l1p6o5K2O1K2NK4M9k7r9p1K7M8L2K3L5Qk6p5m0qJ1
3424f8N5O5L5l0o0j9rm3j9O0R9M2n9o1j0j2j9k2O1O6L6k3l8m7l9lK5N6J3K2K5
3455G9j4p1q6mP2N7mQL1j5p3p1RL8M8L3K0Kl8n1k3%pL7P8M3k1q0m3J0Mj6K9P4
3489E5N3k8o8l6k7%KM2N4J3jk1n4o0k2M0Q5J5k5J8Qm2q8l0N2P6M2Kqj6n2m3j7
3522h1L0N6M4M4j2n6p2j0J4lK1N9O8j1p2p7pML0RN5N3j6n1n6l8jJ5N7N4Qk9j0
3555A9j4o3m9L8Q8M9pk4k2j6n7k9K9P2M8J9j3l3n9l8oL4K9L9M3J2o3q1k1J6L1
3586b9J2L5N7Mo5o7k6PK7L9N2K1j5l4l9m2j4K8O1N8Jk2l2k7k5l5OP2O4J5l0m4
$$ plain form
3618 13 -17 -47 -70 -47 3 44 70 66 31 -29 -73 -62 -30 -6 20 66 70 38 -31 -81 -73 -38 3 32 51 67 21 -21 -61 -68 -36 10
3650 10 47 81 64 16 -16 -52 -59 -51 -2 48 78 63 21 -28 -45 -68 -52 -10 51 81 45 18 -28 -55 -70 -43 -10 35 55 41 18
3681 18 -34 -86 -87 -32 15 43 56 53 38 -26 -62 -75 -32 12 43 68 58 24 -34 -54 -59 -40 12 52 74 58 16 -25 -60 -71 -46 -4
3713 -4 37 62 48 11 -44 -53 -67 -44 -4 46 63 44 12 -33 -61 -59 -43 7 50 67 56 23 -15 -56 -67 -28 10 54 64 44 23 -26
3745 -26 -48 -72 -35 5 47 61 49 8 -39 -63 -67 -45 -2 36 60 48 11 -43 -67 -63 -45 -8 33 57 52 22 -31 -60 -68 -31 0 49
3777 49 55 58 17 -27 -52 -64 -33 12 53 65 50 8 -33 -60 -58 -43 7 49 59 41 2 -37 -62 -69 -41 2 49 61 39 6 -28 -57
3809 -57 -68 -37 5 50 56 57 18 -43 -57 -60 -33 14 34 67 51 19 -25 -58 -55 -37 8 49 65 53 21 -28 -60 -68 -52 3 48 62 39
3842 39 6 -37 -64 -72 -39 -2 35 61 38 12 -36 -72 -61 -32 2 35 61 64 19 -18 -53 -54 -23 7 42 62 57 21 -33 -57 -50 -40 4
$$ packed form
3618A3l0l0k3K3N0M1K6ml5o0m4J1L2K4K6M6Ml2o9n0QL5M1K9J9J6m6m2m0pL2M6
3650A0L7L4j7m8l2l6pQM9N0L0j5m2m9j7k3J6M2O1L0l6k7m6k7j5K7L3M5K0j4k3
3681A8n2n2jN5M7K8J3lj5o4l6j3M3M4L1K5j0l4n8k0nJ9N2M0K2j6m2m1l5j1K5M2
3713dM1K5j4l7n5rj4K3M0N0J7j9l2m5k8KJ6N0M3J7j1l3l8m1j1L9L8M4J0k0k1m9
3745b6k2k4L7M0M2J4j2m1m7k4mK2M3L8K4j2l7n4k4MJ8L7M1K4nl0n3k9qL7L1M9
3777D9OLm1m4k5j2L1M5M1J2j5m2m1k7KJ5N0M2J0j8l9l9k5pK8M3M7J2k2l3l4k9
3809e7j1L1M2M5OJl9o1j4lK7M7K0L3j6l2m4l3LJ8M5M1J6j2l2m9l2qJ6N5M5J4k3
3842C9l3m3k7qL3L7L7K6k3k6m8l6J1K9L4L3K6Lm5l7l5jL1L0L5K0nl6n4k4PJ0M4
$$ plain form
3875 4 50 68 49 -3 -35 -47 -60 -48 -1 55 66 37 -3 -34 -52 -69 -44 -5 35 64 50 17 -31 -69 -60 -40 4 52 53 64 24 -19
3907 -19 -62 -53 -19 16 48 66 56 21 -16 -50 -61 -40 8 55 63 46 11 -36 -50 -58 -51 -4 51 71 57 6 -36 -58 -61 -48 -13 47 63
3940 63 40 22 -34 -54 -57 -26 8 49 63 60 37 -22 -62 -64 -26 22 56 60 58 25 -17 -68 -74 -38 5 47 66 55 13 -39 -55 -62 -47 -9
3974 -9 41 64 54 2 -54 -65 -50 -35 -4 39 71 65 13 -48 -49 -57 -27 1 49 75 56 24 -19 -60 -76 -36 14 53 57 43 20 -19 -62
4007 -62 -85 -57 5 49 56 28 6 -28 -65 -72 -49 -7 27 61 50 19 -46 -71 -44 -37 -3 29 74 66 16 -41 -63 -46 -32 12 49 67
4039 67 64 13 -33 -60 -72 -49 4 55 60 40 6 -20 -53 -79 -61 5 56 53 34 16 -23 -48 -77 -36 -4 51 54 57 20 -32 -66 -61 -19
4072 -19 5 45 59 79 33 -41 -77 -51 -15 9 31 63 55 38 -41 -70 -55 -31 10 50 59 47 -3 -20 -57 -61 -55 -3 56 75 37 -15
4104 -15 -19 -43 -55 -53 10 54 72 51 2 -30 -52 -57 -21 18 50 61 52 27 -31 -71 -59 -10 12 45 53 57 46 -30 -76 -74 -32 17 33 53
$$ packed form
3875DM6J8j9n2l2j2j3J2M7N6J1k9m0l1j8j7K5L9M0K9j4l3m8l8RK0M4M8JJ1m0m3
3907a9m3RL4L5L2J8j0l5l7l4j1K1M8M7Qj7l5m7j4qPM7N5K0j4n1m2k2lJ3L5O0J6
3940F3k3j8n6k0lL1L4M1J4lk3n9m0kL8M8L4Mkl3m2n1oL6M3M2J9j1m2n2j6pJ5L8
3974iN0K3j0n2n6j1J5J5L1M3L2on2o1jqL0K8M8K6j9l2m3m1j6M0N0L9Mj4k3l9m3
4007f2k3K8O2M4Pk8k2l4l7pK3M2L4L4j1l1o5k5K7PL4L2M5qn0n7k2J7J4M4L7J8
4039F7ln1m6k7j2K3N3N1Nk0l4k6l3k6J8O6N1lj9j8l9k5k9M1L2N5LLl7n2l4NM2
4072a9K4M0J4K0m6p4l6K6L6K4K2L2qj7p9k9J5K4M1M0Rj2n0j7l7mON2N9J9l8n2
4104a5mk4j2KO3M4J8k1m9l2k2nL6L9L2J1rk5n8m0J2M9K2L3QMj1p6m6KM2M9J6K0
$$ plain form
4138 53 65 9 -31 -47 -67 -49 -12 51 74 46 -3 -48 -40 -45 -45 -3 70 87 54 -9 -33 -48 -49 -30 15 40 71 65 7 -25 -55 -70 -40
4171 -40 10 47 54 46 31 -29 -69 -72 -27 17 52 55 48 15 -28 -67 -61 -29 6 50 70 57 11 -28 -53 -51 -39 -2 45 77 57 12 -33 -56
4205 -56 -42 -28 4 36 68 62 14 -25 -57 -52 -29 8 44 55 41 12 -30 -61 -83 -51 11 47 41 33 15 -31 -71 -77 -42 12 41 67 47
4238 47 14 -24 -53 -56 -36 -4 42 76 53 15 -32 -66 -49 -34 0 25 62 51 10 -35 -70 -76 -40 1 44 60 42 -1 -34 -62 -67 -45
4270 -45 7 48 45 53 2 -26 -55 -69 -47 15 53 55 57 13 -22 -57 -63 -32 4 53 60 53 12 -34 -57 -55 -33 10 50 58 46 12 -46 -75 -68
4305 -68 -33 6 27 52 50 13 -36 -60 -64 -36 -1 43 65 42 5 -33 -53 -65 -41 9 51 68 53 22 -24 -55 -61 -35 8 43 60 58
4337 58 4 -20 -52 -67 -43 -8 43 55 42 15 -20 -65 -55 -46 -3 35 51 40 16 -26 -69 -62 -34 -1 38 63 50 23 -32 -46 -65
4368 -65 -33 9 51 56 52 15 -37 -62 -71 -34 7 42 59 48 14 -22 -55 -59 -37 4 40 59 50 10 -31 -59 -59 -36 -7 39 58 40 10
$$ packed form
4138E3J2n6m0j6k0J8L7O3K3k8m9m5Qn%M2P3J7l3o3k4j5jJ9M5K5L1on8l2l0j5L0
4171d0N0L7Pqj5o0m0lM5M4L5Lpl3m3l9OL2L5M4K0j3m6l9k5KJ2L7M7L2k0m5m5k3
4205e6J4J4L2L2L2om8l9l2NK3L7L6J1j4k9m2l1k2L2O2L6oqj8m6m0oL5N4K9K6k0
4238D7l3l8k9lK0L2M6L4k3l8m7l4J7J5L4K5L7j1m1m5l5oL6M1M3J6j8m3l3k8nK2
4270d5N2M1lQn1k8k9j4K2O2L8KKm4l5l5oL1L6M9Ppm1m6k3KK2M3M0Qj2l4n8k9P
4305f8L5L9K1K5kl7m9k4mK8L5M4K2k3l7l8k0j2K4N0M2J7j5l1m6l1oK6M3L5J7k
4337E8n4k4l2j5K4L5N1J2j3k7l5m5J0RM3L8J6j1k4m2m3PK8L3L9K5j3k7n5j4j9
4368f5L2M2M2Nml7n2k5rL7M1L5J7j1l4l6l3mK2M1L6J9rm0m1k8%K3K9M6J9j8l0
$$ plain form
4401 10 -31 -56 -62 -43 8 42 70 64 16 -11 -56 -62 -34 16 47 64 53 21 -27 -58 -68 -40 12 45 53 50 11 -26 -66 -62 -45 6 40
4434 40 54 41 3 -29 -62 -65 -32 11 44 65 46 15 -34 -54 -57 -31 8 55 74 56 27 -17 -53 -50 -29 11 59 61 48 13 -29 -50
4466 -50 -62 -35 5 48 53 33 21 -31 -60 -70 -43 7 46 58 36 22 -25 -49 -58 -33 25 46 65 48 10 -28 -53 -55 -25 10 47 62
4498 62 63 24 -17 -55 -51 -24 11 36 64 42 13 -18 -52 -48 -40 12 40 62 50 19 -29 -55 -50 -42 1 40 55 48 9 -27 -49 -58 -42 16
4532 16 42 69 54 16 -13 -51 -57 -22 8 40 63 47 15 -27 -56 -66 -36 8 25 50 49 23 -34 -58 -64 -25 -8 48 58 36 10 -36
4564 -36 -55 -57 -41 3 35 58 37 12 -29 -59 -48 -33 10 46 61 59 15 -17 -44 -60 -29 10 45 63 49 15 -33 -64 -59 -40 0 37
4596 37 57 41 2 -31 -54 -56 -41 2 31 54 44 9 -36 -55 -61 -35 3 38 59 49 25 -14 -47 -51 -15 6 44 52 62 13 -23 -50
4628 -50 -57 -35 -5 50 54 56 11 -37 -57 -58 -33 1 28 52 44 10 -34 -54 -55 -40 0 45 64 52 7 -29 -49 -50 -39 13 53 69 46 13
$$ packed form
4401A0m1k5oJ9N1L4K8om8k7m5oK8N0L1J7j1l2m8l1j0K8N2L3Qll9l7m0MJ7N1L4
4434D0J4j3l8l2l3lL3M3L3K1j9l1m9k0lK6L9M7J9j8k9m4l6LK1M0M8Kj3l5m2k1
4466e0j2K7M0M3Nk0j2n2k9j0K7N0L9J2k2j4m7k4rK5N8K1J9j7l8l8k5kL0L5L7J5
4498F2Jl9m1l8MK7L5K5K8k2k9l1l4MQN2K8K2j2l1m8k6NQM3L9J5pl9l6k2rJ6N8
4532A6K6K7j5l8k9l8oL5L0L2K3j6l2m2k9j0L0M4J7K5jk6n7k4oL9J7N6J0k2k6m6
4564c6j9kJ6M4L2K3k1k5m1l0J1J5M3L6J5km4l2k7j6L1L9L5J8j4l4m8l1NJ9M0L7
4596C7K0j6l9l3k3kJ5M3K9K3j0l5m5j9oK6L8L5K1j0k4l9l3mL6K1L8QJ0m9l6k7
4628e0pK2L0N5MKm5m8k0jK5L4K7K4ql4m4k0jJ5M0M5J9j2m5l6k0jJ1N2M0J6k3l3
$$ plain form
4662 13 -19 -50 -64 -44 16 40 56 51 22 -13 -49 -64 -27 7 43 47 41 7 -14 -50 -55 -42 0 42 67 44 13 -31 -53 -46 -26 1 35
4695 35 72 50 22 -36 -54 -47 -23 0 44 64 53 17 -12 -34 -48 -27 12 45 56 35 -5 -12 -38 -62 -44 13 46 53 37 4 -20 -52
4727 -52 -64 -37 2 40 55 39 11 -33 -51 -50 -26 -1 30 51 58 21 -24 -55 -45 -22 7 37 60 56 30 -20 -54 -46 -20 8 45 54 43
4760 43 11 -18 -39 -51 -41 2 51 50 37 7 -21 -44 -60 -28 2 39 58 33 12 -35 -52 -46 -30 14 32 58 49 17 -27 -61 -47 -29
4792 -29 17 41 42 49 20 -25 -43 -51 -28 12 33 48 33 12 -24 -43 -50 -34 0 33 51 42 -4 -33 -44 -51 -47 -12 50 54 53 13 -18 -37 -43
4827 -43 -29 6 46 62 53 21 -24 -45 -54 -11 25 40 47 40 19 -18 -42 -57 -18 18 32 40 35 17 -23 -52 -57 -26 9 29 47 32 9 -23
4861 -23 -40 -42 -26 7 37 58 48 8 -26 -38 -46 -25 15 40 53 50 8 -25 -38 -54 -25 12 46 42 41 5 -20 -62 -65 -30 18 41 36 33
4895 33 7 -23 -43 -68 -24 5 37 46 32 3 -30 -49 -43 -31 -1 47 60 47 9 -29 -48 -46 -23 7 37 60 38 5 -36 -54 -45 -32
$$ packed form
4662A3l2l1j4K0O0K4J6nk9l5l6j5L7L4L6Mol4k1l6nJ3M2M2K5k3l1m4k2PK0K7L4
4695C5L7k2k8n8j8PK4K3M4K0j1l6k9k2j4K1L9L3J1k1m0pk6k4J8N7L3Pj6l3k4l2
4727e2j2K7L9L8J5j6k8m4j8JK4K5L1K1Pl7m5l1J0K3K9L0K3mk6n0l4QK6K8L7Rj1
4760D3l2k9k1j2J0M3M9jj3l0k8k3j6L2L0L7J9k5k1m7j7OJ6M4J8K6rl2m4l4J4J8
4792b9M6K4JPk9m5j8qK3M0K1J5j5k1l6j9pJ6L4L3J8rm6k9j1pML5O2Mjm0l1j9o
4827d3J4L5M0J6rl2m5k1rM3L6J5Ppk1l7k4j5L9L6J4Qnj8m0k9nL1L5K0J8j5k3l2
4861b3j7kJ6L3L0K1j0m0l4j2qK1M0K5J3lm2l3j3j6K9L7L4mjl6k5m2lL5M8K3nl
4895C3k6l0k0k5M4K9L2Rj4k9l3j9OJ2L0M8J3j3l8l8j9KK3L0L0K3k2l3m1j8RJ3
$$ plain form
4927 -32 2 28 54 40 10 -27 -42 -58 -40 1 28 40 31 0 -31 -53 -44 -27 5 46 53 38 4 -23 -46 -47 -19 14 29 53 31 10
4959 10 -18 -47 -42 -15 10 43 42 42 5 -34 -48 -44 -23 -2 44 56 26 5 -17 -51 -50 -27 8 23 41 41 1 -17 -44 -38 -28 16 38 50
4993 50 46 9 -16 -45 -47 -26 21 43 57 32 4 -25 -42 -46 -32 15 32 55 44 14 -36 -40 -37 -27 10 32 49 32 9 -27 -58 -57 -37
5026 -37 11 38 45 35 7 -31 -47 -45 -26 8 33 34 40 14 -17 -48 -40 -16 5 38 39 44 7 -17 -44 -43 -25 10 38 39 33 -5 -30 -47 -44 -24
5062 -24 9 43 44 38 -3 -27 -39 -45 -33 1 34 48 34 8 -29 -46 -41 -9 16 35 48 30 -5 -23 -49 -45 -11 11 31 51 37 7 -19
$$ packed form
4927c2L4K6K6j4l0l7j5j6J8M1K7J2rl1l1k2RJ7L2M1Pj5l4k7k3jK8L3J5K4k2k1
4959A0k8k9NK7K5L3j%l7l9j4MK1K1M6J2l0k1k2l4JK3L5J5J8%m0j8k7OJ0M4K2J2
4993E0ml7k5k9kK1M7K2J4k5k8k9j7mJ4M7J7K3j1l0n0mLJ0L7K2J7j7k3l6l1JK0
5026c7M8K7Pj0k8l8j6KJ9L4K5JOk6l1l1QK4K1L3JNl7k4k7JJ8L5K8Jol8k5j7LK0
5062b4L3L4Jom1k4j2oJ2L4L3J4j4k6l7j7NL2K5J9J3j8l5j8k6ML4K2K0K0j4l0k6
$$ [...]
8191B
##END NTUPLES=NMR FID
##END=
