##TITLE=1H_LR-743-1
 
 8 sc, 
 15.12.2021
##JCAMPDX= 6.0         $$ Bruker NMR JCAMP-DX V2.0
##DATA TYPE= NMR FID
##DATA CLASS= NTUPLES
##ORIGIN= UXNMR, Bruker Analytische Messtechnik GmbH
##OWNER= root
$$ XWIN-NMR		Version 3.5
$$ Wed Dec 15 11:25:04 2021 Russian Standard Time (UT+4h)  she@DPX200
##.OBSERVE FREQUENCY= 200.1311
##.OBSERVE NUCLEUS= ^1H
##.DELAY= (6, 6)
##.ACQUISITION MODE= SIMULTANEOUS
##.ACQUISITION SCHEME= undefined
##.AVERAGES= 8
##.DIGITISER RES= 18
##SPECTROMETER/DATA SYSTEM= spect
##.PULSE SEQUENCE= zg30
##.SOLVENT NAME= CDCl3
##.SHIFT REFERENCE= (INTERNAL, CDCl3, 0, 15.7039)
##AUDIT TRAIL= $$ (NUMBER, WHEN, WHO, WHERE, WHAT)
$$ ##TITLE= Audit trail, XWIN-NMR		Version 3.5
$$ ##JCAMPDX= 5.01
$$ ##ORIGIN= Bruker BioSpin GmbH
$$ ##OWNER= she
$$ F:/spectra/data/she/nmr/H-F/1/audita.txt
$$ ##AUDIT TRAIL=  $$ (NUMBER, WHEN, WHO, WHERE, WHAT)
(   1,<2021-12-15 11:23:50.93 +0400>,<she>,<DPX200>,
      <created by zg, POWCHK disabled, PULCHK disabled
       configuration hash MD5:
       00 E9 B6 7A A2 85 ED C7 34 08 36 98 17 FE 4E 26
       data hash MD5: 16K
       60 93 43 A7 53 26 D5 D1 3D B2 B5 97 46 83 16 F7>)
$$ ##END=
$$ 
$$ hash MD5
$$ 47 36 50 75 BD 47 9D B4 80 E0 56 E5 38 E1 84 6D
##$RELAX= 
##$RELAX= 
##$RELAX= 
##$RELAX= 
##$RELAX= 
##$RELAX= 
$$ Bruker specific parameters
$$ --------------------------
##$DU= <F:/spectra>
##$EXPNO= 1
##$NAME= <H-F>
##$PROCNO= 1
##$TYPE= <nmr>
##$USER= <she>
##$AMP= (0..31)
100 100 100 100 100 100 100 100 100 100 100 100 100 100 100 100 100 100 
100 100 100 100 100 100 100 100 100 100 100 100 100 100 
##$AQSEQ= 0
##$AQ_mod= 1
##$AUNM= <au_zg>
##$AUTOPOS= <>
##$BF1= 200.13
##$BF2= 200.13
##$BF3= 200.13
##$BF4= 200.13
##$BF5= 200.13
##$BF6= 200.13
##$BF7= 200.13
##$BF8= 200.13
##$BYTORDA= 1
##$CFDGTYP= 0
##$CFRGTYP= 5
##$CHEMSTR= <none>
##$CNST= (0..31)
1 1 145 1 1 1 1 1 1 1 1 1 1 1 1 1 1 1 1 1 1 1 1 1 1 1 1 1 1 1 1 1 
##$CPDPRG= <>
##$CPDPRG1= <>
##$CPDPRG2= <>
##$CPDPRG3= <>
##$CPDPRG4= <mlev>
##$CPDPRG5= <mlev>
##$CPDPRG6= <mlev>
##$CPDPRG7= <mlev>
##$CPDPRG8= <mlev>
##$CPDPRGB= <>
##$CPDPRGT= <>
##$D= (0..31)
0 1.2 0 0 0 0 0 0 0 0.06 0 0.03 0 0 0 0 0.0002 0 0 0 0 0 0 0 0 0 0 0 0 
0 0 0 
##$DATE= 1639553030
##$DBL= (0..7)
120 120 120 120 120 120 120 120 
##$DBP= (0..7)
150 150 150 150 150 150 150 150 
##$DBP07= 0
##$DBPNAM0= <>
##$DBPNAM1= <>
##$DBPNAM2= <>
##$DBPNAM3= <>
##$DBPNAM4= <>
##$DBPNAM5= <>
##$DBPNAM6= <>
##$DBPNAM7= <>
##$DBPOAL= (0..7)
0.5 0.5 0.5 0.5 0.5 0.5 0.5 0.5 
##$DBPOFFS= (0..7)
0 0 0 0 0 0 0 0 
##$DE= 6
##$DECBNUC= <off>
##$DECIM= 32
##$DECNUC= <off>
##$DECSTAT= 4
##$DIGMOD= 1
##$DIGTYP= 9
##$DL= (0..7)
0 120 120 120 120 120 120 120 
##$DP= (0..7)
150 150 150 150 150 150 150 150 
##$DP07= 0
##$DPNAME0= <>
##$DPNAME1= <>
##$DPNAME2= <>
##$DPNAME3= <>
##$DPNAME4= <>
##$DPNAME5= <>
##$DPNAME6= <>
##$DPNAME7= <>
##$DPOAL= (0..7)
0.5 0.5 0.5 0.5 0.5 0.5 0.5 0.5 
##$DPOFFS= (0..7)
0 0 0 0 0 0 0 0 
##$DQDMODE= 0
##$DR= 18
##$DS= 0
##$DSLIST= <SSSSSSSSSSSSSSS>
##$DSPFIRM= 0
$$ [...]
##$SUBNAM2= <"">
##$SUBNAM3= <"">
##$SUBNAM4= <"">
##$SUBNAM5= <"">
##$SUBNAM6= <"">
##$SUBNAM7= <"">
##$SUBNAM8= <"">
##$SUBNAM9= <"">
##$SW= 18.051750892319
##$SWIBOX= (0..15)
0 0 2 0 0 0 0 0 0 0 0 0 0 0 0 0 
##$SW_h= 3612.71676300578
##$TD= 16384
##$TD0= 1
##$TE= 0
##$TE2= 300
##$TE3= 300
##$TEG= 300
##$TL= (0..7)
0 120 120 120 120 120 120 120 
##$TP= (0..7)
150 150 150 150 150 150 150 150 
##$TP07= 0
##$TPNAME0= <>
##$TPNAME1= <>
##$TPNAME2= <>
##$TPNAME3= <>
##$TPNAME4= <>
##$TPNAME5= <>
##$TPNAME6= <>
##$TPNAME7= <>
##$TPOAL= (0..7)
0.5 0.5 0.5 0.5 0.5 0.5 0.5 0.5 
##$TPOFFS= (0..7)
0 0 0 0 0 0 0 0 
##$TUNHIN= 0
##$TUNHOUT= 0
##$TUNXOUT= 0
##$USERA1= <user>
##$USERA2= <user>
##$USERA3= <user>
##$USERA4= <user>
##$USERA5= <user>
##$V9= 5
##$VALIST= <valist>
##$VCLIST= <CCCCCCCCCCCCCCC>
##$VD= 0
##$VDLIST= <DDDDDDDDDDDDDDD>
##$VPLIST= <PPPPPPPPPPPPPPP>
##$VTLIST= <TTTTTTTTTTTTTTT>
##$WBST= 1024
##$WBSW= 4
##$XGAIN= (0..3)
0 0 0 0 
##$XL= 0
##$YL= 0
##$YMAX_a= 697124
##$YMIN_a= -635410
##$ZGOPTNS= <>
##$ZL1= 120
##$ZL2= 120
##$ZL3= 120
##$ZL4= 120
##$ABSF1= 10
##$ABSF2= 0
##$ABSG= 5
##$ABSL= 3
##$ALPHA= 0
##$AQORDER= 0
##$ASSFAC= 0
##$ASSFACI= 0
##$ASSFACX= 0
##$ASSWID= 0
##$AUNMP= <proc_1d>
##$AZFE= 0.1
##$AZFW= 0.1
##$BCFW= 1
##$BC_mod= 2
##$BYTORDP= 1
##$COROFFS= 0
##$CY= 11.3945322036743
##$DATMOD= 1
##$DC= 2
##$DFILT= <>
##$DTYPP= 0
##$F1P= 2.36226072786647
##$F2P= -0.459571619588291
##$FCOR= 0.5
##$FTSIZE= 0
##$FT_mod= 4
##$GAMMA= 1
##$GB= 0.15
##$INTBC= 1
##$INTSCL= 1
##$ISEN= 128
##$LB= 0.24
##$LEV0= 0
##$LPBIN= 0
##$MAXI= 10000
##$MC2= 0
##$MEAN= 0
##$ME_mod= 0
##$MI= 1.114404
##$NCOEF= 0
##$NC_proc= 0
##$NLEV= 6
##$NOISF1= 3.799351
##$NOISF2= 2.8
##$NSP= 1
##$NTH_PI= 0
##$NZP= 0
##$OFFSET= 15.70392
##$PC= 1
##$PHC0= -15778.28
##$PHC1= 7.800789
##$PH_mod= 1
##$PKNL= yes
##$PPARMOD= 0
##$PSCAL= 0
##$PSIGN= 0
##$REVERSE= no
##$SF= 200.130013532006
##$SI= 16384
##$SIGF1= 3
##$SIGF2= 2
##$SINO= 400
##$SIOLD= 16384
##$SREGLST= <1H.CDCl3>
##$SSB= 0
##$STSI= 0
##$STSR= 0
##$SW_p= 3612.71676300578
##$SYMM= 0
##$S_DEV= 0
##$TDeff= 0
##$TDoff= 0
##$TI= <>
##$TILT= no
##$TM1= 0
##$TM2= 0
##$TOPLEV= 0
##$USERP1= <user>
##$USERP2= <user>
##$USERP3= <user>
##$USERP4= <user>
##$USERP5= <user>
##$WDW= 1
##$XDIM= 8192
##$YMAX_p= 0
##$YMIN_p= 0
$$ End of Bruker specific parameters
$$ ---------------------------------
##NTUPLES= NMR FID
##VAR_NAME=  TIME,          FID/REAL,        FID/IMAG
##SYMBOL=    X,             R,               I
##VAR_TYPE=  INDEPENDENT,   DEPENDENT,       DEPENDENT
##VAR_FORM=  AFFN,          ASDF,            ASDF
##VAR_DIM=   8192,          8192,            8192
##UNITS=     SECONDS,       ARBITRARY UNITS, ARBITRARY UNITS
##FACTOR=    0.0002768,     1,               1
##FIRST=     0,             0,               0
##LAST=      2.2672688,     0,               0
##MIN=       0,             -635410,         0
##MAX=       2.2672688,     697124,          0
$$ Real data points
##PAGE= N=1
##DATA TABLE= (X++(R..R)), XYDATA
$$ [...]
2135B027l278N46K378k418K16n8m92J344k424J245K280l845Q86K032o74J186k693
2152a742M62M227k816o93J433o41K100k359r86M088k925r31K116k116J841p35
2168C23k492L282j676j000K401k494J264M96k307L555j632j782L861k435J86K187
2184A737k739K183m51k005L806k199j232K282k446K399q8l993L869o35k145L034
2200A377k781M26K305l015K078m08j910L972k355j182K893k340K233l1m297M527
2216A492N65l241J648j591J763J573m520K076J157j951K345k528l9L404l635J112
2232c70J866l198K442L7j722K123j926R47J776l616J679R74j734K050k525l22
2248a519L841l096o15J882j319J606j033j298K812j440k25J338j910J937J43k372
$$ y = [2027, -1251, -705, 1673, -745, -529, -587, -1079, 265, -2159, -914, 1366, -2479, -1593, 439, -235, 951, -1742, -1280, 2947, 131, -562, 871, 230, 2330, -29, -1015, 3073, 148, -783, 1333, -783, 1058, 323, -2169, 1113, -563, -1563, 838, -1656, -392, 104, -2203, 1352, -280, -2062, 1799, -636, -450, 1737, -1002, 1181, 730, -1275, 2531, 332, -900, 1382, -1064, 1335, 1247, -2746, 1123, 488, -1657, 1377, -1404, -978, 1327, -1688, 390, -18, -1928, 2044, -311, -1493, 1400, -940, 1293, 1262, -3035, 1492, 2057, -1184, 464, -1127, 636, 2209, -2311, -235, 922, -1029, 1316, -1212, -1251, 2153, -1482, -370, 1496, -1702, 740, 777, -945, 1178, -748, 199, 1975, -1641, 38, 1012, -722, 1328, -1197, -1519, 2322, -774, -1389, 493, -826, 780, -253, -1551, 1261, -179, -404, 934, -976, 961, 1104, -1268]
2264a268K486n85j208J983j702j35J325j339P50p00p03J960j492l86J339j455
2280a130J159L10j857J916J91j219J027l38L14L91r50R16k73n86J257j151l28
2297c51J165j138K19L81j217O96L28o85J00j14O06m5q11J000R4n57Q08m20j59
2316a00R99o31l07N75j47k16n7J32r4m69M05o2o58N52P9o19M50R2l95L48K75l23
2338a71M8M36r7l53N27J01n57L02K05n37J76K88n06j17L99k67m04M78L0n23L76
2359a66K39n12L55L70m84J68M72k95k33N78J4o01K90L35o20M4M49n54p7L39n16
2380d05o4N30l37l91N58J37o24L36O14m53j67O61j71j99M55j41k40M84k07m88
2400a12N29R5p83P2O29n41n67O44on72K85L7k31K81J0j93L77K19m84O7R57l01
$$ y = [-1268, 1218, 633, -575, 1408, -294, -429, 896, -443, 307, -393, -1096, 864, -628, -1014, 325, -1130, 29, 339, -1518, 398, 589, -630, 397, 59, 373, 764, -186, 730, 457, -129, 1128, -23, -351, 814, -324, -105, 276, -941, -245, 83, -602, -502, -616, -10, -55, -866, 134, 228, -329, 479, 59, -100, 899, 268, -39, 536, 389, 173, 116, 248, 154, -315, 90, 28, -630, -78, 1, -618, -168, -76, -471, -123, 152, -171, -123, 313, 216, -137, 390, 491, -66, 236, 441, -96, 80, 368, -138, -255, 144, -123, -527, -49, -19, -542, -166, 73, -439, -84, 286, -198, -30, 442, 147, -86, 492, 506, -95, 195, 530, -90, -46, 403, -151, -228, 111, -405, -469, 61, -276, -667, -109, 28, -596, -260, 354, -99, -266, 395, 224, 25, 480, 339, 99, 583, 376, -112, 417, 512, -271, -199, 430, -111, -678, -34, -40, -612, -327, -290, -521, -240, -230, -423, -46, 173, -311, -244, 713, 412]
2422D12p58R25K82r54M50L17l76K6k62l1L12l00l46j37M17J11j141O16P60j266
2442i43L47Q02p89L04K00j05N71m48R2N08l79M29l14n0J105j524j71J789j227
2461A97n40N58n65P02n35p47J105p46k3M98r90J286l89j166K167q89q98J917q97
2480D5J7M81q06J730r71j352K134q26j01L55k224K541K50l205K126K7j103J187
2498C05j852J406J018k896K095J32j309K381k276L59K702l410J715J555l231K203
2514H97k80q13K205l488J238K536l847J901n8k074L802l123j079M402l535M62
2530h54J617k780L409j212k169L803k940R53K881n000K687J371l370L921k576
2545b59j719M912l660l0K154l196L300j521k614N319l589r88M024m277K419J237
$$ y = [412, -346, 579, 861, -93, 357, 674, 298, 324, 62, 31, 343, 43, -303, -440, -23, 88, -1053, -437, 323, -943, -596, 206, -583, -279, -79, -184, 387, -61, 31, 539, 160, 589, 275, 225, 1330, -194, -365, 1424, 197, -343, 215, -350, 352, -183, -930, 175, -571, -594, -96, -1086, 200, -189, -1355, 812, -77, -975, 942, 45, 62, 543, -263, 1467, 496, -856, 1278, 452, 351, 706, -1518, 1023, 1273, -1932, 194, 221, -882, 305, -1547, -141, 877, -2019, 76, 208, -1101, 1280, -996, -637, 2065, -1345, 370, 1925, -1306, 897, 617, -196, 2009, -1479, -241, 2295, -1552, 349, 291, -1783, 2019, -1104, -2183, 2219, -1316, -854, 763, -2017, 1392, 180, -1989, 1814, -1126, -173, 2708, -2292, 395, 1766, -1604, 2317, -259, -1978, 2934, -726, -756, 1398, -1798, 1502, -19, -2633, 2686, -903, -1891, 2133, -2144, 275, 1512]
2561A512m401M680j361k860M728k768K04J539l824M882q27m664N299k145j037
2576a043L618m939K549K099n220M098k94k727L419l364J796K551n861L968J084
2591A734m326M412k324q82M474n267J362L481m225K542r97j729M653m075J20L591
2607B544m991K917J395m340M057j812j735M638l903J60K780l514K769p44k090
2622a869M414l722n49M475l945J159J177l261L970j310k451L851k443j4J714k702
2638a506K822q76k736M138k079j155L120k895Q30J079k220L006j285k403L176
2653A016o89J91j63k677L797L43l543K133k54j51J279k689J332J510k337R96m43
2670c49l04J907j948J21Q70j600K234n2k609J556N53J73J9k062J675J334j770
$$ y = [1512, -2889, 1791, 430, -2430, 2298, -470, -266, 1273, -2551, 2331, 1504, -3160, 2139, -6, -1043, 2575, -2364, 185, 2284, -2936, 1162, 868, -1859, 1560, -1804, -8, 2543, -3318, 650, 1734, -2592, 1820, -504, -1386, 3088, -2179, -817, 2664, -1561, 981, -16, -1745, 2908, -1167, -1047, 2544, -2447, 470, 1865, -2475, 1582, -230, -1965, 2673, -1230, -1070, 1710, -1804, 965, 221, -1869, 2545, -1177, -1726, 2749, -1196, -37, 1140, -2121, 1849, 539, -1912, 1939, -504, -518, 1196, -1506, 1316, 440, -2296, 1842, -237, -1392, 1728, -1167, -337, 742, -1478, 1528, 243, -2160, 1016, 327, 518, 355, -2322, 1475, 1818, -1725, 408, 154, 3, 1282, -1407, -75, 1435, -902, 94, -349, -653, 1254, -694, -573, 297, -1303, 931, 879, -1730, -174, 379, 552, 571, -1491, 184, 1518, -252]
2687b52J64j27O57P27k212P71J580j573j42J95J00O17j094K76M43j008R00L64
2705C86o28r7n78J377Q51k140k8J553M01r91j260J713J180k153m20J066P94k18
2723H08k262O56K201j059j191o8P73R31j334j21Q75q40P32K80r26P68k86L4R03
2742H74j256K77J048p47p8n41O62J263k067l46J460n18L24o16r33J596k60o48
2760e06N15p78P27M08q66P41n80R8J351j558rJ505q93r5j17r1J367j084r53J083
2780B65o5K39n99q40J620n42j073J345m36m46N29n02P76j15q86R94o8l60M52m13
2800a25N92j47j089J520P8j405M90K48K56r6j008P16M13q12J96pK22J09r74P43
2820h0P15j144J66N22k56K04k64J94K95o24K93M60l32q8k81L60N43r33j09Q16
$$ y = [-252, -88, -215, 442, 1169, -1043, -272, 1308, -265, -407, -212, -112, 505, -589, -313, 130, -878, 22, 386, -242, -339, -917, 460, 1311, -829, -857, 696, 1097, 106, -1154, 559, 1739, -414, -834, 232, 1026, 808, -1454, -798, 1403, 344, -847, -915, -142, 789, -545, -666, 209, -631, 101, 381, -545, 223, -63, -29, 874, -382, -105, 943, 196, 118, -423, 239, 1502, -565, -911, 549, 31, 355, -261, -1194, 402, 142, -506, 9, -769, -42, 366, -500, 241, -339, -241, 1110, -448, -457, 1048, 155, 60, -57, -148, 1219, 135, -818, 265, 200, 439, -160, -1000, 620, 78, -995, 350, -86, -532, -3, -505, 271, 156, -730, 264, 196, -164, 288, -125, 467, 320, -769, 751, 829, -576, -86, 162, 418, 322, -686, 30, 443, -369, -173, -180, 42, 151, -823, -80, 635, -509, -343, 179, -77, 127, -137, 57, 352, -272, 21, 481, 149, 61, -220, 140, 683, -250, -359, 457]
2840D57l60l16J29K04Q3n21k1N75j75l14k7J79L55m02k03O11j75m40L81L05j85
2861A40l37J33M31j28l13R4K35m4k30n9L76j74m37K14L63k97l80K38K47j77k04
2882c09J61J42q9j22J27K91j49k81K39L78j84k54J98K50k41j63K77L1k78p2J05
2903E7O7j18l05J36K29k93j81K49Q1j91j31L50J22l17P5L05N3n4o4R1K54j62j27
2926A26K46n0j79p8J49Ql47j6J81k20j17M4k4N1j55k8K88p2j12J18K04J24k06
2949f5J19L05j03K3L9k5J33j19q5J29j99m5n1j91J16j99r1J42l57O8K66k75J63
2972c02j9n9M64k18JL31j04L05k8k90N12p3j87J54l40K30J16n71J68o6k39K51
2994C6n34J8K85l76K19j07k39N61j52k2L17l02N56J27m37N73j56J6M40o76L09
$$ y = [457, 97, -219, -90, 114, 197, -324, -345, 230, 55, -259, -286, -107, 248, -154, -357, 254, 79, -361, 20, 325, 140, -197, -64, 367, 239, -74, 20, 255, 211, -19, -78, 298, 124, -313, -99, 264, -33, -413, -175, 72, -105, -309, -148, -6, -95, -217, -90, 201, 52, -229, 10, 388, 204, -50, 148, 398, 157, -6, 271, 302, 24, -48, 57, 124, 6, -299, -163, 66, -227, -408, -159, -78, -269, -400, -50, 72, -245, -170, 135, 188, 134, 70, 161, 415, 253, 126, 372, 322, 143, 65, 214, 222, -125, -141, 40, -180, -297, -253, -277, -226, -381, -409, -121, -193, -305, -187, 17, 141, -65, 54, 359, 256, 279, 318, 293, 426, 307, 222, 351, 152, 107, 56, -135, -19, -218, -309, -167, -524, -456, -190, -465, -302, -321, -380, 84, -134, -133, 198, 94, 399, 371, 81, 593, 520, 333, 487, 147, 377, 493, -78, 90, 24, -215, 36, -498, -480, -195, -571, -352, -459, -698, -137, -289, -311, 6, -296, 260, 387, -50, 523, 367, 383, 823, 147, 456]
3015D56K76o18L76l78k37N37q02Q7L40q58O19j75n83Q98n96J8P92q60N49L76o13
3036c96J022m89k15J169j033L51O65j174R22k84q33J255j042l50J019j207M50
3053a70or69J443q55p24J538r51K32N99j183J639j93j285J754m64k31P92j265
3071b99J227K20j789J562m12p00J051j691P57Q99k088J162Rj156J516j112R2J146
3089C94j787J389N64j698J689n11k15J644k151P59J580j851R52m13p14K106j910
3106a73n56J522j416J186m90k074K525m47j156J261j734J380J246k659J451M90
3122C56q45J648j871M54K133k341Q29N14j403K031j310r13K125k015M53J139k206
3139a222J336k29q87J869k099N8K232j951N82J61q56K475j802j068K931j151k13
$$ y = [456, 732, 114, 490, 112, -125, 412, -390, -303, 37, -821, -202, -377, -960, -62, -658, -640, 152, -708, -159, 217, -396, 626, 137, -78, 1091, 58, 409, 1074, -100, 822, 538, -295, 960, -82, -432, 587, -620, -170, -176, -1145, 298, -557, -1281, 257, -694, -462, 137, -1046, 593, 400, -885, 869, 405, 174, 966, -299, 928, 1148, -641, 921, 509, -191, 860, -831, -74, 825, -1263, -101, -92, -1248, 268, -844, -752, 394, -1393, -4, 560, -1138, 551, 40, -175, 1469, -682, 77, 1657, -194, 758, 345, -369, 1737, -173, -729, 793, -623, 563, 73, -2001, 524, 77, -1079, 182, -1552, -172, 1074, -1585, -134, 356, -489, 1159, -712, -258, 1875, -466, 363, 877, -526, 1505, 195, -718, 1407, -608, -155, 984, -1222, 114, -115, -1002, 867, -1232, -1174, 1058, -893, -311, -150, -1006, 1469, -333, -1401, 1530, 379, 166]
3156A66M0j048K790r99k346K108m27J37K83k370K009N88k173J476r34j56J891
3173A035k015L52P69j111K095j106j663K562l73j05j13j889K909N68l010J047
3189d8J15N54P90k966J106J629j851P86o59m35J898j690J92J058j803J724L54
3206G54j825J257l95O64J028k817J010J976j310Rj197O15K342k530o79J611o77
3223a64P37j091q77K414j126r55J158p76J054l6j561J649j94l95J119j607O17
3240c4J257j428O51k97n78J614j302m96J291j002L73j70q10J596q70q06J330q86
3258e67M17N94j272R91p8m77J423j072m54J135l48M92p26q46J943n66j256Q34
3276A67k09M75l72j440J609L61j378K61n1P03K57j364Q34M89p93Q49k29k73N88
$$ y = [166, 206, -842, 1948, 949, -1397, 711, 284, 421, 704, -1666, 343, 931, -1242, 234, -700, -856, 1035, -980, -628, 141, -970, 1125, 19, -1644, 918, 545, 440, 327, -1562, 1347, 1915, -1095, -48, 67, 621, 1411, -1555, -449, 1180, -671, 115, -544, -979, 919, -771, -579, 479, -1324, 400, 754, -1071, 186, -209, 455, 1483, -1334, -324, 1652, 342, 351, -846, -231, 2111, -419, -1098, 513, -164, 573, -518, -1395, 1019, -107, -1062, 96, -680, 374, 338, -1223, 426, 232, -163, 956, -651, -34, 1223, -205, 446, 149, -429, 1185, -117, -613, 678, -324, 49, -121, -931, 665, -205, -1011, 319, -567, -150, 444, -828, 163, 85, -392, 1031, -41, -495, 640, 292, 784, 58, -788, 1155, 589, -667, 167, -42, 433, 61, -1379, 230, 591, -787, -526, -577, 126, 383, -981, -147, 342, -451, 398, 169, -104, 484]
3295D84o39O40M07j260N81M26n26R6n04N49K20j337N78O69o91m2l99M17P94j060
3315e97k5Q06l53J73o3J89L55p31L43P70o56j02J95j16L53n62p6O32o65l57M60
3336b7J00j47o84J58Q90n49l83M39P5J06j88K2O40l25l94O34K61k30l75J03N63
3357F89l80m29M54j17m17QJ29K09m08n19N40L31m68j73K49L45k62j76N88J57n09
3378a59Q7M75J90l35l06M42K34m55j14K37k1m18j22M27m6o76J1M85l8l43j07L62
3400a90J28l28J76L95n9k54P1N63O3n49O8M92j22l02J6K02j23m68J40L54l56l63
3422d46K1L04O3n18mN43k08j94K94K60j03k35K78N00k27k91K84J70Pk57p1L83
3444E53l64m40M08J06m35k83J12L72l62l74M24N0j63J4J23L78k29k63O46K18l74
$$ y = [484, -155, 485, 892, -368, 213, 639, 113, 209, -295, 254, 474, -863, -285, 384, -307, -349, -748, -331, 463, -597, -622, 184, -169, 4, -59, 130, 485, -246, 97, 867, 211, 109, 304, 188, 541, -21, -97, 535, -130, -487, -27, 73, -74, -758, -600, 290, -259, -642, -203, -128, -22, -210, -188, 452, 127, -267, 367, 628, 398, 23, 126, 689, 309, -120, 334, 217, -200, -192, -63, 146, -262, -781, -241, 90, -378, -551, -302, 43, -219, -395, 193, 350, -159, -72, 403, 593, 258, -48, 394, 628, 173, 59, 296, 275, -143, -265, 162, 116, -560, -549, -64, -102, -445, -552, -190, -62, -390, -214, 181, 122, -132, -61, 502, 565, 16, 84, 576, 454, 152, 168, 370, 247, -221, -81, 273, -83, -446, -425, -121, -58, -576, -580, -37, -245, -439, -145, 115, 12, -223, 55, 555, 328, 37, 321, 491, 498, 241, 170, 553, 189, -251, 157, 263, -172, -455, -343, 29, -333, -707, -283, -233, -396, -382, -259, 119, -110, -373, 273, 491, 117]
3465A17l0K72L31l32k78N04j25m11N6L7J60l94m82M96R7n41j3Q4K41j69l11O10
3487h1L6l95M46J01J33R1l52M99K15m79K82kj33P3m06L15j5p62L62K2m27K88l77
3510e66QK94m60L68K08m22L91N1J46L36n39M84M83o42L44P3j63L15n98Q4M29p09
3532h5P4n6k69L52n84L0M84p38K50M31m06L13k66J88Q18o89MN78j74M77m63l07
3554c8J022n54k66L37o27N39p3q26N03l05K0M15j067L31O38n82M08m76k2J306
3574F83r12k60Q39k28M13l52l87J193n90n18P49n05L27j84q34J098l53q62P81
3593I8l89M3J50p55R03j07p58R35l17l2M09o60R25P7j148R70K26k69L2q45J037
3614E25N42j510J93L10L24L06j741L26J567q64l25m03J76J512j089q95R54N6O61
$$ y = [117, 87, 359, 690, 358, 80, 584, 459, 48, 104, 141, 301, -93, -575, -79, 18, -523, -536, -452, -211, -380, -691, -81, -45, -440, 6, 107, 240, 331, -21, 478, 693, 214, 496, 494, 361, 434, 28, 343, 328, -434, -72, -50, -477, -189, -566, -558, -264, -724, -356, -148, -570, -179, -128, 18, 354, -185, 299, 782, 140, 484, 557, 394, 709, 111, 195, 624, -85, -11, -67, -336, 16, -568, -538, -54, -792, -542, -111, -517, -204, -470, -282, 536, -153, -149, 429, 255, 732, 269, -38, 984, 430, 164, 501, -126, 413, 340, -486, 17, -288, -268, 147, -920, -589, 49, -533, -125, -601, -623, 683, -229, -489, 350, 122, 535, 183, -204, 989, 399, -119, 630, 125, 452, 268, -566, 532, 179, -683, 98, -291, -248, -98, -853, 50, -57, -815, 120, -197, -229, 180, -480, 445, 522, -626, 344, 570, 301, 333, -512, 525, 1067, -443, -250, 60, 384, 690, -1051, -725, 842, -22, -347, -750, -574, 938, -151, -1046, -92, -36, 625]
3633F25n63j145J508J94n13K55j028Q77R85j371J19o9J00J130j394n59J101k44
3651HN09q43r98J837q8q99K43o05J235L86j698O51M48L1N41j414L96J216q89L01
3671C68n04l89J654r15q12P62m56Q04k90j466J387J81n66K20j007J222O70j763
3689i00O81M59j98P10j381K72J572j204lN2l23J324j024p34J171o52M29Mj459
3708a204J402J64r33O60r14O05J143j567K89M62j77J035j322l03J712q00J5o9
3726A98r07J630k54j302Q02m91N12M39j741P41O49n80N11j147K75J712j358k40
3744e51N51k66J248q50r47J567l42j49J48r09J162j2j157R19n51j55Q85j195K25
3763c79M75p05Q32n85n54J294m86j29K17n77J274j23j251J040J00j76K97r73P90
$$ y = [625, 62, -1083, 425, 619, 106, 361, -667, 210, 1195, -176, -57, -126, -26, 1104, -290, -849, 252, 8, 517, -326, -1324, 513, 425, -474, -231, -836, 399, 785, -913, -262, 186, 217, 758, -656, -260, 956, 67, 368, -136, -525, 1129, 214, -598, 164, -292, 512, 222, -1244, 143, 324, -242, -22, -1029, 193, 863, -900, -219, 240, 42, 752, -629, -357, 1215, 11, 8, 60, -263, 1061, 37, -697, 474, -178, 251, 255, -1204, 198, 362, -571, 89, -825, -220, 923, -644, -355, 107, -70, 965, -357, -660, 1052, 252, 267, 198, -709, 921, 667, -635, 167, -324, 188, 627, -1114, -373, 276, -304, 207, -940, -665, 1047, -311, -551, 0, -266, 982, 132, -815, 752, 410, 261, 409, -500, 662, 650, -507, 412, -139, -294, 591, -604, -379, 96, -609, 223, -362, -916, 378, -108, -237, -20, -597, 677, 554, -697, 343, 443, 267, 564, -409, 381]
3782C81M50j201N11j4k04M93r94K70O05r01M80P3o55P59k31r5M12o76O64M44q82
3803c11M11J00PM80q98K68P42q58P9J61j66L74o94o6O57n88O3J60m20M57j78j58
3825c78N66n23L9O24l03J7p0J10N14o10k5N78l54p4pr3M23m46m17N83m6l32o7
3848b91J3L10l32j70O07k63k34L33LJ93j01k95N34Q8m44J59K50nl44r4O17k96
3870B38n33L13Q9j38o2k80K81J19m11Q5L53j26k92Q0N73j19m95M24K67k71L9M2
3892A76Q9O2l47P1L91k56m53J49M03k40n27L55K67m90LL04l3j28r6J51L86j47
3914I0l26K34L90j62l81M21K53n81J0M56j59k95l6P9J72k38k41J72J62j94k59
3935d33L46K84o37J0P23j91l50J91J61J38j40j17L04j6k30n3K28K15n37k75P23
$$ y = [381, 831, -370, 141, 127, -77, 416, -578, -308, 297, -604, -124, -51, -706, 53, -178, -273, 139, -537, 127, 571, -311, 100, 200, 207, 687, -211, 57, 799, -59, 20, 181, 15, 389, -305, -371, 286, -302, -239, -79, -499, -42, -220, -378, 188, -335, -296, 328, 25, 42, -28, 82, 596, -14, -39, 539, 185, 111, 104, 11, 434, -12, -429, 154, 108, -224, -291, -278, 32, -300, -470, 137, -126, -360, -27, -24, 169, 68, -227, 307, 395, -49, 110, 360, 355, 11, -83, 534, 238, -295, 18, 107, -31, -93, -373, -92, 27, -384, -299, 54, -72, -364, -284, 289, 170, -325, 99, 366, 95, 134, 176, 265, 327, -20, 51, 442, 186, -267, -118, 285, 45, -482, -127, 140, -350, -347, -43, -76, -204, -300, -149, 237, 90, -236, -2, 388, 226, -155, 266, 519, -62, -52, 404, 245, -50, -86, -7, 165, -73, -314, -142, 20, -174, -433, -87, 197, -440, -430, 293, 102, -248, -57, 104, 242, 102, -15, 289, 273, 43, -10, 218, 433, -104, -379, 344]
3956C44j33o35L46R6j34q0o2K75j1l84J79K76J06k82l31P02J19o87M39K41l80
3977DL6O5J99q5m05K38J31r5p9k93L76J08p54M31M63o60j6K26J59K1m16K77K32
4000A63k97K56j11PK77n42L41O00q88pN79r3j74l38L09L61p61J46L38l26K41m75
4022c94l7Q98p46k96P27k28p8L9P1L62n45R2P19n85L6J97l14O61l73n63Q18k30
4044B31m82L52o4O9m71j00Q74n87l99N38k52L18L5o75P98J66o48L72J27R2o1k98
4066f5N60l27k78P56n54m33M93j59K50l04q13P95M24n24m71m0J104j14j132O87
4086a45M35j70K31o08K18P73n41r9K8k6L47l16l7j47m32R62q7j284M88N21l9j62
4108i0p17M92Q00m26l82j08P60M37j085K05O76l88K37k87m22P11p3l77j79j21
$$ y = [344, 211, -424, -78, 18, -116, -196, -258, 17, 6, -378, -199, 77, 183, -99, -430, 272, 391, -296, 143, 384, 4, 40, 105, 304, 219, -186, 52, 183, 88, 9, -284, 92, 200, -554, -123, 340, -320, -336, -110, 49, 70, -346, -69, 163, -134, 122, 11, 18, 295, -247, 94, 694, -194, -201, 378, 285, 111, -227, 82, 443, -318, -172, 166, -160, 81, -394, -431, 467, -279, -575, 152, -76, -154, -115, -44, 318, -227, -135, 584, -1, 35, 232, -82, 579, 206, -357, 461, 231, -251, 101, 37, 106, -365, -465, 409, -178, -577, -39, -291, 27, 62, -613, 185, 351, -297, 75, 202, 294, 233, -65, 495, 168, -110, 646, 92, -341, 152, -7, 243, -61, -874, -79, 345, -179, -650, -690, 414, 300, -832, -145, 290, 120, 351, -257, -39, 734, 193, 94, 122, 96, 443, 127, 90, -57, -489, 473, 386, -898, -410, 111, 72, -90, -807, -315, 485, 59, -323, -431, 329, 766, -319, -114, 562, 174, 411, 124, -298, 413, 340, -37, -216, -337]
4128c37O49k85n44L30k05N02J56j164O92P77p06o4J2M82L35q44J80L88j45M01
4148F10r18n5J172q56k24M03p09P15J42p93K03j22P10J51j410P94P11n13L71r81
4168e99K54J775j298p88Q23J79N18j108n86J427l94j68j29r74J534J15j543R12
4186e0j32q4R21j159P0P64k84N88r92k63J723r92l09N09r15J314k0j780J150K23
4206B82k94K34j159R06O31j132O59n26m6J615j619l16J521q71M32q9j047J494
4224F75k15p73M28o33J092J7j769J431Q2q14J065j178Q4J416j247Q1M03m39R57
4243F63p74l18R99r20O81J76j537J398K12j188Q30n25J9R90j158J37M44k54P22
4262E97j061o6J497j170P3O07j080J085J00j212Q25r9j00L20q86N88J93o55P44
$$ y = [-337, 312, 27, -517, -187, -392, 110, 266, -898, -206, 571, -135, -199, -187, 295, 630, -214, -34, 354, 209, 610, -308, -363, 809, -47, -271, 132, -577, 138, 280, -513, -310, -432, 278, 429, -981, -187, 524, 11, 382, -599, -345, 1430, 132, -656, 167, 346, 864, -244, -830, 597, 203, 35, -94, -1068, 466, 581, -962, -50, -182, -266, 655, -504, -434, 330, 46, 634, -358, -621, 1102, 110, -199, 310, -605, 709, 689, -1091, 59, 282, -12, 222, -937, -31, 600, -532, 127, -399, -445, 1170, -449, -765, 756, -115, 317, 228, -819, 675, 460, -313, 115, -518, 574, 591, -1178, 253, 335, -479, 586, -592, -508, 908, -339, -258, 145, -294, 663, -111, -429, 570, -350, 331, 507, -1030, 368, 580, -608, 222, -303, -284, 706, -452, -315, 129, -125, 597, -464, -530, 967, -203, -130, 477, -603, 482, 582, -630, 195, 96, -4, 316, -570, 18, 211, -444, 300]
4281C00p42r8J320j111k15R42o15L99N1o47P66j05j66J72n52Q05r4r87R17k18
4301A22n20P79o23j76O95n47O4J09j46L95l81J23L78o47O11J72p95O73Q3n32N03
4322C40k18j86L18k59K2j97N7M13o36qN70n27R8L20m83L80K06m32J95K14qj36
4344D3o2M28l24k06M85k78k18L65l22r5L00k70n0J81o1j73P8L37k18k51M88l4
4366A43l27L46%j60J81q4j11J51O5k59p3L56k22l69M43J8m22K26J65k51R4J27
4388C7o9LJ50j21p9L46p1l92L94J71n55J63L47l51j42K05o3j24J29l5j81K33K7
4411B2l67K84L53n24MN67k57k51L46O6k42Q2J04k00P9Q5l25J56K92m85j20N73
4433B42j89m46L42J82l58L2K90j30r4K42j48k6L78l45j85N45j18n05L82K29m11
$$ y = [300, -442, -540, 780, -331, -546, 396, -219, 180, 231, -416, 350, 245, 79, 251, -301, 504, 410, -577, 340, 122, -398, 381, -242, -418, 277, -270, -206, -97, -243, 152, -229, -106, 272, -375, 236, 408, -387, 286, 369, -163, 340, 122, -64, 254, -5, 17, -180, -123, 290, -346, -354, 216, -311, -213, 107, -376, 4, 210, -222, -27, 187, 179, 43, -19, 409, 85, -121, 364, 86, -132, 233, -89, -184, 116, -154, -204, -23, -84, -257, -179, 158, -60, -311, 177, 143, -184, 162, 162, 2, 183, 99, -12, 139, 204, -55, -128, 228, 6, -363, 80, 98, -324, -98, 67, -184, -90, 37, -32, -29, 121, 0, -79, 267, 196, -196, 198, 369, -186, -23, 324, -27, -169, 36, -27, -151, -22, -57, -238, -5, 22, -345, -61, 292, -232, -228, 339, 82, -169, 177, 243, 1, 83, 187, -13, 66, 151, -174, -18, 274, -211, -331, 242, 53, -393, -51, 131, -227, -195, 95, -35, -129, 113, -35, -61, 317, -28, -213, 332, 214, -291, 91, 320, -91]
4454i1j30M08n4l77K32J12k64K80j00l80N29kn36L92K70m42j12M10O3m24J20L63
4476B67l77Q0K45l72K83J50n41L25L50m92j33L59R4m26KN11m10k58N53l19j05
4497b14L37m62J88M52n27l0L39Q7k09j57N90j92n76P72r4n22N34k99q0M75n89
4518a77n4M68k29k00k50N46J77j018N64N34q16N48k0n07Q62l06l05O04l99J15
4538A37J38j83L32p63K89R32j329Q6Q79q69L18mo33R51k82n73N59j61M86l13n92
4559e95J232n90m56J284j028j02J008q39K70L0o16Q65m02m06M68n94Q07k69j200
4578a133J702k66j262J190l11l3O09j038O31L57o16O16o45K04P66j344P68M41
4596F36j491J290K8j254J025k77k5L53j112R46L40q92O24p34M63J329k030K23
$$ y = [-91, -221, 187, 133, -244, -12, 100, -164, 116, 16, -364, 165, 163, -373, 19, 289, -153, -265, 145, 208, -216, -96, 267, -110, -30, 215, -157, 126, 276, -265, 60, 410, -82, -215, 144, 238, -188, -186, 325, -85, -343, 210, -109, -214, 123, -339, -151, 301, -226, -256, 83, 170, -39, -196, 394, 202, -374, 398, 304, -218, 316, 17, -63, 412, -177, -231, 237, 8, -192, -442, 104, 281, -737, -173, 361, -455, 93, 73, -434, 428, 122, -183, 421, 22, 137, 275, 92, 424, -339, -50, 882, -447, -361, 518, -351, -33, -37, -670, 281, -1, -574, -15, -176, 310, -3, -595, 637, 47, -409, 875, -153, -255, 753, -86, 184, 214, -402, 463, 61, -345, 123, -471, 336, 67, -1133, 569, 303, -959, 231, -80, -113, 496, -542, 89, 446, -170, 446, -199, 5, 771, -573, 195, 636, -855, 435, 463, -791, 234, -43, -68, 285, -827, 119, 459, -433, 191, -543, -80, 1249, -781, -558]
4614e58J474j176M39o3p39J230n51l00M93q29J042p2j259J305n22k24J370j716
4632f56l0J749j000k08j24rJ256j192m41R03n32P72m96j246J908k70j266J212
4650C30m36q3O71p79M56m8k28R74j054j06R99q65N42q8j383J594K39j569M71K34
4670a29L31j58j065R70L17n35M22p66N88J161j559Q0J145o17K23j54m67O49j15
4689C21p7l63m98J103l34r56P44k55p6O93j002L6J007l49k42o1M54L66n42K60
4709B29J00l47Q36l20r01P09J36l34K0m87M6M93j31o33l16J008K48j228K64Q27
4729B19j44o6k51N1P81k5o71lP20R8q39J64M29n51J50J89o86J55L36k50j06o9
4751c69J05R2J22k6m46N98O45j062O3R25l34k16K7m0K96j22k06j57L9M26o00k23
$$ y = [-558, 916, -260, 179, 116, -623, 607, 56, -244, 249, -580, 462, 390, -869, 436, -86, -310, 1060, -656, -686, 1063, 63, -145, -269, -278, 978, -214, -655, 248, -284, 488, -8, -1254, 654, 384, -882, 330, -106, -189, 482, -297, 159, 111, -117, 857, -197, -303, 696, -169, 373, 285, -1098, 496, 735, -834, -363, -129, 202, 44, -1021, -51, 266, -269, 153, -613, -25, 1136, -423, -343, 802, 185, 408, 254, -213, 436, 321, 244, -119, -617, 486, 152, -804, -60, -315, -391, 302, -700, -664, 343, -6, -248, -309, 145, 511, -31, 229, 329, -18, 818, 498, -403, 306, 442, 108, 128, -359, -313, 180, 49, -584, -900, 108, 356, -872, -608, 219, 75, 9, -242, -191, 590, 565, -106, -109, 611, 709, -130, 34, 463, -88, 62, 251, -435, -280, 56, -194, -300, -369, -264, -172, -50, -76, -522, 76, 721, -341, -278, 647, 313, 97, 124, 84, 380, 258, 52, -105, -66, 360, -240, -463]
4773d63P26n86j59P53n89r8N85j42j43k8K98K12m44K17M4k51O45n81n59J122l23
4794B36p48N37j7j02o0j03L20k45O7K26m91O05J41q41P64K11p98N62J04m55J78
4815I1l2J44l25j38M35m52K9M39p38L52N53q92L71N11n01J33J70M5J8k11L89k37
4837A54k69O46m86l41O75n47j76N82n51q9M03j28j63m9L75L2m33N45O8m57O01
4858C92q9m18O18j95m20M23l9l05l5J57m3m79L06K09n89K65K81m95L44K11m01
4879c02L03K68k45k2L09L8l28J69K87m71RL68m76o0L46m31o2L08k46j65K58Q7
4901e8l00Q9M50k74r3N19j88j89M39j08k83L34m5l06J33J26l25r4K99k30l17L88
4923c3m3m12L88J07l74K91K07k84J37K81j92r1L65n5l37K98J24m69J29K19m23
$$ y = [-463, 263, -323, -482, 271, -318, -416, 169, 27, -116, -144, 154, 366, -78, 139, 183, -68, 577, -4, -563, 559, 236, -512, 25, 8, -94, -154, -257, 63, -182, -115, 111, -380, 225, 366, -475, 289, 500, -298, 264, 368, -87, 91, 59, 203, -122, -260, 175, -277, -248, 191, -547, -195, 358, -534, -163, 348, -153, -20, 150, 195, 213, 2, 391, 154, -115, 531, 45, -296, 379, -168, -344, 238, -313, -402, 1, -127, -290, -339, 36, 68, -365, 180, 248, -209, 392, 303, -115, 503, 308, -112, 311, 272, -33, -68, 89, 46, -433, -127, 82, -507, -242, 39, -456, -112, 99, -302, 1, 269, 24, 2, 311, 349, 21, 190, 477, 6, 15, 383, -93, -153, 193, -238, -300, 8, -238, -403, -145, -58, -358, -269, 181, -93, -186, 333, 145, -44, 395, 287, 4, 338, 293, -13, 120, 246, -79, -173, 126, -104, -421, -33, -76, -488, -100, 7, -367, -76, 131, -153, -16, 265, 73, -18, 347, 292, -45, 253, 377, -92, 37, 256, -167]
4944a67l8L34l42j13L21j15k75L06J11l09K15K96l27N8M02l05j15L99j65k75L33
4965B29N8m49J37K55m00pL30l39j13M08j85j91L18pk78K65J71l19L8M27l02k20
4987a74M79j20l60L36l5l39K63N2l51J64K30l00j02M06j26l18M39L5m65L50K09
5008B73l81J00K43k25k3J98k07j50L67r0m88M15K33n49J22L21k49nJ90r1j21K56
5030A39Ol03K23K43m79J49L58n27Q8L79m24r6L04j2j73o0K27r2l6L37m59M5O74
5053E11n60j90O33l06j23J61j63O5k9P5q5l99N52j0n66M99j53k41P40n10l87P54
5075B68k0k33j68J27N63n36q7L65m83M98Nr25Q42P0p54N42j72j66L50k82K75l13
5097b34j68J008p28k38Q26o49M24K84j144Q62L94q67K49j64M08R6j051Q12O7p08
$$ y = [-167, -205, 129, -213, -326, -5, -120, -395, -89, 22, -287, -72, 224, -103, -45, 357, 52, -63, 336, 171, -104, 229, 287, -162, -25, 230, -170, -177, 153, -186, -299, 109, -76, -267, 51, 44, -234, 31, 202, -117, -79, 348, 46, -174, 305, 185, -175, 161, 126, -213, 50, 102, -249, -85, 145, -155, -257, 149, 23, -295, 144, 179, -286, 64, 273, -108, -8, 235, 10, -13, 185, -22, -172, 195, 105, -383, 32, 265, -284, -162, 159, -90, -95, 95, 4, -117, 139, 145, -158, 65, 308, -171, -22, 336, -191, -103, 276, -148, -244, 60, 48, -125, -185, 42, -50, -86, 251, -208, -163, 511, -49, -239, 394, 88, -35, 126, -37, 28, -1, 74, -11, -410, 142, 132, -434, 65, -88, -329, 411, -99, -486, 268, 248, 15, -153, -26, 537, 1, -86, 279, -204, 294, 299, -626, 216, 286, -468, 74, -98, -264, 86, -196, 79, -234, -402, 606, -122, -360, 466, -183, 241, 525, -619, 243, 637, -230, 19, -145, 263, 359, -692, 120, 187, -521]
5117e21R16p43k58J322j033m1P14p88P15Po99P02m13L79L39j483J176M99j424
5136f34Q82l16k99J271j354j92J231o78K23m11k61J415j146j92J121j273Q33M08
5154F28j538J284o8q58J105q54k0Q46r09O66l87o19J821j204p03J537j028N14
5172B13M38j618J307L49j084O70p45N34P30j681Q68K40r69J566j221p28K070j050
5190a11k64O59q91J283j78j225J196l87K76M37j810J411O28j872J185k34p93J312
5208F22j108p6R06j089P95n9q06J205p47J78J092j772R24J187j647O47J53m58
5226e3J079j186k13J059q57L37l56o39J490j093o61J552j043P3P92r95P67K13
5244B66o50Q63m92J26O53r05O69k3q98J328o55r34J259n99m07M48o29N15q6o84
$$ y = [-521, 395, -348, -606, 716, -317, -358, 356, -432, 283, 290, -409, 293, -120, 259, 598, -885, 291, 790, -634, 248, -68, -367, 904, -450, -642, 589, -89, 134, -277, -538, 877, -269, -461, 660, -613, 220, 628, -910, 374, 306, -552, 553, -301, -321, 525, -384, 282, -105, -724, 1097, -107, -810, 727, -301, 213, 651, -967, 340, 689, -395, 275, -470, 64, 794, -887, -19, 221, -748, 818, -403, -1131, 939, -111, -375, 284, -607, 676, 498, -727, 469, 82, 358, 795, -1015, 396, 1024, -848, 337, 103, -690, 622, -486, -562, 344, -745, 50, -9, -815, 390, -357, -179, 913, -859, 65, 1252, -395, 252, 405, -53, 1026, -160, -373, 686, -171, 166, -190, -829, 661, -432, -1093, 459, -584, -511, 281, -714, 53, 266, -384, 479, -13, 113, 766, -139, 530, 507, -391, 937, 282, -652, 607, 8, -399, 49, -580, -65, -151, -835]
5264h35P86k95O7M17q74R02M48j156Q58K57o81O79k40j76K91m39L28q8n68N31
5284B12m31n8M25r19M17O43r72J73N73k37J74j94J86L74k86K14l2j93N36l89k64
5305d8N98n28k47N55m08k85K14Nn5k39J58K24k33J61N0j26M74p7m33N97R6m64
5327a1J75K19k25j84J68N4l00o4J30j78R1lk97K42K92m27M2N00j68k70L66J49
5349C01k12M7J50j45ML6j25k6P0j85j96L76j33m96L89L00m79O2K96j11K2R0M0
5372G5K6R1nj45K23P5m65J66L63n27o9L50k32j92J35J5n3m5P2K4L4J86k50P5M55
5397C82l32j52M94r6l25K19O3j38r3qj0j13R2j48j75L52j38k90M27N3l93K81K17
5420A69j79k7J92N7j28P3J18k24J22P3l84K30J55n36J53K71k79j67K10M4j47l
$$ y = [-835, -49, -344, -277, 140, -734, 168, 616, -540, 318, 575, -106, 573, 333, 157, 448, 9, 337, 249, -319, 212, -219, -277, 148, -771, -354, 289, -683, -510, 63, -174, 0, -194, -8, 366, 80, 294, 262, 69, 605, 216, -48, 550, 22, -225, 330, -78, -363, -149, -144, -199, -438, -280, -56, -289, -128, -78, -204, 270, 193, -240, 357, 453, -11, 164, 383, 158, -26, 142, 196, -104, -168, -38, -216, -125, -128, -425, -183, 109, -318, -276, 224, 56, -214, 152, 301, 89, 136, 286, 141, 145, 181, 56, 30, 100, -85, -281, 95, -38, -534, -145, 155, -324, -262, 34, -77, -55, 35, 75, 101, 192, 187, 42, 265, 340, -125, 41, 404, -123, -192, 158, -74, -266, -131, -116, -169, -214, -142, -118, -84, 102, -148, -73, 382, 50, -102, 392, 296, -29, 190, 253, 115, 22, 14, 4, -109, -17, -165, -340, 12, -126, -416, 11, 64, -329, -48, 169, -10, -37, 155, 212, 84, 157, 275, 51, 173, 246, -138, 92, 247, -289, -136, 135, -144, -311, -101, -57, -204, -207]
5442b07K13p9m0K66k00P2L03l26m8M14k24k24K33M4k25o1J72p2j93J76m6k04K93
5465C7j51j78L93o3k83K97J44k39m6K91rk68J95J01l03K02K6k95K66k2l18J81
5487d2J23k09p2K07O6k93J30K75l20L9K99l23J51J66l36K06J46k51mR3J15k30
5509f4j08L94k60j92M37k88j28M08l10n0L08j89qO4qj0j01L04j28m11N38J5m90
5532b77M03p2k25L90k52j12K37m8m9j78J98K04m69K27K34m88L40J70n27L61O5
5553A32k66K26r9JP9p3J87l54M2N29n33n3M70m41J58J79m76K99J00k16M5j27L12
5576A21j4m04M40j05j92M97m49j29O53l67j55J98j21J81j12j57K12k25K62k3n56
5597d45N58Q2n19L75n4j78L87k39j37K04N6J36l34K4M11l30RJ45l70L78J45n96
$$ y = [-207, 6, -73, -113, 153, -47, 25, 328, 2, -46, 368, 144, -80, 153, 197, -28, -89, 83, 11, -182, -6, -52, -256, 37, -114, -292, 101, 38, -245, 52, 196, -43, -89, 202, 193, -75, 120, 221, -82, 120, 146, -149, 117, 95, -223, -42, 81, -128, -200, 7, 73, -220, -90, 185, -135, -96, 203, -120, 31, 197, -139, 67, 213, -38, -42, 51, 166, -64, -172, 222, -38, -230, 207, -81, -209, 199, -111, -161, 147, -42, -50, 14, 6, -4, -105, 199, 71, -340, 198, 213, -277, 126, 54, -171, 219, -33, -145, 92, 44, -5, -183, 15, 219, -250, -23, 211, -277, 63, 233, -294, 67, 132, -134, 92, -7, -6, 73, 0, 187, -167, -125, 404, -129, -182, 288, -153, 5, 184, -292, 7, 107, -109, -64, -191, 121, 107, -297, 143, 38, -154, 343, -106, -235, 418, 51, -104, 94, -27, 154, 42, -115, 97, -128, 134, 111, -445, 113, 195, -324, 51, -3, -181, 206, -33, -170, 34, 90, 226, -108, -84, 327, -3, 6, 151, -219, 159, 304, -292]
5619b92J42K70j45j9j33O3J26lQk56P8N35l41k62L26M5L9kl00P4L63p8m38l6M45
5644B09m3l42j2Q0J07J19k86j99L59K60l56j47K94L6N2N5l71J77L98k19l14L7
5666a06L39m1l44P3K2o2L03l81k37O20j56k33J97j45J72J35j86O5j03K75J82o58
5688b69L11L11m63L19k09l28O53l58l42L61r1J49k11k08O81m10j97N63m99L14
5708G7L44q15N71K51o17M61k13j06L29m94L44r1n05Q63m65n00Q43n22J09M46q84
5729e74N47M24o20L02k04K42M30r20M37L80p42P11l29o05J044n78k61N97p09M19
5749iJ92o11N27l54J08O64j074M27O89r17O01l9o25R86m91l02O48n98L14M6n71
5770c89P15m87k48R60j005R3P99q67M35J40o43Q65l43l36O26n13M46pp10R66l58
$$ y = [-292, -150, 120, -25, -44, -177, -114, 12, 9, 17, -239, -161, 374, 33, -229, 97, 142, 181, 179, -121, -47, 316, 238, -200, -236, 209, 166, -176, -188, -108, -1, 118, -168, -367, -8, 252, -104, -251, 43, 79, 131, 186, -185, -8, 390, 171, -143, -106, 233, 192, -152, -79, -57, -119, 184, -197, -434, 186, 30, -203, -6, -151, 21, 156, -30, 35, -68, 207, 389, -269, 42, 353, -110, 209, 0, -328, 325, -33, -375, -14, -105, 44, -167, -375, 306, -104, -301, 262, -237, 77, 421, -394, 177, 428, -189, 272, 59, -47, 282, -212, 132, 41, -464, 399, -66, -566, 277, -245, -136, 310, -574, -27, 397, -223, 79, -125, 117, 547, -373, 64, 444, -298, 413, 84, -521, 523, -55, -316, 281, -428, -9, 183, -428, 99, -255, -147, 517, -557, -130, 559, -358, 243, 204, -421, 565, 74, -228, 420, -178, 136, 182, -389, 326, -161, -409, 551, -454, -361, 438, -429, 6, 146, -497, 368, 25, -311, 315, -198, 248, 241, -469, 497, 139]
5791A39o51J015n51k33N97o96M48J33p27O58j23j98L62o08N67K96j010P84J22
5810C24o77O94l66j22N51o01J93K48n19M64k67j20N23p49K70O18r01L79K78m98
5830b78M57k19j12M98m85J41K04l47M18l41j84P11n99j40O23m98M3J74k71K68
5850F3j36j43L79l22J29N4k66M96k30l53O54k14l31L78j35O8p0j95L54j18j79
5871a17J58k01K08M5m75M54Q3m59L10O1j47P5m8J10k5j47K59j01r7K31k52J22
5893D7J66m09J46L01k81j27J52O5o6j56J62K2j44J11o3k0J92k00n4L03j32j99
5915a84K76O4k12k9K28mj91O9O9n9N4j13p6K17p5k91K27J73k86j08L35l1k18Q3
5939h2J11o0K5K0k5J40l7j14Q1J73k23j44K96K6l67J42J49j73n3Q7n9L1k4o2P1
$$ y = [139, -512, 503, -48, -281, 316, -380, 68, 201, -526, 132, 9, -189, 173, -435, 132, 428, -582, 202, 324, -353, 341, -25, -147, 404, -197, -4, 244, -275, 189, -78, -198, 325, -424, -154, 464, -437, -58, 220, -278, 179, -40, -152, 346, -139, 2, 206, -141, 277, -64, -248, 463, -136, -276, 347, -151, -108, 66, -205, 63, -73, -216, 163, -159, -30, 24, -242, 254, 24, -329, 325, 111, -220, 158, 23, 91, 21, -174, 180, 62, -117, 41, -160, 48, 93, -382, 72, 155, -304, 6, 67, -80, -5, -53, 57, 32, -115, 144, 43, -54, 177, -75, 47, 213, -196, -50, 251, -30, -157, -5, 60, -6, -162, 0, 22, -122, -11, -74, -94, 98, -102, -156, 147, 15, -184, 92, 156, -56, -85, 143, 139, -52, 17, 86, 27, 81, -32, -108, 109, 34, -257, -30, 143, -143, -251, 84, 53, -165, -82, 29, -31, -6, 14, -11, 129, 92, -22, 59, 232, 9, -135, 161, 187, -180, -38, 111, -62, -115, -28, -87, -56, -80, -142, -71]
5964g1J10j03j15K42R9k81J09K63k04q7J86jp5j6j4k1L9r9j07J25P8k90K2K71
5988F0j87j29K43J6j25O0J01K7k6L9m8N5J11j86j6K81j93k57K83J3j67q9Q2K8
6012b4j47N7O9j01J11m0r7K68m2k07L07K0k00O5J16K7j84MK10j71j00J13j74J58
6036C8J9l63K42J80l08P3Q9M2q5m6K41o7j51K78j50l6K53k87P5K12l85J24J68
6059A56j97m9o6K41pm00L08Q8k82L13k05r9M75l69l8L27j99P8Oj11K09k92J84
6082G1J86n72L48K08n22L25j15j98N31l69j63L75j41J95k34j94O67l87j66M69
6102C14n27K80K83o78M31L6l73M64l36j10L76l88L71j84m24Q65l33m28O22m02
6122a41K00L14p11M15J98l86L35l67J37L93p47M06J80o54O68k19n09P69m16o5
$$ y = [-71, 39, -64, -179, 63, 162, -119, -10, 253, 49, -38, 148, 147, 72, 56, 42, 21, 60, -39, -146, -21, 57, -233, -211, 60, -127, -256, -13, 3, -122, -62, 39, 66, 40, 79, 31, 86, 197, 11, -5, 276, 83, -174, 109, 122, -45, -134, -52, -24, -171, -114, -45, -146, -35, -75, -172, 96, 54, -153, 154, 174, -26, 39, 155, 182, -2, 2, 212, 41, -59, 54, -120, 38, 57, -306, -64, 116, -192, -119, -30, 12, -73, -119, 122, 55, -96, 182, 32, -4, 249, -38, 37, 249, -136, -12, 156, -41, -90, -156, 85, 78, -322, -14, 74, -208, 105, -100, -199, 276, -93, -131, 196, -3, 75, 81, -30, 179, -113, 71, 257, -315, 33, 241, -281, 44, -71, -269, 262, -107, -270, 105, -36, 159, -75, -269, 398, 11, -155, 314, -213, 67, 350, -328, 103, 139, -234, 230, -106, -216, 160, -228, 143, -41, -465, 400, 67, -361, 261, -141, 59, 373, -338, 77, 275, -111, 224, -143, -6, 387, -360, 46, 226, -428, 240, 21, -488, 281, -135, -200]
6142b00M13n64M61N6m33N40l85K5N88q33L65M15p98N32m6m25O37m81j15M92n31
6163b87L80o7m81P53l85k35P20p20K28N86p98L41J90l48M93m73p9N65n14J91M2
6184A02n31Q47l16o38P76l25n9L61o05K92K91m31M03l04K1N21o02J75L24n89N60
6205B73k5o24O00j13k15K63m15K59J59m10L79k56r8N33n54OM81m89K54J91m72
6226b73L55L2j29J76k71J96J29l54K90j27k18M84l52j58M15k72p9K26k03O1kl5
6248a09J45j51P0J07k22K58K9l31L29R8l33J61O3j10J13p8p8R0k0nj42N6J92k65
6272a33l8K60j76r0K18j59J0J91k04N9J83r1k5J7R3L2k27J60R2l16K42J4k97K78
6296I3j07k09K89j14j43J94p0qk3j5K92k83n1L65k58J18J48l93L15J04l62J91
$$ y = [-200, 213, -351, 110, 166, -267, 273, -112, -87, 501, -332, 33, 448, -350, 182, 136, -289, 348, -133, -248, 244, -287, 93, 26, -455, 298, -87, -322, 398, -322, -94, 492, -306, 35, 225, -123, 370, -103, -182, 383, -131, 60, 102, -429, 418, 102, -536, 240, -85, -144, 217, -388, -96, 195, -236, 167, -137, -116, 405, -197, -22, 302, -287, 273, 248, -376, 224, 111, -104, 159, -256, 3, 162, -248, 131, -125, -223, 310, -244, -238, 243, -246, 8, 199, -273, 82, 114, -15, 161, -110, 86, 215, -139, 151, 24, -194, 290, -62, -220, 195, -77, -156, 70, -133, -72, -74, -109, 36, -115, -45, 62, -160, 98, 127, -204, 125, 223, -110, 51, 114, 4, 117, 39, -39, 51, 31, 26, -116, -60, 132, -133, -171, 89, -87, -177, 41, -118, -108, 83, -121, -62, 121, 30, 5, 22, 115, 147, -80, 80, 172, -144, 98, 112, -185, 93, -14, -223, 66, -48, -191, 3, -67, -75, -98, -113, 179, -104, -155, 210, -48, 70, 218, -175, 140, 244, -118, 73]
6318G3k9o0J30k41J37K7k41L48k63k12N07k74j03L12l05J79K13l61K03L4k4J35
6340A85k99J94J95m43K97j4l33M24j81k43L30k59L6J84k88J77k3l0K27l41J49
6361e6L77n32K03K19l09K36n2k07L33k00q0J05j17K11j66j85L92k97j10M15l67
6382a87Q0K46k65J63Mj67K46j54M6J14k16K77j13l05M66j26l19L12j20m5J18j91
6404a36J02N1j31J47j38O7J39k94K51J20l80K55J19k74J45J7o7Q2j58P7N5q9P5
6427C5j68P5K35l53O7K60k13j0J33j04Q5j6j2L5m1J3m2l5J74j76p9K70j50j94
6451b11K75k2j40L3O8J6m3j5O2n2J07m8j33K44n5k61K36J00k35K0R6k9p5j7O4
6476a5mo4R3j07J34Pk20J76J68k38K0J46n5m7J9Q1m9r7P4k7k6O0j30K8J65k01
$$ y = [73, 44, -16, 114, -127, 10, 37, -204, 144, -119, -331, 176, -98, -201, 111, -194, -15, 198, -163, 40, 74, 50, 185, -114, 80, 275, -168, 129, 115, -218, 206, 25, -218, 112, -147, -111, 73, -215, -38, -61, -91, 136, -205, -56, 321, -211, -8, 211, -98, 138, 86, -121, 212, 12, -68, 37, -80, 131, -35, -220, 172, -125, -235, 180, -187, -107, 139, -126, 37, 41, -126, 120, -34, 12, 126, -90, 187, 74, -231, 235, 109, -210, 102, -18, -63, 55, -136, -34, 17, -114, 33, -105, -38, 101, -193, 58, 178, -202, 53, 172, -102, 43, 60, -7, 75, -83, -6, 49, -40, 35, -133, -58, 177, -176, -109, 151, -62, -72, 61, -43, 42, 26, 14, 49, 8, 21, -21, -56, 118, -58, -137, 133, -17, -211, 64, 42, -98, -65, 3, 19, -24, -39, 23, -29, 78, 30, -103, 141, 86, -175, 61, 161, -74, -54, 42, 13, -62, -79, -15, -19, -83, 10, -97, 37, 44, -176, 0, 168, -70, -50, 96, 41, -6, 13, 94, 45, -52, 22, -5, -31, 29, -101, -73, 92, -109]
6502a09p1K33m3j16P2J15o9q2R6M5q0Q2m8n0J62j07j58K45o4j39P1O2q1q0Q4O8
6528C8j28OR2o6Q5o2q5K20J4k34J00J44m3j39O1J09j35k2J11j24K5P7j17N0L5
6553A2j58Q8J36j30p3J05J32j28r1J69O7j68N4rk0J33j71n7K04q2j18J18K1j20
6577h6K4R8l4j27Q5J33j50J2P7o3J21m1j81K09R2k16k0J37K0j05r3J66l1j47J28
6602Hk0n0J19j52K6J90j97l6K15j26kN6L2Nj71J32J55k51M6Q7j54K33j74j59L29
6627A41j13j64J39n8J30j01j07K41j38j6K28l34J15K25k84J73L0k95L68j16j90
6648a26J53j10K11j18k84M18r7k50L60k95P6L09m64K16J64l55K99r7o7K37l83
6669b03L10J14n01L91K4l39L99l35nM66n34P7L02l54L15k45k2M80n81J25M01n17
$$ y = [-109, -180, 53, 10, -106, -34, 81, 12, -70, 26, 71, -9, 73, 25, -25, 137, 30, -128, 117, 53, -86, -15, 47, -34, -114, -30, 38, -90, -84, 8, -58, 27, -35, -120, 100, 114, -120, -20, 124, 81, -58, 3, 112, -23, -45, 66, -58, -33, 44, -73, -23, 12, -146, -58, 78, -52, -125, -20, 112, -16, -107, 62, 129, -39, 15, 6, -14, 119, -52, -109, 95, 13, -105, 13, 34, -86, -62, 36, 2, -125, -40, 93, -57, -45, 32, -31, 90, 49, -132, 77, 169, -47, -67, 70, 90, -15, -108, 58, 27, -120, 8, -12, -62, 57, -95, -69, 121, -76, -112, 103, -23, -25, 31, 63, 68, -103, 29, 184, -67, -21, 66, -88, 145, -29, -188, 141, 28, -136, 3, -55, 75, -26, -133, 108, -30, -46, 182, -152, -37, 188, -96, 77, 107, -188, 180, 64, -126, 27, -83, 128, 10, -274, 144, 47, -203, 157, -138, -62, 247, -217, -1, 163, -192, 107, 10, -57, 180, -203, 107, 221, -280, 111, 135, -204, 195, -140, -145, 321, -213, -136, 166, -188, 127, -118, -140, 340, -241, -116, 285, -232]
6691b32L28L3m24N79k74k52M98l62P0J74m14M63k16k74O13m69m2N19n85K74J93
6712B00n08N62j90l04N06l61J03K02n17N46j08m93O47k91k31N06m62J65K70n83
6732c41M66n7k85M07l78J92L15o87M53J56n32N12j97k23N02m44N5L17m63L53n5
6753F6k83M57m19M2M86o01J88L04m55M01j38k81N41l58j5K03l67M20o1m03M66
6774A93k50q2M51n30P1M01m05J75n0j66M39l35o5K88l04L00l7m10N45j41k97M02
6796A93k66j6K92l19J73k7j56K82k28m2K79k99J62J03l75L46L2l14K26o7nJ57
6818A31k76J32Q7j37J32j43J1K46k77QK30k20Q5M4j62J51j7k5J0p0J34J2j82J38
6842D2j9l4J27j75o9K24j19o0O1j3N3j8m7M9oP0k4j49J62N8j30L0K2n6P8k1j03
$$ y = [-232, 96, 129, -295, 284, 10, -242, 256, -106, -36, 138, -276, 187, -29, -303, 310, -159, -201, 318, -267, 7, 200, -308, 254, 64, -240, 266, -95, 8, 210, -307, 239, 131, -362, 285, -6, -237, 269, -193, -28, 242, -341, 125, 68, -217, 190, -188, 4, 319, -368, 85, 241, -291, 221, 24, -199, 303, -141, -86, 231, -232, 121, 66, -217, 240, -179, -137, 349, -252, -64, 240, -215, 186, 48, -233, 308, -50, -65, 138, -229, 191, 130, -273, 193, -57, -139, 312, -218, -147, 254, -151, 24, -26, -192, 247, -88, -153, 135, -169, 131, 94, -316, 229, 88, -209, 193, -73, -89, 203, -116, 57, 30, -126, 156, -72, -114, 165, -134, 28, 131, -244, 102, 134, -180, 46, -21, -26, 131, -145, -13, 74, -63, 69, -74, -63, 183, -94, -86, 144, -76, 9, 53, -109, 42, 25, 0, 10, -60, 74, 86, -96, 42, 23, -11, 116, -59, -128, 96, -23, -83, -22, -35, 18, 0, -47, 2, -4, 66, 42, -107, 55, 113, -17, 13, 35, -21, 57, 36, -67]
6869f7N5M8Mq3%O6m1j2J0n7O5O1j04NJ48p8l2N0k3NN8m0n4N3L2k7j08P5O2j30
6899e9M4j8o7J11mj16Q4Lj9J9LM4j6J9L2q1K3Q9j24kJ33j21L0L3j03N4N5r7L0
6928b1kO4m4q4J11l4o0J50r7l5J40r4l2J00o2oL8m4L0q0R5J2j37J15L7j22O0K6
6956B4p0Q0j3m9N8j5kj1rO6j07J7J02j36K5Q5j05M1M3p4P3rl0OJ2Q1p6m3J48j08
6986Dn3J13q1LN0p5L2K3q3M9k1L9jr1J27k4j06J30J7j08J28m7j8O7p7J9L2l5K8
7015D1l9PK8j43J04L2j42P3P2j11O1l9lQ9m9LK8K2K7j10O3J33j82M9R1j26K4J4
7043A7l0N2q3KK3o3J05p5k9J42j21l3K02j05m8J14m0N8o0l1R4o1qL8j09J30q0
7070Aj59K55j43r5J60j02OM9o2J36o1m1J41j12L9P9j38J78j4k41K16J4j26N0o4
$$ y = [-67, -12, 36, 40, -43, -43, 23, -18, -30, -20, -77, -12, 49, -55, -50, 98, 20, -12, 38, 15, 20, 78, 38, -16, 37, 69, 42, -66, 9, 71, -59, -15, -33, -100, 11, 7, -109, -25, -22, -41, -22, -19, 25, 9, 28, 60, -21, 2, 91, -33, -35, 98, -23, 7, 40, -63, -9, 46, -51, -21, -23, 41, -3, -87, 24, -10, -70, 80, -17, -52, 88, -6, -38, 62, 0, -6, 32, -12, 18, -62, 33, 45, -92, 23, 60, -62, -2, 24, -46, 34, 21, -28, 30, 15, 13, 2, -7, 59, -48, -31, 71, -65, -40, 45, -60, -19, 24, -50, 23, 14, -16, -10, 2, 83, 7, -36, 112, 4, -49, 64, -17, -14, 36, -39, -7, 16, -67, -18, -39, 0, -1, -92, 35, 11, -95, 35, 52, -56, 72, 25, 7, 74, -3, 16, 48, 13, 41, 2, 9, 37, -106, -2, 30, -112, -39, 33, -78, -17, -56, -59, 30, -19, -16, 12, 34, 61, -49, 14, 147, -35, 14, 105, -21, 3, 17, -13, 39, -44, -42, -19, -82, 23, -52, -81, 61, -60, -93, 109, 4, -44, 70, 30, 88, 28, -3, 91, 30, 22, 60, -49, 81, 1, -158, 97, -46, -141, 19, -83, -77, -28, -90, 46, -15, -56, 85, -27, 12, 91, -47, 131, 117, -124, 92, 106, -20, 30, -34]
7095c4Q0K5k00J48l4q6J47j54L7J61k19P4J36j94J52k3l8J14j31R1O4j98J55k9
7119D4j25K16j68n4K12k11J2J24j53J20p2j7J53k07R0J41k13J73Ok00K58j10q6
7142f7K29j88K8M0n8R5j31l1K27j91n8J51j17J22k1k03K61l5j66J56p0N2J3j25
7166h7J77m5j55J79m3n0J18j60Q1Q8k17J12N6o8J2n4P2N9j76J25J6j20J39l1q8
7191f0J13r8k1J43j37L1Q8k2qr0N3J22j39k2Q7o4N5Mp2P9pp4M3km4N8K4k2m3l8
7221f3J61n5j18O8M6l1J0j05N5J51j50m6P3L1Pm3l1R8o8J6L4j16P1Q5j32O9k9
7248a2m7J58p3j26J24l0Q5j15n1J80o3j40J49m2L4N5k03J27Q8j50Q1k6m9J32j34
7273d8N9J3j29K01o7j81K09m9q0J50k01J13J49k40R4K3kJ24k28K4K46k37O2P2
$$ y = [-34, 46, 71, -129, 19, -15, -101, 46, -108, -71, 90, -129, -55, 81, -113, 39, 16, -22, 92, -39, 52, 116, -82, 73, 44, -81, 135, -33, -87, 125, -86, -74, 50, -103, 17, -55, -72, 81, -126, -36, 105, -108, 65, 71, -129, 129, 19, -67, 162, -26, 2, 42, -16, 79, -52, -83, 144, -47, -105, 46, -71, 51, 30, -173, 88, 53, -113, 43, -27, 25, 38, -87, 90, 45, -110, 69, 26, -24, 94, -66, 15, 103, -114, -2, 54, -14, -2, -56, 16, 75, -101, 24, 40, -80, 59, 28, -60, 53, -45, -66, 77, -60, -29, 59, 37, 29, -61, -8, 114, -25, -47, 40, -24, 31, 35, -37, 42, 35, -39, 4, 2, -42, 16, 40, 18, -25, -63, 98, 43, -75, -7, 39, 8, 18, -87, -32, 119, -31, -77, -4, 27, 34, -9, -40, 58, -10, 6, 40, -76, -5, 80, -52, 17, -12, -59, 99, 26, -100, 24, -6, 79, -36, -87, 93, 30, -110, 39, -3, 31, 86, -117, 10, 98, -52, 29, 3, -46, 86, -48, 11, 24, -105, 96, 29, -152, 57, 8, -72, 78, -123, -10, 139, -101, -7, 16, 14, 138, -90, -66, 180, -57, 5, 77]
7297G7j90K46q3j55K10j16kJ28k31J42K2j27J87k15PK85k72K7J02j31K03r4k12
7320a92L13o2r4R6j79K16pk50K29m3j10K02k25N2J62j95Q8%j38K40j04o7J23j57
7344a02K07pk81K41O1j87J59j36M6J42k28P9O4j26J44j46oJ75j59M3Q9k08J98
7367F2K2j67J20r3N6J39k31N3J14r3R6j43lK37j95p4J81j18O1Lj04J43o1o0Q8
7392C3q8P4L1j06J03k6j01J73q4p7J38q0M9j4j11J42n0p1R1o5Q0K1j79J21N1j04
7418d9P8On3N1l3J1J7n2O0k6k7L5m6QM4l8j6L8l8nO3k4jk8J7K8l9M8ql9L5k8k2
7451c3O0k7n0P3k5k0LK1Qj5L3j0l0M3j7k6M4jm3K4N4k9m7J9j2kk4MQkJl1K8J8
7485ck1j0O6k1l8M4k0j4L2J1j3j1JN%Nk0nL0k3k2M8k1m9RK4k0L9j4J5J3k2M7%
$$ y = [77, -113, 133, 50, -105, 105, -11, -13, 115, -116, 26, 48, -79, 108, -107, -100, 185, -87, -60, 42, -89, 114, 20, -192, 121, 59, -35, 61, -118, 98, 91, -159, 70, 27, -83, 119, -106, -54, 108, -87, 1, 1, -137, 103, -1, -68, 55, -102, 105, 98, -183, 58, 119, -68, 91, -45, 1, 143, -85, -6, 58, -68, 76, -70, -76, 99, -60, -17, 72, -136, 62, 84, -83, 37, -56, 0, 139, -92, -39, 75, -18, 78, -65, -68, 169, -26, -100, 81, -37, 24, 27, -77, 66, 5, -55, 33, -55, 19, 50, -56, 47, 21, -80, 93, 9, -68, 70, -10, 39, 25, -86, 56, 6, -65, 26, -39, 41, 62, -117, 4, 55, -49, 29, 35, -18, 33, 0, 11, 28, -24, 36, 10, -17, 18, -28, -20, 24, -14, -30, 8, -30, -35, 28, 4, 3, -25, -8, 20, -19, 29, 21, -18, 17, -11, -33, 27, 0, -50, 23, -2, -22, -19, 2, 10, -5, 28, 18, -12, 31, 14, -12, 32, 31, -12, 12, 66, 37, -10, 9, -3, -5, -29, -25, -17, -19, -18, -49, -21, -3, -24, -34, 32, 11, -27, 17, -3, -17, 15, 26, 13, 2, 3, 8, 8, 13, -7, -12, 18, -5, -27, 21, 0, -49, -40, -16, -36, 3, -11, 4, 17, -5, 42, 42]
7519D2n7O3k8KK9l2j8K2l6%K7k4j6K0j6Lm1O8k2k2N5j7k1N8m2kP2n1K1Nk9L0j7
7552B6Lj7n2M1j1l6P1k3k5M0l5k4O0k0jm%N3q2K5Q2q1MQ5j18N5ol7M5k7mK2o9
7585f0N0K4k6O3r5lJ38j07J2P7q4P4l9o5J01l3l5N9j28O4M4j13J24p2m7J18r9
7612e8M3P8j26R8Nq4J09o7JR7j37R0M5j65J15k2n3J21j17nP9j47J09Rj36J88r8
7639b8l2J68j70N8J19j89J22nq7J79j69lJ62j99J00J4j59J96j16o0K14k40L4J86
7663I5j83J13Lj49K56j85l6K09j99J43O1k57K57o2j89K52j44l0J79k58J20N4j78
7686a28K14j11j03K39k15O9Q9j89K00J7k20K41r7l0J48k27J62Q3k27J81r3j12
7708a09K58j93j4J59k41J56K2k08K21m1o5J48k01J15J24k36J26K9q6K12k29l7
$$ y = [42, -15, 48, 20, 22, 51, 19, 1, 23, -13, -13, 14, -10, -26, -6, -22, -19, -60, 8, -14, -36, 19, 2, -19, 39, -3, -5, 67, 16, 37, 42, 13, 43, 26, 29, 12, -40, 1, -10, -46, 25, 2, -23, 17, -18, -42, 18, -2, -3, -7, -7, 46, -36, -11, 71, -10, -6, 79, -39, 16, 10, -27, 18, -9, -13, 9, -60, -10, 14, -12, 51, -44, -47, 91, -16, -4, 73, -11, 63, 24, -41, 60, 27, -8, 51, -77, -13, 31, -82, 42, -30, -77, 41, -58, -15, 63, -63, 35, 40, -44, 65, -2, -1, 96, -41, 49, 94, -71, 44, 22, -31, 90, -27, -32, 47, -100, 9, 18, -118, 70, -28, -60, 108, -62, -4, 115, -74, 48, 43, -44, 135, -34, -37, 125, -74, 26, 40, -119, 77, -39, -99, 115, -125, -91, 95, -88, 25, 28, -121, 135, -50, -86, 123, -76, 67, 128, -129, 128, 66, -123, 129, -15, -45, 134, -124, -4, 50, -128, 86, -25, -128, 111, -104, -35, 54, -135, 65, 82, -138, 103, 6, -24, 124, -103, 59, 142, -85, 96, 3, -109, 149, -44, -58, 101, -140, 16, 38, -170, 51, 10, -55, 93, -108, 7, 131, -105, 21, 50, -36, 176, -53, -90]
7730i0K31j86J1Q4j58K06j05j27K29j65K4J26k37J64L4j41J75j18q1K57j56j1
7752c4Q2j04J60q7j64K61o8q4R9j82J79K2k11J30L0q3R4j12J2J23j09O3Lj25K22
7777A17q4q8R0l6L4P9k05P1Q9o8K3r3J8J51j69J4Q5n0N6m7p6J38k1o7P0m3M7L6
7805G1q3K3JJQ2j09o1J29l0n5J8n0J08J4j51N8O5j1m8l9P9O2j23M4J9k7N4Qr1
7834d2M5J9%K8r7L2P9p6k2j3L8P4j16pJ07o4POm9R4J1j10Q4lm1O0q2O1ol8M4j6
7866Gq4J26n6l2N3p6J01Nj37R4K2nPq7J08O3j64O0K9m9P0q1j3J17p7j0M8q1M6
7895Dj6k0N1m5mP9r6qJ03q5Q6p8j6J14q6k8O4MK0k8p4J10m0n7J17r9L2Pm7N2j
7926A5p3R0k5j8K0l4M2%o8J10m2m2O2m6L2j1o8N2L8m2Kj7N1J5j09N7O0q2J0M3
$$ y = [-90, 141, -45, -34, 50, -108, 98, -7, -134, 95, -70, -46, 80, -157, 7, 41, -100, 75, -43, -124, 133, -23, -34, 48, -56, 104, 17, -147, 114, 46, -38, 61, -121, 58, 80, -131, -1, 29, -54, 40, -72, -60, 63, -46, 17, 20, -105, 117, 33, -55, 35, -1, 33, 112, -93, -22, 67, -1, 22, -71, -53, 98, -71, -57, 28, -22, 34, -13, -89, 49, 28, -39, 31, -12, 35, 71, -12, 11, 12, 13, 95, -14, -75, 54, 24, -31, -13, -63, 45, 59, -92, -34, 31, 20, -28, -67, 12, 74, -49, -5, 14, -13, 41, 49, -42, 3, 22, 22, 50, -47, -15, 64, -12, -34, -47, -9, 65, -51, -58, 49, -15, -8, -2, -51, 43, 54, -56, 28, 25, -16, 44, -38, 23, 17, -21, 23, 7, -77, 49, -7, -39, 14, -62, 39, 44, -93, 1, 23, 18, 25, -62, 46, 109, -55, 5, 34, -15, 55, -26, -39, 78, 1, -9, 39, -42, 4, -12, -32, 19, -26, -30, 49, -47, -55, 48, -37, 49, -29, -45, 69, -17, -45, 19, 23, 43, 15, -59, 51, 11, -46, 71, -28, 4, 11, -36, 16, 15, -58, 32, 7, -11, 9, -25, 17, 17, -51, 59, 17, -25, 37, -9, 23, 12, -56, -4, 34, -8, -6, -23, 28, 43, -66, -9, 51, -31, -21, 22]
7956B2n3K3Kl2P4m8nP0m7Nqk2Q3j05J3P7m1j4J7m0P3o0JM5Jo0L4pL8n3k3P5k6
7989Io9P5k8QOKK1lk3M9j6Lj7l5O2k0l3K2Rj8Lk4J9K1o2J9K2j2J2k8K8M2n6K5
8023A3K3k8j4K6J0j1k4oM9m0k4L5j0Mj8oJ6km3O2l6k1N0KJ6l7K4J5lK0k3j4M5
8056E0k2l9L9k4rMk0L0k5l5L4J2NKl6M4ml3O0pk4J4nj0J0j5K9k2K3j8k7J0L3l5
8090a1LJ8k4MK1l3PK0mOj0lrL0PJ8l1K6m2nJ8k2jJ9j3Kk9K8J7kpj2J3oK1k4K5
8127A5mn2K6K7JkOopQJ2Nk0jQk0J8m3J2L1n2J6M0j5m8M3oL2k6k0L1kJ3J4q1Q3
8163C6m6KM3n8J0N1o1j4M7j3Nl0OM7j3k7L0n8M3M8r0N3J8k9P0j01PQ1
$$ y = [22, -31, -8, -6, -38, 36, -12, -17, 53, 6, 11, 3, -19, 64, -41, -28, 49, 8, -6, 11, -29, 44, -16, -15, 30, 31, -29, 5, -2, 36, -17, -40, 35, 9, -60, 15, -13, -5, 1, 3, 24, 21, -2, 47, 31, 34, 17, -18, 44, 24, -9, 13, 22, 4, 7, -17, 2, 23, -39, -20, 2, -10, 2, -26, 2, 44, -12, 13, 36, 8, -6, 20, 30, 19, -5, -11, 38, -2, -26, 9, -1, 3, -15, -21, -5, -7, -50, 12, -24, -45, 5, 7, 23, -14, 10, 25, 22, 42, 19, 5, 50, 28, -11, 28, 4, -5, -1, -21, 9, -16, -51, -17, -5, 0, 2, -34, 10, 6, -27, 33, 26, 2, 16, 11, 1, 11, -4, 25, 3, 26, 8, -19, -9, 24, -11, -8, 10, -14, -10, 11, -22, -15, 5, 1, 7, -3, -6, -15, 15, 22, 40, 9, 35, -7, -12, 6, -16, -17, 2, -11, -9, -38, -10, 7, 5, -2, -14, -1, -7, 14, -10, 15, 11, -41, -15, 12, 13, 11, 17, 11, 4, 12, 24, 29, 9, 8, 16, -4, 14, -29, -17, 14, -38, -22, 18, 3, -45, -2, -8, 24, -2, -22, 9, 7, 20, 34, -47, 36, -10, -8, 35, -23, -13, 38, -23, -37, 10, -3, 2, -28, -22, 25, 12, -15, 15, -43, 0, 48, -42, 11, 29, 0, 70, -31, -24, 57]
8191E7
$$ Imaginary data points
##PAGE= N=2
##DATA TABLE= (X++(I..I)), XYDATA
0@%%%%%%%JrJ6j6K4l2M0n6P2q8J12j37J65j98K35k83L39m00M66n44O30p30Q43
30D50r64J099j253J423j612J819k042K290k566K869l196L554l946M376m846N357
46B812n915O524p193P928q731R614j0595J1684j2898J4260j5800J7554j9577K1942
60A1609k4745K8131l2317L7649m4710N4562o9382R4512j48408M67450k47484j42905
72a6038O17087o21320j4L8187k83161m2746P0784m7858k54688l687N19321m43846
84d67979j15303P44825l70052j33911P41461l42157j11535N29760j30971j35746
94B08392J44575M9847r5879j58465K36919k31107l91950N11558k03603n95722
104e25435N16953q0519m55929L94854k4719k62772K37469J14119q6952m1224K97443
$$ y = [0, 0, 0, 0, 0, 0, 0, 0, 1, -8, 8, -8, 16, -16, 24, -32, 40, -48, 64, -73, 92, -106, 129, -154, 185, -215, 251, -293, 337, -393, 450, -514, 585, -668, 755, -857, 962, -1080, 1210, -1356, 1513, -1683, 1871, -2075, 2301, -2545, 2812, -3103, 3421, -3772, 4156, -4575, 5039, -5556, 6128, -6770, 7490, -8310, 9244, -10333, 11609, -13136, 14995, -17322, 20327, -24383, 30179, -39203, 55309, -93099, 374351, 126867, -16038, 601049, -20271, -20285, 17902, -265259, -308005, -237221, -285079, -539767, -543454, -24133, -467979, -583282, 161543, -208509, -342420, 399041, 56884, -54651, 475109, 344138, 208392, 352967, 402814, 306935, 148470, 385389, 154282, -237668, 273890, 70287, -525435, -8482, -89001, -544930, -150076, -174795, -437567, -200098, -85979, -172931, -214155, 83288]
115H3288J04942l56137L37674K43469m76089L12733J96045n22561K70666K01623
125C95653m55555M0888J88277j60746j76391P8015J09161k74522N7339K66889
135F9008l78539R0712M12032m20351N027M50650k48083q2208K73658p8825j10733
146a7652J39978R9153k24799m6455K98464k19942j91084L48538j97096k19423
156b30318L65050j43615k53535L04514K5093k41491R8454J80318j23337q9804
166a08671K32198n5642k05134K91649o370l27742K62813R4053l24912J47015J32162
177A31419k61812L3727K06612j49693j47327K21681L7103k45513J60639J55690
187A42526k61717J02271K04728k57447L9282K53926k14202j03059K51301o0643
$$ y = [83288, 188230, -167907, 169767, 413236, -62853, 249880, 445925, -76636, 194030, 395653, -59902, -19014, 169263, 8517, -167874, -89859, 19302, -255220, -197881, 69008, -309531, -218819, 193213, -227138, -222111, 228539, -19544, -101752, 171906, 93081, -17652, 122326, 221479, -3320, -49775, 248689, 28747, -162337, 186201, -10895, -230318, 134732, -8883, -262418, 42096, 67189, -174302, -75848, 104470, -18867, -108671, 123527, 67885, -137249, 154400, 148030, -179712, 83101, 177154, -147758, -743, 131419, -130393, -96666, 109946, -39747, -187074, 34607, 71710, -173803, -13164, 142526, -119191, -16920, 187808, -69639, -30357, 223569, 9367, -93692, 157609, 96966]
197I6966k10921J48623P7658k35332N0377J77175k19433m0576K39071j55701j10374
208a82467K56037o9685j76709K26960N5206k16324J22145J64220j99594j3956
218c4167K23772j27502j33820K05731n0451j94150J78736K6079k46110J15911
228c5971J32097k33390J2570K07163j58255r4564K27802m0953j68494J85685O5555
239I9245j99858J15081J48558k01672J9560K01025j65248q0279K17748r3638j76600
250a16078J85620K1964k19609R6241J17729j97989O608J82369j42077p7057K07276
261F4997o6051j41001J99488K1894j93211J38034J16883j94600L4326J75725j48430
272H054p3117J89151o9232j51703J59681J1023j91547J13901R0869k02090M0730
$$ y = [96966, -113955, 34668, 112326, -123006, -72629, 104546, -114887, -155463, 83608, -72093, -182467, 73570, 3885, -172824, 54136, 109342, -106982, 15163, 179383, -20211, -34167, 189605, 62103, -71717, 134014, 83563, -110587, 68149, 94228, -151882, -35971, 96126, -137264, -124694, 82469, -75786, -170350, 57452, 16499, -151995, 33690, 99245, -100613, 14468, 163026, -38646, -19086, 181939, 16691, -63588, 154160, 60522, -116078, 69542, 91506, -128103, -31862, 85867, -112122, -105514, 76855, -65222, -142279, 64997, -1054, -142055, 57433, 79327, -113884, 24150, 141033, -53567, -19241, 156484, 8054, -65063, 124088, 54856, -96847, 62834, 73857, -117690, -3789, 87080, -115010, -74280]
283g4280J64328j61623m9619J98848p9679j30913J81632K2051j73466J18547J01179
294A17005j77042M3487J56862j53660m3734J84066r5902j25460J74355j0134j82921
305a13078J18631Q2779j86483L6651J45546j46789m1536J74394q1918j06877J68946
316E0266m502j53176J30467P7092j71488N5673J43310j45046l3839J68582q5920
327C1419j08754J54193j2664j54484J10299N8065j68314M9868J21327j48581k5212
338i2838J61477r0214r6002J62471r986j43211J23753O8815j55395N9729J25348
349A13947j38196j3661J55227r4688q6903J51975k8268j42462J13811M7883j63847
360h5182M9605J12989j44630k0604J50470r4516q0130J55087k6857j20672J26122
$$ y = [-74280, 90048, -71575, -121194, 77654, -2025, -132938, 48694, 70745, -102721, 15826, 117005, -60037, -16550, 140312, -13348, -57082, 126984, 31082, -94378, 79977, 69843, -113078, 5553, 88332, -98151, -61500, 84046, -62743, -104279, 70115, -11803, -118680, 50266, 45764, -107412, 23055, 100147, -71341, -15668, 127642, -17404, -51243, 117339, 31419, -77335, 76858, 64194, -90290, 20009, 78074, -90240, -40372, 80955, -67626, -92838, 68639, -21575, -117577, 44894, 34908, -108303, 15450, 84265, -71130, -11401, 113947, -24249, -37910, 117317, 22629, -64274, 87701, 59433, -83029, 30782, 78665, -85182, -35577, 77412, -67218, -87822, 62648, -31868, -111998, 43089, 16232, -104440, 21682]
371B1682M5317j36914O7024J07564j24640j0150J43776q5840q3437J45361l1977
382E7766j33650J16594K6107j51779O4567Q0590j33775j555J20311q3710o6787
393a05321J35385j6774j17199J22548N0189j42729Q1051J00725j35874K0813J24076
404A16890j01593m6822J23527m2039j11353R4335L3414j44156M4959R1636j40475
415h1677L968J28978j17035l9417J49601n5742q6718J20720K7332j01702N9424
426G732Q5031j00989K008J26669r5087o2001J43886o0068j09169J19206j3294
437D3924j23998P4250M1989j15888Q349R7395p2307n7198J19860k1645r2751J26196
449B8176J5542j23191J09533O6227j28418M1268R5931q5392k7618R0763m2279
$$ y = [21682, 66999, -69915, -2891, 104673, -19967, -30117, 113659, 27819, -55618, 89743, 57766, -75884, 40710, 66817, -84962, -20395, 60195, -73580, -75135, 45176, -38534, -105321, 30064, 13290, -103909, 18639, 68828, -73901, 7150, 107875, -27999, -7186, 116890, 15297, -31525, 92002, 49963, -61390, 32945, 66359, -77797, -32838, 58798, -81677, -77709, 51269, -65766, -105183, 44418, -11324, -98042, 22678, 50010, -51692, 7732, 92763, -8226, -6218, 120451, 25364, -36637, 107249, 47181, -61988, 57218, 43924, -80074, -5824, 36165, -79723, -71374, 26021, -46286, -103484, 16376, -5269, -98020, 28176, 43718, -79473, 30060, 96287, -32131, 9137, 105068, 19676, -7942, 82821, 40542]
460D0542q2057Q9573O870j34332O8642O9161j43107K3007J03431j06830j3487
471g8587J09369o1766m8527J10191l35r6001P6537P4402j07738J3437J05007q8524
483G465k5884J08447p3980o4924J12080k5889j09062P2754M4122j02709J6798
494d0782P5496q1405j2044J08086o3411o8691J19991N842r9405O6079M3096q4936
506c2084M0899O2912j02799l483J13673o9500p6897R8187l226q3939O3061K1571
518B8375r2855M8484Q1863j00082k5791J18499l8033o1730Q5847k6356o0909J02125
530E9437n067j20264N7516Q5090r0616m7433Q3146k0402n9785P1180k0947p7706
542h5851J06045J3960j19493P6401P2786q9445J0500P3914l9209l2011P1990R50
$$ y = [40542, -41515, 48058, 54928, -79404, -10762, 58399, -84708, -61701, 41730, -65100, -78587, 30782, -30984, -79511, 30680, 30345, -65656, 10881, 85283, -22455, -9018, 95989, 7465, -18419, 90028, 16048, -48876, 63204, 37315, -71747, 1007, 45129, -57580, -40782, 34714, -46691, -58735, 49351, -14060, -82751, 37240, 43082, -56323, 9756, 52852, -32084, 8815, 71727, -31072, -34555, 79118, 9618, -67279, 30908, 27682, -56257, 6804, 28375, -64480, -15996, 65867, -34215, -60006, 58493, 20460, -41270, 44577, 18221, -42688, 59437, 54370, -65894, -8378, 76712, -13904, -61337, 21809, 1407, -58378, 12802, -8145, -85851, 20194, 34154, -85339, -8938, 63848, -25597, -15097, 58817, 19608, -12403, 59587, 60537]
554F0537q9504N6638N1679j10818K8723N9558j12916K8137P4503j10062j2641
565g6166R1972l3869o4373M6068N6483o0621k288Q3875o0124O564J07915j02009
577f573j9883J44684o8388p0785Q1925o471n0574J1075J7580m9017k6162P5123
589C2534n8829q2248J22359k5856j01800J08755r658p0369R7176K245o3612M7656
601a647N8363k2411m9363O5048K9879q6084O6408K1450j24221Q2622M2153j32262
613e0065L8928M0628p3594Q240K1257k6097k5400M0008L0481r3479M0997J10110
625F2014j08786M072J07172p7751K1355P2467p9968Q717O5667k7835m6150J3407
637A4381N0451o4971l6856R2319p4299n4381J12302p0400n3056J03067m6353m1093
$$ y = [60537, -28967, 27671, 79350, -31468, -2745, 56813, -56103, -27966, 46537, -63525, -76166, 15806, -18063, -82436, -36368, 20115, -40506, -42794, 41081, -19043, -12479, 95436, -6573, -26456, 118228, 49840, -20945, 60980, 54509, 3935, 15010, 32590, -16427, -42589, 32534, -26295, -108543, 13816, -12040, -113840, -5085, -14743, -85112, 12064, 14309, -49303, -1647, 56716, 34305, -15058, 49990, 79869, -6215, 60193, 81643, -42578, 40044, 82197, -50065, -11137, 29491, -44103, -35863, -14606, -40703, -66103, -26095, 4386, -89093, -48096, 62014, -46772, -42700, 64472, -13279, 8076, 80543, 575, 9292, 74959, 47124, 974, 14381, 64832, -139, -36995, 55324, -18975, -73356, 38946, -31454, -84510, 18557, -27796, -68889]
649f8889O5357n886k2209J9968L8299k6889l4931R8659j2557r5202J00084N877
661F1681r1936P9094n067p4398N5231K065n4046P043L0837j6012n5590M9308L0335
674A8545q9570N3570M9803r8407N4784O0591q4906K5530N0808l7605J231K8969
686C3343o670l6811K8223L9978q0187Q953P6628r0829j1695Q6022o7024k3661
698d3730O0546l4576k1820L9463M062l6184J0883N0297m3369j6749Q1899m6761
710C961m3857R3895k5691o0183O3353m53m6239K6794J5347l6548p147L9285k5480
723b963l7736O1372j3903o8795O8277J7976p3190M1297L2127n3371J4836M2069
735B7996k6921j8712M0004k018m0502M2752J6136o7040L4912M1574p1666J0069
$$ y = [-68889, -3532, -9418, -31627, -11659, 26640, -249, -35180, 63479, 50922, -44280, 55804, 61681, -30255, 48839, 43772, -30626, 24605, 26670, -27376, -20333, 10504, -5508, -61098, -11790, 18545, -71025, -17455, 32348, -66059, -11275, 49316, -35590, -10060, 40748, 3143, 4374, 33343, 26673, -10138, 18085, 58063, -22124, -13171, 63457, -27372, -39067, 46955, -20069, -43730, 16816, -17760, -39580, -117, 3945, -32239, -21356, 28941, -14428, -31177, 50722, 3961, -39896, 53999, 28308, -31875, 31478, 31025, -15214, 11580, 26927, -9621, -16768, 22517, -2963, -40699, 20673, 6770, -62025, 6252, 24228, -48962, -7665, 24462, -28909, -14073, 27996, 1075, -17637, 22367, 20349, -20153, 22599, 38735, -28305, 6607, 48181, -23485, -13416]
747a3416N3924n3242j8454N2088j7301l9231L2984J3129m3330K2661L3632n3882
759c0438Q126N7542m7706j4556O5508k8924m1270N5367R644m9794K0817K8512
771C2828m2359J288M1827l8118j9870N0080k6047l7306N3815l234n6225L6586
783f735L0564n0807M969M5234l2122j6753M8621j4101l3021M3285J349m2769L7728
796A5442J9649n5864J4610M4965m3989j6477M9613k2708l8341M4012M653m5744
808c0179K6858J9173m4688J7297L6844m3712n861N0949k6537k9844N1401j053
820B0648m8609L3959K5855m6572R078L4904l6830o244M1277k7174k5247M3354
832A8399q466m0566L7445J5807n1277J5305M0048l8342r704M2818k1887k4275
$$ y = [-13416, 40508, -12734, -31188, 20900, 3599, -35632, -2648, 10481, -32849, -10188, 23444, -30438, -22312, 35230, -12476, -27032, 38476, 9552, -31718, 23649, 33293, -16501, 4316, 32828, -9531, -8243, 33584, -4534, -24404, 25676, -371, -37677, 16138, 12904, -43321, -6735, 23829, -26978, -22009, 23225, -8897, -25650, 22971, 8870, -24151, 19134, 20483, -22286, 15442, 35091, -20773, -6163, 38802, -5187, -21664, 27949, 5241, -33100, 10912, 15565, -30179, -3321, 15852, -28836, -11539, 25305, -18407, -24268, 26681, 144, -29700, 21701, 20648, -27961, 5998, 31853, -14719, -5641, 29263, -7567, -13811, 27466, 292, -24955, 18399, 9933, -30633, 6812, 22619, -28658, -13353, 26695, -11647, -21351, 21467, -420, -24695]
844b4695M0844m340l4550L1597J0017m1644K1731L0563m3978l406M5343k6841
856F41k5823M3361n364l8311L1484J4179l9160J6252K5183l7067L221L8274l1396
869d526j9356M4454j1394l7127L6315J1257m4439J6887K9492l4952j460L3735
881A8886k5140j4360L8947j1506k9931L5422O439l9788K3849K6256m0450P21L7157
894B6502k5024j8150L3581r110k8458K7472N391l5399J9415K0214l8601O650L5778
907B0261l0898j3214L9051j0970k5187L0428P202l1891J7012K3767l1763J531
919d671L2473k8935j1544L8073k0691k5221L4628m415l3446K0961J6733l1587
931a7642j710L0970j8656j6887L5030j1042k5039L9495k611l4012L2510J1546
$$ y = [-24695, 16149, 11809, -22741, 8856, 18873, -22771, -1040, 29523, -14455, -17861, 27482, 641, -25182, 18179, 12815, -25496, 5988, 20167, -18993, -2741, 22442, -14625, -11404, 26870, -4526, -23882, 20572, 9178, -27949, 8366, 19623, -24816, -7929, 21563, -13389, -14849, 18886, -6254, -20614, 18333, 6827, -23104, 12318, 18757, -21031, 2818, 29074, -11376, -10655, 26502, 1478, -16672, 16909, 7799, -20659, 6813, 12204, -23195, -3780, 16434, -22167, -15517, 20261, -10637, -23851, 15200, 4230, -20957, 9471, 16673, -15218, 1794, 25561, -6202, -4671, 27802, -1133, -12677, 25396, 4705, -20516, 14112, 9697, -23749, -2788, 13945, -17642, -19352, 11618, -7038, -23925, 11105, 63, -24976, 14519, 11908, -22104, 10406, 21952]
943B1952l2221J2402K1058k0174j0068K5343n587k9943K6077R631m1314K0504
955b340J7156l8979J8261J8328l6405Q871K7535j6826j6270J9483J5500k4450
967a0136N028K6135l0184P837L4772m2870L13M2331l1817j1470K5332j1926j0109
980f764Q702M717j9057m306L3664k4158k4668M6414j6853k4062M2487k0163j7979
993b2026L9665j0031j9278J4053J2261n356j7772K0842M062l1912L2393l21m4718
1006b8138M1716M481m4670K8000N231k1400J2271o31l606m444J0159J2657l4861
1019b3235J7770L4669m7729J2989L2101m0598J9732J7937l6875J5385J4823j2688
1031D281q398k945K2379j6548j6264L3137k8889n640M5883m4846r108M9089k7628
$$ y = [21952, -10269, 2133, 23191, 3017, -7051, 18292, 12705, -17238, 8839, 18470, -22844, -2340, 14816, -24163, -5902, 12426, -23979, -15108, 12427, -4399, -20669, -1186, 14314, -10136, -5108, 21027, -9157, -1320, 33452, -9418, -9105, 33226, 1409, -10061, 15271, 3345, -6764, 1938, 6655, -12402, -16708, 16956, -7202, -31870, 14544, -2309, -26371, 16116, -4047, -22026, 17639, 7608, -11670, 2383, 14644, 9288, -8484, 12358, 16420, -15492, 16901, 16580, -28138, 13578, 18059, -26611, 1389, 6620, -14780, -2509, -3140, -6746, -11190, -1031, 11626, -23235, -5465, 29204, -18525, -5536, 26565, -14033, 5699, 23636, -13239, 2146, 16969, 4281, -4117, -7062, 15317, -1231, -17495, 15642, -13247, -18887, 26996, -17850, -26958, 22131, -5497]
1044e497p864J9255j1080P479J525J527l349j3360L5000j0025l9131M4556m440
1057A4596l3019L6900j7927k1398L6809j2296j9205Q265P200O011k1342P506J7605
1070I705k7305K2149J0439m2515L4651J7880m1689J9238J1554j6685J0519k071
1082E870m703k714M851J2637l0265K512L4407l4660l193K9014k9780P774K2149
1095A3899k9370M013K0630p009r268J398J8127q776j2808K5377j3779j2598L3431
1108B3267k0698j8335L3154j1958j6681J7443n220r551O856O254j0250j1153K2742
1121E870J183k6943J9734Q476k0912J8908O01k2177K3315R060k5548L323J8567
1134A3457m801j4637O661Q497j3583N137Q385k1757Q465J8761k5929k08K3297
$$ y = [-5497, -13361, 5894, -5186, 2293, 3818, 5345, 1996, -11364, 23636, 13611, -25520, 19036, 14596, -18423, 18477, 550, -20848, 15961, 3665, -15540, -7275, -75, 5936, -15406, -7900, 9705, -17600, 4549, 14988, -27527, 7124, 25004, -16685, 2553, 14107, -2578, 7941, 5870, 1167, -1547, 3304, 15941, -14324, -11812, 22595, -12065, -15258, 13756, -16024, -8250, 13899, -15471, -11458, 9172, 2163, -7105, -5707, 12420, 3644, -9164, 16213, 2434, -10164, 23267, 2569, -15766, 17388, 5430, -11251, 6192, 972, -8579, -1723, 4531, -5719, -16872, 5870, 7053, -19890, -156, 8320, -12592, 6316, 6917, -15260, 8055, 17115, -8433, -5110, 13457, 8656, -5981, 680, 9177, -4406, 731, 9116, -12641, -4176, 14585, -11344, -11552, 11745]
1147A1745j7436o163J9669p851j0586J3465M360j3155K179J4345j0342p240J8105
1160A1095r496j1932K3720q367k0688K3310J725k0623J1719N572j2261L545Q268
1173E587o839p729J3631K659j9891J3275J1801k3705R881J2958k1622R254J1806
1186A1066j9127K998J3031o586q536N901R245j3325o77J8229j6981l505K2042
1199A3775j7843k705K1028j7565m402J7822p334q446N355O896p907q303J7149
1212G520n467j5696K0637o224j4724K3184q082j4785K0337k280j1303Q036M915
1225F068m669p051J1975M307j9653J1584Q400k0155J3377M440k0906J3850N301
1238F868j6493O592O738o591n776O851Q444j4467K077J5935j6265J882J6434j6360
$$ y = [11745, -5691, -11854, 7815, -36, -10622, 2843, 7203, -5952, -3773, 10572, 230, -7010, 11095, 1599, -10333, 13387, 5020, -15668, 7642, 9367, -11256, 463, 6035, -6226, -2681, 5587, -1252, -8981, 4650, 7309, -12582, 693, 12494, -11211, -1330, 11628, -9994, -740, 11066, -8061, -5063, 7968, 1382, -7154, -1253, 7992, -5333, -6010, 12219, -4762, -8267, 13775, -4068, -6773, 14255, -3310, -7712, 10110, 2776, -5670, -315, 6581, -1326, -9629, 7520, 2053, -13643, 6994, 770, -13954, 9230, 1148, -13637, 6700, 4420, -6883, 1153, 6068, 1399, -5652, 6323, 10630, -9023, 2561, 10961, -9194, 4183, 8623, -12283, 1567, 6868, -9625, -3033, 3705, -2886, -8662, -1811, 6633, -7834, -5757, 10178, -6087, -4205, 12229, -4131]
1252d131K510J2926j4292K151J1137q631o653O684P051j1878n129J5843r449r201
1266a1062J7190q165q326J4788p578n270J4199l723r423P014Q202p283n063J3343
1280H843l257j3082J4150J775j4356R371J156j1277Q433K432j1250K774P796o791
1294c283n497J1149K19j3341R633R287j3339K809R272q846J998Q518p958k379
1308a758Q548m111o680R251J247j4329M497J0998j1751l284J1228o650n833J0233
1322A606j614o426P451K90p521Q417N560j2186K058J2822q439o332J2067k449
1336E304j0406Q004L492r737K228L714q004K955P124j0103k803J1724m651p874
1350i033J1464J952j2254N521R469p576j059P280n152j736Q231m448n637Q598
$$ y = [-4131, -1621, 11305, -2987, -836, 10301, 1670, -4983, 1701, 8752, -3126, -8255, 7588, -1861, -11062, 6128, -2037, -10363, 4425, -3153, -8423, 5776, 2053, -7370, -356, 7846, 563, -4500, 8843, 5586, -7496, 6654, 8429, -5927, 3444, 4600, -6677, 1756, 4188, -7062, -4288, 3508, -3283, -8780, 2369, 2588, -10753, -1120, 8167, -5172, -2363, 6909, -1937, 61, 8579, 621, -1758, 6790, 2679, -4001, 5250, 6497, -7832, -3335, 7663, -4088, -7372, 3856, -2794, -8627, 1606, -8, -6434, 1017, 1307, -6214, 2203, 7763, -4423, -2365, 10457, 2018, -4314, 7753, 5304, -5102, 2902, 6394, -3343, -1115, 2599, -5405, -2450, 4674, -5429, -8232, 3492, -1159, -9033, 2431, 4383, -7871, -2350, 7119, -457, -1516, 5764, 612, -1124, 7107, 2659, -2978, 5620]
1364E620j773r903Q229M870j3455R38J0965p386n190Q444k501n415P250O28o364
1379e043N462K591q192N719Q683j1321k579J2804m881p298R313m87q987M414L968
1394D166n873M56L500o481J32Q957o952o135J1843j854j0004R476L868r609K460
1409b050O370l541j641L992k276l182O942r47q406P245J888j0920P067O462j1820
1424d817l88Q461l032l715L481Q28l901K670K884n764L846M950j0507K531J0961
1439H488r086m213R136k405m933M499J149n239O89M888l696j800N013m888j403
1454c801R212n282o594R652L66q532M627N491n650k431M382m37j388L087l299
1469e97l819P140Q45q093L575M630o612J068N969n866j842P379k513m989M684
$$ y = [5620, 3847, -6056, 2173, 7043, -6412, -5474, 5491, -1895, -7085, 1359, -1142, -6557, 693, 1321, -5043, 419, 3010, -5182, 537, 9220, -2101, -4680, 8124, 3243, -4055, 5258, 4771, -4216, 198, 4166, -1707, -1251, 2249, -4232, -4100, 4857, -2095, -8230, 3613, 1759, -8245, 1231, 5099, -4510, -2050, 4320, 779, -862, 3130, 854, -2328, 4614, 3667, -4739, 2506, 4394, -6526, 541, 7003, -4817, -5205, 3256, 224, -3491, -10, 818, -3083, -413, 2471, -3293, 553, 5503, -5004, -2473, 8488, -598, -4811, 4325, 1920, -3013, 1486, 2635, -2604, -1915, 2973, -723, -2523, 2490, -2398, -3801, 5411, 129, -6465, 3187, 3553, -4979, -352, 5139, -511, -2942, 1440, 1003, -385, 2702, -597, -4416, 2724, 3569, -4524, -949, 3681, -2931, -1863, 4106, -1760, -3602, 3777, 1264, -3725, 959]
1484I59J881l919K34J981j847J153K956o701j572J0965l793r303P505J749m914
1499b666L994n41l435K667K255j207l023L207J908n587M645P79q498R084K277
1514E859j3241N510O709n138k202j763M311K539n079P48k017L998O976j3393J895
1529d288J3958j1141r60P814n788L234l38l892M781l512J740K11p341Q784l631
1544c69p024J3270r742o314J6125p741m099O395m336O692j716n466Q413m033L569
1559C624K517j3220J3952L496j7426J1370k40p351J0566j0147l077R522o126K348
1573a92n120l120J4398j0859k936J1762j1619Q079O269j6502J2455M794j0092
1586b683P670m294J990N955j0865P236j095p965J3675j0940o067J5214j2930O13
$$ y = [959, 2840, -1079, -845, 1136, -711, 442, 3398, -3303, -4875, 6090, 2297, -7006, 499, 2248, -2666, 1328, 787, -2648, 19, 2274, 1067, -1956, 1251, 3159, -2428, 2217, 2996, -5502, 3582, 5859, -7382, -1872, 4837, -301, -2503, -4266, 45, 2584, -2495, -1747, -3764, 234, 7210, -6183, -4288, 9670, -1471, -2431, 5383, -405, 2829, 2491, -1401, 3380, -132, 1608, 1819, -5522, 3262, -369, -7393, 5877, -3865, -10179, 5946, -1795, -5894, 501, -3835, 2857, 1141, -4325, 4088, 55, 3624, 6141, -7079, 6873, 10369, -7057, 4313, 4073, -3278, 7288, -2859, -5936, 3586, -2540, -192, -5312, -8432, 5966, -4893, -7829, 3933, -7686, 393, 6662, -9840, 2615, 7409, -2683, 4987, 693, 2683, 8638, -2227, 5009, 3914, -4051, 9624, -1316, -7383, 7831, -5099, -4486]
1600d486Q489j3856P481L124q020P310n831L402P125j2720J0028K800j1040J4926
1614H732n933p873J6316r051k750Q135r471O164j2q138P671p128J796P156j6493
1629a0879P881P916j4329Q346p97o126J2955p784l609R998m332L735k685l970
1643c680J3828q337n030J2079q880J851N074j1543Q138J358j0363O869j414j803
1657a853J466o802Q351k68j0099R903j697l766Q159q154J946R256q656J226L929
1672B941j852L276m774J475M953p274L715J288o914O916k356n810P308l616l321
1687d045M475k291M41r84j032M781l630l99M125m312L530K298o499M745K702m541
1703f36J896L12l46R92j736J138j036q23K929l689p17M025l783k90K807l222M94
$$ y = [-4486, 4003, -9853, -2372, 752, -7268, 42, -5789, -2387, 4738, -7982, 2046, 4846, -6194, 8732, 2799, -5074, 11242, 2191, -559, 7576, -1895, 4269, 4257, -3881, 3790, -3338, -1542, 5614, -10879, -2998, 4918, -9411, -1065, -1862, -7988, 4967, -2817, -6426, 3572, -760, 2975, 290, -3680, 10148, 1811, -3219, 8860, -20, 1831, 6905, -4638, 3500, 4858, -5505, 1364, -50, -1853, -387, -7189, 1162, 894, -9205, 698, -999, -4765, 3394, -4760, -2814, 6442, -2214, -988, 2941, 1089, 4365, -409, 1066, 6019, -1255, 2460, 3748, -3166, 3750, 1394, -4416, 2892, -724, -4045, 430, -1861, -1420, -2404, -3436, 1345, -2285, -2684, 1441, -2871, 659, 2957, -3542, 1203, 3905, -636, 1260, 1572, 1226, 2218, 482, 1620, 584, -239, 2690, -999, -1716, 2309, -1474, -1764, 1043, -2179, -1685]
1720a685K179j796n44J025J074j103q89K632o70j387K288r93m72K541j817j381
1736i98K923J28k670N50K105j228j260J206m49n94J086j076j057J467kj742N08
1753a103J246j580k71K223j523j305K744k9j410Q81K86M24O80n11l80O36J357
1770B365j062j674K341o8k576J489J3j871J070l59j267M00o6J9m20o6N57m45J302
1789c18L31j998K241J917k343O61J572n27N6o1K41J62r26q6l59j25J79k080L3
1808a430J484k086n24J623q12o83P04R10L23o77O59J320J01L42j65L13J374j044
1826A732p95J694n66j919K36P63p63j559k55N90o25n52Q3nM28l50j76J836M05
1845B02j437R27K040j47q94P53J034o40n42O69j2q69q08k65O11l20k002k45J344
$$ y = [-1685, 494, -1302, -1846, -821, 253, -850, -1739, 893, 223, -1164, 1124, 131, -341, 2200, 383, -998, 1925, 2053, -617, -67, 2038, 810, -450, 756, 307, -287, 799, -277, -1334, 133, 131, -1611, -1103, 143, -1437, -1708, 515, -1008, -2313, 431, 402, -1008, -127, 159, 583, 1263, 752, 372, 1008, 2365, 1303, -371, 1970, 1902, -674, 815, 828, -1043, 27, -332, -1599, -1199, -1265, -1246, -1666, -1732, -1175, -1620, -318, 13, -1985, 256, 2173, -170, 491, 2063, 1536, 1592, 1531, 1772, 1934, 1008, 922, 563, 438, 617, -1463, -1430, 54, -2032, -2556, -933, -1745, -2428, -1724, -814, -491, -1168, -509, 811, 912, 1254, 1089, 1402, 2776, 1732, 937, 2631, 2065, 146, 382, 1145, 382, -1177, -1432, -842, -1467, -2019, -1936, -1941, -1513, -1863, -2039, -203, 202, -1235, -308, 1732, 1585, 691, 1444, 2478, 1838, 1296, 1965, 1953, 1084, 276, 11, 622, 302, -1700, -1945, -601]
1864f01o68j325P69R51r72m21J707Q64r06J6J044R53K55q18K26J288n50j083Q68
1883A597N76j700j172J455L49k087n39O76p0j96o29J89Q95r48l44J731O95j121
1901f43p45J917J372j786J07J534p43l3J51j01Q07j538p67J861m43j277n69L52
1919e44J158j791n31K205j873q30J937l36L90r87j038L219k03j850J283K9Q17
1936A055k60j248K977r39k575K706l58n17O20k406J773M58k958K234m05k006J157
1953f92j000J768j91m056L426J527k557J427j263J199K476l616K049K194l039
1968c48J680j84K3K296l689P64K022l475K396j02l260K146j917P69K382n508J607
1985b398L182l036J230j100N97L816m870J025M810l374Q05m04j84N114m792j928
$$ y = [-601, -1269, -2594, -1825, -874, -1846, -2267, -560, 304, -602, -586, 458, 1411, 1666, 848, 1074, 2362, 1812, 729, 1597, 2173, 473, -699, 756, 1105, -982, -1521, -845, -915, -1111, -1740, -1551, -656, -1604, -1948, -217, 478, -643, -1388, 529, 1901, 115, 222, 1756, 1013, 980, 1131, 1030, 1837, 299, -468, 1393, 950, -327, -896, -544, 614, -1177, -1708, 497, -1376, -2206, -269, -605, -215, -1202, -2240, 979, 776, -1074, 209, 238, 1055, 795, -453, 2524, 1585, -990, 1716, 1358, 841, 1461, -945, 828, 1286, -1672, 562, 157, -1849, -692, -1692, 76, -115, -4171, -745, 782, -1775, -348, -1611, -412, 2064, -1552, 497, 2691, -348, 1332, 1148, 1171, 3467, -222, 542, 2564, -911, 1485, 1383, -1877, 269, -1648, -879, 1503, -4005, -2398, 784, -2252, -1022, -2122, -1525, 2291, -2579, -1554, 3256, -118, 687, 283, 99, 5213, 421, -1507]
2001a507N327l069J87Q27k934L195k924j756N608m212j795K678j989L274k298
2016a388l525P174k114l759M030p86K317r63m823O582R56m419J716j692K966J978
2032D250o810K866K068l511K967k515j220L851l842P05J720l125L290j415k489
2047c210M104j985P50J516m652L924J999l741K357j265jL173l491J217J190k935
2063a050L181j135j813K772k942J117J833m529K566J249l183J280j017J562J757
2078A648n166J425L207j383P81k704O05M722l371o97K534j524J387n42j043K487
2094B366k027p1J599k521J252L09j693J399k096J26K912k988q60J476J74J024
2110C81k139n5K630j654M82J157j044J036r85N71K639k651q30J871Q5J74k333
$$ y = [-1507, 3820, 751, 938, 1765, -1169, 2026, -898, -2654, 2954, -1258, -3053, -375, -2364, 910, -1388, -4913, 2261, 147, -3612, 418, -368, 1949, 986, -3837, 2745, 3701, -718, 998, -694, 2272, 4250, -2560, 306, 2374, -1137, 1830, -685, -1905, 1946, -1896, -1191, 529, -2596, 694, -721, -3210, 894, -1091, -341, 1175, -3477, 447, 2446, -1295, 1062, -203, -204, 2969, -522, 695, 1885, -1050, 2131, 996, -817, 1955, -987, 130, 1963, -2566, 0, 1249, -1934, -654, -1671, -109, 1648, -3518, -2093, 1114, -269, 512, -2192, -1587, 3135, -236, -933, 1601, 77, 1464, 922, -121, 2366, 339, 268, 1867, -654, 598, 907, -786, 613, -1483, -1357, 1555, -1433, -2293, -817, -643, 381, -1758, -1813, 817, -837, -355, 802, -242, 794, -191, 380, 3019, 368, -462, 1409, 1494, 1668, -665]
2127f65L56K782k953q47J585o16P48k078o20L381j935j001J596q38J267q60l52
2144a050L082k798n83L570j346j0q37q88M117j944k790K626o79M33o15k346L682
2161A624j208l057L177j212j38J251k956K534N81k678K915j138o31K328k478J959
2177H73P46l432L550m98k345L170k216j6J703l017K640j80l265L040j156j70J925
2194A352m102K345K073l804K649n19j708L488k355oJ975k820K818j56l254L519
2210A495j086n78J916m141K578K766m781J213O69m45K383l811L05L425k765J149
2226B92j86j844L838k176j390L527k857N05J981k849J624k13j082K544k900m5
2242a231K823k491R69k93j750L899j681k464L149q28M0N72k034K417r0j868J957
$$ y = [-665, -309, 2473, -480, -1327, 258, -358, 390, -1688, -2308, 1073, -862, -1863, -267, -1105, 162, -698, -1050, 2032, -766, -1349, 2221, 875, 865, 28, -860, 3257, 1313, -1477, 1149, 470, 903, 288, -2058, 1624, 416, -2641, 536, -676, -814, 437, -2519, 15, 596, -2082, 833, -305, -936, 1392, -1086, 873, 1619, -1813, 1737, 1239, -1106, 2064, -152, -168, 1535, -1482, 1158, 978, -2287, 753, -403, -573, 1352, -2750, -405, 1668, -2136, 513, -6, -1714, 1774, -581, -587, 1388, -1432, 1386, 1230, -2024, 1495, 409, -169, 1747, -2394, 184, 2950, -1831, -618, 51, -394, 1989, -1822, -1517, 1908, -857, 292, 106, -1738, 2100, -76, -1466, 2061, -796, -291, 1690, -1159, 465, 252, -830, 1714, -1186, -1231, 1592, -899, 70, -223, -1973, 1926, 245, -2219, 930, 102, 142, 714, -1320, 1097, 1007, -861, 1096]
2259A096j261K51J407k781J434R93k407J743n00j341J975j015k53O14j155J729
2275E29l66j434J920p33j03J323j849R87J258j911P49K92n57O41r35J97M71j121
2293f42Q82l29j069J435o02n12R82r13K75R30q19J05L09K27K64q00N95N72r18
2312b8M93O5o71Q15l46p70O37n8l96%L8M2l19J89K94o02M02M70o63L20M48m66
2334a06K38L31l33l8L78j24l99K58K17o20O4L87n32j0M10m19j86M72l2m15L82
2355g7L13m82J86M74m37P8N08m13j35M83k49m16M33Q2o56R5M44n43k00N75l39
2376b76k88N25k28k08O20j21m02N29L30n72J28O84l79m31O02%n29L39rm68K98
2397A44l6n80L37K37p03n9P42l23o06O46L12n66K32L46k66K61J88k03K27K37l58
$$ y = [1096, -165, 86, 1493, -1288, 146, 1139, -1268, 475, -25, -1366, 609, -406, -659, -45, -1200, 529, 163, -1271, 649, -84, -187, 1136, -713, 274, 1532, -379, 370, 662, 105, 746, -189, 8, 479, -642, 240, -89, -1158, 277, -325, -837, 145, -768, -493, 437, -382, -277, 32, 259, 523, -277, 318, 890, -28, 465, 530, -141, 674, 328, -442, 195, 137, -259, -259, -221, -179, -498, -309, -15, -617, -215, 255, -408, -88, 360, -106, 132, 463, 130, 92, 470, 346, -53, 205, 422, -198, -134, 253, -279, -289, 121, -298, -484, -12, -44, -459, -77, 236, -246, -60, 414, -23, 55, 563, 150, 15, 498, 249, -167, 266, 348, -308, -213, 231, -312, -512, 63, -276, -564, -39, -267, -475, 145, 24, -378, 151, 481, -91, 37, 721, 342, -89, 513, 513, -16, 323, 314, -154, 144, 108, -472, -135, 102, -601, -660, 82, -241, -847, -201, 111, -455, -223, 123, -143, 118, 306, 103, 330, 567, 209]
2418B09r9O95j76r62O12M99j032M9O03n78j53Mj27L66k33l32J41L38K17p38K09
2439d88J165r44j81J267o82j61O68l54L23j94l43O04m06q6R2m95P82p95r10J856
2459G18o86j355J132k32J26J85r94J115Qo47R80o20M26O33j530J599K77j900J758
2478I93j32j119J051q33O40Q2k055J863J26j521J006j432J002J658l430J251J840
2495I90k135J216n16j19K133k660P54K036k361J691m94j553L227k333p06L106
2511B276l261N75J746k343J887j614r95L833l294k41K524k931K587l44l208M792
2527A989j662k259L565k431J241J310l806L352m45k105L934l810j87M051m158
2542a421J788O63l875M753j375l038L979k525P61J537m061M303m52l974N010k319
$$ y = [209, 110, 805, 629, -333, 279, 778, -254, -205, 398, -180, -333, -329, -456, -90, -323, -655, -514, -176, 41, -697, -488, 677, -267, -448, 819, 137, -24, 644, 290, 613, 419, 76, 680, 274, 188, 280, -215, 567, -228, -1138, 718, 32, -1323, -191, -423, -297, -112, -1106, 9, 17, -630, 350, -270, 156, 789, -741, 858, 1135, -765, 993, 861, -258, 793, -40, 600, 682, -1373, 490, 616, -905, 101, -1331, -329, 1329, -2101, -850, 990, -1145, 71, -445, -564, 1569, -1091, -337, 1699, -662, 1029, 535, -1018, 2209, -124, -830, 2276, -985, -410, 1336, -1007, 880, -734, -1729, 2104, -1190, -1431, 1093, -1838, 749, 405, -2803, 1989, 327, -1932, 1633, -798, 443, 1753, -2053, 1299, 854, -1251, 2683, -1127, -1314, 2737, -1421, 367, 1030, -2845, 1908, 533, -2505, 1474, -1051, -290, 1247, -2814, 1489, 1037, -2937, 2073, -246]
2558b46j020L866m549K241J971m875M132k82k966L334k974J789K268o074L885
2573E00J376m197M091k611r46M678n044J445L045m618K890n16j474M221m760P34
2589a186M448n425K457J249l727M596k738k046N532l924j82K285l326L803j354
2604D62l130N057l395m82M237m848J914J650l946M344j472k796M423k694J95K072
2620A591l498L354q11l277N206k319j963L524l244J828J389m213L406k16k450
2635a693K977k103O69J491l733L202M52l357L465j338j372K790k263J286P46l402
2651b183K914P09j925R27j990K084J912m409J360J681j678J367j599j76K650k385
2667g41m2J156j113J663r75j165K002j205P11J114k885J134J670j022J09j397
$$ y = [-246, -1266, 2600, -1949, 292, 2263, -2612, 1520, 1238, -1728, 1606, -1368, 421, 2689, -3385, 500, 1876, -2321, 1770, -841, -1787, 2891, -2153, -708, 2337, -2281, 609, 93, -1381, 2840, -1920, -1186, 3262, -2163, 294, 1543, -2184, 2412, -326, -2372, 3160, -764, -946, 1339, -1987, 1816, 462, -2668, 2389, -1006, -1488, 2749, -2099, -185, 1465, -2481, 1863, 391, -2405, 2018, -676, -481, 1591, -1907, 1447, 636, -2641, 2565, 246, -1717, 1807, -1437, 391, 1780, -2433, 973, 757, -1693, 1284, -819, -150, 1341, -2392, 810, 1262, -2095, 1370, 32, -1340, 1450, -813, 473, 1219, -2183, 731, 1440, -485, 442, -1548, 536, 2448, -1961, -601, 1080, -598, 769, -830, -1006, 1644, -741, -783, 373, -740, 923, -52, -1217, 785, -420, 291, 1405, -1480, -346, 1324, 302, 411, -986]
2683i86P70K028k112m42Q86j16P21j579j23K183j525p34J012j33M58o58k73J017
2701C94p75L47Q31j007J9j3O61R66j978l94J965oj133q97J214J388k182p45J706
2720C61L56n46j579L04K503j009j722O47Q22P33j040o92J432m91n6P93j101L95
2738A10M16o10Q19p65m41J336p78n40J90J26J072j477r88K047k62n62J28q97J348
2757B72M45j352O61j43Q8Q77j044K89K32n58J221q44r40J837p17q21N86l53R20
2776F56n24j418J317L28n11n9p70J228K60j575J214L10j027P67j47J28L68j017
2794d72O95M26q32M52j61j1L14j065Q91O26j643K94Q43l13kp20L70Q72r06l6M53
2815G5j06J95o17K69J058j066k54Q92l05p0J4j10L56m58j7O20m05k66M8J43M63
$$ y = [-986, -216, 1812, -300, -742, 144, 28, 749, -830, -953, 1230, -295, -1029, -17, -150, 308, -350, -623, 394, -381, -34, 797, -210, -191, -204, 457, 1423, -555, -949, 1016, 1010, -123, -1020, 194, 1582, -600, -1345, 361, 717, 171, -1408, -1104, 1399, 390, -1332, -685, 137, 870, -170, -862, 570, 79, 23, 816, -285, 110, 526, -84, 735, -30, -471, 865, 87, -453, -263, -137, 935, -542, -1530, 517, 255, -307, -179, -1076, 272, 717, -635, 26, -117, -29, 848, -196, 93, 325, -233, 988, 144, -796, 1041, 324, -497, 89, -264, 656, 132, -1286, 31, 359, -152, -211, -981, 247, 507, -1068, 146, 456, -571, 196, 49, 177, 545, -472, 223, 649, -183, 269, 108, 97, 411, -654, 237, 863, -780, -486, 357, 44, 42, -678, -308, 564, -342, -378, 75, -31, 164, -453, -184, 874, -192, -446, 446, 141, 71, 85, -25, 331, -127, -144, 476, 71, -195, -147, -4, 459]
2836D59o99l86R49j85n92L39J50Ll23n2O14j18m48J11K41K33k75k67N44M1n73
2857b34K91L62k75l29J38L80j40m07J09K59j49j67m2K78p4m34J93M43k83l53K88
2878a46L27j61k10K11J74j11r2J18K20j04k81J67L45k61l09J71K14k73k17K27
2898IO4l50m0J94N8j33k03J36L26j94k09L22J79j81q2L16J61l19J4L16k7j50j06
2921A01K7K02k30k37J90mk60o2J26M6k78m3K60q8q8J58P0M7k6L9K74j0j12R9J64
2946C65N6k38K1K56j74j87N3q3pj27j81J10j18j27R7j50Q9L7r8K61j15k3M48j56
2970IJ4K45j39L52k9l24L97j09l1P7m72K67Q5m79J10k18m3K74n53M3K60k69K54
2993b79j87j17N71k24M0K98k69N40Q4l41M34k20J49L36o79K75J31m81L53m92j82
$$ y = [459, -240, -626, 323, 138, -454, -115, 35, 38, -285, -337, 277, 159, -289, -178, 63, 296, 21, -246, 298, 339, -234, 57, 419, 144, -185, -47, 333, 193, -214, -105, 154, 5, -162, -204, 74, 0, -434, -241, 202, -81, -434, -146, 181, 20, -190, 21, 195, 84, -8, 110, 330, 226, -55, 112, 457, 196, -113, 58, 272, -1, -218, 9, 73, -277, -317, -123, -65, -198, -401, -265, 61, -133, -342, -20, 159, -22, -104, 212, 373, 54, 68, 384, 357, 207, 101, 128, 330, 100, -137, 53, 49, -211, -273, -147, -101, -379, -422, -162, -250, -338, -180, -110, -63, -89, -50, 224, 214, 102, 201, 365, 421, 183, 204, 460, 286, 99, 152, 69, 62, -65, -246, -136, -254, -381, -284, -434, -345, -308, -406, -145, -260, -283, 165, 9, 23, 268, 129, 481, 452, 128, 525, 416, 385, 462, -10, 257, 342, -137, -27, -245, -288, -14, -567, -524, -264, -533, -279, -466, -583, -12, -236, -196, 102, -167, 373, 457, 116, 550, 330, 479, 815, 136, 411, 542, 61, 414, -78, -260]
3014b60N50o94nJ62n11O07l75k82P83o00J98N53p50Q03R4n74J042m99j19Q79q50
3035A52M70J50r27J032n62o09J014j114J12N74j239Q86j47j085J397o21l28R48
3053A03j013R65K66j349J648k05p27J252j023N98Q26j884J242L60j316R58q42
3070a41P6J000k006Q11P84j625J046o22l81J740j764K17J391j543J171J18r80
3087g08J654j135J46J577j952Q35P23j376J493j191o93K264j875k47R15j417J592
3104F05o64j759K204q02k01Q90k111J861J000k267J416m12o6K098k448K89J901
3121A534j643R91n87r49K495j815p90J817j750R81J34k027K154p41j120K064j785
3138a037K55J354j655J538n68j238K802j296q89J628j204J435k99k268K856k77
$$ y = [-260, 290, -404, -409, -247, -758, -151, -526, -808, -25, -625, -427, 126, -624, 179, 273, -301, 741, 242, 123, 1002, 152, 622, 772, -155, 877, 315, -294, 720, -394, -282, 292, -947, -61, -208, -1293, 104, -517, -845, 103, -910, 55, 321, -1028, 620, 415, -312, 940, -83, 515, 1341, -543, 699, 1059, -257, 701, -141, -65, 935, -1071, -260, 524, -1101, -55, -677, -1058, 682, -1082, -865, 526, -1017, 154, 272, -708, 946, -189, -43, 1534, -418, 417, 1140, -236, 1257, 66, -627, 1637, -238, -485, 430, -987, 605, -59, -1818, 386, -416, -617, 273, -1838, 23, 1023, -1244, 172, -240, -306, 1792, -656, -367, 1534, -109, 882, 295, -654, 1841, 26, -764, 1053, -697, 284, 418, -1609, 545, -196, -1316, 748, -1037, -782, 572, -1083, 455, -113, -1351, 1451, 155, -734, 894, -310, 1125, 826, -1442, 1414, 1137]
3154A137j863J081r17J421K39l145J955Q19j363Q45j677Q80J911k586P54P65j189
3171i33J986j123r03J924j097Q40K40k345K275N73j677N96j346J528J523l546
3187a485M86J615o82P72k031l3K770j910k40Q02j028J738o84j066J889j311M47
3204D9J400k253Q22P63o71J107k044r3K760j676q43J60j16K143j785j765K516
3221D74l41l77R2j198K096n4j933J613j46j06P38j660J052Q27j359R69p70m91
3239e74J786j330l29P38j033J209l97j358J640m83n00P24r08J124R3j515J482
3256C69q4n19J056j104K90Q07j021R78l66j148J372j92l80k9r92J470J21j892
3274a264R58L74k62J76j168J071J062j717K01P16J14M24j178L25J139j029L44
$$ y = [1137, -726, 355, -562, 859, 1098, -2047, -92, 727, -636, 209, -1468, -588, 1323, -1263, -509, 256, -933, 1053, -70, -973, 951, -146, 694, 934, -1411, 864, 1437, -240, 356, -990, 538, 2061, -1485, -999, 616, -66, 706, -1325, -1358, 1412, -498, -738, 64, -964, 774, 90, -976, 913, -398, 49, 1449, -804, 18, 781, 110, 1217, -827, -920, 1840, 164, -679, -519, -635, 1508, -277, -2042, 474, 133, -244, -152, -1350, 746, 692, -1241, 372, 226, 120, 858, -802, 250, 1077, -282, 687, -83, -574, 1212, -118, -447, 291, -742, 467, 70, -1288, 352, -131, -631, 93, -815, 309, 402, -1113, 369, 285, -234, 822, -282, 8, 815, -206, 772, 406, -742, 630, 438, 58, 29, -963, 507, 628, -1264, -306, 68, -194, -18, -1186, -115, 947, -770, -569, 147, 261, 685, -493, -168, 971, -58, 286]
3291B86L19q04O31k84j24O70j180P4R14p68q1l4Q7N47j081J77J173p68k15K24
3311b37J55P92p67m38J120k50k59K70j61L12m83j35Q39o86m55M56j51R9k87l42
3331f08O71l69n17O80J62j97l70J35R25l32o30O26K03j14mj32M75j73n90N02K69
3352F12n31k83K9M19k52o16M62Q5m81R2K59R7j92l73N46M92m78j38L87K90j87
3373B39k69M70K13o21%M67j7m34k83K96K23m77k30L21j7l40n5M06O4n32N4O13
3395I1K9l53O1M05J13k76Q8L66j08l37P3L80j5o21m6M67j51m37j3K00r3l75R8
3418d54M61l08l17K69L39O2l61L0O17n3l28L29K13j76j84J28M06k84n12L07J30
3439C14k19k46j08K73k13m67L75K17m16j28K54L55j15l62M41K92k34R7J36K21
$$ y = [286, 605, -199, 432, 148, 24, 694, -486, -412, 502, -266, -347, -381, -294, 253, -828, -651, 522, -246, -461, -237, -82, 710, -57, -495, 625, 375, 116, 386, 225, 537, 54, -81, 758, 72, -383, 73, -78, 21, -266, -608, 63, -306, -823, -143, 19, -178, -548, -413, 512, 180, -450, 176, 379, 265, 261, 129, 604, 431, -159, 343, 612, 81, -202, -173, 246, -6, -622, -160, -75, -556, -464, -205, -108, -300, -673, -127, 365, -113, -251, 136, 426, 239, -30, 440, 653, 32, 32, 499, 482, 48, -235, 61, 284, -193, -423, -102, -119, -459, -514, -108, -44, -576, -522, 91, 120, -233, -172, 233, 346, 70, 158, 524, 416, 79, 152, 532, 517, -104, -150, 317, 166, -271, -284, -84, -177, -552, -454, 7, -301, -618, -349, -10, 52, -309, -279, 338, 285, -43, 286, 499, 323, 139, 267, 673, 389, -123, 184, 314, 95, -151, -259, 14, -199, -666, -291, -74, -490, -618, -364, -9, -124, -486, -45, 247, 13, 110, 246, 467]
3459D67j08l32M45K52n53j17K74R7l05m23L52Pn51R1J67j6j77l49M69L68n39P5
3481d06L72J31k1k06M91K73n89L22K58k14Q2l22J09L01o54J5K29m36O1k21M3K61
3503a21o47K13M38m77K61J03j31N05k49J09N47m74K41K96k17K79m45L3N94p45
3523A13j36L77m39J28l27k60N80n57j83L98k99L04q6k64P85l91n1Q02m15Q3J83
3544C45j53P00m80m63P74k94J7j84o25P96j85q74N70l84Q3L68q92L72L39l65N65
3565C0n49k9J057n44K1K19l18J071m82q87J107j69k12O2o94Q59j12j097Q07j60
3585b0l06L27q07O78L29j171P56K22m46N25n23M59N08r80P06K57o38O33m52K49
3605C06N39j294N57P21r03O7m20L96Q73j558r5J006j97J78j062j11J923p67r25
$$ y = [467, 359, 27, 472, 724, 171, 54, 328, 425, 120, -303, 49, 56, -495, -404, -237, -253, -430, -779, -310, 58, -481, -406, -34, 97, 76, -130, 361, 634, 45, 367, 625, 411, 493, 171, 280, 581, -73, -58, 171, -265, -204, -425, -382, -121, -768, -555, -117, -594, -333, -230, -361, 144, -105, 4, 551, 77, 318, 614, 397, 676, 231, 264, 858, 113, -23, 354, -85, 43, -284, -544, 36, -521, -704, -306, -605, -301, -387, -651, 134, -257, -308, 494, 79, 162, 345, 192, 892, 412, -51, 723, 429, 446, 262, -363, 433, 248, -626, -56, -440, -357, 11, -881, -509, -170, -535, 30, -519, -548, 509, -35, -14, 205, -113, 958, 476, -411, 696, 527, 315, 377, -317, 542, 430, -667, 140, -20, -326, 1, -806, -128, 201, -970, -214, 8, -438, 87, -436, 23, 531, -449, 257, 514, -124, 509, 57, 306, 845, -449, 108, 829, -74, -7, -427, -31, 842, -716, -811, 195, -2, 176, -886, -997, 926, 159, -766]
3624g66M33Q7J182o11j379J298L66j31j30j180J194P48j294K82m12J97J221j428
3642c23l91P89k55P52p87j045J496%k89j09r93J579N27j617M82L9M43P59j684
3661f27K05J214n77K82q24k35J611r24m84L77o43J245k85j481J147l5j2L17j371
3680a100R83R28j177K86k52L72J154j742R3J308p32L32o23m64J799r70q85Q73
3698A83n28Q24l45j329J410r6m98O26j209P98J007j441N14M3j90J364j301m11
3716e79J298n38M58n27r70J806m40r93O28q25R50M68j847P45L82l07P69j367J94
3735f95J450r24J62k29l13J784r59j005J229k87M58k37j317J427J86j078M75o10
3753d83N12N61j496O52L17p82J023o73l67J108p00L21K57q91J157N4q40O28m00
$$ y = [-766, -333, -246, 936, 325, -1054, 244, 610, 479, 349, -831, 363, 1111, -183, 99, -313, -116, 1105, -323, -714, 75, -180, 572, -215, -1260, 236, 236, -53, -162, -1155, 424, 951, -666, -184, -145, 298, 1057, -627, -422, 792, 215, 497, -327, -562, 1049, 125, -359, 18, -625, 620, 335, -1146, 1, -34, -46, 271, -1100, -117, 811, -366, -80, -332, 40, 1194, -548, -455, 853, 121, 453, -170, -634, 1165, 195, -690, 183, -345, 479, 134, -1195, 215, 119, -379, 247, -962, -164, 843, -598, -84, -41, -231, 1133, -168, -579, 719, 181, 639, 112, -858, 948, 508, -485, 143, -682, 268, 736, -1111, -366, 16, -291, 478, -889, -695, 755, -169, -7, -236, -549, 1235, 276, -729, 500, 213, 671, 434, -883, 544, 730, -348, 127, -483, 29, 590, -906, -254, 63, -719, 304, -369, -736, 372, -328, -7, 250, -641, 516, 570, -270, 358, -42]
3772d2N63L95j550P16O63q60L16n66J55Q55j256J15O27n91M49m17k13R92o90j6
3792c55O79p33N36K56n41N31l29J04P06r45P1N06m18L36n76k25R81p38l67N87
3812F6l18K16k95l04Q28l23k90N04l26K46J79l78N43k06l20P47k55k87J75r4L51
3833D59l89l87O70k89l85K93j74K15j43n29O18J53m94J09J43J99p7k40N35o5m50
3854b28M36J11p9J8l32K93K32n18K1K73j30k77j23M57j05o53L48L44k99j6p5J75
3876a27K78l45K8M35j17k56J44M38p5n77K69M19l97j02J19j11K3j87l6L11j90
3897e6m33J75M12j58m63K86M47l89j13M57l3j56MJ16L11j49l47J72L86k27m28
3918a86K61K84n32j87N47j28l99N0J36J45j31k16J91K25j37j53K70L15m41j72
$$ y = [-42, 521, 916, -634, 82, 745, -115, 201, -365, -210, 645, -611, -496, 131, -460, -11, -428, -641, 351, -339, -355, 324, -409, 127, 383, -158, 373, 44, 148, 854, -91, -20, 486, 68, 404, -172, -397, 584, -154, -521, 66, -252, -36, -331, -635, 193, -130, -420, 84, -242, 4, 183, -195, 348, 142, -178, 569, 314, 27, 202, 108, 459, 70, -317, 353, 64, -321, -28, -202, 13, -130, -659, -41, 112, -382, -273, -130, 69, -8, -248, 287, 222, -228, 208, 319, 240, 258, -74, 219, 451, -67, -46, 227, 97, -180, -303, 154, 49, -604, -256, 88, -211, -227, -302, -127, 151, -194, -166, 269, 152, -104, 40, 478, 403, -174, 95, 514, 117, 15, 134, 23, 46, -141, -177, 134, -56, -489, -314, 98, -60, -523, -237, 210, -179, -292, 165, 132, -24, -20, 96, 407, 258, -89, 83, 469, 242, -186, 75, 359, -173, -360, 187, 59, -340, -290, -154, -9, -140, -356, -165, 60, -77, -230, 40, 355, -86, -258]
3938b58P44r2n59K60J98n8j27j74J95N4l25j4K08P2l49l31O65Q7p54L24L51k67
3960a50J6M3J91P7l47J46L18k9j91k78M64L11q04K08M66m74p3K00j6m1l68J57
3982a74L08k51o1j07K26K45n58J18O72n83k04N05M1m4l24J63M35l66L5J17k02
4003iK71l04l2O23p21l07Q13j86l48q4J21M41o20r2O27l25j7L2k53P72l07o83
4025e88Q80kl85K67n8K42k97k50P94m65l77M84l53K50M5q00O68J26p41M38R9j31
4047a54j26k14P83j71p01P45J0j37L31n67L80N16p96J99L03k04J6l69L20Mn87
4068d19O08j83p50O88K6j28J8o16O15O79p09l43K49Q34O4j192M94Q46n61M9k50
4089A9j25P92n27m58L25j33K03j62l10J72k69N52K26j189M09R37l34j81l43K98
$$ y = [-258, 486, 394, -165, 95, 293, 235, 108, -66, 129, 183, -142, -156, 52, 124, -225, -556, 109, 196, -558, -234, 117, -150, -134, -91, 100, 177, -170, -24, 294, 265, 74, -204, 260, 571, -233, -25, 441, -33, -106, 94, 78, 37, -331, -174, 134, -117, -178, -285, -59, 186, -372, -254, 418, -165, -369, 136, 177, 133, -191, -28, 407, 41, 76, 193, -9, 262, -42, -74, 549, -172, -479, 334, 148, -200, -284, -163, 278, -342, -434, 193, -132, -149, -117, -370, 402, 95, -588, 292, 290, -95, 172, 114, 356, 59, -191, 603, 138, -239, 245, -108, 142, 187, -613, 55, 181, -560, -122, -23, -154, -280, -494, 289, 118, -583, 162, 172, 35, 366, -201, 179, 695, -101, 98, 401, 197, 213, -156, 164, 168, -419, 189, 6, -744, -56, -30, -158, -140, -756, -141, 538, -171, -514, -265, 569, 633, -559, -65, 781, 220, 269, 19, -106, 686, 159, -299, 26, -107, 96, -66, -376, -204, -473, 79, 305, -884, -475, 462, 128, -53, -396, -98]
4109i8R18n28n58K10M88L62r91j79R41m09k17P2n12N51J75o57M4N5M83n2o89M35
4131a56J81P9L49r50L23J141q54l49M13J26K76p60j25P19l72J01m34l89J206m79
4151D6q23Q04m00K06N75r15K09L78J57L25j157L53J238q71l7j94k60J572r00j447
4171a141J269K96j51n72p79J444O0r28L61n72Q69P56j785N79Q16o84P82o47n08
4190e35J207l91m1k65o59J562m99j186J017n54L87O42j848P85J083r69K45n36
4208e55K76J161j243J59M36o42J379q41j155J876n21n61O09j047R24M80j395N98
4226f2j19K70N73j692P98J085j400P39j77o98J609q83o84J051n44M31r7q87J158
4245D71m51k93Q39j371O47J073j631N39L47n94J038p34m30J030m41K76l06o37
$$ y = [-98, 820, 292, -266, -56, 432, 794, -197, -376, 565, 156, -61, 11, -501, 50, 225, -432, -388, -333, 150, 98, -591, -156, 25, 104, 453, -497, -174, 967, 113, -236, 177, 303, 579, -181, -306, 413, 41, 142, -292, -681, 525, 46, -777, 27, -373, -167, 408, -507, -298, 80, 237, 562, -595, -242, 996, 125, 88, -106, -366, 1206, 306, -1141, 128, 424, 273, -299, -1078, 366, 426, -502, -141, -713, 156, 912, -873, -294, 522, -162, 620, -27, -535, 672, 281, 240, -25, -684, 878, 379, -807, 210, -344, 43, 685, -1163, -378, 705, -264, -19, -555, -279, 882, -361, -202, 234, -408, 971, 130, -1025, 851, 330, -231, 378, -669, 255, 735, -660, -62, -181, 89, 662, -1030, -232, 853, -547, 192, 15, -683, 926, 43, -641, 410, -134, 297, 200, -687, 471, 20, -273, 566, -805, -158, 915, -716, -177, 170, -424, 614, -120, -550, 480, 39, 315, 9, -628]
4263f28J534o55q50J121q29K66P39j426N12N81o49L90n05J14P55q64M05P0o06
4282e25J279n96q62J296m08k37M70p01M60K50o23L02l18K47L67j081N68M43r24
4301e93O63p1n57Q74l12k86M43j76K51j17j98N35m70N1N61q83K64N02p87L04J38
4322A36m63L56j19j78J19r7L80l14k55P40l07k55N64l81R6L94m66O9L11j66j31
4343C3o6K38r5m24M48r6m17M04r5k60L98j54j58K86Pj52M0K91r1l01L68J22m68
4366a42K48J43l17J11L2j92R0R2k38o0L03o8m24L80K49m62J37L62k83K4K37j30
4388I2m2J18p9j26K10O3m29J80L12n49k4M77k95k54L20Qj91J72K6j38J74J59l21
4411a37J29L86m10j35N30j64m00L25J46l27j8J52j55l1J81j98n7L46l34k21N70
$$ y = [-628, 906, 251, -599, 522, -307, -41, 698, -728, -216, 365, -284, 106, -399, -285, 470, -394, 11, 81, -525, 754, 158, -704, 592, 184, -53, 417, -284, 176, 426, -197, 105, -213, 34, 401, -680, -112, 331, -593, 70, -1, -558, 316, 4, -282, 161, -15, 236, 119, -79, 456, -14, 37, 598, -285, -21, 481, -306, -2, 136, -327, 29, -90, -268, -149, -246, 134, -180, -435, 305, -2, -257, 307, -74, 22, 416, -50, 19, 330, 164, 33, -33, 205, 110, -314, 134, 38, -379, 25, -70, -330, 68, -86, -244, 42, 49, -103, -63, 228, 137, -164, 204, 326, -142, 106, 249, -68, 43, 75, -117, -27, 65, -173, -233, 70, 2, -422, -42, 207, -255, -118, 244, -39, -15, 222, 92, 50, 168, 89, -37, 173, 236, -193, -13, 299, -250, -274, 203, -92, -346, -26, -18, -209, -37, -11, -149, 25, 184, -137, -8, 378, -32, -167, 363, 199, -201, 124, 270, -57, -75, 77, -78, -109, 72, -126, -183, 163, -171, -392, 178]
4432A78j2n21L14L31l42j13L79n1k38K15k3j80L00j86l31M92M0o16K98L70m40
4453a36j89M32O0m58J51K70k58J13J22l94L67K23n85K31M32m94j16M34P9m27J5
4474a28M46k89j82L91k79qL36m98Q3N02m82k26M27M9l49p5M53j68l90N10o1l46
4496b84M39k15r3N48m11j97M69J8k26j75L93L1o45N00K49p90L67J21m09M91l47
4517a66k91O36j95k78N4K79L14p79J77R24q08O6N28p21N70J28p31N64j37k70L50
4538B14k89J17k90j84R75q59n24J283o04k44O05o81O66J96q90O56R0j1P3p04Q86
4559D81N4j061J094l55q60J246n59m50N70o56N41J31q42O91k15J33L63j188J121
4578B39O10j705R52M56p71P59p00l9R10r01K83j2m51R66r15j13J151j447N26R33
$$ y = [178, 166, -355, -41, 290, -52, -165, 214, 163, -75, 140, 117, -63, 237, 51, -280, 212, 252, -364, -66, 304, -136, -325, 107, 167, -291, -140, 130, -128, -15, 107, -287, 80, 303, -282, -51, 381, -113, -229, 205, 284, -143, -128, 318, 29, -153, 238, -41, -49, 287, -211, -128, 374, -108, -334, 93, 142, -207, -282, 171, 3, -387, 123, 62, -284, 155, -60, -153, 395, -16, -213, 256, 274, 48, -127, 266, 297, -348, 152, 401, -389, -22, 99, -310, 181, -166, -457, 179, -16, -294, -240, 39, 353, -426, -249, 675, -133, -67, 461, -260, 310, 438, -293, 271, 134, -136, 214, -75, 42, -248, -432, 543, -316, -840, 443, -161, -405, 200, -481, 185, 381, -509, 147, 237, 226, 299, -405, 481, 535, -526, 568, 213, -647, 599, 40, -410, 160, -496, 45, 176, -666, 25, -190, -57, 306, -882, 239, 849, -856, 96, 552, -219, 540, -160, -199, 711, -190, 93, 81, -370, 596, -319, -432, 719, -728, -202, 731]
4598G31j575P35M87p10N95o60K34R80j192L16J29l39J350j428o43K077j031m72
4616d16P08q79Q85J18j017Q13m46K60O32j457Q53M63j095J248p98q88K038p47
4634B75r73O47j65Q67n81j093J355k32q8K97j318J349O32j822R33M19q30Q45n01
4653A6j69N35n70O12m15p34J241n73k97O08j252R73Q71j775L21R00j53L6q39O09
4673e5Q81r22K55j25k4J165j220o38J505n25m28K36n73N30J28n47K8l45P48J79
4693B53j199O91M03m55O62m67l71J219k94n60K23K69L19n97j38M14m33L35M2j072
4713g56N26N32o29oj49j5N96j36m77o3Q35M45j142M0J179k81l79Jp2O08n3q51
4735b47L2N86O0q63n5O77m60j41L93m84J0N68k26j52J65J59J18LO1k62K59O57
$$ y = [731, -844, -109, 378, -332, 263, -397, -163, 817, -375, -59, 70, -269, 1081, -347, -990, 1087, 56, -416, 292, -587, 298, 416, -601, 212, -234, 26, 658, -799, 54, 517, -578, 670, -128, -1016, 1022, 275, -698, -51, -216, 651, 70, -1023, 332, 100, 12, 309, -1009, 340, 972, -850, 83, 502, -328, 517, 16, -153, 382, -188, 424, 9, -725, 516, -57, -354, 254, -998, -25, 846, -929, -608, 292, 139, 175, -664, -55, 826, -96, 159, 34, 10, 1175, -45, -683, 822, 297, -131, 105, -468, 62, 190, -357, -329, -674, 74, 253, -946, -255, 148, -307, 355, -112, -483, 736, 442, -118, 105, 374, 693, 96, -42, 372, -61, 274, 316, -756, -230, 302, -327, -333, -482, -497, 99, -37, -514, -577, 258, 703, -439, -399, 780, 499, 120, 121, 49, 657, 604, -247, -215, 371, 431, -432, -487, 190, -270, -411, -18, -502, -492, 76, -150, -302, -137, 22, 140, 143, 204, -58, 201, 858]
4757H58q91l09J063l30o19K18m4J53o0l52N6QL53k83m28P62j24n13Q40k62m64
4778c68P21p2l19Q5J38K02m41k2L18m16L68j41p69R19J09j024N37L43l23N5k9
$$ y = [858, -33, -342, 721, 391, -228, -10, -54, 99, 39, -313, -257, -249, 104, -179, -607, 155, 31, -482, 358, 96, -368, 353, 281, -38, 47, 185, 387, -54, -76, 242, -174, 194, 53, -716, 203, 312, -712, -175, 168, -155, -100, -129]
$$ [...]
8191b8
##END NTUPLES=NMR FID
##END=
