##TITLE=1H_LR-740-i-2MePH
 CDCl3
 8 sc, 
 28.10.2021
##JCAMPDX= 6.0         $$ Bruker NMR JCAMP-DX V2.0
##DATA TYPE= NMR FID
##DATA CLASS= NTUPLES
##ORIGIN= UXNMR, Bruker Analytische Messtechnik GmbH
##OWNER= root
$$ XWIN-NMR		Version 3.5
$$ Thu Oct 28 11:53:22 2021 Russian Standard Time (UT+4h)  she@DPX200
##.OBSERVE FREQUENCY= 200.1313468511
##.OBSERVE NUCLEUS= ^1H
##.DELAY= (6, 6)
##.ACQUISITION MODE= SIMULTANEOUS
##.ACQUISITION SCHEME= undefined
##.AVERAGES= 8
##.DIGITISER RES= 18
##SPECTROMETER/DATA SYSTEM= spect
##.PULSE SEQUENCE= zg30
##.SOLVENT NAME= D2O
##.SHIFT REFERENCE= (INTERNAL, D2O, 0, 15.7039)
##AUDIT TRAIL= $$ (NUMBER, WHEN, WHO, WHERE, WHAT)
$$ ##TITLE= Audit trail, XWIN-NMR		Version 3.5
$$ ##JCAMPDX= 5.01
$$ ##ORIGIN= Bruker BioSpin GmbH
$$ ##OWNER= she
$$ F:/spectra/data/she/nmr/H-F/1/audita.txt
$$ ##AUDIT TRAIL=  $$ (NUMBER, WHEN, WHO, WHERE, WHAT)
(   1,<2021-10-28 11:52:15.76 +0400>,<she>,<DPX200>,
      <created by zg, POWCHK disabled, PULCHK disabled
       configuration hash MD5:
       00 E9 B6 7A A2 85 ED C7 34 08 36 98 17 FE 4E 26
       data hash MD5: 16K
       6C 4A 1C BC A8 BA 20 24 1D DD E9 A4 FB 4E 31 D0>)
$$ ##END=
$$ 
$$ hash MD5
$$ EB 03 59 4B 65 81 8C D5 F3 F7 5F F0 7C B9 27 F6
##$RELAX= 
##$RELAX= 
##$RELAX= 
##$RELAX= 
##$RELAX= 
##$RELAX= 
$$ Bruker specific parameters
$$ --------------------------
##$DU= <F:/spectra>
##$EXPNO= 1
##$NAME= <H-F>
##$PROCNO= 1
##$TYPE= <nmr>
##$USER= <she>
##$AMP= (0..31)
100 100 100 100 100 100 100 100 100 100 100 100 100 100 100 100 100 100 
100 100 100 100 100 100 100 100 100 100 100 100 100 100 
##$AQSEQ= 0
##$AQ_mod= 1
##$AUNM= <au_zg>
##$AUTOPOS= <>
##$BF1= 200.13
##$BF2= 200.13
##$BF3= 200.13
##$BF4= 200.13
##$BF5= 200.13
##$BF6= 200.13
##$BF7= 200.13
##$BF8= 200.13
##$BYTORDA= 1
##$CFDGTYP= 0
##$CFRGTYP= 5
##$CHEMSTR= <none>
##$CNST= (0..31)
1 1 145 1 1 1 1 1 1 1 1 1 1 1 1 1 1 1 1 1 1 1 1 1 1 1 1 1 1 1 1 1 
##$CPDPRG= <>
##$CPDPRG1= <>
##$CPDPRG2= <>
##$CPDPRG3= <>
##$CPDPRG4= <mlev>
##$CPDPRG5= <mlev>
##$CPDPRG6= <mlev>
##$CPDPRG7= <mlev>
##$CPDPRG8= <mlev>
##$CPDPRGB= <>
##$CPDPRGT= <>
##$D= (0..31)
0 1.2 0 0 0 0 0 0 0 0.06 0 0.03 0 0 0 0 0.0002 0 0 0 0 0 0 0 0 0 0 0 0 
0 0 0 
##$DATE= 1635407535
##$DBL= (0..7)
120 120 120 120 120 120 120 120 
##$DBP= (0..7)
150 150 150 150 150 150 150 150 
##$DBP07= 0
##$DBPNAM0= <>
##$DBPNAM1= <>
##$DBPNAM2= <>
##$DBPNAM3= <>
##$DBPNAM4= <>
##$DBPNAM5= <>
##$DBPNAM6= <>
##$DBPNAM7= <>
##$DBPOAL= (0..7)
0.5 0.5 0.5 0.5 0.5 0.5 0.5 0.5 
##$DBPOFFS= (0..7)
0 0 0 0 0 0 0 0 
##$DE= 6
##$DECBNUC= <off>
##$DECIM= 32
##$DECNUC= <off>
##$DECSTAT= 4
##$DIGMOD= 1
##$DIGTYP= 9
##$DL= (0..7)
0 120 120 120 120 120 120 120 
##$DP= (0..7)
150 150 150 150 150 150 150 150 
##$DP07= 0
##$DPNAME0= <>
##$DPNAME1= <>
##$DPNAME2= <>
##$DPNAME3= <>
##$DPNAME4= <>
##$DPNAME5= <>
##$DPNAME6= <>
##$DPNAME7= <>
##$DPOAL= (0..7)
0.5 0.5 0.5 0.5 0.5 0.5 0.5 0.5 
##$DPOFFS= (0..7)
0 0 0 0 0 0 0 0 
##$DQDMODE= 0
##$DR= 18
##$DS= 0
##$DSLIST= <SSSSSSSSSSSSSSS>
$$ [...]
##$SUBNAM2= <"">
##$SUBNAM3= <"">
##$SUBNAM4= <"">
##$SUBNAM5= <"">
##$SUBNAM6= <"">
##$SUBNAM7= <"">
##$SUBNAM8= <"">
##$SUBNAM9= <"">
##$SW= 18.0517286264689
##$SWIBOX= (0..15)
0 0 2 0 0 0 0 0 0 0 0 0 0 0 0 0 
##$SW_h= 3612.71676300578
##$TD= 16384
##$TD0= 1
##$TE= 0
##$TE2= 300
##$TE3= 300
##$TEG= 300
##$TL= (0..7)
0 120 120 120 120 120 120 120 
##$TP= (0..7)
150 150 150 150 150 150 150 150 
##$TP07= 0
##$TPNAME0= <>
##$TPNAME1= <>
##$TPNAME2= <>
##$TPNAME3= <>
##$TPNAME4= <>
##$TPNAME5= <>
##$TPNAME6= <>
##$TPNAME7= <>
##$TPOAL= (0..7)
0.5 0.5 0.5 0.5 0.5 0.5 0.5 0.5 
##$TPOFFS= (0..7)
0 0 0 0 0 0 0 0 
##$TUNHIN= 0
##$TUNHOUT= 0
##$TUNXOUT= 0
##$USERA1= <user>
##$USERA2= <user>
##$USERA3= <user>
##$USERA4= <user>
##$USERA5= <user>
##$V9= 5
##$VALIST= <valist>
##$VCLIST= <CCCCCCCCCCCCCCC>
##$VD= 0
##$VDLIST= <DDDDDDDDDDDDDDD>
##$VPLIST= <PPPPPPPPPPPPPPP>
##$VTLIST= <TTTTTTTTTTTTTTT>
##$WBST= 1024
##$WBSW= 4
##$XGAIN= (0..3)
0 0 0 0 
##$XL= 0
##$YL= 0
##$YMAX_a= 912535
##$YMIN_a= -980291
##$ZGOPTNS= <>
##$ZL1= 120
##$ZL2= 120
##$ZL3= 120
##$ZL4= 120
##$ABSF1= 10
##$ABSF2= 0
##$ABSG= 5
##$ABSL= 3
##$ALPHA= 0
##$AQORDER= 0
##$ASSFAC= 0
##$ASSFACI= 0
##$ASSFACX= 0
##$ASSWID= 0
##$AUNMP= <proc_1d>
##$AZFE= 0.1
##$AZFW= 0.1
##$BCFW= 1
##$BC_mod= 2
##$BYTORDP= 1
##$COROFFS= 0
##$CY= 11.3945322036743
##$DATMOD= 1
##$DC= 2
##$DFILT= <>
##$DTYPP= 0
##$F1P= 2.36226072786647
##$F2P= -0.459571619588291
##$FCOR= 0.5
##$FTSIZE= 0
##$FT_mod= 4
##$GAMMA= 1
##$GB= 0.15
##$INTBC= 1
##$INTSCL= 1
##$ISEN= 128
##$LB= 0.24
##$LEV0= 0
##$LPBIN= 0
##$MAXI= 10000
##$MC2= 0
##$MEAN= 0
##$ME_mod= 0
##$MI= 1.114404
##$NCOEF= 0
##$NC_proc= 0
##$NLEV= 6
##$NOISF1= 3.799351
##$NOISF2= 2.8
##$NSP= 1
##$NTH_PI= 0
##$NZP= 0
##$OFFSET= 15.70392
##$PC= 1
##$PHC0= -15152.46
##$PHC1= 11.00082
##$PH_mod= 1
##$PKNL= yes
##$PPARMOD= 0
##$PSCAL= 0
##$PSIGN= 0
##$REVERSE= no
##$SF= 200.130013532006
##$SI= 16384
##$SIGF1= 3
##$SIGF2= 2
##$SINO= 400
##$SIOLD= 16384
##$SREGLST= <1H.CDCl3>
##$SSB= 0
##$STSI= 0
##$STSR= 0
##$SW_p= 3612.71676300578
##$SYMM= 0
##$S_DEV= 0
##$TDeff= 0
##$TDoff= 0
##$TI= <>
##$TILT= no
##$TM1= 0
##$TM2= 0
##$TOPLEV= 0
##$USERP1= <user>
##$USERP2= <user>
##$USERP3= <user>
##$USERP4= <user>
##$USERP5= <user>
##$WDW= 1
##$XDIM= 8192
##$YMAX_p= 0
##$YMIN_p= 0
$$ End of Bruker specific parameters
$$ ---------------------------------
##NTUPLES= NMR FID
##VAR_NAME=  TIME,          FID/REAL,        FID/IMAG
##SYMBOL=    X,             R,               I
##VAR_TYPE=  INDEPENDENT,   DEPENDENT,       DEPENDENT
##VAR_FORM=  AFFN,          ASDF,            ASDF
##VAR_DIM=   8192,          8192,            8192
##UNITS=     SECONDS,       ARBITRARY UNITS, ARBITRARY UNITS
##FACTOR=    0.0002768,     1,               1
##FIRST=     0,             0,               0
##LAST=      2.2672688,     0,               0
##MIN=       0,             -980291,         0
##MAX=       2.2672688,     912535,          0
$$ Real data points
##PAGE= N=1
##DATA TABLE= (X++(R..R)), XYDATA
$$ [...]
2920B562m074k003J617L175K193j508l400j807J116K954J714p35k167j656Q09
2935a210K082J217j503k300n51R38K087J088k31j422o12J7J91j54l51PP16Q65
2953H74Qk82l5J34k63j107j349m49J533K643J415j158k513j547J263K027J79k608
2971a235k225L29L790L803J3l397m518q43K537L652N52k509k687M67M118L563
2987E410q86n074m705m93M405N270R58l426m503R1L978L608r12o030n244Q73P191
3004E11O776O2o088o455q09N642N772j123o524n239J857Q480O799k150q528p836
3020h853Q44Q281O914j774p350n383K757Q695N504l892r844o821L294J0146O765
3035I283k540q813n820L120Q533M917m486r593n334M490J0821O734l936j0710
$$ plain form
2920 2562 -1512 -3515 -1898 1277 3470 1962 -1438 -3245 -2129 825 2539 1804 -363 -2019 -1210
2935 -1210 872 2089 586 -1714 -2265 -1327 760 1848 1617 195 -417 -400 -209 -363 -714 -707 9 874
2953 874 882 600 565 699 436 -671 -2020 -2469 -936 1707 3122 1964 -549 -2096 -833 1194 1373 -1235
2971 -1235 -3460 -3131 659 4462 4475 1078 -3440 -4283 -1746 1906 2458 -51 -2738 -2271 1847 5410
2987 5410 4524 -550 -5255 -5748 -1343 3927 4885 1459 -3044 -2953 1025 4633 3721 -2309 -7553 -6680 511
3004 511 7287 7349 1261 -5194 -6003 -361 5411 4288 -2236 -7475 -5618 2862 9661 7511 -1017 -8853
3020 -8853 -8009 272 7186 5412 -1938 -7321 -4564 4131 9635 5743 -4101 -10922 -7628 2518 9283
3035 9283 6743 -2070 -7890 -4770 3763 8680 4194 -5399 -10733 -6243 4578 11312 7376 -3334
3049c334o617L868R724N623m438j0091n141N496J1137N726n621j1941o577N640
3063f546J1562N833n563j1237m908O814J1282M498p605j2258m413P551J2336M558
3077A1904p323j1496l994P371J1065L299p859j1620k705Q150J1755K791q197j1303
3091h162l015Q226J0943K833q567j0811k509Q800J1141K053q568j1175k341R070
3105b082J1167K033r557j1012j599R529J0934J769r470j0817j143R727J0010P09
3119A0198j0121j0493k3J0325J0562O9j0541r698%J0125Q638q95r591q504J590
3134h359J0263Q424j427j0141q583J025R553P708q34r050o849J996Q935P098k521
3149G238r964p618K373R374P663j101r107o908K064Q145N975k828r198n942L557
$$ plain form
3049 -3334 -9951 -6083 3641 9264 4826 -5265 -10406 -4910 6227 11953 6332 -5609 -12186 -6546
3063 -6546 5016 10849 5286 -5951 -10859 -4045 7237 11735 4130 -8128 -12541 -4990 7346 11904
3077 11904 4581 -6915 -10909 -3538 7527 10826 2967 -8653 -11358 -3208 8547 11338 3141 -8162
3091 -8162 -11177 -2951 7992 10825 2258 -8553 -11062 -2262 8879 10932 2364 -8811 -11152 -2082
3105 -2082 9085 11118 1561 -9451 -11050 -1521 9413 11182 1712 -9105 -10248 -521 9489 10198
3119 10198 77 -10416 -10439 -114 10448 10517 -24 -9722 -9722 403 9041 8146 -1445 -9949 -8359
3134 -8359 1904 10328 8901 -1240 -9823 -8798 755 8463 7629 -1421 -8270 -6274 2661 9759 7238
3149 7238 -2726 -10344 -7971 1403 9066 7965 -1142 -8050 -5986 2159 8134 5306 -3892 -9834 -6277
3164f277R689O830l075r124o428K440Q165M742l023p741l817M096Q632M024m289
3179D844q711m335L008P238M560k920o310k846L619O017K152m365o896k597L685
3194c857O813L592k924n285k789K431M415J550l181m947j206L587N809K222l091
3209C139n103k713J944L993J441j979l244o60K962M011N60l258m367r93K023L593
3225A349J287j704j974m20J997J823p78k138k098K3K275K242L45j009j536j92
3241e08M15l8j09p99J47P39P31L1K88j99p46k47p00j81M82R74R99j29r01p47K1
3262d77P13O38n04j040q43Q34J253J374l8k155j489J93J948J593n06k229j519
3279b254N22K398K171o98k899k257L75L209K718q40l547k819J293L897K923j056
$$ plain form
3164 -6277 3412 10242 7167 -1957 -8385 -5945 2220 6962 3939 -3802 -7619 -3523 5109 9133 4844
3179 4844 -3867 -8202 -5194 2044 6604 3684 -2626 -5472 -1853 4164 6316 1951 -4945 -7542 -3857
3194 -3857 2956 6548 3624 -1661 -4450 -2019 2396 3946 765 -4182 -5388 -1801 4008 6230 3139
3209 3139 -1964 -4677 -2733 1260 2701 722 -2522 -3182 -220 3791 4351 1093 -3274 -4267 -2244 1349
3225 1349 2636 932 -1042 -1462 535 2358 1580 -558 -2656 -2633 -358 1884 2229 1220 -316 -508
3241 -508 -93 -131 -240 -1039 -892 -153 578 609 897 698 -48 -295 -995 -1176 -694 280 1279 1150 249 -498 -477
3262 -477 236 874 370 -670 -1513 -679 574 1948 1910 -245 -1734 -1541 407 2000 1494 -735 -2254
3279 -2254 -1732 666 2837 2139 -760 -3017 -2642 567 3285 2445 -1102 -3921 -2628 1269 4192 3136
3295C136m419k878J209M718K759j934m862k981K701N344K793k336n723l009K196
3310c286N495K610k502n384k525L507N749K780l686o442k701K852O305K982k897
3325B857n694k563L462N917K150l951p008k672M589P239L072l738p123l084M040
3340b507O557K507n161p182j929O045Q029K381n769q611k650N350P571K012n379
3355A264o896r86O377P444P47o760q279j854O910P923J871n957p093q47O275O536
3371F675L4p309p415j42P382Q545P28p366p449m88N930O956lp187o768J091Q075
3388A289P295p2q536q167J92P511P519k70p679o323J102Q176O856j804q788p901
3404i600J748Q702P394j218q345o172K023P670N673k708q671n569K686R337N835
$$ plain form
3295 3136 -1283 -4161 -2952 1766 4525 2591 -2271 -5252 -2551 2793 5586 3250 -2473 -5482 -3286
3310 -3286 2209 4819 2317 -3067 -5592 -2085 3664 6444 2758 -3684 -6385 -3533 2772 5754 2857
3325 2857 -2837 -5400 -1938 3979 6129 2178 -4830 -7502 -2913 4326 7398 3660 -3463 -6547 -2507
3340 -2507 4050 6557 1396 -5786 -7715 -1670 6359 8740 2971 -5640 -8290 -2940 4631 6643 1264
3355 1264 -5632 -6618 -241 7203 7950 1190 -7089 -8943 -2033 5890 7761 1804 -5289 -6136 139 6675
3371 6675 6709 -600 -8015 -8157 -775 7770 8498 1132 -6317 -6805 -875 6081 6078 -1109 -7877 -6786 1289
3388 1289 8584 8512 -24 -8191 -7999 -488 7031 6761 -918 -7241 -6139 2037 8893 7089 -1699 -9600
3404 -9600 -7852 850 8244 7026 -1319 -7491 -5468 2202 7875 5167 -3504 -9073 -6387 2950 8785
3419H785k423p958n784J737P715N039k572p709m376K958Q001N077k962q320n138
3434g930K605P545N069k519p735m329L306P504M390l787q112m248L453Q186M404
3449G802l610p473l805L727P220L410m270p138k998M172P132K953m101o874k745
3464f598M207O732J931m033o137k245M057N971J962m277n335j642L747N284J792
3479E416m119n434j296L900N144J337l362m880j210L773M448J081m070m779n81
3494d632L773M681R91l449m810o53L348L847J05l375l592L50M036L469m20l487
3510A82l631r0K680L204J7k291k539P03L024J624o60k905k060J41K551K059J25
3527B134j766j460K90J106Q02m89j562j061N61J979J425j07j384j311k76M65O61
$$ plain form
3419 8785 6362 -1596 -7380 -5643 2072 7111 4539 -3170 -7546 -4588 3413 8490 5528 -2792 -7930
3434 -7930 -5325 2220 7289 4770 -2965 -7294 -3988 3516 7906 4119 -3993 -8241 -4788 3398 7802
3449 7802 4192 -3281 -7086 -3359 3861 7271 3001 -4137 -7135 -2963 4169 7122 3021 -3853 -6598
3464 -6598 -2391 4341 6272 2239 -3898 -6143 -2086 3885 5847 1570 -3765 -5407 -1660 3624 5416
3479 5416 1297 -4137 -5433 -1533 3611 4948 1586 -3294 -4504 -731 3717 4798 728 -4051 -4632
3494 -4632 -859 3822 4813 1364 -3446 -4099 -751 3096 3201 -174 -3766 -3416 620 4089 3669 182
3510 182 -3449 -3539 -859 2345 2362 71 -2468 -1765 1259 2883 2223 -682 -2742 -2601 -50 2009 2134
3527 2134 368 -1092 -802 304 1106 617 -945 -2006 -1445 534 1959 1852 468 -843 -1119 -654 7
3544Gk15m19p5R60P84M33m09j334m84j74K51M33J66M53O79O0p11o82o65K83K98
3565c61N88p64p2O51J019R09p30k109j372L16J696J564j29j384r07R22J716O51
3583B204j545k820j152J919K980J534j191k446j603J199K190Q71j682l102m41
3598c085K180L437J221k230l347j722J659L184J500k145k975r49K554L746R76
3613D004k811m219j606K768M539J446k775l995r93L060L920Q67l716m675p60M092
3629h54M818P55l962m603o23L953M289O92m550m573J86M678M429Q0m495m656k64
3646d700M601M855k88m573m760K36M870M748k77n249m434L28N191M544n40n130
3662e78m800N80N418M824p00n477n103J149N684M593j122n969m691J570O172M784
$$ plain form
3544 7 -208 -627 -702 258 1042 1475 1066 -268 -752 -926 -675 -242 -76 377 1056 1116 405 -277 -942 -659 -361
3565 -361 227 -537 -609 42 1061 1970 1240 -869 -2241 -1925 -229 1335 1206 -178 -1085 -163 1553 2204
3583 2204 659 -2161 -3313 -1394 1586 3120 1929 -517 -2120 -921 1269 2140 458 -2644 -3085
3598 -3085 -905 2532 3753 1523 -1824 -3546 -1887 1297 2797 652 -2323 -3272 -718 3028 4004
3613 4004 1193 -3026 -4632 -1864 2675 4121 1346 -2649 -3642 -582 3338 4205 489 -4186 -4946 -854
3629 -854 3964 4719 757 -3846 -4469 -516 3773 4465 -85 -4658 -4472 206 4635 4715 220 -4436 -4700
3646 -4700 -99 4756 4468 -105 -4865 -4629 241 4989 4712 -537 -4971 -4643 548 5092 4552 -578
3662 -578 -5378 -4798 620 5444 4744 -733 -5836 -4687 997 5590 4468 -1501 -6192 -4622 1550 6334
3678F334j819n959m708J618N960M448j876o161l871K295O577L808k560o504m061
3693f479J996O530L871k133o225l325K823N867L163l023o555l073K789O628L816
3708F670k684o291l203K654N387L042l095o076k672L827O172L026l362o338l075
3723f018L048N695K675l110n630k065L675N762K078m401n989k281L889O313J996
3738E637l461n238j748L806N130Q33m255n476j004M530N411J579l738n193j685
3753d872L406M724O17l638m395k08M088M595P81l981n012j089L596M183J106l484
3769D17l696j98L780L818l0m193m246MM003L916K75l596l273k1L373K955m35l730
3787h77l233P19L878L572n75l668k959L95K785K660k59l351k321Q69L407K082
$$ plain form
3678 6334 4515 -1444 -6152 -4534 1426 5874 3998 -2163 -6034 -3739 2838 6646 4086 -2418 -6479
3693 -6479 -4483 2047 5918 3785 -2440 -5765 -2942 2925 6088 3065 -3490 -6563 -3774 2854 6670
3708 6670 3986 -2305 -5508 -2854 2533 5575 2480 -3596 -6268 -2441 3731 6757 3395 -2943 -6018
3723 -6018 -2970 2725 5400 2290 -3340 -5405 -1730 4032 6110 1709 -4280 -6561 -2672 3641 5637
3738 5637 2176 -3062 -4810 -1004 4126 4959 704 -4772 -5776 -1246 4165 5744 2006 -3187 -4872
3753 -4872 -1466 3258 3875 237 -4158 -4366 -278 4317 5098 1117 -3895 -4984 -1388 2795 3901 417
3769 417 -3279 -3477 303 4121 4091 -102 -4348 -4344 -341 3575 3850 254 -3019 -3040 333 3288 2853 -877
3787 -877 -4110 -3391 487 4059 3484 -184 -3143 -2748 37 2697 2438 -913 -3234 -2365 1042 3124
3803C124o40l331j784K32K627J975l96j995j946P01K392J343m94k609j653R16
3819a538J990J560o79j938j233O15J939J213r75j623j320Q73J799Q25o43j482
3835f17r26P89J416P51q46j393k73O25J159N0l86q49l9M52M86J71p22k73J90J10
3855a25P5J38J36mL9r5m85o4K0M93l7jm21J78L81O16q3p81q59l08N04J131P36
3878A184n99q51l28O84M62M21r91j231m62J333J837P22j385j620p69R29J666M34
3896A436j276j752o0K156J793K85k016k583o25J872K642J93j921k126L19K264
3912F01K128m29k869k560J77K970K662K62l037j875j17K579K260o98l218k208
3928c372Q06L576L083r48l393k747K95K928K570q87k972k188J173L584K535j367
$$ plain form
3803 3124 2484 -847 -2631 -2399 228 2203 1807 -188 -2134 -1433 959 2302 1808 -801 -2454 -1538
3819 -1538 452 2012 1333 -605 -1838 -1223 716 1929 954 -669 -1989 -1116 683 1508 865 -617
3835 -617 -1543 -754 662 1413 567 -826 -1099 -474 685 735 349 -500 -539 -87 399 570 -152 -425 -235 -125
3855 -125 -50 88 224 220 259 164 -321 -385 -365 128 91 90 -331 -153 228 844 761 -20 -879 -1187 -683 448 1184
3878 1184 585 -266 -594 90 552 973 -18 -1249 -1711 -378 1459 2181 796 -824 -1593 -664 1002 1436
3896 1436 160 -1592 -1652 504 2297 2582 566 -2017 -2642 -770 1872 2065 144 -1982 -1663 601
3912 601 2729 2300 -569 -3129 -2952 18 2680 2942 -95 -1970 -2087 492 2752 2054 -1164 -3372
3928 -3372 -2566 1010 4093 3145 -248 -2995 -2700 228 2798 1911 -1061 -3249 -2076 1508 4043 2676
3944B676l682k995P37L835L030o59l724k676J250L994K471j742m345l101J928
3959c003M844K518j279m392k777J985M053K025j951m574k137K608M580K246k295
3974B451m609k445K307M546J913k559m159j678K658M417J675k717m626j921K502
3989b245M822J967k922m241j399K844M101J677l193m695j283L112M872J158l131
4004A444m483j424L354M401J078l584m312j049L680M634P71l566m685n34L654
4019f21M323L78l794m116j53L421M319J75l631m104k9M059L288L70m048l931M55
4036c639L704L739k56l621l494K48L754L098k64l638l447N12L761L516m25l946
4052c98l228j3M138K765l61l405k848M72L897L002j122l802k871Q94L677K611
$$ plain form
3944 2676 -1006 -4001 -3264 571 3601 2942 -782 -3458 -2208 1786 4257 2515 -1830 -4931 -3003
3959 -3003 1841 4359 3080 -1312 -4089 -2104 1949 3974 2023 -2551 -4688 -2080 2500 4746 2451
3974 2451 -2158 -4603 -2296 2250 4163 1604 -2555 -4233 -1575 2842 4517 1800 -2826 -4747 -2245
3989 -2245 2577 4544 1622 -2619 -4018 -1174 2927 4604 1411 -3284 -4567 -1455 3417 4575 1444
4004 1444 -3039 -4463 -1109 3292 4370 786 -3526 -4575 -895 3739 4510 944 -3741 -4275 -621
4019 -621 3702 4080 286 -3830 -3983 -562 3757 3932 301 -3803 -3832 227 3515 3885 -163 -4094 -3639
4036 -3639 65 3804 3548 -73 -3567 -3319 435 3533 3269 -369 -3816 -3304 457 3973 3548 -398
4052 -398 -3626 -3639 499 3264 2903 -502 -3350 -2878 1019 4021 2899 -903 -3774 -2880 797 3408
4068C408j075l325k014J026L379J507j009l558k144J499L501J957j176k831j846
4083b701P66K871J704j381k921j294J328L052J819j407k857j917J087K613J339
4098B101r10k409j088J459K450J152j382k809j536J482K541J103r64j907r04J125
4114d96J685N58j532j779o16J330K237R78j317j722m29Q34J071J86j065j068j60
4131a305J498Q62L37q24j404n04P05P84K02l50k97j14O35O78J2o36j242k2M61
4150e24Q20L76l15l54p1J25p8L50n68k59L25M65L46n8j89l99J0k47l74K08J14
4171b97L64M49n39j05j69M06L79q0r88j25MQ82O81J11r25r43J72J015P01k73j185
4192d65q22M46J651P62o72j424j026O62J204Q41k09j618r23O85J363J151m89j536
$$ plain form
4068 3408 2333 -992 -3006 -1980 1399 2906 1897 -1661 -3805 -2306 1195 3152 1976 -855 -2701
4083 -2701 -1935 936 2640 1259 -1662 -2956 -1628 1424 3243 1836 -1021 -2938 -1851 762 2101
4098 2101 1191 -1218 -2306 -847 1603 2755 1373 -1436 -2972 -1490 1051 2154 1190 -717 -1621 -496
4114 -496 1189 1747 215 -1564 -2180 -850 1387 2365 1048 -674 -1103 -269 802 988 -77 -1145 -1305
4131 -1305 193 1055 1392 568 -836 -1340 -635 149 351 1 -296 -410 225 903 915 279 -963 -985 -524
4150 -524 296 672 357 3 -68 57 -21 329 -239 -498 -173 292 638 580 391 -8 2 -245 -619 -411 -297
4171 -297 67 516 -23 -128 -297 109 488 408 -580 -705 -701 181 862 973 48 -895 -723 292 993 720 -465
4192 -465 -1287 -841 810 1572 900 -524 -1550 -888 316 1157 948 -670 -1593 -908 455 1606 1117 -419
4210d19j222O84J703J070p51j959r69N99J938J404p54j987j262M57K401J062q97
4227A098k232j234J300K546J050r95k741j549J316K315J511r59k882j419J868
4242a007K828J084j995k840j246J913K939J390j813l083q28J870K740N77j700
4257H29l138j021K299L173J112k060l023j063J911K845R73k126l210o58K825K851
4273B519J006k802l274q00K386L003Q91k293l023k83K532L300K21l295l056o81
4289c649K966L583M99k840l452kL103K752l59l225k651J37L261L075j86k723l315
4306c026J30K802K890l91k760k524K73L329K619l67l623k894N35L187K666k80
4322B566l145k523O79L599J999j012l285k388N97L489K964r98l295k103Q12L221
$$ plain form
4210 -419 -1641 -957 746 1816 1065 -894 -1863 -1264 674 2078 1324 -663 -1925 -1468 933 1995 1098
4227 1098 -1134 -2368 -1068 1478 2528 1533 -1208 -2757 -1441 874 2385 1426 -1456 -2875 -1007
4242 -1007 1821 2905 910 -1930 -3176 -1263 1676 3066 1253 -1830 -2658 -788 1952 2529 829
4257 829 -2309 -3330 -1031 2142 3254 1194 -1829 -2892 -981 1864 2837 711 -2499 -3157 -332 2519
4273 2519 3525 723 -2551 -3351 -965 2038 2929 636 -2387 -2670 -138 3162 3383 88 -2968 -3649
4289 -3649 -683 2900 3399 559 -2893 -2895 208 2960 2601 -624 -3275 -3138 123 3198 3012 289 -3026
4306 -3026 -2896 -94 2796 2405 -355 -2879 -2606 723 3342 2975 -648 -3542 -3007 180 2846 2566
4322 2566 -579 -3102 -2423 1176 3175 2163 -1122 -3510 -2913 576 3540 2542 -753 -2856 -2044 1177
4338A177J881j417k953k282J719L436J876j448l127j981J298K835J785j420k525
4353a146j743J434L121J436j574l066j587J434K766J611j305l040r90J580K541
4368A472J412j814k847q22J326K779J212j289k805j094J445K586R23j574k505
4383a595j072J663K711O71j367k559p44J804K071P13j788k078m34J496J828O50
4399A970j570j948m61J421K119J11j299j658m96J780J561j77j136j443q2J167
4415a41J388J84j591j262K92Q23J630J68j097j213k82O54Q50L77j022m57l28J127
4433A00R28O5j204o95k29Q50P05J60o46m02j14R25L39n90l63n88J62M56N15N0
4453D24N3o01l1J28L4k12k60L67n3M98J18k18qj83k92m6k20K66K49O04m8m63j85
$$ plain form
4338 1177 3058 1641 -1312 -3594 -1875 1561 3437 1989 -1138 -3119 -1821 1014 2799 1379 -1146
4353 -1146 -2889 -1455 1666 3102 1528 -1538 -3125 -1691 1075 2686 1381 -1659 -2649 -1069 1472
4368 1472 2884 1070 -1777 -2599 -1273 1506 2718 1429 -1376 -2470 -1025 1561 2484 910 -1595
4383 -1595 -2667 -1004 1707 2378 1011 -1548 -2292 -488 1583 2296 508 -1570 -2004 -508 1320 1970
4399 1970 400 -1548 -2009 -588 1531 1642 343 -1315 -1811 -31 1530 1353 217 -1226 -1308 -141
4415 -141 1247 1431 -160 -1422 -1130 -307 1323 1491 394 -819 -1101 -447 403 780 -242 -699 -1027 100
4433 100 1028 1093 -111 -806 -1035 -185 520 680 34 -368 -482 443 782 192 -171 -759 -597 -141 374 424
4453 424 477 -124 -155 -27 7 -205 -465 -98 -151 347 465 247 239 56 -236 -282 -502 -236 13 617 569 106 -79
4476g9rJ69M1m48k81N8K79P96L46k73n65o46M0O82P8m7l32l38M67P60M22o29j076
4499e85o89N83Q64J061n87j029m18N51R97J88n05j572l49Q65J602Q07r69j727
4517i12o53J030J210N28r03j295n15J068J694O76j475j873m97J560J599K87j370
4534A59j346m18J618J540K29j542k091r9J418K200J32j657j576j72J425J738j1
4551A547j519j874j54K022J930J64k061j960n5J955J785P1j848j930j73K108K125
4568B133J55k232k275J01K132K095L7k524j730K3K391J959k85k433k067M39K324
4585B43K243n34k329k182N54K263K215m13k580j876L96K365J688k05k573j687
4601b412N66K738J791q67k218k057P14K194K206j015k194j788O54K702J770j259
$$ plain form
4476 -79 -88 81 122 -326 -607 -549 -270 526 872 599 34 -612 -572 110 188 141 -191 -529 -62 698 1120 491 -585
4499 -585 -1274 -691 173 1234 647 -382 -800 -249 748 936 431 -1141 -1490 -625 977 1784 815 -912
4517 -912 -1565 -535 675 1203 300 -995 -1510 -442 1252 1928 453 -1420 -1917 -357 1242 1529 159
4534 159 -1187 -1605 13 1553 1782 240 -1851 -1950 -532 1668 1800 143 -1433 -1605 -180 1558 1547
4551 1547 28 -1846 -2000 22 1952 2116 55 -1905 -1960 -5 1780 1851 3 -1927 -2100 8 2133
4568 2133 2288 56 -2219 -2118 14 2109 2146 -378 -2108 -2085 306 2265 1980 -453 -2520 -2081 243
4585 243 2486 1952 -377 -2559 -2005 258 2473 2060 -520 -2396 -2000 365 2053 1848 -725 -2412
4601 -2412 -1846 892 2683 1816 -402 -2459 -1745 449 2655 1640 -554 -2342 -1688 1014 2784 1525
4617A525k398j729Q59K590J400n42k766j618J201K779J040j257k651r76J465K439
4633A361J446j306k497j492J166K557J283j552k336r53J411K516J123j572k449
4648a294j381J365K534R73j265j844j209J363K475N85j476k654o39J360K626Q64
4664B383j371k438m60J039K350L15j550k124o40J995K345O89j861k004n68J144
4680g56J929M91j596j604j06J633J848j2j535j734n65J429J775L50j249j276l69
4697a347J412J250j53j333j351j19J358J465K14j298j027k21J216J015o5j195
4713a79r63J54R42J474k7j155j166k45R42J292l97p47q61M05R55N74k82r87o82
4732i53L75P83N24k02o59m99J80Q25K70k93l08m97J43L67L09j16j46l70J62K52
$$ plain form
4617 1525 -873 -2602 -1743 847 2247 1705 -1061 -2679 -1478 1301 2341 1084 -1567 -2543 -1078 1361
4633 1361 2807 1501 -996 -2488 -1322 1235 2518 966 -1370 -2323 -912 1604 2727 1155 -1294
4648 -1294 -2675 -1310 1224 2197 932 -912 -2121 -758 1717 2302 826 -1828 -2467 -1107 1519 2383
4664 2383 1012 -1426 -1886 -847 1503 1818 268 -1856 -2496 -501 1844 2533 672 -1332 -1900 -756
4680 -756 1173 1664 68 -1536 -1642 -9 1839 1827 292 -1442 -2007 -578 1197 1547 298 -978 -1347
4697 -1347 65 1315 1162 -171 -1522 -1641 -283 1182 1396 98 -929 -1150 66 1081 1016 -179
4713 -179 -1142 -988 -46 1428 1401 246 -920 -1165 -223 1069 672 -75 -936 -531 424 998 716 -271 -953
4732 -953 -578 205 729 527 -132 -631 -451 374 644 351 43 -454 -311 56 365 249 103 -267 -105 147
4752A47P8j45L1k44j2J22J65K18m59Q9M5J05k79L29l88L42p6j10Q2j57J31O1j48
4775g3Nj00J52p6Q2J14k33j00K42J31M36m27n9o94K67N15K60j72l37l42OO52O01
4798H50o57o72m03O55Q36L18l71j295j64N50Q63L84q76o54l16R11R97J53o52j228
4818g71k81N82J155L05q20j142J49R16J038o4j064j001n88J351J131L89p71j346
4836h32o1O00J261L53j297j516M7J034J645L06j253j374l32J453J133M3j456j136
4854a382n6J587J680m51j227j849J88J282J612J13j721j386M74J429J389j98j721
4871b37j619M69J648J196j03j362j412M16J298J280o24j726j258L91K166J386
4887A909k03j941j241R0J879J328n30j762j572P37K027J078m37k183j231Q06J913
$$ plain form
4752 147 225 80 111 -133 -145 -23 142 360 -99 -10 35 140 -139 190 -198 144 68 -42 40 -117 14 75 -73
4775 -73 -68 -168 -16 -92 -10 104 -129 -229 13 144 580 153 94 -600 -333 182 442 270 -67 -409 -403 249 850
4798 850 193 -479 -882 -227 609 927 556 -739 -903 -353 510 894 18 -636 -952 -41 956 1109 457 -771
4818 -771 -1052 -470 685 990 170 -972 -823 93 1131 1067 3 -998 -1586 -235 896 1285 514 -832
4836 -832 -893 -293 968 1321 24 -1492 -1445 -411 1234 1540 287 -1087 -1419 34 1167 1210 -246 -1382
4854 -1382 -1438 149 1829 1378 151 -1698 -1510 -228 1384 1497 -224 -1610 -1136 293 1682 1484 -237
4871 -237 -1856 -1387 261 1457 1354 -8 -1420 -1004 294 1574 950 -776 -2034 -1643 523 1909
4887 1909 1706 -235 -1476 -1386 493 1821 1291 -471 -2043 -1306 721 1799 1362 -821 -2052 -1246 667
4904F67J082o76j618j259P80J826J241j028k062q67O64K021J327j079j757r99
4920a737R03J643J039j087j524j233Q12J949J155q41k108p25Q61J866P87q94j924
4937a058o12Q35K166O07j191j735r59R75J921Q86j347j701o40J129J875O96j316
4954E31j670o48J352J631K41j076j449o43J403J409N09j301j336l41Q88J462O39
4971A601j325j695j25J190J487L10j365j429M7J155R66L23r67j337j08J133J012
4988H73M48j048j492o1J030J426J32j208j103k5J012R08M9j035j207K60J191Q41
5006I91R6j153p89L0R05P78m5j006q49N16P51J007o88q82m71J18O76J014l85p38
5026a24m97K1R65L36k27j008m51P49M0O32K21p40r0l3K40M60l19n03j45J06N17
$$ plain form
4904 667 1749 1073 -545 -1804 -1024 802 2043 1015 -1047 -1914 -1250 771 2098 1019 -738 -1737
4920 -1737 -834 809 1848 761 -763 -1996 -1184 765 1920 1079 -1029 -1754 -893 973 1760 866 -1058
4937 -1058 -1670 -835 1331 1938 747 -988 -1947 -972 949 1835 488 -1213 -1853 -724 1151 1847 531
4954 531 -1139 -1787 -435 1196 1437 361 -1088 -1731 -328 1081 1590 289 -1047 -1388 -500 962 1601
4971 1601 276 -1419 -1544 -354 1133 1443 78 -1351 -1304 -149 817 1140 173 -1164 -1272 -139 873
4988 873 1321 273 -1219 -1280 -250 1176 1308 100 -1003 -1028 -16 892 941 -94 -1301 -1041 150 991
5006 991 1087 -66 -855 -825 80 858 813 -193 -1042 -526 225 1232 544 -338 -809 -691 -15 999 614 -124
5026 -124 -621 -600 365 701 474 -534 -985 -236 -196 436 657 -83 -173 -206 34 494 175 -328 -473 -367 150
5047A50M27j68k83m21j6K41K18m60M18n37J63N78J04l44j46m04N4L40J88j52K09
5068A59m4K21J1n40j37J05J93K14l96L03N8K81j00j45l17j37K86n9O52k33k25
5089A50l71K08K86p2l35k88j25M61J90L92k38n94q3J54N14J06m60k94K1K27O13
5110D62K03j19r05k87M23P94p2k78p70m0M68O23Q7j73j071k90Q41N67L60l14j143
5131f34j33R68M61N9p12j073J46J030Q20J95j009r74J55O19J027k25o90j067R
5150a028J024Q56O3j103q06L35P96Q05J20r17j140LQ74J000K02j171r10J83J003
5169A89Q97m54j099o46L09P22J315k00j339q17M7J195J165k98j231j034K78J505
5187E04R34n16j294q56J97J316J250o43j442o38M36J334O81o50j202q31M76J326
$$ plain form
5047 150 577 409 126 -295 -311 -70 148 -312 106 -431 -268 310 414 70 -76 -480 -426 -86 102 -50 159
5068 159 115 336 347 -193 -330 -225 -32 182 -214 89 147 428 328 183 -134 -271 15 -44 608 375 150
5089 150 -221 -13 273 201 -134 -422 -547 -86 104 496 258 -336 -419 -265 249 355 -105 -399 -378 -151 462
5110 462 665 546 -359 -646 -223 571 499 221 -549 -589 -121 502 589 416 -655 -945 -104 463 823 509 -634
5131 -634 -767 201 662 721 9 -1064 -918 112 932 1127 118 -856 -701 -82 945 720 30 -1037 -1028
5150 -1028 -4 852 915 -188 -994 -659 137 942 1062 145 -995 -992 -118 882 1084 -87 -997 -814 189
5169 189 1086 632 -467 -1113 -804 -82 1233 1033 -306 -1123 -1076 119 1284 986 -245 -1279 -1001 504
5187 504 1438 922 -372 -1228 -1031 285 1535 892 -550 -1188 -752 582 1263 613 -589 -1420 -944 382
5205C82P47m09j298o38L86J392O98m86j401q23P63J170R12m24j438q47O82J128
5223D96Q06p53j161o95M26J598P80n71j518p00O79J243N10l50j339o56P77J455
5241A027M64p86j734j65N30J423N22q83j082l48P21R87K37q12j238L33M02J237
5259H35M09p23j109o93P86J057M75j109o19k83P46R55O26j371p38l63Q74R20K99
5278I74o36r85l16Q99J009l57o80q98NO63J209P7m41j251r2Q02R88k41q86n51
5298g08j91P25Q05R2o28q28pN53P27K4o71o17K53M48P03J4r40k24k01P41O83j02
5320F51m83q14J42N92O18k78l68n62rO61K84R0o41l92K73M55L98j09n77l87J07
5341c49L36M33j81l67l27JN65J42q0l54k13L91J41k3R0k96k06M59j03Q8k2k21
$$ plain form
5205 382 1129 720 -578 -1216 -830 562 1260 774 -627 -1450 -687 483 1395 971 -467 -1314 -632 496
5223 496 1302 549 -612 -1307 -881 717 1497 926 -592 -1292 -613 630 1140 790 -549 -1205 -428 1027
5241 1027 1491 705 -1029 -1194 -664 759 1281 398 -684 -1032 -311 676 913 101 -1137 -804 -402 835
5259 835 1244 521 -588 -1281 -495 562 1037 -72 -691 -974 -228 727 1353 -18 -756 -1119 -245 675 974
5278 974 338 -647 -963 -64 945 588 -92 -990 -985 -322 887 964 523 -728 -820 -18 970 729 -157 -708
5298 -708 -899 -174 631 723 95 -733 -740 -187 540 564 -107 -724 -471 -23 680 694 -246 -470 -671 70 753 651
5320 651 168 -646 -504 88 706 428 60 -502 -511 150 434 524 -117 -509 -236 219 617 508 -69 -456 -349
5341 -349 -13 420 239 -128 -455 -454 111 253 173 -181 -394 -3 138 115 205 -91 -297 162 59 147 125 -96
5363i6j72K29o2J94j05K81k13j91M0O3m5K08k37J85m7m4R5J4O8j31p6j30Q9R6
5387A3K36M8k41j61K26K0o7k29N3j64K41J41M3J81l03j61m7K77K17r1m50j70L42
5410d6N00j62l5m07k56R5M47L42l46m56j7M67l1J30O0p36j93K74P34L77m34o37
5432c30k68L58N73L18p19n13NO76O45L3n10o23l28M40N58ok05o22J22N39M48J9
5454F10n62p89LO06P89K12n75o11j89O94K88K36n16j019K33N81P99j2o04q30m8
5475g04R37N33k31o59m06l16R44O22j82n07q61J75N40O38J84q50m65OP50N50k62
5496D36n96n86j08Q18R51n2r93n85J79O33P58J98j005q05J52R05Q06m61q67n32
5516g54K7Q50O19k09j034j77kR72O36m04p33o65L92M27P25k50q78k68pJ115L59
$$ plain form
5363 -96 -268 -39 -101 93 -12 269 56 -135 -95 -32 -77 131 -106 79 32 -12 83 97 165 34 -42 -172 -83 13
5387 13 249 297 56 -105 121 141 74 -155 -102 -266 -25 116 159 340 37 -124 -171 106 323 232 -218 -388 -46
5410 -46 454 292 257 -150 -406 -311 136 478 132 -324 -341 126 95 225 285 -451 -644 -370 364 741 307 -330
5432 -330 -598 -240 333 651 -68 -581 -576 100 745 778 268 -355 -683 -243 315 309 104 -518 -396 143 591 610
5454 610 48 -741 -738 -132 657 869 294 -317 -506 188 476 712 196 -823 -590 -9 790 778 174 -656 -704
5475 -704 233 766 535 -124 -530 -846 98 720 538 31 -830 -655 -115 523 707 -143 -608 -602 148 698 436
5496 436 -160 -746 -854 -36 915 863 -130 -715 -536 97 855 1053 48 -757 -605 300 1106 645 -222 -754
5516 -754 -727 123 742 533 -501 -678 -680 292 928 524 -209 -874 -482 -55 670 420 -458 -726 -733 382 741
5537G41j98q37n30M74Q57M59m14o11r20Q15M26M28l56p35k91L11N98O96l78q87
5557c52l54l1J019L81k03o93o99P74O72J79m06p83l35M06J006j32j19o08n22L44
5577d56Q80J38j40r02k92O44P38n7l54p34r3O17M88L03n62m52l64L56N75K33o18
5598e2k77k48N44N18K1l18o94O4L10L15K37k23l88k32L20M98J49m99n67N1J42
5619c29N97L12m86l92J12J47n2M17m86j65L8K47K98o3j6n58j6M16K88J8j82k92
5641a47J11M5N5j2j85k07K8M29j7n3j89Q0m1J03L55k58k8l86J26J46R3L33k26
5664A55q3j60J82o8o1J71l44L43j73O5rO6j92M7J23Kl67R0J95j10K29l98K80K27
5688B10j59j08M1j52n8K12L58k48k94J7L3K95J00q3l68OJ27K51j2j9n03J33O8
$$ plain form
5537 741 543 -294 -824 -350 507 966 552 -59 -979 -164 262 690 334 -401 -692 -381 217 913 535 -352
5557 -352 -706 -737 282 663 460 -233 -932 -158 514 693 287 -496 -831 -425 581 449 330 -278 -800 -456
5577 -456 424 562 422 -480 -772 -128 610 553 199 -535 -628 -11 477 780 218 -234 -598 -242 333 566 -52
5598 -52 -329 -577 -33 485 506 188 -506 -442 -132 183 420 197 -191 -423 -103 395 544 45 -522 -471 -329
5619 -329 268 580 94 -298 -186 -39 -91 326 -160 -325 -287 -40 258 195 179 -379 -395 21 309 327 145 -147
5641 -147 -36 9 64 52 -133 -340 -312 117 100 47 -142 -62 -103 0 355 97 69 -317 -191 -45 48 381 155
5664 155 72 -88 94 26 -35 136 -208 135 -38 27 18 84 -108 -61 62 64 -303 -213 -18 -128 101 -297 -17 210
5688 210 51 -57 -16 -168 -226 -14 344 96 -198 -181 -148 147 247 164 -204 -198 -71 180 168 149 -354 -221 -153
5711a53N82r8j33q9o4p1J86r1p5j05n2k88O42J01K2m18l88J58P23P7l47k11o51
5734g43O49K44K46k1o64l89N67M03R2j43m22j66J60K95K26l46l00j14K03N30K02
5755E09k78l66m93L20O05J32m04j63n79N13P32P2k89o72k20K90Q01J3l62o22k0
5776d81L25O56J86l51j155J05M47Q10K69p81n93n4M47N44L85n55o65N6M58M24
5796D77O64r76q11j06P37M26on83l16M3N12O37o6n17o71j41P23O20r6m33o41n5
5818e79N34O34k8l56r40Q9P30O83j06o51o09l3L85J103j98r53n02K32M57Q75L
5839G70r28m36P8P23M49l4r13l97N6Q31K91K4n99j052P09O99L91p8p13n66K97
5860c98N22N38j64p16n43M52O32M13m85n91m59J25R88M21j71q95l32N48L20L05
$$ plain form
5711 -153 429 331 198 109 45 -26 160 69 -6 -111 -163 -451 191 292 314 -104 -492 -334 389 466 119 -92 -743
5734 -743 -94 150 396 375 -289 -678 -111 292 384 241 -181 -347 -187 108 334 -12 -312 -426 -223 307 509
5755 509 231 -135 -628 -308 297 429 25 -138 -717 -204 528 600 311 -361 -581 -291 510 523 161 -461 -481
5776 -481 -156 500 686 335 -820 -715 -268 542 811 30 -563 -617 -170 374 759 204 -461 -405 53 477
5796 477 1141 165 -646 -752 -15 411 405 -178 -494 -451 61 698 632 115 -556 -697 26 646 550 117 -524 -579
5818 -579 -45 589 561 205 -735 -646 84 767 661 10 -599 -632 -247 856 658 -295 -797 -565 -108 767 770
5839 770 -158 -594 -516 207 656 622 -291 -688 -632 199 490 514 -85 -1137 -428 271 662 584 -129 -695 -398
5860 -398 124 662 498 -218 -761 -309 323 736 251 -340 -799 -674 314 735 564 -331 -663 -115 205 510
5880E10j66o97l22J44Q25R5J82q67k61R1J031j9l28l05l94K04O84K99n22p99J72
5901d43N4N52K96j15o78k83M33O09k7j44n36k28J61N41L58l57n07j10J44Q16M0
5922E76m42j62m58L68M00J08k71n64L8L25K75J38j30m84P9j27Q83j11n94j32k32
5943e17N02L16o4K9l32j96L90k2N7j08k61J23l5M12m8R3n14k46N86J63j09j44
5965G5j51r6L93k72K61k53P0q0J72n1n2K48m08K59k28N6L91j86j38K55l35J49
5987G9k52J22K39k81J30q9n9L20o2j43J63l68P5J17J33nk51Q9j22J52K90j21j70
6010a4l49K43K62L7L5lm60N0K63L40j97m12r4K26oL54R2n30m14N50P8J47O8m21
6034a55k57K57K21L73k94l03o1j70M73M53l21o10n1N1O82K66l70n60k63L81P15
$$ plain form
5880 510 344 -353 -675 -531 294 389 571 -296 -557 -466 565 546 218 -87 -481 -277 407 706 184 -615 -443
5901 -443 -389 163 459 344 -334 -617 -184 425 398 254 -282 -510 -349 192 550 193 -314 -424 -280 536 576
5922 576 134 -28 -486 -118 282 390 119 -445 -407 -82 193 331 201 -283 -204 -331 552 441 -153 -285 -517
5943 -517 -15 301 237 266 -66 -262 128 106 163 55 -206 -83 -118 294 246 339 -175 -421 165 328 219 75
5965 75 -76 -172 221 -51 210 -43 27 -53 119 68 16 264 -144 115 -113 -57 334 148 10 265 -70 79
5987 79 -173 -51 188 -93 37 -52 -111 209 147 4 167 -201 -126 -9 124 119 -132 -43 -165 -13 277 156 -14
6010 -14 -363 -120 142 179 214 211 -249 -199 64 404 207 -205 -299 -73 -79 275 367 -163 -577 -27 51 198 266 -155
6034 -155 -412 -155 66 439 145 -158 -219 -389 84 537 216 -394 -445 -394 288 554 184 -376 -639 -258 457
6055D57J49q3n62l91J2M56M42j91n00l56K09Q74J58n73o38l1N40O04j32l99m27
6076c82k51N16R57l41j81q41j87M57R70jn29q58k8N52O47J15n10p33r5O06P04
6097E87J68l63j055l73P94Q54K5m13p03k62P65P99K1p02q23j51O96O97M6l12n99
6118c04m51P41R44k02q22o79M5M80Q00O2o22o72K4P65P30K8j069n45n9Q92O90
6139G76r9r40k63j14P16P58l00n40p66L57P17L90j4j106m17K28O02Q16j41q06
6159a46o20J37Q84L63q8q05n11K01P02O03k98l35p94L14P13N54l62q86l19L29
6179c64M80O45m80k46o66L27O91M23k89q22l93N04N07J02j32o18j14L89L73K73
6199E90k23o86k86M32N70K54k52p25k0n5O93J09l52k83j39J78N52P7l47m32J05
$$ plain form
6055 457 606 523 -39 -430 -418 38 480 289 -211 -567 -358 516 674 101 -537 -568 -28 576 444 45 -382
6076 -382 -633 -117 840 499 318 -523 -710 -253 717 716 187 -671 -699 -147 500 615 105 -628 -723 -117 587
6097 587 755 392 -663 -1036 -242 612 637 224 -479 -741 24 823 844 142 -681 -832 -136 561 607 295 -304
6118 -304 -755 -14 930 728 -94 -773 -728 -248 552 614 -8 -680 -656 109 839 867 -202 -747 -806 86 776
6139 776 677 -263 -526 -640 76 834 534 -6 -772 -415 302 692 678 -428 -845 -617 -15 801 660 -146
6159 -146 -766 -629 255 618 530 -275 -786 -585 117 720 422 87 -707 -393 320 874 512 -374 -693 -364
6179 -364 116 761 281 35 -631 -304 387 810 521 -301 -694 -190 317 419 287 -331 -445 -56 317 590
6199 590 367 -319 -605 -173 397 651 399 -326 -346 -401 292 401 49 -234 -373 -195 357 434 87 -345 -240
6220b40J35M60J16l88n12k26N53L92J12l70k86j67M5N36j14N2l80j5M03L54k54
6241B06j32n89M8M48K60R2k43l32M1O2L31j07m02P6p8L09J32k5k98K46k82K96
6263E9Q6K53k72l32K09K01j39k97L38j61l00K29J72J8o3J21k24K74n1J06k63j33
6285a69L81k8k05J01q5P0r8m8m9q4R6K93q3k85K48o4P7J71j0n10Q2k13M50N43
6309E81l08m29j45J34K02K40j87q7K9l14L36M58m14l63j50K6N36J94k48k70k40
6330d19K01K56M18j46m74j42q6M51O46k44l55p34L41M58L7L39j061l51O38M72
6350B45K89k84l59n20N01L02M59n26m64m13L83O73N66p20n21k02M15O59L44o04
6370B23o46M0K44M85K80p52l79J06P8R54Q9o05p03j99P68N29K26l55p95l10N83
$$ plain form
6220 -240 -105 355 471 83 -429 -655 -102 290 402 32 -254 -421 -376 160 46 98 -282 -297 106 460 206
6241 206 74 -515 -467 -19 241 333 90 -242 -201 -139 192 85 -317 -241 -319 -10 122 97 -201 45 -237 59
6263 59 145 398 126 -206 3 204 65 -232 106 -55 -355 -126 46 64 1 122 -102 172 121 227 -36 -169
6285 -169 212 184 -21 80 -5 65 -33 -81 -130 -214 -118 175 92 -193 55 -9 68 239 229 -281 -199 -412 38 581
6309 581 273 -156 -301 -167 35 275 88 1 30 -284 52 510 96 -267 -417 -391 145 339 91 -179 -419
6330 -419 -218 38 456 310 -164 -306 -392 59 705 461 106 -628 -287 171 208 547 -514 -865 -227 245
6350 245 534 250 -109 -629 -128 174 633 107 -357 -770 -387 286 852 132 -389 -591 -176 483 827 223
6370 223 -423 -383 -139 346 626 -126 -505 -399 -321 633 722 117 -586 -785 -17 512 738 383 -412 -722 -139
6391a39O97K57o04r83l5P34J017K9p72r30p4O47J028o0p25q99J44M78R75m8p02
6412C5r95M44L96J037m2p18j010p0J057O59j23p13p88j48J220L73o9n47o96o5
6432g63P34R71m03m54r39J73O43Q20J11j005j051L45R59P63m01n51o70n7Q87O78
6452G90q6r95p61L45Q07N12L05j112p19M29O56P50j38j199n27O21O88M15j45r95
6472c59p23M84Q11N86l23q38l56L45Q48M27m29q09n12K28R88L92j71j115k26M00
6492c52R08J12k66p41n09N92P46K32n89n63j81L53P70R0j55j036k38N53Q16l3
6512E09k35p93n4K88O18J42l90l77k53M58O05J00o15m05J5J80N39J77l28l86l66
6533e71N37L77K72o42l94j23L90M61J13m85k05J9K13L24J27l14k10j62K21L90
$$ plain form
6391 -139 558 815 211 -772 -807 -73 944 973 201 -729 -803 -156 872 812 87 -812 -668 -190 785 737 35
6412 35 -960 -516 -120 917 875 157 -853 -923 134 793 670 -43 -831 -979 241 614 545 -2 -698 -763
6432 -763 -29 942 539 85 -854 -681 -38 782 893 -112 -1163 -818 141 904 503 -48 -718 -775 112 790
6452 790 704 -291 -1052 -707 100 612 917 -195 -914 -485 171 921 783 -416 -943 -322 366 781 636 -359
6472 -359 -1082 -598 213 799 476 -362 -718 -373 475 902 473 -336 -848 -620 368 760 589 -526 -752 -352
6492 -352 556 668 402 -339 -848 -256 490 722 133 -430 -611 -258 512 602 447 -589 -827 -274 542 509
6512 509 274 -519 -573 -285 333 475 85 -292 -545 -87 518 618 3 -402 -387 -207 332 509 181 -205 -571
6533 -571 -34 343 615 -27 -421 -544 -154 307 420 -65 -270 -251 -38 286 413 99 -111 -273 -52 338
6553C38j27l00l78K97L70NK5q4k02k38N91Nj36q6m8k68J98K59R5k39k45K12Q5
6576A29l7j44J89j61J37O4j92J26R4k75J87l2k25k6L28j79j05q0on4L57P7j79
6599gj01J51j87mL78L3m95J44k6P5M20l07j28k91m6K11L01j43l55M2L59K40K4
6622B88J76p80j45K27N15L42l20n48k20M21L38J74l89l94n2p0Q15L15m65m47l39
6643e58M35N52j9k38r35J60M07O22L77o00o71k75N07M87L85n53o87j70N52O50
6663D28J94o23o28l5J70J202j87r3j400N18N09O90J45p79n88m01O78J028k07o77
6683e6p55pP41P36J38p92p32j51J052M59K22r29j041J91J041Q93l45p25q00J14
6703g46R37O05K88j088q17mO98J313l61j095m55N2J103N77j02r98r64J68J135
$$ plain form
6553 338 211 -89 -467 -170 200 205 230 146 -56 -294 297 302 166 80 32 -236 -38 221 316 77 -168 44 129
6576 129 92 -52 137 -24 113 177 -15 111 205 -70 117 85 -140 -166 162 -17 -122 -202 -208 -262 95 172 -7
6599 -7 -108 43 -144 -148 230 263 -232 -88 -114 -39 381 74 -54 -345 -391 -180 121 -22 -377 -335 24 264 288
6622 288 464 -316 -461 -234 281 623 303 -245 -465 -44 294 468 79 -315 -367 -437 378 693 228 -219 -558
6643 -558 -123 429 410 172 -763 -603 -196 426 803 203 -468 -743 -236 251 636 83 -604 -774 -222 428
6663 428 622 -1 -629 -664 -494 708 521 428 -972 -454 55 745 890 111 -477 -878 -200 828 621 -56
6683 -56 -811 -818 -77 659 797 5 -727 -878 174 633 855 -74 -1115 -924 117 1010 665 -60 -860 -746
6703 -746 191 796 1084 -4 -821 -825 -127 1186 825 -270 -725 -673 430 1007 905 -93 -1057 -889 246
6722B46P32j00r88j037L11J139N34q8j151n88K63J075R03n30r28j058M21J389
6740E45N27n47r34n37L05Q39Q54n21j021p79M97J169Q75o96j055m78M42J196M24
6759A105p38q92m51N53J020K76l01j260m47Q52R55N02n13j365k10M96J039L78
6777I99r03q69k86N51J330K58p77r89l88N94J103N70q27j152j65Q33P88J36p47
6796E9q18n6R09N99J42m96r22j55P95O54m9m87q50n3P10N32J58m27r29j47M91
6817c40R06M01j058m43j19M88Q26K22p91p15o0P61M33N5l65r08R1P03M43k37l53
6838f0m79J61O55N86l44l36m78k91N81M43j65m08k52J53L59J90M3l00o43L56K64
6859C5J95J18m61j33J10N2L89P4l97m23J19K77J52L1j75j99j28L83K86k21p2l43
$$ plain form
6722 246 978 878 -110 -1147 -836 303 837 749 -402 -990 -727 348 1251 721 -207 -1265 -844 545
6740 545 1072 525 -409 -946 -641 198 1052 531 -490 -1269 -772 397 1272 576 -479 -957 -515 681 1105
6759 1105 367 -525 -976 -423 597 873 572 -688 -1135 -283 672 1174 661 -704 -914 -418 621 999
6777 999 96 -773 -1059 -508 822 1080 303 -686 -1074 -480 623 1193 366 -786 -951 -118 670 806 59
6796 59 -759 -815 94 693 835 339 -583 -738 57 711 662 175 -675 -728 -18 514 672 245 -684 -831 -340
6817 -340 566 967 -91 -534 -653 -165 661 883 92 -623 -683 78 511 566 201 -707 -616 87 530 293 -60
6838 -60 -539 -378 277 863 519 183 -295 -586 -5 438 273 -135 -387 -234 125 315 358 58 -585 -229 35
6859 35 230 348 -113 -246 -136 -84 305 379 -18 -441 -322 -45 107 138 -37 -236 -364 19 305 84 12 -331
6881c31J70K77L0r1K1l40j0K19J27J6j03N6L26l67j02j25M10N6j25l66J11J35
6903fQ0L6Kj16PN5J11l32L17l49j80M30K24o1k04k89L0q9P75j40j41m95j2K98
6927d9M20R9m93l29j11O21J9K07k02m33k32L17M98L02l70q16J45L82N55R9l49
6948B80q12j29K35J105P4m35n93k87O65L14K63p82n02N2P06M20K24n78r16o1P28
6969b9Q49k81n81r83M50P48N80j08o30o09k16J125N40J27j192p36j46J098Q98
6988I04j06j043q02J49J276M44m9r58q49M33R78N07k39r87q06N09O50J059m44
7007F26j155q52O75R15J025n57j188p13O17J123O56n74j151m04M64J123O20k15
7025A035j572r78O03J463M42l74j354l51J004P34O31q84q76q55P40J085N65m29
$$ plain form
6881 -331 -161 116 146 55 76 -264 -274 -55 72 88 -15 41 367 0 -102 -227 183 239 114 -252 -141 -6
6903 -6 74 110 112 -4 3 58 169 -163 154 -195 -375 55 279 218 14 -275 -245 -334 441 301 160 -335 -347 -49
6927 -49 371 470 -23 -352 -463 158 177 384 182 -251 -483 -166 332 634 264 -552 -407 -25 530 629 280
6948 280 -532 -661 -426 679 753 318 -275 -562 103 417 680 -102 -604 -552 154 574 798 220 -696 -757 -29
6969 -29 820 539 -42 -1025 -575 173 753 645 15 -594 -810 315 855 982 -210 -946 -1092 6 904
6988 904 798 -245 -1047 -898 378 822 773 -185 -1034 -601 377 884 645 -342 -1148 -639 11 1070 626
7007 626 -529 -1381 -706 209 1234 677 -511 -1224 -607 516 1172 598 -553 -957 -493 630 1250 1035
7025 1035 -537 -1515 -912 551 993 619 -735 -1086 -82 652 1283 399 -477 -1332 -592 493 1058 629
7043F29j192n02O74J037M66o81j164o31R79J184M59q72j211k23N77J279M98j044
7061B62j067l38O49J427K31o39j402l78R54R66M27p45j304j82J088Q93K20r04
7079A58j316K55Q34J127j66q89o14j53N57Q92J25p43j152M22O09R48L13j147j044
7098i84j2Q52R92K10j157p11R8Q60Q01M7j394l73J26Q42N47j0j105n72J45J043
7118B45O19l57q18l93L10N22P81j12j105n54L89Q30O47o78l06n43J45O04J90j52
7138B64l43l73J65O24K63o0p01p90O84M03N35l15n75j98J04N34K19j22l07l57
7158c46MM81L35k46o01M8oO91N1k30o8m55R5M85L06m01n23R3L01L1m4J8p0J56
7182A05k23J07P3J43j68o0P8M6J42q4j79K91k08K8k12J44N5qj09j21J7K97O4r6
$$ plain form
7043 629 -563 -1065 -391 646 1112 431 -733 -1364 -385 799 1258 386 -825 -1048 -471 808 1306 262
7061 262 -805 -1143 -494 933 1164 525 -877 -1255 -301 665 1092 347 -957 -1139 -51 842 1062 158
7079 158 -1158 -903 -69 1058 892 3 -611 -764 -207 685 810 67 -1085 -663 -54 894 1207 60 -984
7098 -984 -996 -144 848 1058 -99 -810 -712 148 949 996 -398 -771 -645 197 744 734 -371 -943 -798 245
7118 245 864 507 -311 -704 -394 128 909 797 -308 -862 -473 357 1004 326 20 -523 -378 226 416 264
7138 264 -79 -452 -287 337 600 540 -161 -951 -267 136 671 356 -219 -417 -313 221 440 318 11 -346
7158 -346 -342 139 474 228 -373 -325 -331 360 411 181 113 -342 -247 238 544 143 -380 -287 14 45 1 19 -51 105
7182 105 -118 -11 62 205 37 -23 55 101 243 159 -20 271 63 91 -121 23 78 70 -39 -160 -143 154 218 122
7206A22k86j69J05QM17lk18k26J68J64K72n5k26o56L66J99J79K58k96l84k36L42
7228a55P62k78o23l42K90M20O28j56n46n86R0N36P23l8r95k17K56N34K70j07o33
7249a67l34K1Q22J71lp61m63J67O71N93k99p57o11M29P46O23k53p25o41l6J080
7270B73P87o85o27n37K92Q62N94l43q78p32K49J118Q51n73j069m30M57J056L66
7289A031l64r92r18N95J276N06p37j033m28N55J153M39o02r01n00L32J282L54
7307A048m89j020n67P19J130M18p65q24p47R25Q07M57p86j266j12O71J070O45
7325A314q44j470k69R18J062L27p16j213j85J072Q95r3o57r83j60Q07J242K8r40
7344A35j171o3R10J199K43j289j069Q9R35J222Qj130j255J23J132Q85J90j123
$$ plain form
7206 122 -164 -333 -228 -220 197 194 -24 -250 -82 82 354 299 73 -583 -217 -18 161 419 123 -261 -497 -155
7228 -155 607 329 -294 -636 -346 74 702 546 0 -586 -496 40 763 725 -270 -487 -231 303 573 466 -167
7249 -167 -501 -480 342 513 510 -251 -714 -547 124 717 418 -339 -950 -521 225 848 595 -130 -771 -807 273
7270 273 1060 375 -252 -789 -497 365 959 616 -262 -994 -745 373 1224 651 -418 -848 -391 665 1031
7289 1031 667 -325 -1243 -648 628 1134 397 -636 -1064 -509 644 1083 481 -420 -920 -588 694 1048
7307 1048 559 -461 -1028 -309 821 1239 474 -350 -1097 -172 635 1092 306 -960 -1072 -401 669 1314
7325 1314 470 -1000 -1269 -351 711 1038 322 -891 -1076 -4 891 798 141 -842 -1002 -195 1047 1075 135
7344 135 -1036 -1099 -189 1010 1253 -36 -1105 -1016 -81 1141 1149 19 -1236 -1113 19 904 1094 -29
7362b9j005m7J099J209l20j020j127P0J185J264k30j069r71K17Q99R52k9j121
7380g3j074J01R31J183l98p28j149N45J119O65m22j150n87L40J177Q44n95j071
7398c42r15M45J001Q06n48q66n89L22J172M43m74p68o37L10J081L71l55q04m30
7417g77K34R73J7M3q78n39O40P72K25l34o98o89M57R80L36l48q12l57N26O01M82
7438H54m39q16n83O23Q78Ok51n29l39K80O79J23l29p25L6M97K21P7k57l02j01
7459c97L51J95J13k05k71m3L06Q5L22n76L7j52J00M60k43k91R1qK4M59k5k48k29
7482a45M8R6J25K8N5n22K12J78K6j3k22j5J93K97n03J87K18l09k0J56j07K1l6
7505e2J94J30k22l08Q5J79Q3J31o6m31J91oK99r1l9k88o5K90K43l3k90m30L52
$$ plain form
7362 -29 -1034 -1081 18 1227 907 -113 -1240 -1170 15 1279 1049 -20 -991 -774 125 1077 1048 -73
7380 -73 -1147 -1046 -115 1068 670 -58 -1207 -662 457 1122 700 -450 -1037 -697 480 1324 729 -342
7398 -342 -1257 -812 189 995 447 -419 -1008 -686 486 929 455 -313 -950 -640 441 812 457 -347 -777
7417 -777 -543 430 447 490 -388 -927 -287 485 710 376 -322 -1011 -554 426 762 414 -398 -755 -229 372 854
7438 854 415 -401 -984 -361 517 523 272 -257 -596 -316 363 486 157 -568 -532 -35 186 263 6 -296 -397
7459 -397 -46 149 262 57 -214 -257 49 134 456 -120 -83 -235 -135 325 82 -209 -118 -126 -102 357 332 84 -145
7482 -145 -97 -1 124 152 207 -315 -103 75 101 88 -134 -149 44 341 -162 25 243 -66 -86 70 -37 -16 -52
7505 -52 142 272 50 -258 -173 6 89 220 154 -277 -86 -92 207 116 77 -211 -276 14 257 224 -66 -496 -144
7528a44L16P2J30m89k33K35L26J59q4m71j88J69L51K82j40q23J13J69O49J16l98
7549A17m73j22K24O13L59n00o79KK27L28O61l75p89m79L81J175K65o66o78p60
7569a169J028N08M18m18r59l3M46Q61J05o65p51k74M80J010J88o40o21l47L57
7588d76J236l3l05j111l81R38Q50M5n36q50k78O68J219N3o19j334NQ43J005K27
7608A166j124r01l26J143R29J29j158p78j76J012Q87M69j128j469J57J083R63
7625H78np71j161P5J231O86r7r69j064K97Q70R86m5r21j087J43J151J052k66j280
7645b97p89K37R74J067l67r08r12J29J077Q15j55j194m78M5J118P86k89j028j016
7664a185O00J011Q15n15j305p48P08R41P27k89j138o50O11P74P13k93j527m55
$$ plain form
7528 -144 172 244 374 -115 -348 -113 213 372 288 -183 -371 -202 149 431 291 -532 -419 -250 399 515 117
7549 117 -356 -478 -254 359 718 218 -461 -459 -232 96 757 382 -407 -886 -505 670 935 269 -409 -1169
7569 -1169 -141 367 785 367 -592 -625 -179 682 787 122 -629 -903 -423 587 775 135 -486 -833 -476
7588 -476 760 727 422 -689 -1070 -132 718 763 227 -623 -901 -233 986 1039 420 -914 -909 -66 939 1166
7608 1166 42 -859 -1185 -42 887 1016 -142 -920 -1096 -84 803 1272 144 -1325 -1168 -85 878
7625 878 873 102 -1059 -984 247 933 836 -133 -1197 -900 -30 956 911 -10 -1097 -954 197 1249 983 -297
7645 -297 -1086 -849 125 1192 825 -83 -995 -866 211 1026 871 -323 -801 -756 362 1148 859 -169 -1185
7664 -1185 -585 426 1241 726 -579 -1327 -619 322 1049 760 -378 -1028 -417 357 1070 777 -750 -1205
7682a205Q11R92Q47r03j205m19O51R32M90p62q01m51P42Q64L46n86p90m20L51
7701e16J039M84o97r14m88O70J083L27p27r15k97M21J150K97o36r12l21P36J040
7720H24O4n92r53p8N09R45K51o85p76k81L18J080j31m31n39k44N32R67j01m67
7740B12n02l44Q27J61L46l65p45o1O96L34l7n51m54j97Q49L33l0l63o00K7L11
7761a53N60k1o06Q8o6K00L24O3m14k98P9L17J94p4l64j28j4N24Lr8m75j60L19
7784b00L33o8pQk83L41q5J05j53l43M91l36M43J0k52J43k21J03oj77j86L85J46
7807A91k70J0L4m2l1K78j28j97J80j62K52L15m63k7j55J77J59L3k10k74J00P1
7829a59N84q2k51k23m51L32N69pj84l71n39N24P78j3k18o38j07M27N49j17j26
$$ plain form
7682 -1205 -394 598 1445 542 -663 -1082 -431 501 991 229 -572 -1023 -281 583 929 343 -447 -867 -516
7701 -516 523 1007 310 -604 -1092 -422 661 988 261 -654 -951 -530 620 917 281 -631 -952 -216 824
7720 824 888 296 -657 -735 -226 719 970 285 -491 -772 -454 626 495 64 -475 -719 -187 780 679 212
7740 212 -290 -634 193 354 700 335 -410 -471 225 559 522 -29 -483 -680 169 502 472 109 -491 -464 -153
7761 -153 407 386 -220 -132 -198 2 326 389 -25 -323 -244 73 267 193 -171 -299 -313 211 214 116 -359 -519 -200
7784 -200 133 65 58 66 -217 124 39 144 -9 -352 139 -197 246 256 4 147 -74 29 23 -154 -340 45 191
7807 191 -79 -69 -35 -77 -108 170 42 -155 25 -137 115 430 -33 -60 -215 -38 121 154 -56 -330 -230 -159
7829 -159 425 343 92 -131 -582 -250 319 312 128 -243 -782 -258 520 507 289 -349 -456 -29 520 403 277
7850B77o29k22M30N49K62n43q16P8N20N78K04p10p14j52Q21Q64j00r47m89Q7P48
7871I6O68m04m06n30j92Q72P06l24n61p63K7Q24O98J92j296l05M29M38N21J12
7891H02r67o39J65P53Q22j14j056r17M13R57P66j99j048p05L49J107N61m37j044
7910d31n23K75J121P07o42r61o18P26N76R48p14j139l25L66J068R55q44j122m68
7929a045M43J376K54l43j188o18N73J022O54o20j257l77O18R43P49p74j221k04
7947a015O35J070M90o74j304m95J063J091M20j039r69j86P03J075L33j000j303
7964a105K05P48J087pl14j266k65P44J226k29p85r71J13P18J047M14r73j163j74
7983i50Q80P38J74j053n38l10R62R21N8p10j313K56R56N95J24o34q48k00J011
$$ plain form
7850 277 -352 -574 -144 405 667 124 -692 -614 -94 484 688 -22 -736 -888 -67 797 697 -250 -739 -652 96
7871 96 764 360 -46 -576 -768 104 810 486 -75 -838 -811 13 711 903 -393 -698 -269 169 690 802
7891 802 -165 -804 -639 114 936 822 -234 -1151 -738 219 985 786 -262 -967 -618 489 1050 613 -431
7910 -431 -954 -679 442 1149 507 -454 -1072 -346 230 1178 464 -675 -1000 -634 434 1389 545 -577 -1045
7929 -1045 -602 774 1028 685 -503 -1121 -548 474 1128 508 -749 -1126 -508 435 1184 410 -811 -1015
7947 -1015 -380 690 1180 506 -798 -1293 -230 861 1281 242 -727 -913 -210 865 1198 198 -1105
7964 -1105 -900 -152 935 928 614 -652 -917 -173 1053 824 39 -932 -819 -101 946 1360 387 -776 -950
7983 -950 -70 668 842 -211 -749 -1059 -97 824 882 172 -1141 -885 71 666 790 156 -692 -892 119
8002A19R03k52p60p77q2Q92O74jr06n64Q6P28Q84j97p84q14J92J076M22k20o46
8023b7p95K9Q37O59j48p44m82K48Q67K12K9p03p29J51J019L85m33n51o28M08P01
8044C05K45m1q11l18M4O74N75k76n45m87L61L71M74k06n04n51N36N44N0j35m54
8065a49k11K98M22%j19l97l59K54L76K44k46m00K3L87o1L27j39n18P9p1N17j68
8087H9o7j40l47L54L19j39K07j65m44K79J66qL4l25J09p7N3J57j34J62K5O3R8
8110B69k29J61k69J09j40mnJ28J36q1N5l69Q1m3L76k43o6O5j92M73k7L74m88n54
8134d83L56M14P1l8n87l96L15N32L46j58n09l5j14L84N66k05k19o95q3N42O70
8155F74l68l71m91l3R78M01j12o79p06L86L67N90j60p07l75k4Q95O02l68q37m85
$$ plain form
8002 119 1022 770 10 -767 -849 43 717 716 -190 -754 -668 60 944 747 -37 -851 -659 417 839 619 -27
8023 -27 -822 -793 44 703 555 -189 -671 -423 444 656 685 -18 -747 -596 423 808 375 -176 -804 -396 305
8044 305 550 509 -302 -620 -576 98 673 397 -148 -635 -274 97 571 365 -139 -690 -154 390 440 305 -149
8065 -149 -360 -62 360 360 241 -156 -515 -261 115 359 113 -287 -264 123 62 389 250 -268 -189 -260 257 89
8087 89 22 -118 -465 -111 208 69 276 111 -333 -54 112 104 138 -187 -78 -155 -102 55 -79 83 108 171 269
8110 269 40 201 -68 41 -99 -103 -108 20 156 75 130 -239 -158 -201 175 -68 -134 -69 -261 212 185 559 71 -483
8134 -483 -127 287 358 320 -267 -663 -348 184 530 372 -137 -172 -286 98 664 459 240 -455 -538 4 674
8155 674 306 -65 -556 -589 389 790 678 -1 -707 -321 46 636 476 -231 -606 -630 265 867 499 -338 -823
8176h23L51R91M04l30r09o76K22R40O10k42r45n48L12J077O43
8191A077
$$ plain form
8176 -823 -472 519 923 593 -316 -992 -770 170 780 538 -407 -955 -643 434 1077
8191 1077
$$ Imaginary data points
##PAGE= N=2
##DATA TABLE= (X++(I..I)), XYDATA
0@%%%%%%Jj%qQqJ6j6K2l0L2m0N6o4P2r2J10j27J53j77K03k38K72l11L61m12M64
33B46n27N94o66P52q42R39j052J169j295J439j592J759j946K148k367K610k875
50a506L165l490L846m242M692n195N764o424P190q094R185j0523J2213j4428J7466
65I619k1913K9076m2503P6290l21441p09419M14292Q94209N84325l57808q61851
76c07124n32173L55597Q14953M50066l92496p93672l87474M48557Q31471M00689
86H88394m38852q32417m34468L57223P39628L73610l52255o73016k81380M19748
96b33785O97104K68616m53237p40838l10898M18399P27067L34491l53623o44850
106b91554k71638L62570N89292J75240m52039o36858j75540M85252O88670K37146
$$ plain form
0 0 0 0 0 0 0 0 1 0 0 -8 0 -8 8 -8 14 -16 16 -24 32 -32 40 -52 58 -69 84 -93 110 -128 144 -167 194 -218 246
33 246 -281 313 -353 399 -443 496 -556 613 -682 757 -835 924 -1022 1126 -1241 1369 -1506
50 -1506 1659 -1831 2015 -2227 2465 -2730 3034 -3390 3800 -4294 4891 -5632 6581 -7847 9619
65 9619 -12294 16782 -25721 50569 -270872 -980291 -565999 328210 912535 554727 -307124
76 -307124 -839297 -483700 331253 781319 388823 -404849 -792323 -343766 487705 888394
86 888394 449542 -382875 -817343 -460120 279508 653118 300863 -372153 -653533 -233785
96 -233785 463319 731935 278698 -462140 -773038 -354639 372428 706919 353296 -291554
106 -291554 -563192 -200622 388670 563910 111871 -524987 -700527 -215275 473395 710541
116G10541m17719o33184k25606L64892N34933J33564l99900n00204o0935M66477
126b7141N38082P4593m67061n61274j33774L80474M84491J14734l21782l79357
136b98015j8899L68012L71458k0115m17087m23145l0962L80169M23496Q0408k97555
147A17765l47306n1219K67027K75955k5601l19974k93982M1669L60145L49090
157C73569J8584l13019l35550m9995K42929K55643o13k42034k08443O5381K94556
168A01008K35116o1978l06802k64749J1836K48962K27954k250j89772j50631N3501
179i7805J93334J18888r3748k26561j43985P0022K09986J55597k3043j47732j13515
190i8562K0142J04250N8829n6151j14104n3393O7004J31638Q1227l2882j05994
$$ plain form
116 710541 292822 -340362 -565968 -201076 333857 467421 67521 -432683 -493618 -27141
126 -27141 510941 585534 118473 -442801 -576575 -196101 288390 403124 81342 -298015
136 -298015 -316914 51098 422556 402441 -14646 -437791 -468753 -88584 334912 415320 117765
147 117765 -229541 -280760 -13733 262222 236621 -83353 -377335 -335666 24479 373569
157 373569 392153 79134 -256416 -306411 -63482 192161 191548 -50486 -258929 -193548 101008
168 101008 336124 274146 -32656 -297405 -285569 -36607 191347 189097 -675 -151306 -97805
179 -97805 95529 214417 120669 -105892 -249877 -179855 30131 185728 162685 14953 -98562
190 -98562 -78420 25830 84659 28508 -85596 -138989 -71985 59653 140880 107998 2004
201B004q2763J446O3825N2082o073m3804k3519K8293N4690K6902l0766o2957m2634
214f3274O106L7763L1603N919r946l980M726J159j0180j0214L080J3540L794j7013
228f917j9287P688L7668L0258j6506n7547m1290K3946P2036M5547l6031q8551
240d8986m8523N1209J09458N8482n6267j16692n7359O2613J16339M1943q8829
251B3388j35130l9512J08538J58503N3318j07603j65064o0063J00780J55094M7852
262A40101j07935j48775k6043J38578J73145L0065j57635k04593o0880J39111
272h4861K01951O9187j22901j78580m1114J45938J83259K0199j87657k23743l6869
283b55191J99133K52911O8120j76122k40504o3627J68028K10867J8660k07133
$$ plain form
201 2004 -80759 -79313 -15488 36594 30521 -13283 -36802 -8509 46181 73083 42317 -20640 -63274
214 -63274 -57168 -19405 12198 18117 8171 4191 8917 10076 -104 -10318 -7238 6302 10096 -6917
228 -6917 -26204 -18516 19152 49410 32904 -24643 -65933 -41987 30049 75596 39565 -48986
240 -48986 -97509 -46300 63158 121640 65373 -51319 -108678 -46065 70274 112217 23388
251 23388 -111742 -151254 -42716 115787 169105 61502 -103562 -163625 -62845 92249 140101
262 140101 32166 -116609 -142652 -4074 169071 199136 41501 -163092 -223972 -84861
272 -84861 117090 186277 63376 -115204 -156318 -10380 172879 193078 5421 -218322 -255191
283 -255191 -56058 196853 264973 88851 -151653 -215280 -47252 163615 182275 -24858
293b4858k22501O355K57388K71287J9626k56098k86768m4814K23808K51858J9267
304B14550k25407k21252L1617K71511K40550m5650l08466k84122R801K88055K83849
315B55036J1775k47291k36649K2936K55364K12401o8782l05150k46528O2750L26600
326D2462K86667j8861k93317k71824J0591K61711K26652n4974k86164k18003R5216
337b19844L38607K58055q1880l50812k86397M5892L14827K56121n7941k96648
347h0020k09425J12551L31445K09817j43189l73148k44170J22088L65264K51171
357C42384r6201l24310k09570J17217L11928J70582j61869l41696j78351J72957
367a96929L64817K07456j42475l41802k03886J22019L03578J64108j45681l03234
$$ plain form
293 -24858 -247359 -241004 16384 287671 307297 51199 -235569 -280383 -56575 195283 214550
304 214550 -10857 -232109 -200492 71019 311569 265919 -42547 -326669 -316868 -28813 255036
315 255036 266811 19520 -217129 -194193 61171 273572 204790 -100360 -346888 -284138 42462
326 42462 329129 310268 16951 -254873 -244282 17429 244081 189107 -97057 -315060 -219844
337 -219844 118763 376818 294938 -55874 -342271 -296379 18448 274569 216628 -80020
347 -80020 -289445 -176894 154551 364368 221179 -151969 -396139 -274051 91213 342384
357 342384 246183 -78127 -287697 -170480 141448 312030 150161 -191535 -369886 -196929
367 -196929 167888 375344 232869 -108933 -312819 -190800 112778 276886 131205 -172029
377a72029j41912J76935L31976J58908j75627l42479j79482J52076L21286J66999
387B96651j47038k98343j33565J75079L06247J19189k00370l28677j30478J97378
397a43927L28232J34535j83885l05136j12849J89433K89120Q5900k09643k92320
407b20540p7067K18193K95979P8955k10791k84309p5100K00258K63793O0186j99830
418D9727k50882m5805K04368K47901M4238k00167k41868m3096J93569K31425L7430
429B26840j90679k24915l3771J87907K18772L0441j84225k09325k2871J82988
439a8838K00064J2503j88731j97592o062J91906J97349P216j84741j87487m122
450a78535J73565J65898j2629j73398j50689L1165J84496J53620k9894j80624
$$ plain form
377 -172029 -313941 -137006 194970 353878 178251 -164228 -343710 -191634 129652 296651
387 296651 149613 -148730 -282295 -107216 199031 318220 117850 -210827 -341305 -143927
397 -143927 184305 318840 134955 -170181 -283030 -93597 195523 281423 71780 -220540
407 -220540 -297607 -79414 216565 295520 84729 -199580 -274680 -74422 189371 249557 49727
418 49727 -201155 -246960 -42592 205309 249547 49380 -192488 -235584 -42015 189410 226840
429 226840 36161 -188754 -222525 -34618 184154 214595 30370 -178955 -201826 -18838
439 -18838 181226 193729 4998 -192594 -198656 -6750 190599 197815 13074 -174413 -178535
450 -178535 -4970 160928 148299 -25099 -175788 -144623 39873 193493 163599 -17025
460a7025j53603J7802J56330J32137k0197j37292j03737L9450J39412R3410n1161
471I5526j49508j05503L5320J37633J08804j3261j04553q3383J7476Q8498N7210
482H4259m1816j03324o0758M6837J17095Q2852k2152r9464q0851M454O7123M9001
494D3256k0128o0754k5514M8947Q2047L5801m8127r1021n6645J7719O1428M3200
506C0209m411k5815m152K6267K5266j1957m7212m5392p424L1846M1842K4621N276
519C8964l907p370j5041k5900k5959p377J7554K7776J8275M383J354P200N137
532C5089j6124m1241m0700n486L9150N6952L1118j5089l9205k2308J1162K1188
544A4506l730l7802l7869Q514O2924P0330J7157n3198p9342l6615L3518O1774
$$ plain form
460 -17025 -170628 -152826 3504 135641 115444 -21848 -125585 -86135 53277 146687 95526
471 95526 -53982 -159485 -124165 13468 122272 109011 4458 -78925 -61449 27049 84259
482 84259 42443 -60881 -121639 -74802 42293 125145 102993 3529 -77322 -72868 -5745 43256
494 43256 23128 -37626 -63140 -14193 67854 103655 55528 -35493 -92138 -74419 -12991 30209
506 30209 25798 -17 -4169 22098 47364 35407 -11805 -57197 -64621 -32775 9067 33688 38964
519 38964 35057 27687 12646 -13254 -39213 -46590 -29036 -1260 17015 21398 22752 29952 35089
532 35089 18965 -22276 -62976 -68462 -29312 27640 58758 43669 4464 -17844 -6682 14506
544 14506 10776 -27026 -64895 -56381 6543 76873 94030 40832 -38510 -75125 -41607 20167
556B0167K2560l9675n4852j012O8676P7618M463q6783j04135k5478P7276J04771
568F3596L1878o7698r0125j3154Q1268Q8530m364j06863j07530J506J16874J22862
580A16780J0687j07493j15491p001J04550J02791j1235j17955j04147K0980J33114
591B5580J16294j7866j36171j21143J1753J30312J15024j6714j31230j09621K7188
602a06594J40754J13485l0714j49113j20307K9600J50826J21478l0284j52287
612c3156j20239L5325J57514J21224l8931j61446j21217M3455J64956J18918n1439
623A14964j71376j17522N7850J77943J19045o0835j80652j19036O1907J76945
633E9233J09578o9191j75730r8713Q3549J84601R8798r0341j92039j05123Q3907
$$ plain form
556 20167 42727 3052 -51800 -52812 15864 93482 97945 11162 -92973 -118451 -41175 63596
568 63596 95474 27776 -62349 -75503 5765 94295 89931 -16932 -124462 -122956 -6082 116780
580 116780 127467 19974 -95517 -102518 2032 104823 93588 -24367 -128514 -107534 25580
591 25580 141874 124008 -12163 -133306 -121553 8759 123783 107069 -24161 -133782 -106594
602 -106594 34160 147645 116931 -32182 -152489 -122889 27937 149415 119131 -33156
612 -33156 -153395 -118070 39444 160668 121737 -39709 -160926 -117471 47485 166403 114964
623 114964 -56412 -173934 -116084 61859 180904 120069 -60583 -179619 -117712 59233
633 59233 168811 99620 -76110 -174823 -91274 93327 192125 101784 -90255 -195378 -111471
644a11471J87158J02723q0448j74967q7079R0847J74811P7832j06046j89113q4626
655b00379J05948J96059R6274r2883j84880r1495Q9178J70794P1144j06400j77244
666a23884o4043J23569J97024P7142j18650j98718q6503J04210J80539P1045j07190
677E4541j66873m5430J30513J77796M0360j46027j94564n6209J33830J88412N9922
688A76271j16902j62857l6853J24551J50399J3258j48404j65766j7226J53823
698b9706J78923L6160j32981j64885l5902J17351J39184J1830j28223j34883M811
709a38321J49980J54293P406j48159j62813k6162J24841J43290J8461j15638j20710
720a13532P208J33047J23244j8050j50951j41066M126J42794J40733P078j21441
$$ plain form
644 -111471 75687 178410 97962 -77005 -164084 -73237 101574 179406 73360 -115753 -200379
655 -200379 -94431 101628 197902 105019 -79861 -171356 -82178 88616 159760 53360 -123884
666 -123884 -187927 -64358 132666 209808 91158 -107560 -194063 -89853 90686 161731 54541
677 54541 -112332 -157762 -27249 150547 190907 44880 -149684 -205893 -72063 116349 176271
688 176271 59369 -103488 -140341 -15790 134609 147867 -537 -166303 -183529 -29706
698 -29706 149217 185377 52396 -112489 -148391 -31040 108144 119974 -8249 -143132 -138321
709 -138321 11659 165952 173358 25199 -137614 -163776 -38935 104355 122816 7178 -113532
720 -113532 -106324 26723 149967 131917 -19034 -160100 -155974 -13180 127553 134631 13190
731A3190j16997Q111J18254R7156l2382j35389j02263L7219J44725J14662k1623
742A24663j29101j06033J5723J08813Q1800l0619j08842p0031M5855J20819P8007
753A31054m1604j21104q6112K5613J03607P6167k2440q9149n8363L4927R2675
764D5271N4144m2764j01438o2498L5490R7805O5381k6225q4016n3667K8879P6454
776C2816M1467l8840p9828l9038M2621Q2377M1238l7910p5413l7423L3050O3703
788B8820K6672l5691n7439j9175L8046N5721J7529l5128m9923j5448L0328M2137
800B6449J1933k6486l5786r472K3176L0907Q874j8291k4955p547J4265J8980M394
813A6441j3422j7221m244J2509J7483P491o816j3177q336n11L713J200j84J978
$$ plain form
731 13190 -103807 -95696 22558 119714 87332 -48057 -150320 -113101 31624 146286 124663
742 124663 -4438 -110471 -94748 14065 95865 65246 -43596 -113627 -67772 53047 131054
753 131054 89450 -31654 -117766 -92153 11454 87621 65181 -23968 -82331 -47404 45271
764 45271 99415 56651 -44787 -107285 -71795 26010 91391 65166 -18850 -72517 -43638 32816
776 32816 74283 35443 -44385 -83423 -40802 41575 82813 44903 -30510 -67933 -34883 28820
788 28820 55492 19801 -37638 -56813 -18767 36954 54483 19355 -30568 -46016 -15688 26449
800 26449 38382 11896 -23890 -33362 -10186 20721 29595 11304 -13651 -21198 -6933 12047 16441
813 16441 3019 -14202 -18446 -5937 11546 19037 12221 -956 -9292 -9803 -6090 -4890 -5074 -3096
827c096N487N438J558l063l166j744l326q043q653J456J7295K2999R621j4566
841A8197k7149j4781R288K0246N343j7494k0967N493L5821L5216k272m3970m9004
854d6033r167L7154M4988Q579l2644l2453P424M4478L4091j8455o2321m9741J1363
867f2737O4452N8849R15n1194m8218L579M7608L5109k1958o3701m1405K8135P9505
880B8939N9661j6013p6173o4754N666O2867N1351j5820o5227m1873L5178Q5747
892D9549N2652l7538r9411o9968K4435R2601O8533k0177q0839n1925L6495Q8709
904E3116M4849n4761j08469n6539N3254J14692O7641m0872j03178n9274M1650
915d7891R2784M1433n8916j01623l7748P1511J16726M9931o4639j16327n6216
$$ plain form
827 -3096 2391 7829 9387 6324 3158 1414 -1912 -9955 -18608 -17152 143 23142 32763 18197
841 18197 -8952 -23733 -14445 5801 11144 -6350 -27317 -21824 13997 49213 46941 2971 -46033
854 -46033 -55200 -18046 26942 35521 2877 -29576 -22152 22326 56417 37962 -24359 -74100 -62737
867 -62737 1715 60564 61479 10285 -37933 -34354 13254 48363 26405 -37296 -78701 -50566 28939
880 28939 88600 72587 -3586 -68340 -62674 193 51544 35724 -29503 -71376 -36198 49549
892 49549 102201 64663 -34748 -104716 -80281 12320 80853 60676 -20163 -72088 -35593 53116
904 53116 97965 43204 -65265 -121804 -68550 46142 113783 72911 -30267 -89541 -47891
915 -47891 44893 86326 27410 -74213 -111961 -40450 76276 126207 61568 -54759 -110975
926a10975N3663J03351M4719n7852r7224l1472P3532J08130L3364q0466j19913
937h1143m4478P2707J17044M6403o6726j07110l5242P4731J06519K5014q8176
948A9543j17229k8059R1575J23476L4855q5808j17658l0676Q4312J09613J9506
959A03450r1916j09167j3026J00277J14300J4458j00230j13709j6315R5114J07730
970I0966J0237r5180j01085l131R9416J00551p7j02003j01749j89J00378R9720
982I7854q19r9201r6469L817J00117R4708o349j00834r3136Q645J01825R1184
994A01342j1813j02541r0141J4705J05167R0072j5678j05079q8610J5294J01698
1005A4416Q2934j9913j00593p7320K7246J04100P6288k9590j06528p7905K6632
$$ plain form
926 -110975 -57312 46039 90758 32906 -64318 -95790 -22258 85872 119236 38770 -81143
937 -81143 -125621 -52914 64130 110533 43807 -63303 -98545 -23814 82705 107719 19543
948 19543 -97686 -125745 -34170 89306 124161 38353 -79305 -109981 -25669 83944 103450
959 103450 11534 -97633 -110659 -10382 103918 118376 18146 -95563 -111878 -16764 90966
970 90966 101203 6023 -95062 -98193 1223 101774 101697 -306 -102055 -102244 -1866 97854
982 97854 97035 -2166 -98635 -94818 5299 100007 93658 -7176 -100312 -91667 10158 101342
994 101342 89529 -13012 -103153 -88448 16719 106791 91113 -13966 -102576 -87282 14416
1005 14416 97350 77437 -23156 -100476 -73230 30870 107158 77568 -28960 -106865 -80233
1016h0233J01441P3531k5169r3967o3160L2055R3308N6512m0467r7958n9050L9168
1028f3989R9215O2717l1240q9470n6625K9857P9997M4465l9139q3018m1002M5653
1040d2579R0943M8334m0341q9353n2566L0512P7142M3779l1855o9864l0930M4147
1052b2631P6820L0112m9157q4337l9936M0504P8454M0413l1170o3391k6440L6224
1064a4535N7644J3989m8795o5462j7079M9411O9924K6395l7133n8732k3507K8444
1076a9436M2555Q626l5147m0143k63M4672M9571Q207l9549n0801j7947K5195L7844
1089A3384J3324j9738k5346l17K8239K8196k445l5779l8196p165K7732L6613J3958
1102C2460j5405k3275o181J4756J4088n834k3845j9040N794K7161K5164L577j7634
$$ plain form
1016 -80233 21208 94739 69570 -24397 -87557 -55502 37806 94318 53851 -44107 -103157 -63989
1028 -63989 35226 97943 66703 -22767 -79392 -49535 30462 74927 35788 -47230 -88232 -42579
1040 -42579 48364 96698 56357 -32996 -85562 -55050 22092 65871 34016 -35848 -66778 -22631
1052 -22631 54189 84301 35144 -49193 -89129 -48625 29829 70242 39072 -24319 -50759 -14535
1064 -14535 43109 57098 8303 -57159 -74238 -24827 45097 71492 34359 -24373 -47880 -19436
1076 -19436 23119 31745 -3402 -43545 -43808 864 50435 58642 19093 -31708 -49655 -24460 13384
1089 13384 26708 6970 -18376 -18693 9546 37742 35297 -482 -38678 -45843 -18111 18502 32460
1102 32460 17055 -6220 -12401 2355 16443 10609 -13236 -32276 -26482 679 25843 29420 11786
1115A1786j8875n283O461N897l116o951j5J1082J2802M358p134j1060p010j395
1129h453j82m38K809Q358J0052K596p393j1307n127M386O418p90q391n469P595
1144e336J6526J0575p261k0263j4953L383J8862J4587l613j7526j2140P893K1092
1157A1826J3338j0248k6233j7663R450K8194J9994q316k9472k0968R819L2335
1169A2056K1232j1959l5803k3595J4284L9067K4187j6478m1606k4774K0465M6112
1181B3188K5562k2564n0048k7023K3754N1066K5915k6119n0881k2565L2056N4235
1193C6576K0380l7050n9712k3019L6705O0361K4533l4156n6649k0661L6523N4753
1205C8584J4842m3075n9423j5522M6801O6031K1529m3237o4763k2684L8890N9178
$$ plain form
1115 11786 -7089 -12372 -5911 -14 -3130 -10081 -10096 986 13788 18146 11012 -48 -7058 -8453
1129 -8453 -8635 -9073 -6264 2094 12146 14742 7349 -3958 -9085 -4699 1719 929 -7462 -12931 -5336
1144 -5336 11190 21765 14504 -5759 -20712 -17329 1533 16120 12507 -5019 -17159 -9266 11826
1157 11826 25164 14916 -11317 -28980 -19530 8664 28658 20342 -9130 -30098 -20279 12056
1169 12056 33288 21329 -14474 -38069 -23785 15282 39469 22991 -18615 -43389 -22924 23188
1181 23188 48750 26186 -23862 -50885 -27131 23935 49850 23731 -27150 -49715 -17659 36576
1193 36576 56956 19906 -39806 -62825 -26120 34241 58774 24618 -32031 -52692 -16169 38584
1205 38584 53426 10351 -49072 -64594 -17793 48238 69767 26530 -38233 -60917 -22027 37151
1217C7151J6601m4223n9234j0678N4034O7770J3764n7492p4293j9841N1980P0819
1229D6358J7718n0879o3716p001N9557O5272N95p0350p4513m666P0404P7401R887
1242G6067o2550o8305m288O1893O0043p753p1456o2941J1392P8900P1093l842
1254G8253p3828p0547r75O4134O0024o804o5208n3824J7118P5595O0216j7144
1266F7010q0688o8090Q485P3833O4876o901o6775n3970J7182P1613N1081k6520
1278E1136q2600n8264K4815Q4747O3025j7833p6953n5836K0273P1439M4914l1298
1290C7565p7312m3791L7852Q5012M9620l3540q2481n0526K7536P2989M1866l1250
1302C3540o8730l3214L9546P4054L3924m1096p7753l9404L5427P2925L8239l1130
$$ plain form
1217 37151 53752 9529 -49705 -60383 -6349 61421 75185 17693 -56600 -76441 -24461 46358
1229 46358 64076 13197 -50519 -57520 2037 67309 67904 -2446 -76959 -81625 -11221 66180 76067
1242 76067 13517 -54788 -59076 2817 62860 55107 -16349 -79290 -67898 11002 82095 78253
1254 78253 4425 -66122 -67097 -2963 57061 50257 -14951 -68775 -51657 23938 84154 67010
1266 67010 -13678 -81768 -73283 550 65426 58525 -8250 -62220 -45038 26575 77656 51136
1278 51136 -31464 -89728 -64913 19834 82859 65026 -11927 -67763 -47490 23949 68863 37565
1290 37565 -39747 -83538 -45686 39326 88946 55406 -27075 -77601 -50065 22924 64790 33540
1302 33540 -35190 -68404 -28858 45196 79120 38024 -39729 -79133 -43706 29219 67458 36328
1314C6328o5387l0323L5328O4279K5246m1554o9003k7545M1078P0628L0931l7247
1326C2759o5871k8404L6075O1742K1469m1021o1370j8264M4764O4374J9380m3767
1338B1866o3320j9399M1617N8354J5637m1496n4928j1156M3680N3795R160m3946
1350I864n2317r047M1948M9274P760m0463m6053n762L9164M3764M417l7727m1482
1363c6660l754L6453L8654K037l5550l6722r18L5762L6683K008l4247l5638k581
1376c4473L0850L2103O79l0306k8690L114L2265K8677l592l3672l0419J227L0110
1389b127K7575o17k5028k1107M864K4632J7128r729k7540j8493Q062K7109K0000
1402B4729k681j9921j4968K162J3591P268p377j4490n333J0272J7639J0147n341
$$ plain form
1314 36328 -29059 -59382 -24054 40225 65471 23917 -45086 -72631 -31553 39075 70006 32759
1326 32759 -33112 -61516 -25441 36301 57770 16749 -44621 -62885 -18121 46253 65633 21866
1338 21866 -41454 -60853 -19236 39118 54755 13259 -41669 -52825 -9145 44650 53810 9864
1350 9864 -42453 -51500 -9552 39722 47482 7019 -39034 -44796 -5632 38132 42549 4822 -36660
1363 -36660 -40414 -3961 34693 36730 1180 -35542 -36460 -698 35985 37993 3746 -31892 -34473
1376 -34473 -3623 28480 29159 -1147 -29837 -26723 5542 34219 30627 -3045 -33464 -32237 -2127
1389 -2127 25448 24831 -197 -21304 -16440 8192 25320 15591 -11949 -30442 -22380 4729 24729
1402 24729 22048 2127 -12841 -10679 2912 10180 2803 -11687 -17020 -6748 10891 21038 15697
1415A5697j4946j2345j481O403O073Q60j611O02N321N648N76o565r903p241l93
1430a3305N835P780O115L179M90l160n259o026l772l82K718L642K618K956M610
1445H039M234n44r336j3371q483M344J4467J2049N46r008o693L160R183J615j2685
1460b483j7654n089J6041K5262J2296j1258k3050j2388Q562J7920N271j5127j9012
1473b0709r34K3043K7179M825k4070l0848j0257J8828K6669P833j7636k2294j702
1486b0073K3719K5336N9k9355l1908n002K7755L4187Q752k3520l0459n502K4482
1499a529K8722J179l1413l2667r55L5250L8201M589l4302l8684n209L2896L5990
1512C2068N19l5800l5457L280M1211L8344m173m3898m0271L556M3719L8246n195
$$ plain form
1415 15697 751 -11594 -13075 -6672 -599 261 -1350 -748 4573 10221 10797 4232 -5671 -12912 -13305
1430 -13305 -7470 310 6425 9604 10094 6934 1675 -4351 -8123 -8505 -5787 -2145 473 3429 8039
1445 8039 12273 11729 2393 -10978 -19461 -15117 -650 11399 11945 2937 -3756 -596 8587 10202 -2483
1460 -2483 -20137 -25226 -9185 16077 28373 17115 -5935 -18323 -9761 8159 13430 -1697 -20709
1473 -20709 -21643 1400 28579 33404 9334 -21514 -31771 -12943 13726 21559 3923 -18371 -20073
1486 -20073 3646 28982 29041 -314 -32222 -37224 -9469 24718 33470 9950 -20509 -26011 -1529
1499 -1529 27193 28372 -3041 -35708 -36663 -1413 36788 41377 7075 -31609 -36818 -3922 32068
1512 32068 32587 -3213 -38670 -35390 5821 44165 39992 -3906 -44177 -40621 3098 41344 36149
1525C6149m2976l5991Q557M5494L5451j1117m7117l6376J1540M7669L6442j1799
1537C5926m7425l5599J2542M7824L4965j3424m8442l5151J3968M8613L4625j4798
1549C3624n0014l4343J6338N2038L5400j7123n3343l6005J6898N3260L4981j9381
1561C2330n2558l1819K2864N5742L0686k6560n8304l1813K6370N8148L1250k5720
1573C0616n4947k6973K8071N3165K2449l2802n6154k2514L4862N8857K4685l1955
1585B7360n5570k3950K9425N0241J8898l2333m9483j4933L7123N3667J7822l7190
1597B1077n5693k1631L2208N1899J9441l0635m6599j3062L5566M7983R973m1328
1609I199n3132j3813L9653N4352J6093l5199m7797j1379L5474M2896L712m1727
$$ plain form
1525 36149 -6827 -42818 -34261 11233 46684 35567 -11550 -47926 -36386 11283 47725 35926
1537 35926 -11499 -47098 -34556 13268 48233 34809 -13633 -48784 -34816 13797 48422 33624
1549 33624 -16390 -50733 -34395 17643 53043 35920 -17423 -53428 -36530 16730 51711 32330
1561 32330 -20228 -52047 -29183 26559 57245 30685 -27619 -59432 -33062 25086 56336 30616
1573 30616 -24331 -51304 -23233 29932 52381 19579 -36575 -59089 -24227 34630 59315 27360
1585 27360 -28210 -52160 -22735 27506 46404 14071 -35412 -50345 -13222 40445 58267 21077
1597 21077 -34616 -56247 -24039 27860 47301 16666 -29933 -42995 -7429 40554 50527 9199
1609 9199 -43933 -57746 -18093 36259 52352 17153 -30644 -42023 -6549 36347 40059 -1668
1621a668m5206j576M5937M9294N805m1820m7213o698L5980L9085Q93l6956l4944
1634c9087N559M2365L8398m850m3404m1086j332L7313L7214J477l2048k9892M385
1647b4988L4264K8073q352l9014l2869N387L8683L5011o92l2519l0043K192K9724
1660D857K4141q556l3485k3952J1543L7179K7685q526l4899k7489N676K9270K0939
1673B4383q347k7496j5750J3408L0168J6286j4183l1429j8173J0394K6907J6482
1685B2650p830k1538j1580J0301K0466Q829j2478k1908j0381J0998K1430J1441
1697B0400p248j7324j0452O382J4007P098p769j4514o030Q629J5257P160p306
1710H290j3967p387N556J1703N481n636r584l806O326R414K881o105p883k246
$$ plain form
1621 -1668 -46874 -48450 -2513 46781 52586 10766 -36447 -43145 -7165 31920 32813 -4143 -39087
1634 -39087 -33528 8837 47235 42385 -1019 -42105 -43437 -6124 31090 32567 519 -29373 -24988
1647 -24988 9276 37349 28997 -10017 -42886 -37499 1184 36195 35503 2984 -27059 -24867 4857
1660 4857 28998 20442 -13043 -36995 -25452 11727 39412 30886 -4013 -31502 -25826 3444 24383
1673 24383 16036 -11460 -27210 -13802 16366 32652 18469 -12960 -31133 -20739 6168 22650
1685 22650 14820 -6718 -18298 -7997 12469 21298 8820 -13088 -23469 -12471 8959 20400
1697 20400 13152 -4172 -14624 -8242 5765 12863 5094 -9420 -15450 -6821 8436 15596 8290
1710 8290 -5677 -13064 -7508 4195 9676 4040 -5544 -9350 -3024 6390 9271 3166 -4717 -6963
1724f963M725O132J323m299m449m47L845K779q7k048q65N40M59j495k033O2K839
1741A8K367j014k563q73K966L918k04n988p353J01P222Q776K526o669p532j557
1757e859O335O428k124r030q177K863J3010J1515o74j2498j2909j961J0058J0559
1771G536k7j0475r139L815J5185J1984l525j8443j7281K62J6978J7621J657j4592
1785A556j4225J996J7394J3633o660k3227j8193N835K6169K2013k385k3116k0519
1798a9729K783K1145J5480q281k5014j5080J2554L0812J9358j0662l1069k1954
1810b9657P270K6948J7866q595k5060j3386J4633K9141J4542j6926l3911j9333
1822c6468J3273L2749K0753j0008k8815j6328J2754K8624J3388j8678l3848j6237
$$ plain form
1724 -6963 -2238 3894 5217 918 -3531 -3978 -133 2646 2559 511 -354 186 645 -850 -2883 -2821 18
1741 18 2385 1371 -1192 -2065 901 4819 4615 -1373 -8726 -8625 -1403 7373 9899 3230 -4302 -5859
1757 -5859 476 6904 4780 -4250 -12427 -9564 3446 14961 14287 1789 -11120 -13081 -3023 7536
1771 7536 7509 -2966 -12105 -8290 6895 18879 15354 -3089 -20370 -20108 -3130 14491 16148 1556
1785 1556 -12669 -10673 6721 20354 13694 -9533 -27726 -21891 4278 26291 23906 790 -19729
1798 -19729 -16946 4199 19679 11398 -13616 -28696 -16142 14670 34028 23366 -7703 -29657
1810 -29657 -22387 4561 22427 13832 -11228 -24614 -9981 19160 33702 16776 -17135 -36468
1822 -36468 -23195 9554 30307 20299 -8516 -24844 -12090 16534 29922 11244 -22604 -38841
1834c8841J9746L7910K0467j5986l5873k0029J4615L2859J4677j8800l4186j2448
1846c5889K4412L8753J5255k4435m0473j7609K1718L7041J4625k1684l4114r857
1858c2257K6330L5386Q271k9591l8829j0140K7799L8216J1485k5156l5017q518
1870c2021K5959L3115N460k9326l4721n671L0811L7263P579k9110l6357p675K7689
1883g005L4217N192k9116l3797l262L1603L5486L310l2403l6331m088L1992L4822
1896C0620K540l1756l3608O2L3164L2578j388l4138l2349K222L4280L1317k916
1909C0628l4057l0009M418L4079K8633n137l3819k7184N796L2458K6208o795l2450
1922g231k5287P656L3124K4839p695l2408k4986O612L0970K3790p221k9568k1874
$$ plain form
1834 -38841 -19095 18815 39282 23296 -12577 -32606 -17991 14868 29545 10745 -23441 -35889
1846 -35889 -11477 27276 42531 18096 -22377 -39986 -18268 18773 33398 11714 -22400 -32257
1858 -32257 -5927 29459 37730 8139 -30690 -40830 -13031 25185 36670 11514 -23503 -32021
1870 -32021 -6062 27053 32513 3187 -31534 -37205 -6394 30869 38448 9338 -27019 -34694 -7005
1883 -7005 27212 32404 3288 -30509 -33771 -2168 33318 36628 4225 -32106 -36194 -4202 30620
1896 30620 33160 1404 -32204 -32142 1022 33600 32212 -1926 -34275 -32053 2227 33544 30628
1909 30628 -3429 -33438 -29020 5059 33692 28555 -5264 -32448 -26652 5806 32014 25219 -7231
1922 -7231 -32518 -24862 8262 33101 25406 -7002 -31988 -25376 5594 29384 22163 -7405 -29279
1935b9279Q724L0767K1816j0195l2178k2762R224L1554K2560q118k9091j9673
1947b6651R560K8536J6523j2905l0164j6527J4117L1113J7723j2476k8513j6122
1959b5786J1200K4643J1673j3160k3887q972J6184K5525J0558j5350k5909j1982
1971b5263J1363K2002J0446j0300j7913n932J2591J8773M901j4998k1649p376
1983b3355J2343K0853R887q945j6477o997Q718J3364L129j2658j5707k387J4277
1996c955J8054N705j0992j6224o096P667J1140J727q352q948K055J2054J0569
2009A4404q63j1809j2169k247P576Q728K051m558l476J782N207K559l683p684
2023d182n271J337N813N998K029j486k468j325n54j193j752r27O31K190K804K339
$$ plain form
1935 -29279 -20555 10212 32028 21833 -10345 -33107 -23883 7671 30231 22113 -6978 -26651
1947 -26651 -17091 11445 27968 15063 -15101 -31628 -17511 13602 31325 18849 -9664 -25786
1959 -25786 -14586 10057 21730 8570 -15317 -24289 -8105 17420 27978 12628 -13281 -25263
1971 -25263 -13900 8102 18548 8248 -9665 -15597 -3006 15767 20668 5670 -15979 -23355
1983 -23355 -11012 9841 19728 10783 -5694 -12691 -3973 9391 12520 -138 -15845 -18232 -3955
1996 -3955 14099 19804 8812 -7412 -13508 -5841 5299 7026 -1326 -10274 -8219 3835 14404
2009 14404 13541 1732 -10437 -12684 -5108 3620 5671 1113 -2363 -581 4626 7185 3502 -4182
2023 -4182 -9453 -8116 -2303 3695 5724 4238 1770 445 -109 -1302 -3054 -3981 -3350 -1160 1644 3983
2039C983L31m67j833l035k641j692J118L884L882J216k166k882p90J337J252j152
2055C45m270k834K676O792N812j155p582o995J9O890O389j207p528n968L846J0057
2071E287P126m728j2310q194L883J2774Q368m210j2813p720N996J3524P425p427
2085F981j5071p596Q011J5547Q043q546j5773p601Q808J6664P236r379j6923p533
2099a7132R679J7144P054j0063j7727o797J1765J8818P267j2544j9904p987J2172
2112h255J9931P590j2303j9519o594J4144K0466N593j6339k2758o075J6999K3722
2125A6602P205j6082k2958n453J6335K1417L220j9200k2268k180K1441K4388L779
2138B6246k0614k4910m139J9108K1737J874j9341k0429P81K2560K1956j036k4012
$$ plain form
2039 3983 4314 3847 2014 -1021 -3662 -5354 -4236 -352 3530 4746 2580 -302 -1092 245 1497 345
2055 345 -3925 -6759 -4083 2709 8521 7366 -216 -7211 -7192 -302 6087 4880 -2648 -8616 -4770 5287
2071 5287 12413 7685 -4625 -12819 -8936 3838 12206 7996 -4817 -12537 -6541 6983 14408 6981
2085 6981 -8090 -15686 -7675 7872 15915 7369 -8404 -16005 -7197 9467 16703 7324 -9599 -17132
2099 -17132 -7453 9691 16745 6682 -11045 -17842 -6077 12741 20008 7464 -12440 -20427 -8255
2112 -8255 11676 19266 6963 -12556 -19150 -5006 15460 21053 4714 -18044 -24119 -7120 16602
2125 16602 23807 7725 -15233 -20686 -4351 17066 20286 1086 -21182 -23362 -1921 22467 26246
2138 26246 5632 -19278 -23417 -4309 17428 19302 -39 -20468 -19687 2873 24829 23793 -219
2151b19k4346j153K2087K3250K139k0424k0367J367K1808J9506l714k5637k2101
2164b7804L202K5896K4770q81k3796k2525J142K2569J9527n053k5092j9463P037
2177b0471K8430K2519n718k8180k2975L615K5245J9692n542k4381j6781R605K7174
2190A2232J7471j0933k9203j9622Q613K7496J9198p270k3985j5503R351K3762
2202A1607J3314j2591k6958j4190J2339K7937J6424r805k5866j5185Q968K3178
2214I172J2325j1989k3889j1052J4202K6741J2784j3614k6788j4069J1813K4333
2226I969J2426j2332k2870r004J4701K3696Q378j6167k5125r514J4990K4259R422
2239B2829j3676k1796o988J4244K0204N007j5897k0957m613J6137K0926N454j4948
$$ plain form
2151 -219 -24565 -25718 -3631 19619 21758 1334 -19033 -17666 4142 23648 19934 -5703 -27804
2164 -27804 -24602 1294 26064 25183 1387 -21138 -19996 2573 22100 17047 -8045 -27508 -20471
2177 -20471 7959 30478 24760 -3420 -26395 -22780 2465 22157 16615 -7766 -24547 -14942 12232
2190 12232 29703 18770 -10433 -30055 -21442 6054 25252 17982 -6003 -21506 -12155 11607
2202 11607 24921 12330 -14628 -28818 -16479 11458 27882 18077 -7789 -22974 -14006 9172
2214 9172 21497 9508 -14381 -25433 -11231 15510 28294 14680 -12108 -26177 -14364 9969
2226 9969 22395 10063 -12807 -21811 -7110 16586 24964 8797 -16328 -25842 -10852 13407 22829
2239 22829 9153 -12643 -19631 -5387 14817 19824 3927 -17030 -21643 -5506 15420 20874 5926
2252E926j9335n030J3983J7590L630j4455j6908k555J4998J7391K610j4350j7109
2265a3614l131J3431J6632K822j3979j5716j578J3605J5073J447j3369j5107r77
2278a4461J3730J4023j4j3699j3146L85J3588J2567o78j2507j1338P18J1859R764
2292A0791j893j1292q905K890J1593Q544k631j0672q018J569Q488O863j808p375
2306a856n125K700Q006N082l473p809o389J867O932N834j49m918l651P83M121
2321A955K424k660n482k998L246N890L747o73m327l174q6J515K43j233j487J142
2337a958L150K889J89k540k399j288l72o23l40J370L386L053L88k782l831j127
2353b835J510J370q57k336k5L677N520J831l959p507m170K582N716L439j778m697
$$ plain form
2252 5926 -13409 -18439 -4456 13134 16764 2309 -14599 -17154 -2156 15235 17845 3495 -13614
2265 -13614 -16745 -3314 13318 16140 2161 -13555 -15133 -1528 13545 14992 1623 -13484 -14461
2278 -14461 -731 13292 13278 -421 -13567 -13182 406 12973 12295 -212 -11550 -10832 1027 10791
2292 10791 8898 -2394 -11299 -8409 3184 11728 9097 -1575 -9593 -8024 464 7327 5519 -1856
2306 -1856 -6981 -4281 3725 8807 5334 -2475 -8864 -6997 -65 5769 5620 702 -2949 -2166 1955
2321 1955 4379 1719 -3763 -6761 -3515 2375 6122 5449 1122 -2052 -2138 -623 -380 -1613 -3100 -1958
2337 -1958 1192 4081 4270 1730 -669 -1957 -2329 -2952 -3292 -1922 1464 4517 4905 2123 -1708 -2835
2353 -2835 -1325 45 -812 -3148 -3173 504 6024 7855 3896 -3611 -7781 -5199 517 3956 2178 -2519
2369b519o88M639N408L07o860q972k188O060R496M218l865p738l048M662O604
2384E516P44p223q861j219R385J1633L493q184j2039m082O817J0391J941q225
2398H7j0199j27J1342J2357N10j2835j4019j913J1493J3639J575j1084j1761M61
2412a0474J3015J1834k130j5304j3113J451J5501J4537q75j4673j3080J565J4044
2425B298J2016k982j5650j2589L834J6916J3746l094j7139j3930K901J6115J3599
2438A6041l851j6757j2817N263J7828J2863n216j8875j3442N375J8930J3365n775
2451A2932j9298j2350O575J9940J1968q022j9779j2050Q506K0317J1384r074k0652
2464i603j1304R924K1157J0860j0234k0952j0302J0072K0462R610j1182j9712
$$ plain form
2369 -2519 -3207 1432 6840 7147 287 -8685 -10873 -4813 4683 8901 5036 -2702 -5750 -1088 5516
2384 5516 6260 -963 -9824 -11043 -1658 9975 13468 5284 -6755 -10837 -4020 6371 8312 87
2398 87 -10112 -10239 1103 13460 13970 1135 -12884 -14797 -3304 10335 11910 826 -10935 -10474
2412 -10474 2541 14375 12245 -3059 -16172 -14721 780 15317 14442 -231 -13311 -11746 2298
2425 2298 14314 11332 -4318 -16907 -13073 3843 17589 14495 -2644 -16574 -13673 2442 16041
2438 16041 12190 -4567 -17384 -12121 5707 18570 13354 -5521 -18963 -13588 5342 18707 12932
2451 12932 -6366 -18716 -12141 7799 19767 11745 -8034 -20084 -11578 8739 20123 11049 -9603
2464 -9603 -20907 -10983 10174 21034 10800 -10152 -20454 -10382 10080 19690 8508 -11204
2476a1204r000J1826K0849Q846j2262k1062q906J1441K0317Q249j0916j9226p263
2489a8311J2259J9529O191j3594k0538p215J3883K0583P640j2856j9335o340J2937
2502e167J8338M596j4840j9292l964J6270K0652M712j5255j9972n334J4108J8137
2515A2989L208j4892j6808q76J6668J8090R89j7311j9185k260J5622J7362K321
2528A5917j3997j4855m44J5012J4247j191j7023j5612N73J6425J6529J242j4608
2541B215j4395m50J3169J2157k123j4223j2534K923J6612J4181j653j5751j4606
2554a4478R72J3461J1857k092j3133r925M377J4869J0238m554j5987j1605L341
2567a2659J3924J0986k415j1836q562M099J1976O699n452j3482p519N494J2894
$$ plain form
2476 -11204 -20204 -8378 12471 21317 9055 -12007 -20913 -9472 10845 19094 8178 -11048 -18311
2489 -18311 -6052 13477 19668 6074 -14464 -21679 -7796 12787 20427 7571 -11764 -18104 -5167
2502 -5167 13171 17767 2927 -16365 -20329 -4059 16593 21305 6050 -13922 -19256 -5148 12989
2515 12989 16197 1305 -15503 -16379 289 18379 19368 2057 -17128 -19388 -3766 13596 15917
2528 15917 1920 -12935 -13379 1633 15880 14689 -2334 -17946 -17373 -948 15581 16823 2215
2541 2215 -12180 -12630 539 12696 10573 -3650 -16184 -13261 3351 17532 15879 128 -14478
2554 -14478 -13506 -45 11812 9720 -3413 -13338 -8961 5908 16146 11592 -4395 -16000 -12659
2567 -12659 1265 12251 9836 -2000 -10562 -6463 5513 12212 6760 -6722 -14241 -8747 4147
2580D147Q834l510j1540p216L292Q981N543m675r274m817N414J0539N466m245
2594F939j0264o272L191Q166N321l309p386l425M417Q159L296n169q473l936L929
2609d816P986L718l157o355k583L539N308J614l992n829j385M157N187J940l387
2624A945m609j008K758L089M52k488k734l3K377K132L69j697j585j8M94J199J43
2641G86n98o40q8N4L48K80N10J62n0n32j160N2O49O23K76q81j065K21J977J368
2661B292p1k475k612p96K488L515O71j950l194k29K625L284j44m653m405J51N290
2678b13O183M94n071n678n16M707M787r45o188m965K299P877O506j791q510p285
2694h309R03P459O319j466p011n134L358Q951N271m348j0207p091K811J0470P564
$$ plain form
2580 4147 12981 9471 -2069 -9285 -5993 2988 8531 3856 -5418 -10235 -4821 5718 11184 6939
2594 6939 -3325 -9597 -6406 1760 7081 3772 -3614 -7039 -2622 5537 8833 3664 -4809 -8745 -4816
2609 -4816 3170 6888 3731 -2624 -5207 -1668 3640 5254 1262 -4567 -5952 -1795 3392 5332 1945
2624 1945 -2664 -3672 -914 2175 2627 139 -2595 -2628 -251 1881 2250 553 -1032 -1050 -556 643 786
2641 786 188 -452 -540 -486 -138 142 652 814 764 232 -928 -876 -227 396 672 -209 -1274 -1053 924 2292
2661 2292 2221 -254 -2866 -3662 -1174 2341 3012 1062 -2132 -2361 264 3548 3404 -1249 -5654 -5503 -213
2678 -213 5970 6464 1393 -4285 -4801 -94 4693 3748 -2440 -7405 -5106 2771 9277 7486 -1024 -8309
2694 -8309 -7406 53 6372 4906 -2105 -7239 -3881 5070 10341 5993 -4214 -11305 -8494 1976 9540
2709I540k144q649o241K731R139N345m966j1230o573N296J2668Q435l964j2023
2723b636q403L223J1040O664n047j1839n723P272J4121P028p374j5036q281O374
2737h617J3787P170o288j2873m993Q460J3686M165j0015j5386n442R462J5208
2750H324O212q192j3536n049Q562J3043L275j0697j4143l115J1380J5588M918
2763A6570j0821j4976n197R491J3964L979j0905j3662k524J2393J5349K612j2647
2776C626j6127l592J1801J5305L240j1882j4094j604J3046J4069O49j4333j4997
2789a4893p00J4350J4759R66j3173j4147j11J3614J2904r89j4516j2799J495J4866
2803A626J3402j554j4172j3122J297J3829J2320j980j3682j1761K058J4521J1693
$$ plain form
2709 9540 7396 -1253 -7494 -4763 4376 9721 4755 -6475 -13048 -7752 4916 13351 9387 -2636
2723 -2636 -11039 -7816 3224 9888 4841 -6998 -12721 -5449 8672 15700 8326 -6710 -14991 -8617
2737 -8617 5170 12340 6052 -6821 -11814 -3354 10332 14497 4482 -10904 -16346 -6884 8324
2750 8324 14536 6344 -7192 -12241 -3679 9364 12639 1942 -12201 -15316 -3936 11652 16570
2763 16570 5749 -9227 -14424 -4933 9031 13010 2105 -11557 -14081 -1688 13661 16273 3626
2776 3626 -12501 -16093 -4292 11013 14253 2371 -11723 -13327 -281 13788 14437 104 -14893
2789 -14893 -15593 -1243 13516 14482 1309 -12838 -12949 665 13569 12580 -1936 -14735 -13240 1626
2803 1626 15028 13474 -698 -13820 -12523 1306 13626 11646 -2036 -13797 -11739 2782 14475
2816A4475k594j4463j1715K665J4201J1077k412j4222j0888L111J3899J0964l413
2829A0685j4228j0215L701J4264R783m510j4190r570N140J3964R251m622j3905
2842d452q950M868J3474P735n756j2845o930O111J3210P200o229j3192p182N862
2856g076J2064O289n172j1378n050N957J1170M567o740j1473n315O093J1389N825
2870A1150n074j0269m884N141R309L511o346r824l335O714J0723M168n793r939
2884d748m452N158Q075K944n236p577j699O760Q448J489o774q766k753N462P775
2899D106K127m301n617m22M951N001m05o248n728o45N535O084J681l668m455j185
2915c189K526L071k55l557l060M92M514L889Q21l396m097j770J751K611J185j799
$$ plain form
2816 14475 11881 -2582 -14297 -11632 2569 13646 11234 -2988 -13876 -10765 3134 14098 10685
2829 10685 -3543 -13758 -10057 4207 13990 9480 -4710 -14280 -9140 4824 14075 9453 -4452
2842 -4452 -13402 -8534 4940 12675 6919 -5926 -12856 -6745 6465 13665 7436 -5756 -12938 -7076
2856 -7076 4988 11277 6105 -5273 -10323 -4366 6804 11371 4631 -6842 -12157 -6064 5325 11150
2870 11150 6076 -4193 -9077 -3936 5373 8884 2538 -7286 -10621 -3907 6816 10984 5191 -4748
2884 -4748 -9200 -4042 4033 6977 1741 -5836 -7535 -775 7673 9162 2388 -6378 -9131 -3669 4106
2899 4106 6233 1932 -3685 -4107 844 5845 5440 -808 -6536 -7181 -1646 4438 6119 2451 -2004 -3189
2915 -3189 -663 2408 2153 -1404 -4464 -3972 542 4431 5252 1856 -2241 -4011 -2260 351 1536 -263
2931b63j442J094K261J945o05l090k837m51J529K477R18k44o47K58O9j96j128
2948c52j097o52Q69R88P20Q49O6P05j064j805j654j32J770K131M75j419j134J85
2966e51J878J186j643l221j742J276M320K515j055l743k277J015L375J573j714
2981A192m084j283K382M704K168k243n181k466J933M838K470k226m498k641K818
2996b117N603K490l160n995l234L216O585L374l599o870l126L658P448L014m384
3011B903p433l206M780Q019K861n537q135k719O034Q739K709o158q991k609O359
3026b384Q415K245o478q485j338P068Q754J551q010r404j603P545R008J766o945
3041A705q671j304P937Q467J09q206r687n62Q920J0569R38q218r873j444Q617
$$ plain form
2931 -263 -1705 -611 1650 3595 2990 -100 -2937 -3388 -1859 618 1536 1292 645 903 972 776 -352
2948 -352 -1449 -2101 -1232 -244 476 1325 1391 2096 1032 -773 -2427 -2559 -789 1342 1817 398 -736 -551
2966 -551 1327 2513 870 -2351 -4093 -2817 1503 4018 2963 -780 -3057 -2042 1333 2906 1192
2981 1192 -2892 -4175 -1793 2911 5079 2836 -2345 -4811 -2878 1960 4430 2204 -2294 -4935 -2117
2996 -2117 3486 5976 2816 -3179 -6413 -3197 3388 6762 3163 -3707 -6833 -3175 4273 7287 2903
3011 2903 -4530 -7736 -2956 5063 7924 2387 -5748 -8467 -2433 6306 9015 2857 -6134 -8743 -2384
3026 -2384 6031 8276 1798 -6687 -8025 -957 7797 9348 1338 -8066 -9669 -2124 6884 8650 1705
3041 1705 -6966 -8270 -333 8134 8243 37 -9650 -10212 -1292 9277 10215 1997 -7876 -9320 -703
3056g03R016K57r506r305N59J0732J0405l60j0726j0868k83J0033J0055n35r974
3071a203r279K380J1192Q738k383j2302r604J902J1558R691j426j0581q108K498
3085f927J0472P351l851j1676p939L911J2244Q748k621j1534q496K421J0710P012
3099I825l599j1002o748M784J2136P700m611j2598q249L767J1433P468l455j1153
3113d302o170M993J2129N775o100j2723o831N583J2641O922n200j0881n704N507
3127d361J0333M318p002j0974m148O908J1985M632o244j0934m584N630R801L570
3141H930o576r128k786P538R600L159p058j0327l576O108R686L349n951q927k367
3156h326O781Q850J925p168r337k571O967R193K783o886q322j809O327Q091R80
$$ plain form
3056 -703 8313 8570 -936 -10241 -9682 1050 11455 11095 369 -10499 -10782 -749 9306 8771 -1203
3071 -1203 -10482 -8102 3090 11828 9445 -2857 -12461 -10559 999 10690 9264 -1317 -9425 -6927
3085 -6927 3545 10896 7045 -4631 -12570 -8659 3585 12333 9712 -1822 -10318 -7897 2813 9825
3099 9825 6226 -4776 -11524 -6740 5396 13096 8485 -4113 -12362 -8595 2838 10306 6851 -4302
3113 -4302 -10472 -5479 6650 12425 6325 -6398 -13229 -7646 4995 11917 6717 -4164 -9868 -4361
3127 -4361 5972 10290 3288 -7686 -11834 -4926 7059 11691 5447 -5487 -10071 -4441 5360 8930
3141 8930 2354 -6774 -9560 -2022 7578 10737 3679 -6648 -10224 -4116 5570 8919 2968 -5959 -8326
3156 -8326 -1545 7305 9230 2062 -7275 -9846 -2879 6314 9097 2211 -6111 -7920 -1593 6498 7478
3171G478p073p456p01P001P692Q17p003o870l43N940O491L63o340n980L15O163
3187D94N472k80n847n311o5N871N005m81n542m691O29M830M873m21m910m140N06
3204d008M348M212r88m257l842Q04M455L869q23m063l328K28L981K412q97l162
3220a059k140R36M049J854j105l435k399P12K554J981o44j811p98J250J730L71
3236B046j623j774j126J258J572O92J21n63k88m3p0n30n00k4J91N92L59L59L62
3255A011rl63j491p22k60Q43J331J032j39j024n03M64O97l77j556j119OJ767K747
3274B335J019j661k678j296Q00J944Q59j376j937j30K678L322K65l058m310j481
3290d705K574L945J679k390l205q91L428L682k7m378m841m45M601N317J323m281
$$ plain form
3171 7478 405 -7051 -7752 -751 6941 7758 755 -6115 -6458 -518 5973 6336 -4 -5984 -5669 494
3187 494 5966 5686 -161 -5472 -5537 334 5339 4858 -684 -5375 -4746 84 4957 4536 -374 -4514 -4008
3204 -4008 340 4552 3564 -693 -4535 -3731 724 4593 3770 -293 -3621 -3393 588 3000 2103 -1059
3220 -1059 -3199 -2263 1786 3640 2535 -900 -3299 -2587 -33 1948 1304 -507 -1305 -55 1675 2046
3236 2046 423 -1351 -2477 -1219 353 1045 1166 603 315 272 202 -328 -828 -852 -661 -69 290 649 1011
3255 1011 1002 639 -852 -1574 -1834 -991 340 1372 1233 209 -294 170 867 490 -1066 -2185 -2179 -412 2335
3274 2335 3354 1693 -985 -2281 -1481 463 1322 -54 -1991 -2121 557 3879 4144 1086 -3224 -4705
3290 -4705 -2131 1814 3493 1103 -2102 -2993 435 4117 4090 -288 -5129 -5574 -973 4344 5667 1386
3306A386m543o94L752M233m36m907m435P49N834N213j1n683n266n31M798M803
3322D262j17m859m579R93N768N060j064o226n539J06O187N739q8o025n481J106
3338d757O309N232j547p486n570J778P580O201j643p433n690J292P726N312k212
3353E092p798n589L038Q278N387k681q456n340K975P840N031k998q161m776L775
3368d383Q024M474l596p940m915L661Q270M528l703q242m242L600Q360M533m345
3383D084p840m828M193Q505M336m568q711m001M888Q852M245m943r069m019M966
3398c910Q933L513n263q778k866N652Q857L047o254r133k677N774Q600K920n778
3413B637q243j990O154P651J457o443q132j517O512P995J994n836p499j998N619
$$ plain form
3306 1386 -3157 -3851 -99 4134 3698 -1209 -5644 -4895 939 6152 6141 458 -4808 -5339 -541 4262
3322 4262 4145 -714 -5293 -4300 1468 6528 5464 -762 -6301 -6195 -8 5731 5643 -382 -5863 -4757
3338 -4757 1552 6784 5237 -2249 -7819 -6041 1539 7740 6097 -1336 -7026 -5734 1992 7304 5092
3353 5092 -2706 -8295 -5257 3021 8408 5727 -2729 -8069 -5094 2746 7777 4779 -3382 -8158 -4383
3368 -4383 3641 8115 4519 -3421 -8336 -4675 3595 8123 4420 -3822 -8064 -4464 3896 8429 4084
3383 4084 -3756 -8584 -4391 4114 8450 3882 -4829 -8830 -3942 4910 9155 4212 -4857 -8876 -3910
3398 -3910 5023 8536 3273 -5505 -8371 -2719 6138 9185 2931 -6202 -8879 -3105 5495 8415 2637
3413 2637 -5606 -7596 -1442 6209 7666 1223 -6909 -8426 -1914 6081 8075 2239 -5260 -7258 -1639
3428a639P342Q81o133p037o65O667P523J331o663p574j529N926P068Q61o053o434
3444f128pO689O555k25p281p026k86O858O790O72o063n968L81O193N355j208p236
3461a935n382J641O748N523m64o297n122R81M914M125j385n243l668J784N661
3476A881M565j590n811m652P19N329L934j001m615l211J699N123K927k004n295
3491b002l887J670N095L831j014m531k820J592M165J889k206m374k377K618M270
3506A919K585j847l816k370J554L365J129j523l275q07K355L039J173k102k793
3521a414j431J251K391J162j112j890k21J271J638J11j426j891m26R87J662R40
3537A602o76j342p17O00J189m5p36o31l47Q82R57P0m45o50o3J45M30l67P8j5L09
$$ plain form
3428 -1639 5703 6584 451 -6586 -7251 -584 6939 8270 1607 -5967 -7496 -1570 5498 6359 306 -6128
3444 -6128 -6135 554 7109 6884 -397 -7423 -7709 -851 5939 6611 548 -5420 -5039 1154 6509 5301 -1935
3461 -1935 -7317 -5676 1072 6595 6131 -166 -5288 -4307 607 4732 3347 -1896 -5564 -3780 1881
3476 1881 6446 4856 -955 -5607 -4888 441 4375 3374 -1241 -4452 -2753 2370 5297 3293 -2002
3491 -2002 -5889 -4219 876 4707 3693 -838 -3658 -2066 2099 3988 1782 -2592 -4969 -2351 1919
3506 1919 4504 2657 -1159 -3529 -1975 1390 2519 996 -2279 -3086 -731 2308 3481 1379 -1414
3521 -1414 -2845 -1594 797 1959 847 -1043 -1264 7 1645 1756 330 -1561 -1987 -1000 662 1602
3537 1602 926 -416 -1133 -533 656 611 -125 -756 -1103 -221 736 806 361 -289 -352 -207 223 -144 -66 -81 228
3558B28q9j5j89j4L52M02n53o18m92K89J554K12r33j044k99J222J450J94j396
3577B61k123j20J680J821Q0j658j827K31K033K218o27k246k658L55K634K452O6
3594B572k422k431L09K827J659m78l043k290P16L382L051n82l288l309L92L373
3610D38K355n92l589k318R41M430L139j247m352l671Q17M363L436j074m237k664
3626c825J773M480K392k168n220l200J996N479L793k037m836l272J999M839K526
3641D719k864n362k301L188N895K883k667n748k993K276N460K214k863m973k112
3656e248L722N766J984l643o313k633L307N923K729l267n462k230L936N334J954
3671E859m290o212k114M357O574K351m042o120j748M064N275J336m725n968p79
$$ plain form
3558 228 139 124 -65 -79 273 675 122 -496 -988 -699 855 1067 134 -910 -1209 13 1463 1657 261
3577 261 -1862 -1982 -302 1519 1599 -59 -1886 -1655 378 2596 1969 -277 -2935 -2580 54 2506 2572
3594 2572 150 -2281 -1972 855 2514 2036 -1007 -3297 -2581 801 3852 3270 -18 -3327 -2935 438
3610 438 2793 2201 -1388 -3706 -2765 1665 4804 3557 -795 -4466 -3649 714 4150 3076 -1161 -3825
3626 -3825 -2052 2428 4820 2652 -2568 -5768 -3772 1707 5500 3463 -1373 -4645 -2646 2193 4719
3641 4719 1855 -3507 -5808 -2620 3275 6158 3491 -2257 -5250 -2974 2486 4700 1837 -3136 -5248
3656 -5248 -1526 4240 6224 2581 -3732 -6365 -3058 2865 5594 2327 -3135 -5365 -1429 3905 5859
3671 5859 1569 -4643 -6757 -2400 4174 6525 2483 -3637 -5385 -1321 3954 5290 565 -5403 -6182
3686f182N312O377J345n032o643j286M908N808P05m973n319l41N556N617J58n700
3702C10n713o06M954O056N09n186n358J80N184M656Q9n438n679O58N278N600j80
3719E314m989n146l71N618M635m72n444m682Q03N710M742p44n904m584Q62N535
3735H83M646j307n654l961J413N405L946j356n483m146J722N399L845j878n098
3750a624l527J711N375K893j484m884l243J644M896K904j890m777k594J987M542
3765A929K823k057m393k803J828M054K935k051m249k133K024M461K279k282m546
3780b181k278K323M336J690k154l619j985K590L561J262k075m141j463K473M016
3795B355J172j733l395j250J804L155K69j843l055n88K653K978P49k030k871j045
$$ plain form
3686 -6182 -870 5507 6852 1820 -4823 -6109 -1201 4607 5312 339 -4980 -5321 235 5852 6010 310
3702 310 -5403 -6009 -1055 5001 5510 324 -5034 -4854 330 4986 5075 -363 -6042 -5384 -106 5494 5314
3719 5314 325 -4821 -5192 426 5061 4589 -855 -5537 -4734 976 5718 4974 -930 -5514 -4652 883
3735 883 5529 4222 -1432 -5393 -3980 1425 5371 4015 -1468 -5614 -3892 1507 5352 3474 -1624
3750 -1624 -5151 -3440 1935 4828 3344 -1540 -4783 -3139 1757 4661 2771 -2006 -4600 -2613 1929
3765 1929 4752 2695 -1698 -4501 -2673 1381 4316 2265 -1984 -4117 -2093 2368 4647 2365 -2181
3780 -2181 -4459 -2136 2200 3890 1736 -1883 -3868 -1278 2283 3545 1470 -2671 -4134 -1661 2355
3795 2355 3527 1794 -1601 -2851 -1047 2108 2377 534 -2521 -3109 -456 2522 3271 1241 -1630 -2675
3811b675J644K491L64j130k100j40J795J778K14j674k591p61K152J928M67j254
3827E08j562JJ477Q32n4j946j182J61J493J524M08j034j199pN02O51n58l90o08
3846i83O61J097M57k64p88r01K67n4j17L12J80M86L65j28j09m28l79R0j56J30
3866b62m00P56P85M67p31n98r32k5N60Q38J89o13n30K91R92L73k10j739r48M62
3886a275J441J065J34j615p95J47J490J068q07j990r98P40K315J564r53k288j509
3903b266Q20K304J598j536k150j217J264K933J248j886k622j139J376K799J177
3918B703j622k481j555J717K965J133j885k999j329K252L279R07k123l249j023
3933c310K316L087J321k173l603j055K349L660J043k570l855p37K758M018O97
$$ plain form
3811 -2675 -1031 1460 1824 694 -1406 -1546 249 2027 2241 567 -2024 -2785 -633 1295 1762 508
3827 508 -1054 -1053 424 1256 1202 -744 -1926 -1765 -272 1252 1660 626 -573 -580 -78 573 15 -375 -983
3846 -983 -322 775 1232 968 180 -721 -454 -508 -625 -313 -133 353 718 590 481 53 -326 -236 -392 -262
3866 -262 -662 94 879 1346 615 17 -915 -940 -380 458 647 34 -496 -205 787 1160 950 -789 -1737 -1275
3886 -1275 166 1231 1365 -250 -1045 -898 592 1660 853 -1137 -2135 -1395 920 2484 1531 -757 -2266
3903 -2266 -1446 858 2456 920 -1230 -2447 -1183 1750 2998 1112 -1510 -2649 -1273 1526 2703
3918 2703 1081 -1400 -2955 -1238 1727 2860 975 -2024 -3353 -1101 2178 3085 962 -2287 -3310
3933 -3310 -994 2093 3414 1241 -2362 -3417 -1068 2592 3635 1065 -2790 -3527 -769 3249 3946
$$ [...]
8191d4
##END NTUPLES=NMR FID
##END=
