##TITLE=1H_LR-740-02b
 D2O,8 sc, 
 26.10.2021
##JCAMPDX= 6.0         $$ Bruker NMR JCAMP-DX V2.0
##DATA TYPE= NMR FID
##DATA CLASS= NTUPLES
##ORIGIN= UXNMR, Bruker Analytische Messtechnik GmbH
##OWNER= root
$$ XWIN-NMR		Version 3.5
$$ Tue Oct 26 09:31:16 2021 Russian Standard Time (UT+4h)  she@DPX200
##.OBSERVE FREQUENCY= 200.1313468511
##.OBSERVE NUCLEUS= ^1H
##.DELAY= (6, 6)
##.ACQUISITION MODE= SIMULTANEOUS
##.ACQUISITION SCHEME= undefined
##.AVERAGES= 8
##.DIGITISER RES= 18
##SPECTROMETER/DATA SYSTEM= spect
##.PULSE SEQUENCE= zg30
##.SOLVENT NAME= D2O
##.SHIFT REFERENCE= (INTERNAL, D2O, 0, 15.7039)
##AUDIT TRAIL= $$ (NUMBER, WHEN, WHO, WHERE, WHAT)
$$ ##TITLE= Audit trail, XWIN-NMR		Version 3.5
$$ ##JCAMPDX= 5.01
$$ ##ORIGIN= Bruker BioSpin GmbH
$$ ##OWNER= she
$$ F:/spectra/data/she/nmr/H-F/1/audita.txt
$$ ##AUDIT TRAIL=  $$ (NUMBER, WHEN, WHO, WHERE, WHAT)
(   1,<2021-10-26 09:30:03.09 +0400>,<she>,<DPX200>,
      <created by zg, POWCHK disabled, PULCHK disabled
       configuration hash MD5:
       00 E9 B6 7A A2 85 ED C7 34 08 36 98 17 FE 4E 26
       data hash MD5: 16K
       C3 E8 A3 AE 77 CC 33 1E DF B9 DF 3D 15 4B 43 A1>)
$$ ##END=
$$ 
$$ hash MD5
$$ 05 D4 F8 D4 35 E4 B0 17 CB 43 D2 E5 A7 66 7A 5E
##$RELAX= 
##$RELAX= 
##$RELAX= 
##$RELAX= 
##$RELAX= 
##$RELAX= 
$$ Bruker specific parameters
$$ --------------------------
##$DU= <F:/spectra>
##$EXPNO= 1
##$NAME= <H-F>
##$PROCNO= 1
##$TYPE= <nmr>
##$USER= <she>
##$AMP= (0..31)
100 100 100 100 100 100 100 100 100 100 100 100 100 100 100 100 100 100 
100 100 100 100 100 100 100 100 100 100 100 100 100 100 
##$AQSEQ= 0
##$AQ_mod= 1
##$AUNM= <au_zg>
##$AUTOPOS= <>
##$BF1= 200.13
##$BF2= 200.13
##$BF3= 200.13
##$BF4= 200.13
##$BF5= 200.13
##$BF6= 200.13
##$BF7= 200.13
##$BF8= 200.13
##$BYTORDA= 1
##$CFDGTYP= 0
##$CFRGTYP= 5
##$CHEMSTR= <none>
##$CNST= (0..31)
1 1 145 1 1 1 1 1 1 1 1 1 1 1 1 1 1 1 1 1 1 1 1 1 1 1 1 1 1 1 1 1 
##$CPDPRG= <>
##$CPDPRG1= <>
##$CPDPRG2= <>
##$CPDPRG3= <>
##$CPDPRG4= <mlev>
##$CPDPRG5= <mlev>
##$CPDPRG6= <mlev>
##$CPDPRG7= <mlev>
##$CPDPRG8= <mlev>
##$CPDPRGB= <>
##$CPDPRGT= <>
##$D= (0..31)
0 1.2 0 0 0 0 0 0 0 0.06 0 0.03 0 0 0 0 0.0002 0 0 0 0 0 0 0 0 0 0 0 0 
0 0 0 
##$DATE= 1635226202
##$DBL= (0..7)
120 120 120 120 120 120 120 120 
##$DBP= (0..7)
150 150 150 150 150 150 150 150 
##$DBP07= 0
##$DBPNAM0= <>
##$DBPNAM1= <>
##$DBPNAM2= <>
##$DBPNAM3= <>
##$DBPNAM4= <>
##$DBPNAM5= <>
##$DBPNAM6= <>
##$DBPNAM7= <>
##$DBPOAL= (0..7)
0.5 0.5 0.5 0.5 0.5 0.5 0.5 0.5 
##$DBPOFFS= (0..7)
0 0 0 0 0 0 0 0 
##$DE= 6
##$DECBNUC= <off>
##$DECIM= 32
##$DECNUC= <off>
##$DECSTAT= 4
##$DIGMOD= 1
##$DIGTYP= 9
##$DL= (0..7)
0 120 120 120 120 120 120 120 
##$DP= (0..7)
150 150 150 150 150 150 150 150 
##$DP07= 0
##$DPNAME0= <>
##$DPNAME1= <>
##$DPNAME2= <>
##$DPNAME3= <>
##$DPNAME4= <>
##$DPNAME5= <>
##$DPNAME6= <>
##$DPNAME7= <>
##$DPOAL= (0..7)
0.5 0.5 0.5 0.5 0.5 0.5 0.5 0.5 
##$DPOFFS= (0..7)
0 0 0 0 0 0 0 0 
##$DQDMODE= 0
##$DR= 18
##$DS= 0
##$DSLIST= <SSSSSSSSSSSSSSS>
$$ [...]
##$SUBNAM2= <"">
##$SUBNAM3= <"">
##$SUBNAM4= <"">
##$SUBNAM5= <"">
##$SUBNAM6= <"">
##$SUBNAM7= <"">
##$SUBNAM8= <"">
##$SUBNAM9= <"">
##$SW= 18.0517286264689
##$SWIBOX= (0..15)
0 0 2 0 0 0 0 0 0 0 0 0 0 0 0 0 
##$SW_h= 3612.71676300578
##$TD= 16384
##$TD0= 1
##$TE= 0
##$TE2= 300
##$TE3= 300
##$TEG= 300
##$TL= (0..7)
0 120 120 120 120 120 120 120 
##$TP= (0..7)
150 150 150 150 150 150 150 150 
##$TP07= 0
##$TPNAME0= <>
##$TPNAME1= <>
##$TPNAME2= <>
##$TPNAME3= <>
##$TPNAME4= <>
##$TPNAME5= <>
##$TPNAME6= <>
##$TPNAME7= <>
##$TPOAL= (0..7)
0.5 0.5 0.5 0.5 0.5 0.5 0.5 0.5 
##$TPOFFS= (0..7)
0 0 0 0 0 0 0 0 
##$TUNHIN= 0
##$TUNHOUT= 0
##$TUNXOUT= 0
##$USERA1= <user>
##$USERA2= <user>
##$USERA3= <user>
##$USERA4= <user>
##$USERA5= <user>
##$V9= 5
##$VALIST= <valist>
##$VCLIST= <CCCCCCCCCCCCCCC>
##$VD= 0
##$VDLIST= <DDDDDDDDDDDDDDD>
##$VPLIST= <PPPPPPPPPPPPPPP>
##$VTLIST= <TTTTTTTTTTTTTTT>
##$WBST= 1024
##$WBSW= 4
##$XGAIN= (0..3)
0 0 0 0 
##$XL= 0
##$YL= 0
##$YMAX_a= 126652
##$YMIN_a= -194707
##$ZGOPTNS= <>
##$ZL1= 120
##$ZL2= 120
##$ZL3= 120
##$ZL4= 120
##$ABSF1= 10
##$ABSF2= 0
##$ABSG= 5
##$ABSL= 3
##$ALPHA= 0
##$AQORDER= 0
##$ASSFAC= 0
##$ASSFACI= 0
##$ASSFACX= 0
##$ASSWID= 0
##$AUNMP= <proc_1d>
##$AZFE= 0.1
##$AZFW= 0.1
##$BCFW= 1
##$BC_mod= 2
##$BYTORDP= 1
##$COROFFS= 0
##$CY= 11.3945322036743
##$DATMOD= 1
##$DC= 2
##$DFILT= <>
##$DTYPP= 0
##$F1P= 2.36226072786647
##$F2P= -0.459571619588291
##$FCOR= 0.5
##$FTSIZE= 0
##$FT_mod= 4
##$GAMMA= 1
##$GB= 0.15
##$INTBC= 1
##$INTSCL= 1
##$ISEN= 128
##$LB= 0.24
##$LEV0= 0
##$LPBIN= 0
##$MAXI= 10000
##$MC2= 0
##$MEAN= 0
##$ME_mod= 0
##$MI= 1.114404
##$NCOEF= 0
##$NC_proc= 0
##$NLEV= 6
##$NOISF1= 3.799351
##$NOISF2= 2.8
##$NSP= 1
##$NTH_PI= 0
##$NZP= 0
##$OFFSET= 15.70392
##$PC= 1
##$PHC0= -15153.19
##$PHC1= 8.400831
##$PH_mod= 1
##$PKNL= yes
##$PPARMOD= 0
##$PSCAL= 0
##$PSIGN= 0
##$REVERSE= no
##$SF= 200.130013532006
##$SI= 16384
##$SIGF1= 3
##$SIGF2= 2
##$SINO= 400
##$SIOLD= 16384
##$SREGLST= <1H.CDCl3>
##$SSB= 0
##$STSI= 0
##$STSR= 0
##$SW_p= 3612.71676300578
##$SYMM= 0
##$S_DEV= 0
##$TDeff= 0
##$TDoff= 0
##$TI= <>
##$TILT= no
##$TM1= 0
##$TM2= 0
##$TOPLEV= 0
##$USERP1= <user>
##$USERP2= <user>
##$USERP3= <user>
##$USERP4= <user>
##$USERP5= <user>
##$WDW= 1
##$XDIM= 8192
##$YMAX_p= 0
##$YMIN_p= 0
$$ End of Bruker specific parameters
$$ ---------------------------------
##NTUPLES= NMR FID
##VAR_NAME=  TIME,          FID/REAL,        FID/IMAG
##SYMBOL=    X,             R,               I
##VAR_TYPE=  INDEPENDENT,   DEPENDENT,       DEPENDENT
##VAR_FORM=  AFFN,          ASDF,            ASDF
##VAR_DIM=   8192,          8192,            8192
##UNITS=     SECONDS,       ARBITRARY UNITS, ARBITRARY UNITS
##FACTOR=    0.0002768,     1,               1
##FIRST=     0,             0,               0
##LAST=      2.2672688,     0,               0
##MIN=       0,             -194707,         0
##MAX=       2.2672688,     126652,          0
$$ Real data points
##PAGE= N=1
##DATA TABLE= (X++(R..R)), XYDATA
$$ [...]
2207e11N38O44N32j58r49n60n62l28N92R07O12M88o9q81q11m69m54P19Q61O35
$$ -511 27 671 1203 1045 96 -464 -1026 -1354 -762 145 757 1245 1176 295 -516 -985 -1439 -720 141 776
2227G76L09p5o89p77o69J8M90Q17N91R5K98p73p74p07P9L59P52O45L17j22o50
$$ 776 1085 1010 321 -456 -1125 -1107 -617 200 791 886 1184 411 -363 -1070 -991 -632 120 765 1082 960 310
2248C10r76m96K49P6Q93O00O54l98p77p38l07l08O02R52L42L67J30r95n26n32
$$ 310 -666 -1162 -913 -837 56 656 1310 912 135 -603 -910 -1218 -616 336 678 1045 1175 180 -346 -878
2268h78K7J21R12P28L91l80n96q95o00J07M43O75P61L25k18o66o83p37J13M59
$$ -878 -851 -730 182 910 1301 921 325 -570 -1170 -1063 -620 55 816 1141 923 257 -426 -1163 -1050 -591
2288e91N00Q52J14j01l69r07o53J97N05P76M41K68j6o74p78n10j62L64J060L10
$$ -591 -91 761 875 774 405 -502 -1155 -958 -453 323 764 1032 1016 342 -436 -946 -1108 -744 316 626
2308F26K91j47m39o18p24j10N10Q55M09L52p5o51o85m74q5J45R87O25L07l31m76
$$ 626 917 770 331 -287 -1011 -1121 -611 244 653 1005 930 279 -406 -880 -965 -820 167 792 1099 768 292
2329B92q45l65r5K90R46N78J18J7r57l06p55J26M69M91N86K90K05p61n81q45J34
$$ 292 -553 -918 -1013 -723 223 801 919 936 -21 -327 -1082 -956 -487 4 590 880 1085 324 -257 -1102 -968
2350i68M93O84O05K27k17m21p28n13K9J90P74O95L42l82n70p65o36m7O81M39P41
$$ -968 -475 209 814 1041 824 403 -325 -838 -809 -619 155 850 1192 810 240 -525 -1161 -1208 -527 -88 653
2371F53M50j41p09q91j80k35L38Q95M02L76k01p28m61n26J83K21N74P27R2P0q14
$$ 653 1103 962 253 -638 -818 -1053 -715 180 582 958 757 29 -432 -958 -775 -554 20 747 839 909 95
2392I5n48m83Q1K25O68P17M15n29k58q49m05l4L59Q17L97M10k81n81o92m00Q1
$$ 95 -453 -936 -855 -630 38 755 1170 641 383 -466 -871 -905 -546 271 668 1078 797 216 -476 -876 -795
2413g95N30L26P82P2n8o14q73k94r5J51J057O81K12k19o27r37k02p0M90Q44L89
$$ -795 -265 61 843 915 857 243 -630 -924 -1019 -868 189 870 1082 863 236 -701 -903 -973 -483 361 750
2434G50K36o7n44p89n69J87L50M56P55m3j32l47q47n34K54M95L40P80j09nm89
$$ 750 986 919 375 -414 -983 -796 -446 10 765 722 590 243 -604 -1138 -884 -389 -49 731 622 617 128
2455A28j16q11l02O72N69O16K68k38n59r09m08j01P93P83L01J70j84l89p20l72
$$ 128 12 -799 -1101 -429 140 756 1024 786 227 -682 -1090 -1191 -398 385 686 856 672 283 -437 -809
2475h09M3K34O52J014l95J98p09q07m98L68J6R39P12J39l21p77n15l70J30M83
$$ -809 -766 -532 120 1134 739 937 228 -579 -1077 -709 -693 246 958 1097 776 -1 -516 -886 -756 -273
2495b73M05N15M72m24o32n03m16j48O68O67K76N14l97n97q04j32l3M05P56L27
$$ -273 132 647 1119 695 63 -440 -856 -1004 -336 331 607 1121 724 127 -677 -809 -842 -437 319 646
2515F46M62l22o53n35m92k56N05J247K30J61nq44n24k76k83K78O76Q36J77k27
$$ 646 1108 786 133 -402 -894 -1150 -645 602 832 993 988 144 -380 -656 -939 -661 15 851 1028 801
2535H01o24q34j38p2N83L92O96P9k31m63o53l74j6L94N66O31L85n67l70n68m40
$$ 801 177 -657 -795 -867 -284 108 804 883 652 189 -464 -838 -854 -460 106 737 1122 555 185 -383 -823
2556h23k59O93P55R0O60m54m86o08k37j20N17O38K43M09k00n68q30k27r1P86L37
$$ -823 -1082 -389 366 456 1116 662 176 -432 -669 -789 -272 366 609 1018 818 250 -580 -807 -898 -112 225
2577B25N72J72j21o38p15n61L12L53N68M02L06q9k82j025k94K77Q4L78Q57K92
$$ 225 797 969 848 210 -505 -1066 -754 -401 167 569 875 786 504 -521 -815 -538 -454 -76 781 1073
2597A073n04n94n27m95L41L68M14O33L56n25n98n10l70J56N31M90M06J22j51o65
$$ 1073 569 -25 -552 -1047 -706 -338 76 709 1065 540 -58 -568 -938 -782 -251 239 645 767 616 -49
2617d9o90l50J88M52P08M99K58j45p12p31k68J07L34Q50N71j98l5m70j055K7j78
$$ -49 -739 -1089 -901 -449 259 758 1016 871 159 -572 -840 -733 -399 451 1022 824 789 319 -736 -709 -887
2638h87M60K96J033j26m13o9j068k23M82K20N48P70O4p87k61m49m65J06K58M90
$$ -887 -427 -131 902 776 363 294 -774 -997 -515 -295 253 1023 1087 300 39 -410 -875 -769 -511 -21
2658b1P03K41k89n11m28m25m05Q06O26J44N52m59m85n62l36K14L22L45P89O5l27
$$ -21 682 923 634 123 -305 -730 -1135 -329 297 441 993 534 49 -513 -849 -635 -313 32 821 886 559
2679E59n17q23l8j09M44P83L54L27j48p93o04l79J12L51R42J60L4j4q14n8p12
$$ 559 42 -781 -819 -928 -484 299 653 980 832 39 -565 -944 -832 -481 461 621 655 641 -173 -231 -943
2700i43J61L58L07Q58Q9k28j98p59k74j85J79O81O03L74m15m63r48J68MK16N63
$$ -943 -782 -424 -117 741 830 602 404 -355 -629 -814 -635 46 649 1023 608 145 -803 -635 -631 -415 148
2721A48P38j15k78m58m90l46n56R53P30M74J17l74o98l57J16n27O13O10N89K31
$$ 148 886 771 493 35 -455 -801 -1357 -404 326 800 917 543 -155 -512 -396 -923 -310 300 889 1120
2741A120n79n88n82j58l1L86O00P01j28l40m08n98l14K16K69O59N53j6k35n13
$$ 1120 541 -47 -629 -787 -818 -432 168 869 741 401 -7 -605 -919 -703 -434 225 778 762 527 14
2761A4m49k39Q2L93N69L87K63m40l46p89l65JM54Q56L57O7j06p03n66j0j58M15
$$ 14 -435 -674 -592 -199 370 757 1020 580 234 -555 -920 -919 -465 391 748 815 709 6 -560 -570 -728 -313
2783c13O61L77L40o80l50l84n34M8O14O00M85N9n87l88m89j07n9K87P11M46J78
$$ -313 348 725 1065 385 35 -349 -883 -835 -221 379 864 923 336 -52 -541 -648 -707 -420 291 737 915
2804I15l87n93m42o44O37O5N86N41K55n19o05m81n00K94P01M20O95J47m84o71
$$ 915 528 -65 -507 -1151 -514 -449 137 678 933 414 -191 -672 -1172 -878 -177 243 938 1085 601 -70
2824g0l15n21L06J96N54N64K64n84k16q83j89Q0M73N82O46j5n53j81o77n03P2
$$ -70 -385 -906 -600 -404 150 714 978 394 178 -705 -894 -814 -341 241 887 872 319 138 -539 -1042 -970
2845i70P50N63M67q6m02l11n92l05R4M96N05M15K04k09o62m77q3j2L76M11M91
$$ -970 -220 343 810 724 322 11 -581 -886 -792 -296 209 624 828 619 -43 -520 -603 -615 -239 172 663
2866F63K7k26l35n86l65J24M93K84Q83k18l49m40l66j35j48M23P23K24J28l96
$$ 663 690 464 129 -457 -822 -698 -205 79 962 744 395 -45 -411 -546 -694 -271 452 676 804 408
2886D08l41p29j79J49K35L56P86K11m94n37q08J47o8R32K38L75J62m24l59o78
$$ 408 67 -662 -841 -692 -457 -101 685 896 402 -135 -943 -796 -864 68 306 681 843 419 60 -618
2906f18k78L61M28O97J27K05k97p57m09l12K0M92M40M87K27l74n39m18j74L5N40
$$ -618 -896 -535 -107 590 717 922 625 -132 -541 -853 -833 -341 99 586 813 439 -100 -518 -692 -657 -117
2927a17L77M01J42j80p28n36J05k25N64M03O02K16n88o71m92J3O3L67M47N92J63
$$ -117 260 661 803 623 -105 -641 -536 -761 -197 206 808 1024 436 -235 -727 -714 -651 -284 163 755 918
2948I18m59n01m37l67M56L46M01L82J50k62l37o25l05J3K32P19K42M07n01p59
$$ 918 459 -42 -479 -846 -390 -44 357 739 889 627 290 -335 -640 -627 -395 324 566 973 472 -287
2968b87j88k10K9M64M53L24K05j86p35l73j35j39M64O77J37k0Q1n58l45m83M50
$$ -287 -475 -685 -656 -192 261 585 790 604 -131 -504 -639 -778 -314 363 500 480 561 3 -342 -825 -375
2989c75J04L52N25J12l55j54o49m31L18M87L39L87J85m53l76k26l38j85M94O14
$$ -375 -271 81 606 718 363 209 -440 -871 -553 -66 273 660 845 392 16 -210 -548 -733 -239 375
3009C75M11J74l97n13o08k84J00Q87J73K89M49m53q93k76j12K85PQ12L39k44K8
$$ 375 786 960 563 50 -558 -842 -742 145 318 607 1056 603 -290 -566 -678 -393 -386 426 765 521 549
3030E49n46o14n5j20P15M72J58j0q9m55n73k70L09M50K29P69k75r8l42o45k88
$$ 549 3 -611 -666 -786 -71 401 559 549 460 5 -568 -838 -529 -79 150 919 644 546 204 -441 -729
3051g29J55M60K89M07J82m89k97m59l11J00P04J73M70l0k22l45p25k29M05k9Q95
$$ -729 -574 -114 175 582 764 275 -22 -481 -792 -692 12 185 655 625 403 58 -667 -896 -491 -520 375
3072C75L42k16j47m43k40o9j75L50M79O47k94k72o32k57j23L0M91M04M74L2m15
$$ 375 717 501 354 -89 -329 -398 -573 -223 256 903 609 337 -295 -552 -675 -645 -154 250 724 756 341
3093C41n74k31k63J19M82N52K46J51n72k53l85k67P7N09L70L90m7l88n53p6m37
$$ 341 -233 -464 -727 -608 -126 426 672 823 251 -2 -387 -654 -577 -68 302 692 645 257 -296 -372 -809
3114h09L07L27L53M76j21k35l08m75j37Q4K67O23M36m7m45l94m54J23k99O02K30
$$ -809 -502 -175 178 654 533 298 -10 -485 -622 -538 -271 352 788 741 296 -98 -552 -429 -728 -126 104
3135A04O07R8l95o57m89J8R3L32P77K08l8k20l50n94r7J0M35O01J89J52m10m48
$$ 104 711 809 414 -243 -732 -714 -621 -289 488 696 658 438 88 -506 -603 -593 -158 443 632 784 374 -74
3157g4n83O5R2L88N35K11p8l98k70k50k84l4N18L68K67M06n90m75m25k8J61L10
$$ -74 -657 -592 -500 -112 423 634 556 158 -112 -362 -646 -680 -162 206 473 879 289 -186 -611 -639 -478 -168
3179a68N15J36k8j30k56n88J9J41M03J65N50q2m07l05m19j07k19P38L39O3L78
$$ -168 347 483 455 325 69 -519 -500 -359 44 209 759 677 270 -35 -454 -561 -780 -42 297 360 738
3200G38k77n25o47l7J87K06P73K30l36nl36o18R9J34p2P30L82P8m68n3n17m76
$$ 738 461 -64 -711 -748 -561 -355 418 648 312 307 -29 -647 -548 -414 -486 244 626 704 236 183 -334 -810
3222h10J87K16O37M00L2l89n96j80j18J34L46M02J14J70l3o23k86m31K51O34J12
$$ -810 -623 -407 230 630 662 273 -323 -503 -621 -487 -141 261 375 545 512 -111 -397 -828 -577 57 169
3243A69L69j5j62o81l45KJ45L47M93Q7M98m58q06j56k2J0M29L48L93j0l51l73
$$ 169 538 523 361 -320 -665 -663 -518 -171 322 409 907 449 -357 -513 -535 -525 -96 252 645 635 284 -89
3265h9n32r7K86L87N74J92k54q4n46k23k39M89N4N01J38p9l44n6o24j34J55N64
$$ -89 -621 -718 -432 -45 529 721 467 383 -163 -386 -625 -136 -82 419 557 478 134 78 -546 -680 -525 39
3287C9L93QK46k72p08k72p0J2P41L38J33n4l10j58o34m3K00K15O23j95N11o51
$$ 39 432 440 686 414 -294 -566 -636 -624 117 455 588 534 224 66 -568 -611 -411 -196 427 232 743 92
3309I2k29o90J69J54L86M83j94K74k48m04m37M6J41K48O73K60p3j92o68k06L7
$$ 92 -137 -827 -658 -504 -118 365 171 445 197 -207 -644 -598 -457 -209 464 724 651 459 -209 -415 -378
3330c78j15M02M44M27k08l30l68m24k68K75N70K08L01O6m48l05k89l79L80M61
$$ -378 -493 -91 353 780 572 242 -126 -550 -818 -543 27 235 536 602 154 -151 -440 -819 -439 22
3350B2L07K50m1k72m69j33n2o3O55L12mj18k58k69m85q3M25L74K22L25q4l41l06
$$ 22 329 579 538 266 -203 -336 -388 -451 204 516 512 394 136 -133 -618 -701 -276 98 320 645 561 220 -86
3373h6l25L2K7L92M42J10K17o22m96M9k85N7N18K15K55M4m08k26n53M2K96K77
$$ -86 -411 -379 -352 40 482 592 809 187 -309 -260 -545 -488 30 245 500 544 136 -90 -643 -601 -305 -28
3395b8L90j18N00o62k75j04j78RO07J86K71J83n70l32k73j54k19N13P64J82N6
$$ -28 362 244 744 82 -193 -297 -475 -466 141 327 598 781 211 -121 -394 -548 -767 -254 510 692 748
3416G48p88j57l67j38K51J95O24J91k42M0n72l20J09J05J73L58L82j70k28m52
$$ 748 -40 -197 -564 -702 -451 -256 368 559 317 357 -215 -535 -426 -321 -148 210 592 422 194 -258
3436b58k20k31K15J81O54K02j82m11j45j40j44Q1O93K50k0j51l63k29n90K33K96
$$ -258 -478 -709 -494 -313 341 543 361 -50 -195 -335 -479 -398 295 545 525 374 11 -218 -808 -575 -279
3457b79K04N90L6j75r3n87j59PL17K50K73l0r6r5k60n31M2K60L37J94K81O7k05
$$ -279 -75 515 551 376 283 -304 -463 -456 -139 111 384 354 258 163 -97 -628 -586 -326 11 205 486 553 348
3480C48q56N4j89L10L70M67rj85j91k91k29l44N57J41P16l0n8m19l59k47j55L29
$$ 348 -508 -454 -643 -333 37 504 495 310 119 -172 -401 -745 -188 -47 669 639 581 162 -197 -444 -599 -270
3502b70L60M38M6J54n88l58l16J38O2L98M21M2j50l79j89k40l55K47P75J94J00
$$ -270 90 528 574 728 140 -218 -534 -396 -334 64 485 527 377 -2 -191 -431 -786 -539 236 430 530
3523E30k07j68n77j51%K11N47K73Q0qm62l60j20j8K48J29M32L59k17o92j99k88
$$ 530 323 155 -422 -573 -573 -362 185 458 538 530 68 -292 -412 -430 -182 -53 379 738 521 -171 -370 -658
3545f58K52m0M94K65N8L71p19k47m04J58K93L88L29j05N8n24l04o7m6L6M59N39
$$ -658 -406 -446 48 313 371 742 23 -224 -628 -470 -177 211 540 435 493 -31 -335 -402 -448 -412 47 586
3567E86r0J1n8o37l87k8J85M74M19k32M31l94o20p2j34M34K87N20j90j75k38l20
$$ 586 496 507 449 -188 -575 -603 -418 56 475 243 674 280 -340 -412 -546 -112 175 695 505 330 92 -228
3589b28j87l41K37P13K12K31n9n28Jn98l6J18N83M69j58m3m02j77l86M4M99J85
$$ -228 -415 -756 -519 194 406 637 578 50 51 -547 -583 -465 118 587 429 386 -16 -193 -579 -535 -36 149
3611A49K83M2K3n58k21j12k20O23R6P53j09m57m59M2r8l23K85J52O44j39%n20
$$ 149 432 474 497 -61 -282 -394 -614 9 105 858 749 292 -167 -125 -223 -546 -261 -109 535 396 396 -124
3633a24k09k67j4N51j43L18N42N2m25n74k12J29J20L07M35K97l75n90m28L16j02
$$ -124 -333 -600 -614 -63 -206 112 654 706 281 -293 -505 -376 -256 51 486 783 408 -182 -610 -294 -396
3654c96N3K11M96L88m07q8m29l60nL36K53L17K66l47m36j03j00k84K09M01Q68
$$ -396 -343 -132 364 752 345 257 -172 -532 -537 -201 52 369 635 288 -148 -251 -351 -635 -426 -25 843
3675H43m29r4m04mn06q6M91M32R3J90L4n34l86l51K51L10L79J96J8m6l27n13P6
$$ 843 414 320 -84 -88 -594 -680 -189 243 336 526 560 26 -360 -711 -460 -150 229 425 443 397 70 -443 -367
3698c67J73j18N67J16K90l85p5m07l91J62K40N04J22j59pk16l96m1j31L83J96
$$ -367 -194 -312 255 371 661 276 201 -206 -597 -435 -195 309 431 272 265 49 -347 -388 -519 -136 60
3719F0O26l67j10k73P9l46k08K04P03L9J79k10l08j64k95L8J92L86K85J4k7o48
$$ 60 686 319 209 -64 15 -331 -539 -335 368 407 586 376 68 -96 -391 -353 -161 225 510 524 497 -151
3741a51l35J43j29L59L31O4K63m5n89l21j78L99qK96N26j3j97m68O3m55j43K77
$$ -151 -486 -343 -472 -113 218 282 545 500 -89 -410 -588 -189 -197 99 625 612 415 -53 10 -445 -588 -311
3763c11L81K67m9Q6l12m37Q6j11j0L69M98r3R0n55j72l1j01L10M55L34l32O5m29
$$ -311 70 337 288 374 62 -375 -289 -400 -410 -41 457 364 454 -101 -273 -304 -405 -95 360 694 362 427 -2
3786bl8k52j9K42J20N09P6l43k7l59l01J3L02L68P6K93k43l86m79m43L71M65J34
$$ -2 -40 -292 -311 -69 51 560 636 293 266 -93 -394 -381 -79 289 365 658 415 29 -450 -893 -522 -57 77
3809G7L29K2j15n72n2k77k9N98K53J54j05J3m21k31P2k51L58K24L20K35l83o8
$$ 77 406 428 313 -259 -311 -588 -617 -19 234 388 283 296 -125 -356 -284 -535 -177 47 367 602 219 151
3831A51m32j67r7L13L53M53j87J88m41k57m22J77L31L74M4P7O8m93m86Lj65L39
$$ 151 -281 -448 -545 -232 121 574 387 575 134 -123 -545 -368 -37 337 381 458 526 33 -453 -450 -615 -276
3853b76L09J89L1K2p0n48j50K14QK46M83J70j60n14m89k3j25P24K58k36M06m62
$$ -276 33 222 253 275 205 -343 -493 -279 -271 -25 458 628 468 -46 -535 -558 -683 41 299 63 469 7
3875GL2n0n50RL9M85O16J22l76k67l30j51J99J04L32K80L59o70k30j97m31L46
$$ 7 39 -11 -561 -552 -513 -28 588 710 334 67 -263 -414 -215 -111 221 501 860 190 -40 -237 -668 -322
3897c22nN64J19Q5j46l49l86j1L04K40J54J4J52l4m29l21M7j20L84R4M52o3j13
$$ -322 -327 237 356 441 295 -54 -440 -451 -147 93 247 261 413 379 -50 -371 -324 -444 -60 34 486 423 310
3920C10l69l48j47K93L87K73J14n0j39m83j68l4L5L27L4P32j49k80l64l14k87
$$ 310 -59 -407 -554 -261 126 399 513 463 324 -159 -327 -361 -326 1 35 767 618 338 -26 -340 -627
3941f27J93K48K61K46J43j81k04o31J5J70K05O65j53K57n49k01l12o4K03o4M78
$$ -627 -434 -186 75 321 464 283 79 -552 -537 -367 -162 503 350 607 58 -143 -455 -519 -316 -380 98
3962I8M01R1k30j25p75K20k17L99M71P1k61R9k77m44J19j03O04j93N18L9k5n91
$$ 98 499 590 360 235 -540 -320 -537 -138 333 404 143 242 -35 -479 -360 -463 141 -52 466 505 480 -111
3984a11k03j3J14J43L28N9J91m19J8m91k3J76J30M06L35k67J36n19k04l84M91
$$ -111 -314 -327 -213 -70 258 317 508 89 107 -384 -407 -231 -101 305 640 373 509 -10 -214 -598 -107
4005a07J9K64L42k58J13m26k89o2j27L77K86J95K45l65k33k60O2j31L36J68L11
$$ -107 -88 176 518 260 373 -53 -342 -404 -531 -154 132 327 572 207 -26 -286 -224 -355 -19 149 460
4026D60J58k55m07p0J3k12L23L26L9M4j20k96l19p8j3L29J57M25j54J6m12m87
$$ 460 618 363 -44 -114 -101 -313 10 336 375 419 299 3 -316 -394 -407 -78 79 504 350 366 -46 -533
4048e33k2L66o6L38M92k5j43o37J2l05J85Q4N08K27p6n4m92j06k69Q4M69K32O4
$$ -533 -555 -189 -255 83 575 550 407 -230 -218 -523 -338 -254 254 481 405 351 -141 -247 -516 -432 37 269 333
4071C33k68J44j20m86P0rK83M31M4j12J14m54l34Q4j34L14M33p9J92p9m16m18
$$ 333 65 209 89 -397 -327 -336 -53 378 422 310 424 -30 -364 -280 -414 -100 333 254 446 367 -49 -467
4093d67q4L65L3M05J26J69m38j33n67N2M27k09N03K82o8m4l60j16k87L5K89M10
$$ -467 -551 -186 -153 252 378 547 109 -24 -591 -539 -112 -321 182 464 396 352 -8 -124 -411 -376 -87 323
4115C23J08J5n00ml85p6N1N20J98K23r8k72k85k15K63j78K09K37J14K19k62k60
$$ 323 431 446 -54 -58 -443 -519 -468 52 250 473 375 103 -182 -397 -134 -312 -103 134 248 467 205 -55
4137e5k69k70N04j97M89K19m1J3l83p89L87M3M10J68N73m74k70r5k45j89J66K97
$$ -55 -324 -594 -90 -287 202 421 380 393 10 -779 -392 -349 61 229 802 328 58 -37 -282 -471 -305 -8
4159hJ11J24j31J04k32k68l00J73L99M57j13L96o19k40k13j30J14K33M61O9J86
$$ -8 103 227 96 200 -32 -300 -600 -427 -28 429 316 712 93 -147 -360 -490 -376 -143 318 387 573
4180E73l15k34k85j42J17L20L34m7j35J97o60k86r8J73N37K80M41l94j4p07j13
$$ 573 258 24 -261 -403 -286 34 368 321 186 383 -277 -563 -661 -488 49 329 770 376 362 -345 -458
4201d58P2J99J51J98J63J53j19m86j69j86K53K44J58PJ91o2n62K00m30J7N74J62
$$ -458 -386 -187 -36 162 325 478 359 -127 -296 -482 -229 15 173 180 371 309 -253 -53 -483 -466 108 270
4223B70K0J00j7n36k24j42P3M73K75j85K48j77j79j30j67l29M92L16J40p4O2m86
$$ 270 290 390 373 -163 -387 -529 -456 17 292 107 355 178 -1 -131 -298 -627 -135 181 321 247 309 -177
4245a77q9l31K99J62M36N7j52n7l55j80k27M61K34J04N9K79k06m01k05k75K36
$$ -177 -266 -597 -298 -136 300 357 205 148 -207 -387 -614 -153 81 185 244 523 317 -84 -289 -564 -328
4266c28L9M23L15j4j15l44m49k17J66N81J30K51o7k01j15l06j43J15K28M28r4
$$ -328 -289 134 449 435 320 -24 -473 -690 -524 57 187 438 371 170 55 -251 -394 -279 -51 377 283
4287B83J54l64j82j77j77K32J02L90OJ82l57k82r5j0r2N79M5L29j89k10k15k71
$$ 283 437 73 -109 -286 -463 -231 -129 261 267 449 92 -190 -285 -295 -387 192 237 566 377 167 -48 -319
4309c19k18L07J33K57J67j63k3k23j83j48J81N9O19J26J37n21k23k84k28K18M54
$$ -319 -537 -230 -97 160 327 164 141 -82 -265 -413 -232 -173 446 572 709 188 -35 -319 -547 -329 125
4330A25l8L01J54k87m35j46l59L39L27L13J90q5o0o13j11Q8K00n5K13J78L7k02
$$ 125 87 388 542 255 -180 -326 -685 -346 -19 294 484 399 339 -274 -385 -297 -97 -152 61 239 276 74
4352G4j7p66K95J86L95N5K41o4k74j12m97K04J39L00o8L11j15q9m48j05j96L75
$$ 74 57 -709 -414 -228 167 222 463 399 125 13 -484 -280 -141 159 91 402 287 198 -250 -355 -551 -176
4374a76L02j84K81L44l76p5m87M2J74j4N39J57k22p5l78j47j79J45K79K97O7J09
$$ -176 126 -58 223 567 191 116 -371 -329 -155 -169 370 527 305 230 -148 -295 -474 -329 -50 247 314 423
4396D23k67m25L45n01P4M08J34J76q7k3n01k09j82J48O41K45k6k4j54m54O6l75
$$ 423 156 -269 76 -425 -351 57 191 367 280 257 -244 -453 -635 -487 154 399 373 349 195 -259 -193 -568
4418e68J06K17N70M87n21o2m28m92L8K87K97K93O7J38j97k53n01MJ59L78K02Q2
$$ -568 -462 -245 325 812 291 229 -199 -691 -653 -366 -69 224 291 429 232 -21 -522 -518 -359 19 221 303
4440C03j20j63m08R4k65M68L2l6L28lj22k90k4k74M15jK36Q3kj19k63K33k36p7
$$ 303 183 20 -388 -294 -559 -91 -59 -95 233 230 108 -182 -206 -480 -65 -66 170 253 251 132 -131 102 -134 -211
4464b11K13J81J58jk13j41l41J00m4K54J81J00J51l42l90O2l21J98N5O68K30k32
$$ -211 2 183 341 340 127 -14 -355 -255 -299 -45 136 236 387 45 -345 -283 -604 -406 -351 317 547 315
4486C15k09j87k88rj93M57K36J39P5l37q1m55P1J34K18L86J92q1k06j86j98l27
$$ 315 106 -81 -369 -378 -571 -114 122 261 336 -1 -82 -537 -466 -332 -114 272 464 383 177 -9 -207 -534
4508e34L65J84K65J78R4j24l53l68o8J83J86O06m51K09m16j62n40K68K21L96J90
$$ -534 -169 15 280 458 552 428 75 -293 -361 -178 8 614 163 372 -44 -206 -746 -478 -257 139 329
4529C29K06l66o1k20l51j26N04J6L59K02q2l82k2l40J25j6N3N75R5m5k22o17r
$$ 329 535 169 108 -112 -463 -589 -85 -69 290 492 410 28 6 -334 -209 -225 -172 403 498 453 231 -386 -395
4552c95j24J9M16L75m6Q3Km43n9k46m8L62L18lK16m28m14o2j1R1K96K40N85m54
$$ -395 -519 -500 -84 291 245 328 330 -113 -172 -418 -466 -104 214 211 427 -1 -415 -477 -488 -397 -101 139 724 270
4576B70J01l82l68j2J6M63J20M1K06m44p3l43j7J87K45L43j4j42M9n30j93j26
$$ 270 371 -11 -379 -391 -375 88 208 249 455 11 -62 -405 -422 -235 10 353 339 197 246 -284 -477 -603
4598f03L26N3N23Q8j92j10n75K72j51j51O92N0J1M50n89q8l68o0M42K68m8L21
$$ -603 -277 -224 299 387 195 85 -490 -218 -369 -520 172 222 233 683 94 6 -362 -422 20 288 240 561
4620E61j08p38j4j52Q8o5L66M95nl5k72l76l4M9j61L23K76K48j39l8m35j06K15
$$ 561 453 -285 -299 -451 -363 -428 -62 433 428 393 121 -255 -289 -240 -401 -78 198 446 307 269 -166 -272 -57
4643e7j90K04L50r3r4M4m17k73K54p8K03K30M99k14k41j65j27k88L11K14N3K29
$$ -57 -247 -43 307 214 120 164 -253 -526 -272 -350 -147 83 582 368 127 -38 -165 -453 -142 72 125 354
4665C54j04j16j73n10L10p8N03n7K38K08k07p16j64L6L82r8M92K65j3l64k83n34
$$ 354 250 134 -39 -549 -239 -317 186 129 367 575 368 -348 -512 -476 -94 -192 300 565 552 188 -95 -629
4687f29Q3K32M34p4K90L73k31m98k40j96K50K07L92J53J2l07m71j35N4K44k06
$$ -629 -546 -314 120 46 336 709 478 -20 -260 -456 -206 1 393 546 558 251 -220 -355 -301 -57 -263
4708b63M31K91j55j10k96L1n40M39N04n8m8J18j70o33J67j25K9L86M76N4k48j52
$$ -263 168 459 304 194 -102 -71 -611 -172 332 274 226 344 174 -459 -292 -417 -388 -2 474 528 280 128
4730A28m22J75k97pK88O06J55j98j21n49K6j77K03L91L5R5O8j87l75l58p0K80
$$ 128 -294 -119 -416 -423 -135 471 626 428 307 -242 -216 -393 -190 201 236 331 399 212 -163 -521 -591 -311
4752c11M96j29L17J54l36n03l88K37J88J51N32k49K22l13k17k19J1M4L34K75J32
$$ -311 185 56 373 527 191 -312 -700 -463 -275 -124 408 159 381 68 -149 -368 -357 -313 21 296 428
4773D28K2p9l95m24k99N31L89L6L3J76k43l99k46P1k7L19M44j26J8j85l65j7O9
$$ 428 450 371 -24 -448 -747 -216 173 209 242 418 175 -224 -470 -399 -426 -107 337 211 229 44 -321 -338 -269
4796b69K8M62Pl4K64l86k16j87J3n4M87M26m8l63k17M4l76K46r8K50K48K58p3
$$ -269 -241 221 228 194 458 72 -144 -331 -318 -372 115 541 493 130 -87 -43 -419 -173 -271 -21 227 485 412
4819D12n05o0l25j42M68J37J50M85j76k08m67NL5O3Q4K96K75m61J3r6m30p4L92
$$ 412 -93 -153 -478 -620 -152 -15 135 620 444 236 -231 -226 -191 -128 -44 252 527 66 79 -17 -447 -521 -129
4842a29K37K54k6L05o96J49n07J54OJ93M80k8k7k68l11j53K32j28K41K88J31k82
$$ -129 108 362 336 641 -55 94 -413 -259 -253 -60 420 392 365 97 -214 -367 -135 -263 -22 266 397 115
4864A15q8l5l86p6M59k36M61K12k50j22k88o9l9M3K62K87Q6J77j83n03r7k23N38
$$ 115 27 -8 -394 -470 -11 -247 214 426 176 54 -234 -303 -342 -299 -37 250 336 513 330 -173 -270 -493 45
4887D5J05q4K72p7k34l76k5k78N13L31K09p1K7k63l26m01K64J06L28Q7P5K42m12
$$ 45 150 66 338 261 27 -349 -374 -652 -139 192 401 330 357 94 -232 -633 -369 -263 65 152 227 469 57
4910E7r8l52K0O4L29K63K50k73m6m05j82J09O9K80L21N1l79L4l37l64K04L9L05
$$ 57 -41 -393 -373 -309 20 283 533 260 214 -191 -373 -264 -195 85 406 457 78 112 -225 -589 -385 -346 -41
4933d1L05R1r8l10j29k91j15L30M94p0J30RQm54j72k78K94K94K28O3P5k55l17
$$ -41 264 355 257 -53 -182 -473 -588 -258 236 166 296 305 313 -141 -313 -591 -297 -3 225 288 363 108 -209
4956b09j73j1K6K43N35K20l22p1l14l43j89M23J93J68K70N3l07k77m46K45J15
$$ -209 -382 -393 -367 -124 411 631 309 238 -76 -419 -608 -185 8 176 446 499 192 -85 -531 -286 -171
4977a71J76L82l45M32k53k84r1q2P9J25K85j14L24o31j91O7J45j82L18K90K27
$$ -171 5 387 42 474 221 -63 -154 -236 -157 -32 253 139 463 -168 -359 -292 -147 -329 -11 279 506
4998E06k49l78j03j04lK18r3M49L03l56j40m75R2l1M8p6M60K51Kl30l58L7M3L4
$$ 506 257 -121 -224 -328 -331 -113 -206 243 546 190 50 -425 -333 -364 -316 -392 68 319 321 -9 -367 -330 -287 -253
5022b53J90K06L15l9n05qm98J38K60L74Q0j0J93k84l75k15q1N3L95M83J44k35
$$ -253 -63 143 458 419 -86 -94 -592 -454 -194 180 260 250 443 159 -216 -431 -512 -459 -64 419 563 328
5044C28r0m15k29P3K35J57j6M23k98l06L9q3k17L72K7J18L49j74m35j30j46N9
$$ 328 238 -177 -406 -333 -98 59 43 466 168 -138 -99 -182 -399 -27 0 118 467 293 -142 -272 -418 -359
5066c59RJ22L06K37j71j35j34l06J50lM48N5J7J71k34j77j41k49J68L3L07K36
$$ -359 -350 -228 78 315 144 9 -125 -431 -281 -284 164 219 236 407 173 -4 -145 -394 -226 -193 114 350
5088C50k66m2k42j83r1J14M20K27J4k7l91n0n8k72L70K09K55K45l41l37j84Q7
$$ 350 84 42 -200 -383 -474 -360 60 287 301 274 -117 -167 -225 -497 -127 82 337 582 241 -96 -280 -193
5110a93l05K44L38J71M6o8k64k08r1N9j8O75k42K33Q7l32k22o6j87J46L16K95
$$ -193 -498 -254 84 255 301 233 -31 -239 -330 -271 -289 386 144 377 464 132 -90 -156 -343 -197 119 414
5132D14K76n62j21j63n59J79L05L50Q8P7j70k44j95J20l46L39K87L47k23J65m5
$$ 414 690 128 7 -156 -715 -536 -231 119 207 284 114 -130 -325 -205 -551 -212 75 422 199 364 319
5153C19n71J17j63j37M82J19K45j38r4m27k1KN2M16J26J77n3l47k37k65j21M86
$$ 319 -252 -135 -298 -435 47 166 411 273 179 -248 -269 -267 -215 201 327 504 451 104 -133 -398 -519 -33
5175c3JL40l1O3k63j10k40k42K58K76K44n0K60n06j27k64J33o2N22K25m6pk12
$$ -33 -32 308 277 340 77 -33 -273 -515 -257 19 263 213 473 -33 -160 -424 -291 -353 169 394 348 341 129
5198A29m31j19j14O10N9j22M17ql83l19N2q7L58N0J11J53n1j91k99o2m07O33J93
$$ 129 -302 -421 -535 75 134 12 429 421 38 -281 -229 -316 42 92 203 356 305 114 -185 -247 -654 -21 172
5221A72K67j01pm24l20n9L4J09M08L26j41K26l76m69J51Q5j28L37K24N3k20O4
$$ 172 439 338 331 -93 -413 -472 -438 -329 79 405 264 490 114 -355 -204 -119 -247 90 314 367 147 211
5243B11k62m98J58L46L35M4K15l45J48p57j33K30r9N12K38l3m5j57l86oj48J23
$$ 211 -51 -549 -391 -45 290 334 549 204 352 -405 -538 -308 -407 105 343 310 265 108 -278 -284 -432 -309
5265c09K04L13n3K39k93l72p8m5K82K96OP6J51k68j55m54o9K45L26L68J61k47
$$ -309 -105 208 155 394 101 -271 -349 -394 -112 184 190 266 417 149 -6 -460 -529 -284 42 410 571 324
5287C24l88k8j23j60J51L46k0M54k19j34m68J6r1j97M64L48J59j20J36p21j83
$$ 324 -64 -92 -215 -375 -224 122 102 556 337 203 -265 -249 -340 -537 -73 275 434 314 450 -271 -454
5308d54L2k8N45J33J23M0k13o77K34pJ08Q8M21m1J36l47k51l05%J56N58oJ25o4
$$ -454 -422 -450 95 228 351 391 178 -499 -265 -272 -164 -76 345 304 440 93 -158 -463 -463 -307 251 245 370 306
5332C06o6n75j1k83N54K45M25j90j79j39k69j74m7M59J41k4J25J04k46l04p9o2
$$ 306 240 -335 -346 -629 -75 170 595 405 226 87 -182 -356 -403 56 197 173 298 402 156 -148 -227 -289
5354b89K61J99n9L45k50r0l21k51J42K23J16L59J77k46j84l06j37j49L02K40K15
$$ -289 -28 171 112 457 207 117 -204 -455 -313 -90 26 385 562 316 132 -174 -311 -460 -158 82 297
5375B97K60k39k82k76o4j54M46MK47J42J5m14k46j69j21M31K37J63M9J46m01m40
$$ 297 557 318 36 -240 -304 -458 -12 -8 239 381 396 -18 -264 -433 -554 -123 114 277 326 472 71 -369
5397c69K3K0L09K7L51j28M2K8m37j49m20L43O27P2L27k67m89j68m19M14J97L59
$$ -369 -346 -326 -17 10 361 233 275 303 -134 -283 -703 -360 267 339 666 399 -90 -258 -677 -263 -66 293
5419B93j58Q7j09j0l44j13m3J85J62K58O2l1q6l19m83J39L77K90K52N5n5l61o8
$$ 293 135 222 113 103 -241 -354 -397 -212 -50 208 270 239 153 -166 -649 -510 -133 157 409 464 409 48 -20
5442b0l44j54O44Q6jL03k85l73l7p1k18J51L62L69j55k1l11p9k21o3O5N22L86
$$ -20 -364 -518 126 212 211 514 229 -144 -181 -252 -470 -319 43 412 257 236 -75 -154 -375 -438 -373 149 535
5465E35o6k53j03o46J15J05J06L09J90P1J03l49l55k16J14L02J03J7K96j77K9
$$ 535 469 216 113 -533 -418 -313 -207 102 292 363 466 117 -238 -454 -340 -38 65 82 378 201 230
5486B30n02J65k64L07M0K90J04j32Ln34P6J53J43K8J99J8K22m64k08rl01K86L10
$$ 230 -272 -107 -371 -64 -24 266 370 238 241 -293 -217 -64 79 107 306 324 546 82 -126 -135 -436 -150 160
5509A60K80Rj91k41j79N0j67LM05M77o5l16J03m30l19k3K04K69K97R7k9l64k39
$$ 160 440 449 258 17 -162 -112 -279 -276 129 606 541 225 328 -102 -421 -444 -240 29 326 423 394 30 -209
5532b09l25K17K49J48K3K61k6l24j35p5k54M86J70OK27k10k93m14j7J50o1L78
$$ -209 -534 -317 -68 80 103 364 338 14 -121 -196 -450 36 206 212 439 229 -64 -478 -495 -345 -406 -28
5554b8O28k94j73l17J53j90p4K47M85j26j20J24n37L32m19J0Q5J95L42L95m40
$$ -28 600 306 133 -184 -31 -221 -295 -48 437 311 191 315 -222 110 -309 -299 -214 -19 323 718 278
5575B78l26k28l32K12M30P8J82L12pn05l76j65J64K15K90J11Q2J71n51k84m8l3
$$ 278 -48 -276 -608 -396 34 112 294 606 599 94 -282 -447 -283 -68 222 333 415 586 35 -249 -297 -330
5597c30J51N01o3K21j23k42n81n9L33ML44j38L17J2k48l03j94q2L64J42L40L13
$$ -330 -179 322 259 480 357 115 -466 -525 -192 -188 156 18 335 347 99 -204 -398 -480 -116 26 366 679
5619F79l16k41m27k8m9oM29K35J23k11j81k84o4k27L75K28J31J34M9j92l25J4
$$ 679 363 122 -305 -333 -382 -388 41 276 399 188 7 -277 -341 -568 -193 35 166 300 349 157 -168 -154
5641a54Q4n3K30K99r6j40j58l43q7J27J26J83N8K74J18m50n77L1L74p7M64j68
$$ -154 -70 -123 107 406 310 170 12 -331 -418 -291 -165 18 76 350 468 18 -559 -528 -154 -231 233 65
5663F5L43rl38k92m4R7L39J09J16j80J33m50j53o6j06K21J35K50M05J44p47k98
$$ 65 408 399 61 -231 -275 -178 161 270 386 206 339 -111 -264 -330 -436 -215 -80 170 575 719 -28 -326
5685c26J5J84J57Q7k1L14j85m59J83l41J31K72J84J43j02m5j90n27K04qJ81N02
$$ -326 -311 -127 30 117 96 410 225 -234 -51 -392 -261 11 195 338 236 191 1 -526 -322 -330 -149 353
5707C53k55N03l90k38j28o6j00J24K41M90j06j23k3l36o03L95L14R5K05m1Q5l59
$$ 353 98 601 211 -27 -155 -221 -321 -197 44 534 428 305 282 -54 -657 -262 52 147 352 311 396 37
5729C7k31j44K29J71%K87L1J8l11n12J52j33M61J25L56j27k22l46j35n4K35j35
$$ 37 -194 -338 -109 62 62 349 380 398 87 -425 -273 -406 55 180 536 409 187 -159 -294 -348 -113 -248
5751b48M22K59QJ79o69k88r0j35M55K29M27l04k57L2l16j20j9K79K92M32r6j47
$$ -248 174 433 441 620 -49 -337 -427 -562 -107 122 549 245 -12 20 -296 -416 -435 -156 136 568 472 325
5773C25j97m48j90J83K05K31Q5K90k33l71j89K70m30L50k3M34N4k23k84J05l0
$$ 325 128 -320 -510 -327 -122 109 194 484 251 -120 -309 -39 -469 -119 -142 292 346 123 -161 -56 -86
5794h6k86L09L2L16J18j13l18j41j61m5L36O0K94n7j19k09j2j71r2K26J40L52
$$ -86 -372 -63 -31 285 403 290 -28 -169 -330 -375 -39 21 315 258 139 -70 -82 -253 -345 -119 21 373
5816C73K02n58n6L4l35J34J29Q2K27L46k66l96p3j75j48M50K22j47M33j12n61
$$ 373 575 17 -39 -5 -340 -206 -77 5 232 578 312 -84 -157 -332 -480 -30 192 45 478 366 -195
5837a95q3L28j59K4J92Q9M74j76n53j87K1k51L27L67O9k4L5j31m39m11O61j05
$$ -195 -278 50 -109 -85 107 196 670 494 -59 -246 -225 -476 -149 218 287 263 298 167 -272 -683 -22 -127
5859a27K00L03J38k05k93j17k81K0J53J81L69J14m59j56J58l58M3L09p4N06N3
$$ -127 73 376 514 309 16 -101 -382 -362 -209 -28 341 455 -4 -160 -2 -360 -317 -8 -82 424 477
5880D77o80k8K1n4p0J10N05M8K19l42k38k81q7J20J69L76p6R8J26l92j83k32K33
$$ 477 -203 -231 -210 -264 -334 -224 281 329 548 206 -32 -313 -400 -280 -111 265 189 287 413 21 -162 -394 -161
5903a61N7n0O34l2k49j38j38j76K33j23N10J08k02o5j34n17J44m1L95J11q3J59
$$ -161 -104 -154 480 448 199 61 -77 -253 -20 -143 367 475 273 208 74 -443 -299 -340 55 166 83 242
5925B42j27j54l77o0j03O07K09m2P3k99k49k48L17m2L32O0K01j8m08o5l35JK3
$$ 242 115 -39 -416 -476 -579 28 237 195 268 -31 -280 -528 -211 -253 79 139 340 322 -86 -151 -486 -485 -462
5948d62M40K32J24r1m8l62j27j72K50MJ69M42j90k11j16O6J5k35R4N09J9o6j76
$$ -462 -22 210 334 243 195 -167 -294 -466 -216 -212 -43 399 209 -2 -118 -52 -37 -272 -178 331 350 284 108
5971A08q0l06L7J10K89j2L41R5k91l91m06K33J45K5L21n4r2K1j71k82J53j17K34
$$ 108 28 -278 -241 -131 158 146 487 582 291 -100 -506 -273 -128 -103 218 164 72 93 -78 -360 -207 -324 -90
5994i0J37J14J3j37J17o21K31j30J85L59j16K90k05l76p4k32K21M52J93k72J41
$$ -90 47 161 174 37 154 -467 -236 -366 -181 178 62 352 147 -229 -303 -535 -314 138 331 59 200
6015B00j84k78j93K24R9J09M46j72n0J68m28j13k28j00L94J92J90j04j5p5k84
$$ 200 16 -262 -455 -231 -132 -23 423 251 201 369 -59 -172 -400 -500 -106 86 276 172 157 82 -202
6036b02k13K45J55J93R8j23j35r0k74j43J93J16K93N7J58r9k23k82o9K22R5L01
$$ -202 -415 -170 -15 178 276 153 18 -72 -346 -489 -296 -180 113 170 328 229 6 -276 -345 -123 -28 273
6058B73J60k42l19J51j28j34o0L11J42L3J96k7l96j50k4R3P1K39K69k96K6k29
$$ 273 433 191 -128 23 -105 -239 -299 12 154 187 383 356 -40 -190 -214 -121 -50 189 458 162 188 -41
6080d1k70Nk56O51n4M39k12o1o8n29R3j35M07K59K59l68P1k95m33J30L88j78K66
$$ -41 -311 -306 -562 89 35 474 262 201 133 -396 -303 -438 -31 228 487 119 190 -105 -538 -408 -20 -198 68
6103F8J66J35j90j30l02k7K32L8K24q6N9nm37M8k50M96J48k18L56L0j85l72j43
$$ 68 234 369 179 49 -253 -280 -48 -10 214 128 187 182 -255 -207 -457 39 187 -31 325 355 170 -202 -345
6126c45J85j38M54J32K5K45n47L1p22N18j02J77M11o6J45l02j16J8l24J23J06
$$ -345 -160 -298 156 288 313 558 11 42 -680 -162 -264 -87 324 258 403 101 -15 3 -321 -198 -92
6147i2L34L7k0n2m06l91L16K44O4J47K00l5l9l88j53j35PJ85M66r8N6k35J92k70
$$ -92 242 279 259 207 -199 -590 -274 -30 34 181 381 346 307 -81 -234 -369 -362 -177 289 191 247 12 204 -66
6171f6j71n1N90J9n4J01k93R9l63l27L59jL12j5K79k51m60K13P8k38K97J70K28
$$ -66 -237 -288 302 321 267 368 75 174 -189 -516 -157 -158 154 139 418 167 -293 -80 -2 -240 57 227 455
6194D55J57n53k5m55K51j73K51L52R9p7j74n6m93N4L57O1M5K81ok24j27l80J04
$$ 455 612 59 34 -421 -170 -343 -92 260 359 282 108 52 -441 -387 -30 31 76 357 351 127 0 -380 -276
6217b76P3L66j9P1O4j73l45J7j57N2K43L15m9J1o1j71j50m14L91K29K97k0L4l92
$$ -276 -203 163 144 215 279 106 -239 -222 -379 -327 -84 231 182 193 132 -39 -189 -603 -212 17 314 294 328 -64
6241f4k4j73J29J53p6J09L55k0k76k35jr9L6L38j4j0K09k47k52l84K12J29J08
$$ -64 -88 -261 -132 21 -55 54 409 389 113 -122 -123 -222 -186 152 138 128 337 90 -162 -546 -334 -205 -97
6264i7K20J56M7j58l54l2r2J80J62J87l9Ok4n83K67j27K20L6J62J27O0k42j87
$$ -97 123 279 326 168 -186 -218 -310 -130 32 219 180 186 162 -421 -154 -281 -61 -25 137 264 324 82 -105
6287a05j11k0K25oR9J83kj08k40j45m7K87k73L61K97j68k35r3l59K37j08K16L76
$$ -105 -216 -236 -11 -17 82 265 263 155 -85 -230 -277 10 -263 98 395 227 -8 -101 -460 -223 -331 -115 261
6310B61j11J39k91Rl08j34K28L29j30M46j81j70j29j37p7L1L87k01M62k57n8k10
$$ 261 150 289 -2 7 -301 -435 -207 122 -8 438 257 87 -42 -179 -256 -225 162 -39 423 166 108 -102
6332a02k85K94mj14L84K43j37o2j47m23j7K82L6L66R2l37j30r6j04J05J01n4K29
$$ -102 -387 -93 -97 -211 173 416 279 217 70 -353 -370 -88 -52 314 406 69 -61 -157 -261 -156 -55 -109 120
6355A20m2K13k36q0l91J05J60kN47J55m95k09K6r7j06O3N41Jj83K10r2l20j04
$$ 120 78 291 55 -25 -416 -311 -151 -153 394 549 54 -155 -129 -226 -332 -269 272 273 90 300 208 -112 -216
6378b16K0J14J49q1L17j27j55J5m17K8J96L94N5m6k18R2m74J56Q5K3k00O44j18
$$ -216 -196 -82 67 -14 303 176 21 36 -381 -353 -157 237 292 246 28 120 -354 -198 -113 -90 -290 354 236
6401B36L8j95l64m9K18L5L68M9j04q7k20Nj50O1r8L70J18J46j43j72k34r3O3J16
$$ 236 274 79 -285 -334 -116 -81 287 336 232 145 -75 -70 -220 -159 -257 113 231 377 234 62 -172 -265 -202 -86
6425h6K48J25k0l9k1l07m70K29K56L58r8J52j66k0l06j1q1P5J49J45M30l81j05
$$ -86 162 287 267 228 207 -100 -570 -341 -85 273 175 327 161 141 -165 -176 -257 -182 -33 112 542 161 56
6448E6j19j24r0K55j31L59O7K4q0n36J6J5R8L96k13K59K36p30m1o3N1J05M35N4
$$ 56 -63 -187 -277 -22 -153 206 273 297 217 -319 -303 -288 -190 206 -7 252 488 -242 -283 -346 -295 -190 245 299
6472B99j52J2m0j11j59J29K8qK65j7k6m00j19J61j74O8M24j9J13rk77j96J45j97
$$ 299 147 159 119 8 -151 -22 6 -2 263 246 220 -180 -299 -138 -312 -244 180 161 274 265 -12 -208 -63 -260
6496b60K08L2K32q7J85k22j78r5M4R3J27L1R4p8J8k85j9kQ0J91j46N98n78J09
$$ -260 -52 -20 212 125 310 88 -90 -185 -141 -48 79 110 204 126 144 -141 -160 -162 -82 109 -37 561 -17 92
6520I2j43m32L07m8K00j2J50L13n07J09n31L69L21n1M6m2j33J04q8j94k1K19J3
$$ 92 -51 -483 -176 -224 -24 -36 114 427 -80 29 -502 -133 188 137 183 141 8 112 24 -170 -191 28 41
6543D1J74k8j01R1m14k4l5J51K88K14Kj95k80MJ0j43L56j52J86K57j42l19K18
$$ 41 215 187 86 177 -237 -261 -296 -145 143 357 359 164 -116 -112 -102 -245 111 -41 145 402 260 -59 159
6566A59m49j99L70J77K03j34Q1j63j80k76K74J51O1K72O8m09n5p0J00j65J56L86
$$ 159 -290 -489 -119 58 261 127 208 45 -135 -411 -137 14 75 347 415 6 -49 -119 -19 -184 -28 358
6588C58R7k23j80k71J86j26o9J35J26K48J2j45j35k82m8m9K74J8J60K97k24j14
$$ 358 455 232 52 -219 -33 -159 -228 -93 33 281 293 148 13 -269 -317 -366 -92 -74 86 383 159 45
6610D5j25k73K2J53J98M32l51J46k55k82K76l73L40K99r7J90n4j90j58m6j04Q9
$$ 45 -80 -353 -331 -178 20 452 101 247 -8 -290 -14 -387 -47 252 155 345 291 101 -57 -103 -207 -118
6632a18J05K42k5Jj40k91K9k0J63n6K06K43q2k63p5l42L06j24K05K37R3j25r0
$$ -118 -13 229 204 205 65 -226 -197 -217 -54 -110 96 339 257 -6 -81 -423 -117 -241 -36 201 294 169 79
6655G9m01r3L12j22K83J16J43p0k26j33l11j0M40J57J29L3k80k72j3k03J49L46
$$ 79 -322 -415 -103 -225 58 174 317 247 21 -112 -423 -433 7 164 293 326 46 -226 -239 -442 -293 53
6677E3J50n1J95k83k52r6k81K81K05K11J4Q3j76l18L02q2k64L6L95m0J7p5P1k38
$$ 53 203 152 347 64 -188 -284 -565 -284 -79 132 146 229 53 -265 37 -45 -309 -273 122 82 99 24 95 -143
6701a43k02K52j05L83J17j33q3k26k2j22L9L81m5K24j36j37K71k66k2l95J04L21
$$ -143 -345 -93 -198 185 302 169 86 -140 -162 -284 -245 136 91 315 179 42 313 47 25 -370 -266 55
6723E5L8J18k28Nj03k50N60k73M7K96k59%Q8l32L18m74K08M09j65m3J31k25j49
$$ 55 93 211 -17 -12 -115 -365 195 -78 -31 265 6 6 94 -238 80 -394 -186 223 58 15 146 -79 -228
6746b28J02q5J37K57KQ3k35M9j94j47K33j6J74J89l4j29m8k48M5j30m5L28L39
$$ -228 -126 -211 -74 183 185 268 33 82 -112 -259 -26 -42 132 321 287 158 110 -138 -93 -223 -268 60 399
6769C99l73o4j15J83j88l4J31J05n1L2Pl0m56J45K74J30j57P7J05J08j94l71r2
$$ 399 26 -38 -153 30 -158 -192 -61 44 -7 25 32 2 -454 -309 -35 95 -62 15 120 228 34 -337 -429
6792d29K44N2K87R0K37n07O8m68J92J06K92k33K9J24Q1l07kj45K60l5M66k26J62
$$ -429 -185 -133 154 244 481 -26 42 -426 -234 -128 164 -69 -40 84 165 -142 -144 -289 -29 -64 402 176 338
6815C38j27m87J79K8k76M74l1J82l0k26k17k14J13J25K92K50o4j23q8j26j23J41
$$ 338 211 -276 -97 -69 -345 129 98 280 250 24 -193 -407 -294 -169 123 373 309 186 98 -28 -151 -10
6837a0n3k01K83K06o5m8r4k84J65j50J01J70K19j4k08R0l35pJ2L46lJ39j11n8
$$ -10 -63 -264 19 225 160 112 18 -266 -101 -251 -150 20 239 225 17 107 -228 -235 -223 123 120 259 148 90
6861I0j21k52n3J21RJ90p9M32l41j89Q8k33k9J41M2M10L3j28j61M4j02K3j31K67
$$ 90 -31 -283 -336 -215 -206 -16 -95 337 -4 -193 -105 -338 -367 -226 -184 226 259 131 -30 14 -88 -65 -196 71
6885G1K10k73L23ln69r3K88j04J78l5M14l0n7o69Q1j10L41M5L29J4q8l31P5j01
$$ 71 281 8 331 328 -241 -334 -46 -150 28 -7 407 377 320 -349 -268 -378 -37 8 337 351 263 -68 7 -94
6909i4n0L2L12k7k20K22l15j10K96l34K11J56J28R6m04L26m00J16j60K66l5PJ33
$$ -94 -144 -112 200 173 -47 175 -140 -250 46 -288 -77 79 207 303 -101 225 -175 -59 -219 47 12 19 152
6932A52m30N67l53j25K71k37R9L66o2p3r4p7j86j19J46K45J02k0M4k38m4j36k9
$$ 152 -278 289 -64 -189 82 -155 -56 310 248 175 81 4 -182 -301 -155 90 192 172 216 -22 -66 -202 -231
6955b31K51J00L4j75M5k99K15k61O2N03j66k46M21l38l16J54J36j2J47J82K9K15
$$ -231 20 120 154 -21 24 -275 -60 -321 -259 244 78 -168 253 -85 -401 -247 -111 -123 24 206 235 450
6977D50k95k78k0j58%L31l7K01K3o7j88L0k43R5kJ1L47n4j6j38j47j81M06q6L09
$$ 450 155 -123 -143 -301 -301 30 -7 194 217 150 -38 -8 -251 -156 -158 -147 200 146 130 -8 -155 -336 70 -16 293
7002B93j34K46n82l7J0j96L07J17J32L00k01l01k06M3K05q3K14j31L25k03j74
$$ 293 159 405 -177 -214 -204 -400 -93 24 156 456 255 -46 -252 -209 -4 -87 127 -4 321 118 -56
7023e6k43K75j70lJ69K50J59k26np7j92j12k11O87p1K15j03k59l6k03J58q6K00
$$ -56 -299 -24 -194 -197 -28 222 381 155 150 73 -119 -231 -442 245 174 389 286 27 -9 -212 -54 -140 60
7046F0j13K05m2o9K1k16j78K36P5J54j50O1r5k48K61q1j11L84l86N33l95L8r1
$$ 60 -53 152 110 41 62 -154 -332 -96 -21 133 -17 44 -51 -299 -38 -119 -230 154 -232 301 -94 -56 -147
7069a47l99M25L4o9K89L9K2ol19J67r7j72J45J46j07J16P4j63j7L5q6Q0P0J64
$$ -147 -546 -121 -87 -156 133 172 194 188 -131 36 -61 -233 -88 58 -49 67 141 -22 -39 -4 -90 -10 60 224
7093B24j71j42j78J23l3J67o2M2R0J25N1k99N9k59J8M34k40L84k99o0r8J81l80
$$ 224 53 -89 -267 -144 -177 -10 -72 -30 60 185 236 -63 -4 -263 -245 189 -51 333 34 -26 -124 57 -323
7116c23n2L32J20l2J81m88M1p5k8J61k3J80J52k3j33j56K9j7J9J45L6J83k53K21
$$ -323 -375 -43 77 45 226 -262 -221 -296 -324 -163 -186 -6 146 123 -10 -166 -137 -154 -135 10 46 229 -24 197
7140A97p0j86k36M12j39OL63k25j99k5P3k25O6lJ64L10l80P9o2j12J87NL1l9Q3
$$ 197 127 -59 -295 117 -22 -16 347 122 -77 -102 -29 -254 -188 -191 -27 283 -97 -18 -80 -192 -5 0 31 -8 75
7165G5J96m02J37j72J87k37J70J22j31K23o6n69J06O2J66O4K72J29k68n9q7K8
$$ 75 271 -131 6 -166 21 -216 -46 76 -55 168 102 -467 -361 -299 -133 -69 203 332 64 5 -82 -54
7187e4k50J36N8L47q4k00m25L85j81K64k9q0J77J11j1l30M3R2l03L50j8j01L91
$$ -54 -304 -168 -110 237 153 -47 -472 -87 -268 -4 -33 -113 64 175 164 -166 -123 -31 -334 16 -2 -103 288
7210B88l54K85n23P7J60k96N71j22N5j28L8p1q3L0K6j7L47n1R6k48k64K3j44K01
$$ 288 -66 219 -304 -227 -67 -363 208 86 141 13 51 -20 -103 -73 -47 -64 283 232 328 80 -184 -161 -305 -104
7234a04m0J27J11J45k07k45J00l22L52K68JK3k33K02k54j45J27r9J63J52P4j01
$$ -104 -144 -17 94 239 32 -213 -113 -435 -83 185 186 209 -24 178 -76 -221 -94 -193 -30 122 196 95
7256I5j00j17o1L6J97o6J85L0j52j26o9JP1l73N45q0K14kj5l41j14J71LJ93J53
$$ 95 -5 -122 -183 -147 50 -16 169 199 47 -79 -148 -147 -76 -449 96 16 230 228 213 -128 -242 -71 -68 125 278
7281B78k07P7k18j93L19j76k25L54J81k12K2J09m51K52k97L2L45oJ69Q4m32j67
$$ 278 71 148 -70 -263 56 -120 -345 9 190 -22 0 109 -342 -90 -387 -355 -10 -16 153 237 -195 -362
7303c62J41J12j05J29J01r6L32j66n7j67Q0j90M26k96L16L5k84j56j61O6J69M56
$$ -362 -221 -109 -214 -85 16 -80 252 86 29 -138 -58 -248 178 -118 198 233 -51 -207 -368 -302 -133 323
7325C23l51q1L50k35k49J23K2J41J22m9L7O0j13J6p2j05Q2lJ59k07Q0K04n17R2
$$ 323 -28 -109 241 6 -243 -120 -98 43 165 116 153 213 100 116 44 -61 21 18 177 -30 50 254 -263 -171
7349a71J63k8r5J62J61N2j49j58j96j80L17M8L14R5k13Q9l21p5J50P2l23M67k04
$$ -171 -8 -36 -131 31 192 244 95 -63 -259 -439 -122 -74 240 335 122 211 -110 -185 -35 37 -286 181 -23
7372b3P1K3k98K15j53l3N11l80J83j06j43j56J74j10K77K14j2P6k8j93k35O0J53
$$ -23 48 71 -227 -12 -165 -198 313 -67 116 10 -133 -289 -115 -225 52 266 254 330 302 109 -126 -66 87
7395H7q8j73M40j94l4J35n08Q6J74L4L46j49J15l42k1M8l28M15n8MK37k20K58
$$ 87 -1 -174 266 72 38 173 -335 -249 -75 -41 305 156 271 -71 -92 -44 -372 43 -15 -11 226 6 264
7418B64j90k70K5J39Q3Q0p2K7K41k99k48J56j27J89L5nJ34j59J58j25j85J8J19
$$ 264 74 -196 -171 -32 51 131 59 86 327 28 -220 -64 -191 -2 33 28 162 3 161 36 -149 -131 -12
7441a2Q5o3R9q8O2j91J33J5q0p2L26Q4l32k39L02n8j56N5m4L57n7K54m90J26k98
$$ -12 73 10 109 21 83 -108 25 40 -40 -112 214 298 -34 -273 29 -29 -185 -130 -174 183 126 380 -110 16 -282
7466b82M71p9k83M46l87L75r5m41K01j44Q5j03M30j29J00k04O4k86P6L03j88J70
$$ -282 189 110 -173 273 -114 261 166 -275 -74 -218 -133 -236 194 65 165 -39 25 -261 -185 118 -70 100
7488A00Qj33n3n48N24Q4K01j75J06K18k36j49N7l34L49j15J58MJ87j03j23Kj30
$$ 100 108 -25 -78 -626 -102 -18 183 8 114 332 96 -53 4 -330 19 -96 62 66 253 150 27 29 -101
7511a01L4J01j76L56n0P0l49n8J5M6m2J27L12k49N4j20J71k90k37M17Q6J3P6j57
$$ -101 -67 34 -142 214 164 234 -115 -173 -158 -112 -154 -27 285 36 90 -30 141 -149 -386 31 117 130 206 49
7535D9K17l98j9J51j12J29M29m18M88l38l15K96k79K14Kj13K53K2k17j95n1N0
$$ 49 266 -132 -151 0 -112 17 446 28 516 178 -137 159 -120 94 96 -17 236 258 41 -154 -205 -155
7557a55J24J38j07L4j9k33J70k67K59j6j32L19p7n0j27o2O0k46M64k32P1M91k51
$$ -155 -31 107 0 34 15 -218 -48 -315 -56 -72 -204 115 38 -12 -139 -201 -141 -387 77 -155 -84 407 156
7580A56k32q2P0n0k3K84L4P4j62j23n9q4J54J73l29L63J32l62J56j56r9K0m1K50
$$ 156 -76 -158 -88 -138 -161 123 157 231 69 -54 -113 -197 -43 130 -199 164 296 -66 90 -66 -165 -145 -186 64
7604F4J80j17J44l29k01L04l09q0M05Q4Lj46J85j08k88J8J71n4K93l10J97n7l09
$$ 64 244 127 271 -58 -259 45 -264 -344 61 145 148 2 187 79 -209 -191 -20 -74 219 -91 106 49 -260
7627b60L04JjN9j24J00J06k52j15j13J88O0J65k40N6j02K02J8j85P9n3J18K39
$$ -260 44 45 44 103 -21 79 185 -67 -182 -295 -107 -47 118 -122 -66 -168 34 52 -133 -54 -107 11 250
7650B50j06rl51J3o6r0M71n8K02j93k5J09n2j80o5R7k4K59j13Kj16k42J39J57
$$ 250 144 135 -216 -203 -269 -359 112 54 256 63 38 147 95 -85 -150 -53 -77 182 69 71 -45 -287 -148 9
7674Ip6L84j53j73J98m14nK63p4Lj87K27K13j29n8PJ18l20j1K26Mk7J09j88R7
$$ 9 -67 317 164 -9 189 -225 -230 33 -41 -38 -225 2 215 86 28 35 153 -167 -178 48 52 25 134 -54 43
7699D3j71K25J55m31M68j85j41j15j3k06L27O6k7L34l49J1J3R9j98O8m7J04K43
$$ 43 -128 97 252 -179 289 104 -37 -152 -165 -371 -44 22 -5 329 -20 -9 4 103 -95 -27 -74 30 273
7722B73j69J41r9l86j0L35k12L94k05j16n0K24j44l43K25R2R9L8J03k89J58P8
$$ 273 104 245 146 -240 -250 85 -127 267 62 -54 -104 120 -24 -367 -142 -50 49 87 190 -99 59 137
7744A37k68O3J74r7J27J3k1p1J51m47M1K48J22m8L9j02r5p0k57J08J10L01J22
$$ 137 -131 -68 106 9 136 149 128 57 208 -239 -198 50 172 124 163 61 -34 -104 -361 -253 -143 158 280
7767B80j98N5l3l04M6Q6pK27J15J22l45K3J81l74J38j91J04L00l44J96j12J46
$$ 280 82 137 104 -200 -154 -68 -75 152 267 389 44 67 248 -126 12 -179 -75 225 -119 77 -35 111
7789A11k15J61r4J36K3p9L9J45l50m7K00j74K29k28L95k32k34L27k03J90j38J87
$$ 111 -104 57 -37 99 122 43 82 227 -123 -170 30 -144 85 -143 252 20 -214 113 -90 100 -38 149
7811A49j70L68l54j02J4k01K1L24J29l1J51j51k55k8j75K6L99n3k51M48q6p2k41
$$ 149 -21 347 -7 -109 -95 -296 -275 49 178 147 298 147 -108 -136 -311 -285 114 61 -190 258 172 100 -141
7834a41J09q3J79R6l2M8o2j00q1R8l94L61J61r5J04k0j50j50j41j2K17J84n8M6
$$ -141 -32 -115 64 160 128 176 114 14 -67 31 -363 -2 159 64 168 148 -2 -152 -293 -305 -88 96 38 84
7858H4j03j03o5o7K59j82J40O6q3j4l1N7K0q3J52q9J8K03R8k26k35j0n7K34mR8
$$ 84 -19 -122 -187 -254 5 -177 -37 29 -54 -68 -99 -42 -22 -105 47 -42 -24 179 277 51 -184 -194 -251 -17 -21 77
7884G7O1k88j05J54J05k26K55J08j0Q0j93j44m4J72k53J01M52P7j83j39k46J05
$$ 77 138 -150 -255 -101 4 -222 33 141 131 211 18 -126 -170 2 -251 -150 302 379 196 57 -189 -84
7906h4k45J95N2n5L15L0R4l70j81j45M38J63m52R1K93k1k50J82O2k79j62P03k37
$$ -84 -329 -134 -82 -137 178 208 302 -68 -249 -394 44 207 -245 -154 139 118 -132 50 112 -167 -329 374 137
7929A37q5p5j27j15J40J70j12K40J01k64J87j64m8o3k53K75J54r0k01L86k09P3
$$ 137 52 -23 -150 -265 -125 45 -67 173 274 10 197 33 -15 -78 -331 -56 98 8 -193 193 -16 57
7951E7q5K6J4q3N7MK47j38j33m24K39N03j56j20K05k17j81J95j86J44L21j77J96
$$ 57 -28 -2 12 -71 -14 -10 237 99 -34 -458 -219 284 128 8 213 -4 -185 10 -176 -32 289 112 308
7974C08j11j90P0j95j52L16j21L99j92Rj98L5n3j22K76Jk47K67K92m32m5j85M17
$$ 308 197 7 77 -118 -270 46 -75 324 132 141 -57 -22 -75 -197 79 80 -167 100 392 -40 -85 -270 147
7997A47k51j60Q4M35j31j35j64R9J0l10K76K6J50k20L13k59K49k21j00J12O4J78
$$ 147 -104 -264 -180 255 124 -11 -175 -76 -66 -376 -100 -74 76 -144 169 -90 159 -62 -162 -50 14 192
8019A92k9j34qm3q9l6J30K78r0m6Q7k28j58l3Q1Q0J75K18l86k3J60P3r0m2k41
$$ 192 163 29 21 -22 -111 -147 -17 261 171 125 212 -16 -174 -207 -126 -46 129 347 -39 -62 98 171 81 39 -202
8044b02J53M7K65l06J29k2l91j0K92j1K80p2l8q8N3k12J12J07mlJ65j93k5k08
$$ -202 -49 -2 263 -43 86 64 -327 -337 -45 -56 224 152 114 26 79 -133 -21 86 82 79 244 51 26 -182
8068a82K68j83j53M34j62J77j75P4l55J64J67j18J94p4j08R8q1n5j70L25J05k70
$$ -182 86 -97 -250 184 22 199 24 98 -257 -93 74 -44 150 76 -32 66 -15 -70 -240 85 190 -80
8090h0K16j0K40n33K0J50J04l06L26R7J13l82j29L11k94p0M2O9K21k05L34l40
$$ -80 136 126 366 -167 -147 3 107 -199 127 224 337 -45 -174 137 -157 -227 -185 -116 105 -100 234 -106
8112a06N1l98L66L5p5L35N2l60J0q3j84J76K79J1k63J18J20r0j51j6n0J20K43
$$ -106 -55 -453 -87 -52 -127 208 260 -100 -90 -173 -357 -181 98 109 -154 -36 84 -6 -157 -173 -223 -103 140
8135A40j71J42j71R3r7j75K30j14K89J9O3m27J42k24L14l43L20p3K1J60L4j13
$$ 140 -31 111 -60 33 -64 -239 -9 -123 166 185 248 -179 -37 -261 53 -290 30 -43 -22 138 172 59
8157E9p8J8k53N4P0J27J06l8j76m8Mj84L24J35q3L12k40j06j91J6Q8N7p2O8m4
$$ 59 -19 -1 -254 -200 -130 -3 103 65 -111 -159 -155 -339 -15 120 37 349 109 3 -188 -172 -84 -27 -99 -31 -75
8182g5j05J36j19R6j56P3N4L1M38
$$ -75 -180 -44 -163 -67 -223 -150 -96 -65 373
8191C73
$$ Imaginary data points
##PAGE= N=2
##DATA TABLE= (X++(I..I)), XYDATA
0@%%%%%%%%%%%%%%%qJ6j6J6j6J8k6L2l6M4m9N7o9P8q9J03j18J34j51J70j91K14
$$ 0 0 0 0 0 0 0 0 0 0 0 0 0 0 0 0 -8 8 -8 8 -8 10 -16 16 -20 24 -25 32 -37 41 -48 55 -63 71 -80 90 -101 113
37A13k40K68k99L34l69M09m54N02n56O13o75P44q20R02r93J095j207J336j482
$$ 113 -127 141 -158 176 -193 216 -238 264 -292 321 -354 390 -430 472 -521 574 -633 703 -779
56g79J644j830K049k308K618k998L479m111M977o236Q249j1970K1068q4723j23836
$$ -779 865 -965 1084 -1224 1394 -1604 1875 -2236 2741 -3495 4754 -7216 13852 -70871 -194707
71a94707J15417J5817M5483J30873k4917j00774N0109j8939q8413M6286K9562
$$ -194707 -79290 -63473 -17990 112883 87966 -12808 37301 18362 -70051 -23765 5797
82E797n9408Q1291R0492o1286k2244N608j14044k9118J01463K1033J5217Q1046
$$ 5797 -53611 27680 118172 56886 34642 40250 -73794 -102912 -1449 19584 34801 115847
94A15847m8904j07257N056j3687m3175P8249O3255l6174K6324L1940p6005l3962
$$ 115847 66943 -40314 -35258 -48945 -92120 -13871 49384 13210 39534 71474 -4531 -38493
106c8493J6057n7873n993R8649L5115L243M1418n2639j02525L646J9365o677P2752
$$ -38493 -22436 -80309 -86302 12347 47462 50705 92123 39484 -63041 -59395 -40030 -46707 26045
119B6045N8089l9845o920R976o4667k7441L5305j1869J0360P4751Q744l6369L000
$$ 26045 84134 44289 37369 47345 -17322 -44763 -9458 -21327 -10967 63784 72528 36159 39159
132C9159l9918o6801J9143L8360O185N1847M0115m5867l8007j2786m6124n926
$$ 39159 -759 -67560 -48417 -10057 -3872 47975 88090 42223 4216 -8570 -54694 -60620
144f0620N8412K2289P642L6678j2740m9357q811j6552l4901K8531M9922J0481
$$ -60620 -2208 20081 27723 64401 51661 2304 -6507 -23059 -57960 -29429 20493 30974
156C0974K3050J3781n2466m5473l051j5146J0268O0667K6072q222O359k6919n4648
$$ 30974 54024 67805 15339 -30134 -33185 -48331 -38063 22604 48676 40454 46813 19894 -34754
169c4754o545J0584l398L4810M2397o189p011l274m4534l1958J3653Q400J9239
$$ -34754 -41299 -30715 -34113 697 43094 36905 29894 26620 -17914 -49872 -36219 -27819 -8580
182h580M9879J5224k5159j6177k8768l7023J1821L3900J5775K6400J9827k3592
$$ -8580 41299 56523 31364 15187 -13581 -50604 -38783 -4883 10892 37292 57119 33527
194C3527k6513j2358k7973j1572K7612K5447J8788K6600o072l8823k6422j9218
$$ 33527 7014 -5344 -33317 -44889 -17277 8170 26958 53558 47486 8663 -17759 -36977
206c6977j5048K1539L8306J7322J1323J187l0835l1296p699m822Q547L2903K1440
$$ -36977 -52025 -30486 7820 25142 36465 37652 6817 -24479 -32178 -37000 -28453 4450 25890
219B5890K419R45j7717l4024j4861K869R112K9401L2435M849j0846j8091l3045
$$ 25890 28309 29254 11537 -22487 -37348 -34479 -25367 4034 36469 41318 30472 12381 -20664
232b0664k1782O894J6458K4214L0093J0358j3060j8089k4723k4749k273J5848
$$ -20664 -42446 -35552 -19094 5120 35213 45571 32511 14422 -10301 -35050 -37323 -21475
244b1475K0183K4905J6963q404k2932k2616k0227m494J7998K2819J8094J2126
$$ -21475 -1292 23613 40576 32172 9240 -13376 -33603 -38097 -20099 2720 20814 32940
256C2940o003k2723k1946j4699k939J6123K6881J9576P999o381k2214k5622j4529
$$ 32940 26937 4214 -17732 -32431 -35370 -19247 7634 27210 35209 28828 6614 -19008 -33537
269c3537k205J3511K6441K3341R150n647k0609k7159j6998j059J2633K3792K2787
$$ -33537 -35742 -22231 4210 27551 36701 31054 10445 -16714 -33712 -34771 -22138 1654 24441
282B4441R477o082j7258k3781j6632j608J1900K0968K1223R741o327j8945k2460
$$ 24441 33918 27836 10578 -13203 -29835 -31443 -19543 1425 22648 32389 26062 7117 -15343
295a5343j5792r15J4087K1217J9047Q951o222j7892k1883j5777j625J3750K2417
$$ -15343 -31135 -32050 -17963 3254 22301 31252 25030 7138 -14745 -30522 -32147 -18397 4020
308D020K0230R081o842j8522k1663j4684k038J2172K0847J9797R555n506j8341
$$ 4020 24250 33331 26489 7967 -13696 -28380 -30418 -18246 2601 22398 31953 26447 8106
321H106k1517j5069q96J2427K0432J8719Q865m643j7111k0935j5248j632J2340
$$ 8106 -13411 -28480 -29376 -16949 3483 22202 31067 26424 9313 -11622 -26870 -28502 -16162
334a6162K0595J8577Q025n961j6245k0001j4288k375J0420J8843J8556R008n312
$$ -16162 4433 23010 31035 25074 8829 -11172 -25460 -27835 -17415 1428 19984 28992 23680
347B3680j6317j9762j3115q73J1956J8448J6954P688n813j5485j8838j3549j520
$$ 23680 7363 -12399 -25514 -26387 -14431 4017 20971 28659 22846 7361 -11477 -25026 -26546
360b6546J2031J9905J7708Q448n821j7685j9392j3076j954J1750J7966J6816R284
$$ -26546 -14515 5390 23098 31546 25725 8040 -11352 -24428 -26382 -14632 3334 20150 29434
373B9434k834j5303j9185j4132l392J0374J9164J6105O024m840j3877j6741j1401
$$ 29434 26600 11297 -7888 -22020 -25412 -15038 4126 20231 26255 21415 7538 -9203 -20604
386b0604j509Q172J6378J6226O940n522j4997j8465j1947J402J1393J6555J6527
$$ -20604 -22113 -13941 2437 18663 25603 20081 5084 -13381 -25328 -23926 -12533 4022 20549
399B0549P108n532j4156j8698j4431o71J1592J7191J6650P543n977j4451j5313
$$ 20549 27657 22125 7969 -10729 -25160 -25831 -14239 2952 19602 27145 21168 6717 -8596
412h596j3003k867Q965J4286J4377J0064l995j3843j5785j1790k641J1456J6842
$$ -8596 -21599 -24466 -15501 -1215 13162 23226 19231 5388 -10397 -22187 -24828 -13372 3470
425C470J3223O137m831j5505j5336q548j057J0294J6595J2589N738l331j3611
$$ 3470 16693 22830 17999 2494 -12842 -21390 -22447 -12153 4442 17031 22769 19438 5827
438E827j7025r889k093P622J7217J6856O276l467j3761j9660j1747J329R965J5011
$$ 5827 -11198 -21087 -23180 -15558 1659 18515 24791 21324 7563 -12097 -23844 -22515 -12550 2461
452B461J4256K508o514r602j2981j1352m80O607J1105J5683Q915n555j2486j5087
$$ 2461 16717 19225 12711 3109 -9872 -21224 -21704 -15097 -3992 11691 20606 15051 2565 -12522
466a2522j3008L30J3367J4297J3206P236p492j4500j1635q845k84J1700J3350
$$ -12522 -25530 -25200 -11833 2464 15670 22906 15414 914 -10721 -19566 -19850 -8150 5200
479E200Q906O633k211j2514j2260r551n404P649J7205J3329O772k941j6414j7739
$$ 5200 14106 20739 18528 6014 -6246 -15797 -21201 -13552 3653 16982 23754 20813 4399 -13340
493a3340p158J215R117J5997J0181J29l141r222j3755p741o23L523J2171J5806
$$ -13340 -20498 -19283 -10166 5831 16012 16141 13000 3778 -9977 -17718 -18341 -14818 -2647 13159
507A3159N536l195r760j6611j1743K592R828J2141J4732M896q527j0366j1242
$$ 13159 18695 15500 5740 -10871 -22614 -20022 -10194 1947 16679 21575 13048 2682 -8560
520h560r923K553J1559Q589R968N750o283j0083q468j1109m138R593J2788J1561
$$ -8560 -18483 -15930 -4371 4218 14186 19936 13653 3570 -4898 -16007 -20145 -10552 2236 13797
534A3797R611m646j6634j3542p668j508J1277J5515O977K755k397j2121j0942
$$ 13797 23408 18762 2128 -11414 -19082 -20590 -9313 6202 13179 15934 13537 1416 -9526
547i526m014k187M189J2565R816L026j18q697j5711q100M64N839J4710J4634J278
$$ -9526 -13540 -15727 -11538 1027 10843 13869 13751 5054 -10657 -18757 -18293 -12454 2256 16890 18168
562A8168o957r831j4338q035N727Q541R163J0955J917o539o022q689j1212j280
$$ 18168 11211 1380 -12958 -20993 -15266 -6725 2438 13393 15310 8771 2749 -5940 -17152 -18432
576a8432O585Q452J3254J0117n403j2385j1477j0488L29J3123J1653O220L687
$$ -18432 -11847 -3395 9859 19976 14573 2188 -9289 -19777 -19448 -6325 5328 11548 15235
589A5235n583j1170o208m123k295O662J0132O676N004R5j0896j2925p003k319
$$ 15235 9652 -1518 -7726 -11849 -14144 -7482 2650 9326 14330 14425 3529 -9396 -16399 -18718
603a8718O752J6045J1552Q02m423j1536j3527m047L911N546J0024R044L35l148
$$ -18718 -11966 4079 15631 16433 12010 474 -13053 -17100 -13189 -7643 2381 11425 11760 8612
617H612m425j0583q296K71L857Q913J3742N534n842q884j2014q796L562J1009
$$ 8612 4187 -6396 -14692 -14421 -10564 -1651 12091 17625 11783 2899 -9115 -17911 -14349 -3340
631c340Q586P957K606o978p977o028o579p24P532P810P561O174l558j0436r139
$$ -3340 5246 13203 15809 8831 854 -5174 -11753 -12477 -4945 2865 10426 16600 13042 2606 -6533
646f533o781k168P801J2161P776L750l892j1640j0375l616J401O842J0335O352
$$ -6533 -13314 -15482 -7681 4480 12256 16006 12114 474 -9901 -13517 -12116 -5274 5061 11413
660A1413O34k049o414r921n567j75M090J0109J0574K765m201p829j1327o844L274
$$ 11413 12047 9998 3584 -6337 -11904 -12079 -7989 2120 12694 15459 11258 3429 -7898 -14742 -11468
675a1468P127Q385Q579J798n523o719p917o434J115O957P432P716L482m811p920
$$ -11468 -4341 4044 12623 14421 8898 2179 -5738 -12172 -11057 -4100 3332 11048 14530 9719 1799
690A799q095n695r15P356Q778P347L964l725j0005r078m921R52P146R556O098
$$ 1799 -6296 -11991 -12906 -5550 3228 10575 14539 10814 809 -8269 -13190 -12238 -5092 4464 10562
705A0562J550k438p230q051n152j024N020R327P897K792l570q038r492m267J364
$$ 10562 12112 9674 2444 -5607 -10759 -11783 -6763 2564 10461 13253 9683 1645 -7847 -12114 -10750
720a0750N581Q101P254J694l795p062q433m890J631O216P883O844K078m357o633
$$ -10750 -5169 2932 10186 11880 8085 1023 -7410 -12300 -10669 -4453 3430 10274 12352 7995 1362
735A362q179n581P45N876Q109P829K576m078p788q343m667R59O285P552O280K441
$$ 1362 -6817 -12398 -11653 -5777 2332 10161 12737 8659 871 -7472 -12139 -11180 -4895 2657 8937 11378
751A1378k835p370o977m870j6N833Q040O175K038l403p603p375m084N22N763P672
$$ 11378 8543 1173 -5804 -10674 -10690 -4857 3183 9358 11396 7993 390 -6985 -11069 -10547 -4784 2888
767B888O195K280l361p307q013m327J719N531P401O313J898l463o381p320m975
$$ 2888 9083 11363 8002 695 -7318 -11645 -9926 -4395 3006 9319 11217 7754 1373 -5947 -10922
782a0922P07N072P753O841J496m003o478o840m125R51M967P144N945K016l109
$$ -10922 -10215 -5143 2610 9451 10947 6944 466 -6374 -10499 -9548 -4581 2563 8508 10524 7415
797G415o748o768m178P97N898O969N526J593l509o194p103l847Q37N292O972O000
$$ 7415 667 -6101 -10279 -9482 -3584 3385 8911 10504 6995 801 -6302 -10149 -9312 -4020 2952 8952
813H952J739l940o323o849l773J065M885P261N782J596k951o576o714l788J078
$$ 8952 10691 6751 428 -6421 -10194 -9129 -4244 3017 8799 10395 7444 868 -5846 -9634 -8556
828h556M732P143N543J188l366o329o330l794J110M719O845N527J541l052o638
$$ -8556 -3824 3319 8862 10050 6684 355 -5975 -9769 -8659 -3940 2905 8432 9973 6921 283
843B83o424l297J249N100O422M930J462l118n773o207l739M95N243O689N370J142
$$ 283 -6141 -9438 -8189 -3089 3333 8263 9725 6607 834 -5373 -9112 -8617 -3374 3315 8685 9827
859I827l768n657o100l444P19M974O602N216J490l306n994n963l327J242M657
$$ 9827 6059 402 -5698 -9142 -8423 -3449 3153 8369 9859 6553 559 -5404 -8731 -7489 -2832
874b832O233M638J226k816n817n939l310J245M529O114M993Q97k992n769n810
$$ -2832 3401 8039 9265 6449 632 -5307 -8617 -7372 -2843 3271 8264 9161 6169 400 -5410
889e410k857J015M727O025M710R16l430n195n638l171J128M670O032M418J097
$$ -5410 -8267 -7252 -2525 3500 8210 9126 5696 501 -5137 -8308 -7180 -2510 3522 7940 9037
904I037l015n692n560l167R31M747N884M378J473k922o068n353k547J129M639
$$ 9037 6022 330 -5230 -8397 -7466 -2719 3165 7543 9016 6094 26 -5327 -7874 -6745 -2106
919b106N789L607J049k587n585n397k515O91M222O061M097O23k741n149n702k338
$$ -2106 3683 7290 8339 5752 167 -5230 -7745 -7054 -2832 3229 7326 7949 5208 59 -5643 -7981
935g981J117M245O076M489m7k806n131n530k453J649M086M790M557O71k995m641
$$ -7981 -6864 -2619 3457 7946 7899 5093 -38 -5568 -8021 -6372 -2286 2504 7061 7732 4737 96
951I6n328l317J628M292N018M396J344l672n232m450l073J388N159M934L219P98
$$ 96 -5232 -8549 -6921 -2629 2389 6785 8129 4457 -775 -5225 -8298 -6910 -1751 3183 6402 7200
967G200k729n258m149k136k18M490N404L377J284k345o046n100j618Q31M009O494
$$ 7200 4471 -787 -4936 -7072 -7290 -2800 2604 5981 7265 4920 -1126 -6226 -7844 -7013 -3004 3490
983C490K964j27k147n122n095j560J836L251M894L951k43k289l734n178l117J818
$$ 3490 6454 6327 4180 -942 -6037 -7597 -5761 -2510 2384 6335 6092 3803 69 -5109 -8226 -6408
999f408L304M726N016O18l594m567m808k750K730M620L920K931Q14l672m120k766
$$ -6408 -3104 1622 6638 7256 3662 -905 -5713 -8463 -5733 -1113 2807 5738 6552 2880 -1240 -4006
1015d006k768J21M698M453K934J978k709o552l569j801N03M752N781J935K84j838
$$ -4006 -6774 -6653 -1955 2498 5432 7410 4701 -1851 -5420 -7221 -6718 -1966 3815 5750 6034 4196
1031D196n579m677j74Q50L178N341K679n51j292l716n300j557J303K115N547M786
$$ 4196 -1383 -6060 -6234 -5384 -2206 3135 5814 5263 3971 255 -5045 -6602 -5299 -3184 2363 7149
1047G149m26l519l979m959j993L499L824L032L307M00l797l135l159l099J360
$$ 7149 6723 3204 -775 -5734 -7727 -4228 -404 2628 5935 6335 2538 -597 -3756 -6855 -5495
1062e495M219L484L434J900l646n023k917k524K5N395M861J538J458k542o310
$$ -5495 -1276 2208 5642 7542 3896 -1127 -4044 -6568 -6543 -1148 3713 5251 6709 4167 -2143
1077b143k681k18j60L982M940J500j75p15m400m502p63J51K195N783M112q56k435
$$ -2143 -4824 -5042 -5202 -1220 3720 5220 5045 4330 -70 -4572 -5335 -5184 -2989 2794 6906 6050 3615
1094C615m089n569m35L131K239L696L770q74l048k177l985k669K350L481K374
$$ 3615 -474 -6043 -6478 -3347 -1108 2588 6358 5484 2436 259 -3726 -6395 -4045 -564 1810
1109A810L660J206l630l737k951k936R58M885L531K431J646l716n522k059r08
$$ 1810 5470 6676 3046 -691 -3642 -6578 -5620 -735 2796 5227 6873 3157 -2365 -4424 -5332
1124e332L34M476M182O28Q80j251m586l482p75m00L383N337K363n32j430m673
$$ -5332 -4998 -522 3660 4288 5168 3917 -669 -4151 -4926 -5326 -1943 3394 5757 5225 3795 -878
1140h78m457P2J563K127M464K883j095k251k477m297j841K726K349L169L802k49
$$ -878 -5335 -5263 -3700 -1573 2891 5774 4679 2428 -49 -4346 -6187 -3461 -1112 2057 5859 5610
1156E610l475k463l226k825J810L940K794L026J073l872m085k208j840J024M787
$$ 5610 2135 -328 -3554 -6379 -4569 -629 2165 5191 6264 2392 -1693 -3901 -5741 -4717 70
1171G0K601J313J409k276m624k063j303k06L817M883J117j5j572m475l290l74
$$ 70 2671 3984 5393 3117 -1507 -3570 -4873 -5079 -1262 3621 4738 4723 3151 -1324 -4614 -4988
1187d988O95K877M579K247j081j788l206l886m69J775J883L688L001o94k192k716
$$ -4988 -4293 -1416 3163 5410 4329 2541 -665 -4551 -5020 -3245 -1362 2326 5327 4633 2441 -275
1203b75l462j952K143K796K907K911n1l205l356k041j790J466L448K820J994M96
$$ -275 -3737 -5689 -3546 -750 2157 5068 5017 1812 -1544 -3585 -5375 -3909 -461 2359 4353 4849
1219D849k743l441j983j856J215L403L407J530M83k146m281k456q11P61K943M172
$$ 4849 2106 -1335 -3318 -5174 -3959 -556 2851 4381 4864 2718 -1563 -4019 -4830 -4069 -1126 3046
1235C046J462k73j762l621k820r39J345K533L633J979m63j622l071l441j064J858
$$ 3046 4508 4235 2473 -1148 -3968 -4907 -3562 -1029 2604 4583 4120 2498 -573 -4014 -5078 -3220
1251c220K697K962K309m22k211l274k690j405J889K774K931K008K3k241l357k445
$$ -3220 -523 2439 4748 4326 2115 -1159 -3849 -5254 -3365 -591 2340 4348 4371 2130 -1227 -3672
1267c672j025J365K694L150J808K03k453l034k254j388J376K685L197J313k2j499
$$ -3672 -4697 -3332 -638 2512 4320 4523 2070 -964 -3218 -4606 -3230 -545 2652 3965 3943 2444
1283B444l583k664n40J111K807L154J560l61k035k904k515q98J353K644K998J861
$$ 2444 -1139 -3803 -4343 -3232 -425 2729 4289 3928 1893 -1011 -3526 -4424 -3071 -427 2571 4432
1299D432k25k201l144k398j055J332K737K779K032k55k231k772k614q17J352K575
$$ 4432 4207 2006 -1138 -3536 -4591 -3259 -522 2257 4289 4034 1803 -969 -3583 -4400 -3048 -473
1315d73K992J819l67k170l090k163p86J403K651K908J222J1k025l320k396n93
$$ -473 2519 4338 3971 1801 -1289 -3452 -4238 -2835 -184 2724 3946 3957 1932 -1388 -3784 -4377
1331d377J354K555L017J415p8j657l338k287o14R62K464L153J371k11k107k657
$$ -4377 -3023 -468 2549 3964 3886 2229 -1109 -3396 -4010 -3048 -584 2569 3940 3729 1622 -1035
1347a035k328q45J286K454K953J450j02k182k700k619n14J450K364K856J577j87
$$ -1035 -3363 -4208 -2922 -468 2485 3935 3833 1651 -1049 -3668 -4182 -2732 -368 2488 4065 3878
1363C878k315k423k383m39R06K311K990J444k54j833l220k066o79J305K159K951
$$ 3878 1563 -860 -3243 -3682 -2776 -465 2525 3969 3715 1882 -1338 -3404 -4083 -2778 -619 2332
1379B332J186l2j879k752k131n90J030K783K623J517n34j837k863j886n82J032
$$ 2332 3518 3486 1607 -1145 -3276 -3866 -2836 -53 2570 4087 3553 1716 -1147 -3033 -3615 -2583
1395b583K112K871J216j39j733k958k022n63J396K415K209J184o5j801k318k050
$$ -2583 -471 2400 3616 3477 1744 -1214 -3236 -3799 -2403 12 2221 3405 3340 1539 -779 -2829
1411b829p41J316J997K494J290k13k068k294j996o81J225K524J986J577n5j902
$$ -2829 -3570 -2254 -257 2237 3527 3314 1246 -1048 -3044 -3725 -2500 24 2010 3587 3532 1630
1427A630k827j964l54J225K250K309J056p6j530k923j640n10J023J995K593J302
$$ 1630 -1197 -3161 -3515 -2290 -40 2269 3325 3249 1719 -1204 -2844 -3354 -2331 -336 2257 3559
1443C559k94j970k129k462l8J074J901K470J291o87j402k462k070J6J214J607
$$ 3559 3265 1295 -834 -3296 -3334 -2260 -359 2111 3402 2715 1313 -1149 -3219 -3203 -1989 -382
1459c82K391J519n56j675k258j745q87J208K113K183J513k91k011k588j345l55
$$ -382 2009 3528 2972 1297 -961 -2706 -3593 -2385 -272 1911 3424 3133 1122 -1466 -2811 -3166
1475c166J009K386J900J019m2j601k523j588p33P84K489K093J268l91j573k619
$$ -3166 -2157 229 2129 3148 3106 1505 -1018 -2606 -3339 -2555 -66 2027 3295 2904 1331 -1288
1491a288j637k42P96K176K391J095k69j704k455j656k19R60J986J645J464k59
$$ -1288 -2925 -3167 -2371 -195 2196 3291 3022 1318 -1137 -2793 -3012 -2052 -66 1579 3043 2784
1507B784j466j876k102o70J251K171J974J306l28k013k503j305n7R51J963J702
$$ 2784 1318 -558 -2660 -3330 -2079 92 2066 3372 3044 1031 -1472 -2777 -2834 -1883 80 1782
1523A782J101l3j728k105j454o28J148J916K157J005n04j700k154j428j05N55
$$ 1782 2883 2850 1122 -983 -2437 -3065 -1917 -1 2156 3161 2657 957 -1197 -2625 -2730 -2175
1539b175K093K205P98l06j575j798j979j17J193J798J775J054n10j314k156j371
$$ -2175 -82 2123 2921 2615 1040 -758 -2737 -2854 -1661 137 1912 2966 2456 1142 -1014 -2385
1555b385n14J027J790K072J026k52j919j999j198m04J031J946J507J165n07j285
$$ -2385 -2899 -1872 -82 1990 3016 2764 845 -1154 -2352 -2756 -1725 221 1728 2893 2386 1101
1571A101j864j625jM36K019J908P25n76j160j961j668p2O75K170K322N06o27j452
$$ 1101 -763 -2388 -2389 -1953 66 1974 2699 2123 963 -998 -2666 -2738 -2063 107 2429 2935 2308 856
1589H56j982j477L20R00J206K140R06n54j114j676k022m58R68J661K082J204m65
$$ 856 -1126 -2603 -2283 -1383 -177 1963 2869 2315 1201 -475 -2497 -2955 -1987 -326 1756 2960 2495
1606B495j702j771j466n53J447J955J284P56j23j435j985q03l79M89K026J580
$$ 2495 793 -978 -2444 -2997 -1550 405 1689 2445 2322 887 -1098 -1901 -2280 -1791 235 1815
1622A815M52L17j551k200r49m19Q45J526K056P12p95r01k214j140J41P64J598
$$ 1815 2267 2584 1033 -1167 -2116 -2535 -1690 -164 1892 2604 1809 908 -1306 -2446 -2305 -1541 57
1639E7J953N40l10j082j692j736k10P16J554K127P94m86j509j870j194k83J225
$$ 57 2010 2550 2240 1158 -534 -2270 -2480 -1764 -210 1917 2711 2225 716 -1154 -2348 -2631 -1406
1656a406J624J381O66j60j521j465j124m84P27J937J355Q82k92j284j858q65k41
$$ -1406 218 1599 2265 2105 584 -881 -2005 -2489 -1762 175 1530 2412 2120 836 -1022 -1887 -2128
1673b128M60J924J510M79k32j377j882r36P5P08J388J527N61l27p08j785j591
$$ -2128 -1668 256 1766 2245 2013 636 -1246 -2182 -2107 -1399 -11 1516 2077 1750 1042 -743 -2334
1690b334Q6J157J225J907L52o97r03j609j405J74Q81J165J664R64o24j396j627
$$ -2334 -2248 -1091 134 2041 2393 1696 793 -816 -2221 -2047 -1166 -1 1663 2627 2003 607 -1020
1707a020r98m77J209J550R36R19j94j253j509j124m22Q79J845J164P20k14j471
$$ -1020 -2018 -2495 -1286 264 1200 2119 1925 672 -837 -1961 -2383 -1504 341 1505 2225 2011 540
1724E40j721r10j92O82J712J311O36R1j600j589j239K15P31J309J862K88k91j309
$$ 540 -1181 -2091 -2283 -1601 111 1422 2058 2149 549 -1040 -2279 -2064 -1333 -24 1838 2126 1835 526
1742E26j526r66J12M87J476J438P40k01j625j224j293L9Q55J128J683O92p23j212
$$ 526 -1000 -1966 -1854 -1367 109 1547 2287 2086 461 -763 -2056 -2017 -1162 -34 1649 2341 1618 406
1760D06j364j024q9J077J406J180N87l55j405j305p55k27P93J127J596L83m42
$$ 406 -958 -1982 -2071 -994 412 1592 2179 1824 419 -886 -1641 -1868 -1075 52 1648 2031 1589
1777A589j104j470q62q9M51J538J378P71n92j049j689o69L0O35J263J641L26l88
$$ 1589 485 -985 -1847 -1936 -1485 53 1431 2202 1610 561 -1128 -1797 -1767 -1132 131 1772 2098 1710
1795A710j337j185j014j70P52J449R94Q75l64j043j359j143q6P75J614Q33Q27
$$ 1710 373 -812 -1826 -1996 -1244 205 1199 2074 1710 667 -692 -1835 -1921 -1146 468 1301 2128
1812B128n32q71j168j211k76P44J285J336N38l28j299j411q38K44M80J255J244
$$ 2128 1596 725 -443 -1654 -1930 -1186 99 1435 1973 1645 346 -1065 -1903 -1659 -1179 76 1320
1829A320R71p31j088j035j476J78O88J562J010P15p29r79j302r25q1P44J651J052
$$ 1320 2291 1560 472 -563 -2039 -1861 -1173 389 1399 2114 1385 406 -896 -1821 -1902 -1158 493 1545
1847A545K32j66j036j237j151m0J031J149J098L22k26j238j084q39q6O53J370
$$ 1545 1777 1611 575 -662 -1813 -1853 -822 327 1425 1747 1521 283 -801 -1640 -1726 -1073 297
1864B97P47R97m96j158j204p55k23Q96J222Q93M18k53n92j431q55k04Q16J111
$$ 297 1044 2041 1545 387 -817 -1572 -1795 -899 323 1216 1634 1381 789 -642 -1497 -1701 -885 226
1882B26J067N70l55j232r33p33m90O59J557J090K78k42j245j030p29j90O35J286
$$ 226 1293 1863 1508 276 -657 -1390 -1880 -1221 336 1426 1704 1462 217 -813 -1542 -1732 -1097 189
1900A89R97N22K4j167j465p52p7R93J067R68L76k43q83j458k74l74P08J107R03
$$ 189 1186 1708 1732 565 -900 -1652 -1729 -736 331 1299 1675 1432 549 -909 -1183 -1557 -849 258 1161
1919A161R69o50j101j004r21p8P03J065J084M22k66p81j336q03k00Q95R73J113
$$ 1161 2130 1480 379 -625 -1546 -1624 -921 144 1228 1650 1384 603 -733 -1536 -1736 -841 132 1245
1937A245M67n85o68j402o82j14Q65J055Q92L21Pj133r86q46K67L21J236Q38N85
$$ 1245 1712 1127 459 -943 -1625 -1739 -874 181 1073 1394 1401 268 -718 -1564 -1297 -976 260 1098 1683
1956A683m40r71p87j113J50R28R09P37N36l68r24r98o60P8M38J154Q08K76o45
$$ 1683 1243 272 -515 -1628 -1478 -550 359 1096 1632 1264 340 -658 -1318 -1240 -802 352 1160 1436 791
1975G91m03j147j051l6J159P91J258K64k73j097r62r95K00O04J028J072K21r2
$$ 791 388 -759 -1810 -1846 -687 104 1362 1626 1353 256 -706 -1701 -1501 -897 131 1203 1424 1332
1993A332r30j191m52k74O71J018P94N38k81q51j246n80r3P99P28J058M27m57p29
$$ 1332 402 -789 -1241 -1515 -844 174 968 1506 1225 374 -872 -1452 -1545 -746 -18 1040 1467 1010 281
2012B81j085o91J0J011R28Q80P5n56l23j090r40J79P44P39J235K88o54o72j177
$$ 281 -804 -1495 -1485 -474 454 1334 1409 853 530 -560 -1500 -1321 -577 162 1397 1685 1031 359 -818
2031h18n03lQ20N93Q18O68l39j054q28o75k03O71J017P87M42n31o00q70m90k08
$$ -818 -1321 -1324 -504 89 907 1575 1236 182 -646 -1321 -1524 -853 164 951 1393 862 262 -608 -1098 -1306
2051a306O18Q13R41J93m66m72j122n08j00O82J040R95j55k02m89j399k91j32N56
$$ -1306 -688 125 1066 1259 793 321 -801 -1309 -1409 -727 313 1308 1153 951 462 -937 -1228 -1360 -804
2070h04R43J187L41q56o35p59o35j65P62O39R82M99o68o91q26o87J05Q43R15N62
$$ -804 139 1326 1667 811 176 -583 -1218 -1383 -621 18 1000 1499 831 140 -686 -1373 -1268 -425 490 1052
2090A052L88m87r88n89m33m40Q42Q33Q56J38j0o85j244k97J0K48J295M34J01L42
$$ 1052 1440 953 -35 -624 -1057 -1497 -655 178 1034 1172 1162 477 -767 -1064 -1054 -806 489 923 1024 1366
2110A366j075j183m65J61N03R70J009q5n29o04p69l03j99O16P63Q66N89p59o72
$$ 1366 291 -892 -1357 -1196 -693 277 1286 1201 672 68 -701 -1004 -1203 -587 176 1042 1631 872 200
2129B00q57p77L99O50M35R89K11l92q69o45n53j88P68J039O54K03l57j069l33
$$ 200 -657 -1434 -1035 -385 50 1039 1250 858 -11 -656 -1209 -1397 -629 410 1064 1267 910 -159 -492
2148d92p66P6N46Q34Q46n7k43m53j093j79k60N38R43P03L27m26o01j011m55M7
$$ -492 -1258 -1182 -636 198 1044 987 744 291 -802 -981 -1241 -703 240 943 1270 844 243 -768 -1223 -1176
2168a176M35P01J007N24n83m04j296p63M22M33P99Q78J28k7j018o75q23M24K43
$$ -1176 -741 -40 967 1491 908 504 -792 -1555 -1133 -700 99 977 1105 1078 60 -615 -1438 -1014 -771
2187g71J010Q99L70o17p79p18o81J61N79P07O05O24m99q27o67l21k15Q92M85Q88
$$ -771 239 1138 1508 891 112 -606 -1287 -1126 -547 160 765 1389 890 63 -604 -925 -1140 -248 237 1125
2207A125l3j94p93o54p14K08K40J164P56K68l02q81q28m36k26N05J027O78K99
$$ 1125 1092 898 105 -549 -1263 -1055 -815 349 1105 1373 1071 190 -638 -1074 -1300 -795 232 910 1209
2226A209k10n82j179l22L9N58R77M14K19m02m38j010m32J77L92R66N28L61k14
$$ 1209 999 417 -762 -1084 -1045 -487 490 904 1123 721 283 -727 -1159 -982 -590 376 904 1265 1051
2245A051q40r61k73J7P47O16M90K81k07p24q22l46j99P63R53L12M96o00p13o68
$$ 1051 211 -750 -1023 -1006 -259 357 847 1128 921 197 -625 -971 -1170 -407 546 858 1354 754 41 -627
2265f27l16J16J62J134N56K39l33o16j079m34K69M85Q52M39J85l42m04r78j89
$$ -627 -943 -827 -665 469 1025 1264 931 315 -764 -1198 -929 -444 408 847 1032 690 286 -692 -881
2284h81N0K15R50N09M26n25n11q36m27n3O48Q51N85L38n65o36o13m81R6N58O92
$$ -881 -831 -616 334 843 1269 744 233 -603 -1030 -1083 -435 416 1001 1339 774 138 -475 -956 -860 -302 390
2305C90M89R0j84o66o43o15J51N93N79O01K30l53p83p34q8J11M12P47O20J20l57
$$ 390 879 969 785 119 -524 -1139 -988 -395 184 785 1015 662 -121 -855 -943 -832 -420 327 947 1067 710
2326G10p14o36m55J48O92N16M44K72l82p60n58l32J30L98R69L86nk3n84r63m92
$$ 710 -4 -640 -1095 -947 -255 261 705 977 595 -165 -723 -1055 -925 -527 442 828 823 800 216 -747 -1239
2347a239N4Q12P87M09L70m20o45r44j39r0O06P76N09J82j96p52o86l03J5N65P59
$$ -1239 -1185 -373 414 823 1193 773 128 -816 -955 -1045 -439 337 846 1028 832 80 -606 -909 -894 -329 430
2368D30M66K43o46n26n14k27j72O27O81L25N55o50o29q90J33K4J88R20N99L97
$$ 430 896 1139 493 -33 -547 -774 -946 -319 362 687 1242 592 -37 -927 -794 -770 -582 338 937 1334
2388A334q34n65o13l18J57M59O24N02L05m51n46q22k19J55K21R44O36P7o43n15
$$ 1334 500 -65 -678 -996 -839 -380 244 746 1051 600 54 -768 -987 -832 -611 333 969 1046 403 -112
2408a12o09l68M46L09O11O46Q8j17q41q85p9J50J72J024M38K43l66q57l65n35
$$ -112 -721 -1089 -643 -334 277 923 1011 894 53 -832 -911 -761 -589 435 873 1116 750 -107 -472 -1007
2428a007L05M23O68O39j5k39p74o96m07J46N20Q32N36K98o29o64o00l31P8Q36
$$ -1007 -702 -279 389 1028 1013 774 0 -696 -1103 -957 -437 395 931 1229 600 -64 -664 -995 -917 -81
2448h1K69P40q2n69l94o87O5j1J5J080N54j4k48n87m83o26J88N08R13N00po25
$$ -81 188 928 846 277 -117 -804 -739 -750 -735 345 899 885 637 50 -433 -1059 -871 -363 550 1050 1043 418
2470D18l57m86n52K86K16N47R41J38o68n35o44n05K43O56M77N87K2J76j166l98
$$ 418 61 -425 -977 -691 -475 72 1013 1151 483 -52 -696 -1201 -958 -302 175 762 784 960 -206 -604
2490f04k43J07N93N19O04ok39r53m66l14K85M4R70N11r9J77r89o96J15j89M02
$$ -604 -847 -740 -147 372 976 970 731 -222 -688 -1002 -717 -673 297 808 709 886 -103 -799 -684 -873 -471
2511d71R13O07j83k73p30o59j78K85L25O80Q17l33k08n16n31o16L07P60L86L21
$$ -471 442 1049 866 593 -137 -796 -974 -689 -364 316 1133 800 592 76 -455 -1071 -764 -4 382 703
2531G03L00l24p42l78n02J86M63Q70K00J32k68n55o53k54j03M90R07N75j88k51
$$ 703 1003 679 -63 -441 -943 -757 -294 576 776 908 640 85 -568 -822 -925 -435 472 1047 859 608
2551F08o73q06l5Q6N27P62J40J12j55n66p59j94Q3N97Q35K35pj50n56q00q3M6
$$ 608 -65 -871 -906 -820 -293 469 609 721 566 0 -759 -953 -870 -273 562 797 790 640 84 -716 -799 -753
2573g53L37P44N80j46j76n28n20o18L72M86L67N50N0o1p25l40n59Q1N41N59L72
$$ -753 -416 328 908 762 586 58 -462 -1080 -708 -222 145 695 745 684 -41 -381 -940 -859 -318 241 613
2594F13K52l50n27q59j01k8P96R36K43j85l57o71l91j82j61O44O49L69M00l52
$$ 613 865 515 -12 -871 -972 -1000 -204 732 975 790 433 -238 -629 -811 -972 -328 321 690 1090 738
2614G38o05r52P0l13Q07O78M39K1n03m68m71m07L35M56N03O51j76n07l35o60k19
$$ 738 133 -819 -749 -1062 -255 423 862 883 380 -88 -559 -966 -631 -175 328 979 803 296 -39 -699 -918
2635i18J37P20N88J67K12q1j288j69l00R3R24N41K16m9k37o32o85r8r2N57Q73
$$ -918 -781 -61 527 694 906 825 -463 -632 -932 -839 85 626 842 793 556 -76 -761 -859 -951 -394 479
2656D79L18L6k82p69p39K61j12M95Q10L29r7k88p84n67J39oM48O46O41N2q04m92
$$ 479 797 833 551 -218 -957 -696 -808 -313 497 826 729 441 -343 -910 -771 -777 -329 317 958 1010 206 -286
2678b86j62o31K53O00N10O84k43l84l77n02m80K28P97L38N88l30j41m66m23l03
$$ -286 -448 -1079 -826 -226 284 968 725 341 -36 -538 -1018 -790 7 345 933 603 462 -4 -427 -730
2698g30l3O34N02M48N6l93n50n11m06K80N81N06L94J69j28r31n93J6K7N28P46
$$ -730 -763 -129 373 821 877 484 -66 -577 -983 -703 -122 384 778 947 819 -112 -705 -689 -662 -134 612
2719F12K97L4o15n12l66l54J28P36L41L94K08n89m70n94m37O50L96L47P94J03
$$ 612 909 943 328 -184 -550 -904 -776 -40 301 695 903 314 -156 -750 -1187 -537 -141 206 1000 1103
2739A103n22n42p10l00M32O58K21N18k12l18n40n07j61K79N48K92N78p4j40p02
$$ 1103 581 39 -671 -971 -539 119 340 858 646 328 -212 -719 -880 -601 -53 239 817 743 603 -99
2759i9m16l75J19N79M98O51m18j00l52p71j73K33N78O33M12k36l21o80j75m64
$$ -99 -515 -890 -771 -192 306 957 539 439 87 -684 -857 -624 -46 587 999 763 442 -238 -413 -877
2779h77R7O27O81K32R3n44n74o21k09L81O18N65L00p3j96q73l8l79R9J73J137
$$ -877 -780 -153 528 760 853 309 -265 -886 -1095 -714 -96 469 769 696 500 -373 -411 -790 -691 -518 619
2800F19L00j14l00p26m23j84L23K19P48L84K7n13l64p77q5K74N81M74M34o3m5
$$ 619 919 805 505 -221 -644 -828 -505 -286 462 846 873 360 -4 -781 -866 -592 -11 463 897 834 789
2821G89q79o28j6Q3K65R94L26J13m13o46o00l44M36M79M48L90N7k97r66p6l34
$$ 789 -90 -718 -734 -651 -386 608 934 1047 634 -12 -612 -956 -520 -41 407 797 854 557 -409 -485 -819
2842h19J32P42Q3Q02Nl39o02n44k61Q7N02O54M08J31n50m57p43J48M37J87M75
$$ -819 -687 55 138 940 945 606 4 -540 -801 -714 -212 442 850 981 431 -26 -769 -621 -184 3 478
2863D78K53K21l27p22m89l50J79P45L58M59Q8l07o80m78j98J38O34L11K51L40
$$ 478 731 952 625 -97 -586 -936 -757 -12 346 805 893 586 -94 -572 -770 -632 2 313 564 904
2883I04n52l71o78m0J52N55L20O46M2n29o78l14l88L74O53L49K07p8l1q42j86
$$ 904 352 -19 -697 -737 -585 -30 290 936 978 449 -229 -543 -931 -557 96 445 652 574 543 -299 -485
2904d85m00M45L51P00J51o1m39k81n38k57L27L73N97k9L94m37o41m16k38j3N85
$$ -485 -885 -440 -89 611 762 701 262 -19 -557 -814 -487 -114 483 454 848 411 -230 -646 -884 -897 -312
2925c12N66L24J19l87m09l78l42J04O09N60L00k79o5p23l64q9lQ40K11M98k4m52
$$ -312 254 578 697 310 -99 -477 -819 -715 -106 454 754 475 410 -313 -677 -766 -769 71 282 780 756 304
2947C04m92m27o7n4P74N04L40k70m45j38m00m39K91M36M71N37l25k93n11m92K3
$$ 304 -188 -615 -682 -736 38 542 882 612 167 29 -371 -810 -519 -83 388 925 600 307 -204 -696 -673
2968f73K42J77Q61RO5m45k58o43k94N18L53P38K08m02j95l97l35m06M87M22M10
$$ -673 -431 -254 607 616 681 236 -22 -665 -959 -441 -88 650 858 456 261 -136 -471 -877 -390 32 442
2989D42P8Q8j98p06m84K65l0P23J31M79q8k85n71n00m01M16M84P76J51j37l21
$$ 442 520 608 410 -296 -780 -515 -545 178 309 788 700 415 -156 -656 -1057 -641 -157 619 770 633 312
3010C12n88j65k64K35M69M12L91r2l85n43n66j75P30J69O18J85j80k32k34p27
$$ 312 -276 -441 -705 -470 -1 411 802 710 325 -218 -784 -959 -229 -60 558 743 563 331 97 -630
3030f30l64O16K89O07K78n8l00n78n59J06J54M58L04K22J08k02o55l41l9q4O59
$$ -630 -994 -378 -89 518 796 738 438 -140 -699 -593 -439 19 323 545 653 451 -204 -545 -584 -668 -9
3051iO03J28Rl84m69j86l43m3P69M08K15Q8l94p40l33K4J71O09J93M12j56m91
$$ -9 594 722 731 347 -122 -308 -651 -694 75 483 698 786 392 -348 -681 -657 -486 123 316 728 572 81
3073H1k59l89n6L66K06N68J09O5l19p17r8m08M35N80J3M45J80n33m88l97j09K27
$$ 81 -178 -567 -623 -257 -51 517 626 691 372 -345 -443 -851 -416 164 177 622 802 269 -219 -616 -725 -498
3095d98O96J41J17O5l31l65n53j72K82Q10K80Pl3q1o79k50n2K99L90L67L50j50
$$ -498 198 339 456 521 190 -175 -728 -900 -618 192 472 479 446 365 -314 -564 -616 -317 73 440 790 640
3117F40k21n12m88j3K67N33K24L13O8n18n54l24j36L29L35M97j79L84l38l77n67
$$ 640 419 -93 -581 -594 -327 206 430 743 811 293 -261 -585 -721 -392 -57 440 261 645 307 -70 -637
3138f37J25J15L20K83K87J00l56m53m18J63R8L72M94M42n03p1n51l23j60M61K94
$$ -637 -512 -397 -77 206 493 593 237 -216 -634 -471 -373 -1 493 935 432 361 -190 -513 -673 -212 82
3159H2J98M13k1j38q24m01K92j63N05O53P1q4l24m41k49j53J32K89P42k7j77j86
$$ 82 280 693 672 534 -290 -691 -399 -562 -57 596 667 583 259 -182 -431 -584 -452 -163 579 552 375 189
3181A89n15m13J09K09M55L97L87l86k37n84l08J82r1M70M90L15l5m13n82j60k40
$$ 189 -326 -739 -630 -421 34 431 818 432 195 -389 -697 -515 -606 -136 354 669 634 221 -361 -521 -761
3202g61J46O91L27J6M2l09k95n03R5K31J83N22K10k97k51k28k74j23M5L79M42
$$ -761 -615 76 403 419 461 152 -143 -646 -551 -320 -137 385 595 298 47 -181 -455 -578 -533 -154 288
3223B88N81l46l76m11l57O0LL64P36K62k10l02n46l70j28K33O23K89J96K36o39
$$ 288 869 523 147 -264 -621 -561 -558 -194 542 804 594 292 -254 -624 -752 -519 104 393 589 825 186
3244A86l78m65K67J66L41M70O9j45m74m03m06J25M70L49M31J42q1m13n90j96j41
$$ 186 -192 -657 -390 -224 117 587 656 511 37 -366 -772 -647 -177 172 603 745 664 251 -339 -535 -676
3265f76M28J75N00J24m8m11m69l05J36K8P58q9J78J26l51l04l73K02J25K72M10
$$ -676 -248 -73 427 551 503 92 -377 -682 -546 -518 240 151 329 455 104 -200 -573 -371 -246 26 436
3286D36L14j57n73l32j11k46K63K28O35j2o7l74l27l33K0J42L18N75L32l3n20
$$ 436 750 593 20 -312 -423 -669 -406 -178 457 445 378 4 -323 -656 -636 -494 -176 399 731 698 178
3307A78k59n79K7M40L34L14J25j9l47m50k90j60M28L37L80N4J9m93k24n47L35
$$ 178 -81 -660 -633 -193 141 455 580 561 214 -236 -526 -686 -258 79 459 513 532 39 -185 -732 -397
3328c97J12K48O96Ok73n04k82k63M20l1J88O00k4r0l40l93k16q6M17L2L78N57
$$ -397 -285 -37 659 665 392 -112 -394 -657 -237 -268 -80 520 496 406 66 -327 -543 -629 -212 -180 198 755
3350G55m72jp28j86l7J80N45J22M26j82k91m41j33k72M35M52J31J31M9l62l59
$$ 755 283 282 -446 -632 -669 -489 56 178 604 422 131 -310 -443 -715 -280 172 303 434 483 121 -238
3371b38n22K33L95J34O01rj74k90l85l89j1N17L66K24o3P4n01k89m76L85J27N43
$$ -238 -760 -527 -132 2 603 594 420 130 -255 -644 -655 -138 228 452 389 463 -38 -327 -803 -418 -291 252
3393B52J66K02k44m76j25l17j07K40P57J89k2j65r0n61k06L5J74M91J55L88k61
$$ 252 418 620 376 -100 -225 -542 -649 -409 348 537 515 350 260 -301 -507 -472 -298 193 348 736 475
3414D75m54k91m52L42J2M96M1L57j69m51j48l41q5M47M51M46l9k46l18l95j52
$$ 475 21 -270 -722 -380 -368 128 169 526 357 -94 -242 -583 -668 -221 230 676 637 391 73 -322 -474
3435d74q8J11O08K84K03k28m47k80m04J96L76K25K41K6k0m25j92l09J2J25O01
$$ -474 -562 -451 157 441 644 416 -31 -311 -715 -519 -143 82 323 349 329 -96 -288 -597 -585 -460 141
3456A41K83R5r4n65j43k99J6L72L99P7J59m36J9k93k07k5P0M69M63J17j73n12
$$ 141 424 519 425 -140 -283 -582 -566 -194 205 282 441 5 24 -269 -476 -501 -431 38 501 618 445 -67
3478f7m36k08L94lM28J91K52j84l84l02k61Q8L2O23K06jj20j59l03j21l17O07
$$ -67 -503 -711 -317 -320 108 299 551 367 -17 -319 -580 -492 -460 163 369 368 248 89 -214 -335 -652 -45
3500d5K34J49M06l78l09k30m89K91R4L12M70j08r5q5n06k23K2K71L21M84k4j60
$$ -45 189 338 744 366 57 -173 -662 -371 -277 35 505 397 302 217 -289 -512 -490 -219 102 586 562 402
3522D02l38l86k49MK25K82L04K57j91k93k74k35J0L44J92M61j63J89o28k00k65
$$ 402 64 -322 -571 -567 -342 -60 244 501 310 17 -257 -492 -482 -138 54 515 352 541 -87 -287 -552
3543e52o8M76K26L38K54l28n32j36l14J19K31O10J37j7j63j06o32j02J50L52J70
$$ -552 -620 -144 82 420 674 346 -186 -322 -636 -517 -286 324 461 444 281 175 -457 -559 -409 -57 113
3564A13L88K9J4n65k95j81K70J96K68K17J59N8n49l85k26N9L52L02M01q8j78o23
$$ 113 501 530 544 -21 -316 -497 -227 -31 237 454 613 671 122 -263 -489 -430 -78 224 625 537 359 -264
3586b64o9m15J53K85M51N23L9j98n61k34j55p2K69J89N27L8k16l34l08k18M6M96
$$ -264 -333 -748 -595 -310 141 664 703 505 -56 -290 -445 -517 -248 -59 468 506 290 -44 -352 -570 -524 -28
3608b8K16L30OJ29q78j52k99K00L35N11k9p6J40m75n25J00R1K28M95P9L6l0k28
$$ -28 188 518 524 653 -225 -377 -676 -476 -141 370 341 265 405 -70 -595 -495 -404 -176 319 398 434 404 176
3631A76n43o3j2K82L89R7J50l26j3m59r3J0L36K12J70K30j98k68m72l7J7K45M09
$$ 176 -367 -430 -442 -160 229 326 476 150 137 -322 -415 -405 -69 143 313 543 345 77 -395 -432 -415 -170 239
3654B39K46k19L3m96l28O7Q3K93L54K61J11k23l83m26k30L50J94M19Q4J19K3o52
$$ 239 485 266 299 -197 -525 -458 -375 -82 272 533 644 421 38 -388 -618 -268 -74 345 429 548 571 -81
3676h1l04l4K67Q4K90K50p1j45p4p83l7K58K85K16J63N6k65j11m00p8K09O4M30
$$ -81 -385 -419 -152 -68 222 472 401 256 182 -601 -638 -380 -95 121 284 340 75 -36 -436 -514 -305 -241 189
3699A89M68j06k52m18m16K0P8M10N02J52Mn51p1n70L03j76L77L46J73l93L99m37
$$ 189 657 551 299 -119 -535 -515 -437 -27 475 627 631 80 9 -561 -258 -434 -57 289 462 69 468 31
3721C1k26k17q2K72P09K22n6p2p77j69r5J19m8O36K63n1l02k41m03P6J38J40L04
$$ 31 -195 -412 -494 -222 487 709 653 581 -196 -365 -460 -341 -389 247 510 459 157 -84 -487 -411 -273 -133 171
3744A71L43J81n27m33l2j48o7L02M79J19K44l02l28n15J2L32qL53M09n2l60k86
$$ 171 514 695 168 -265 -297 -445 -512 -210 269 388 632 330 2 -513 -501 -169 -177 176 585 533 173 -113
3766a13l07j07R1J90M65L25L1o44J16n94k1J62J3N12N18N9j91m61k93m55K64L44
$$ -113 -420 -527 -436 -246 219 544 575 -69 47 -547 -568 -406 -393 119 637 696 505 44 -249 -704 -440 -96
3788i6M74p2J91k38m10l1k90K32K24J91L23J22k72m21j64m72J28M70N95j29P9
$$ -96 378 306 497 259 -151 -182 -472 -240 -16 175 498 620 348 -73 -237 -709 -581 -111 484 355 434
3809D34j92k47k42j62r3L46N83J63q7n1o07j68n8k25Q03j54N88j89k67l15k84
$$ 434 242 -5 -247 -409 -502 -156 427 590 503 452 -155 -323 -381 -606 197 43 631 442 175 -140 -424
3830d24QM1L02J76M87l58M0k97j83l6j18K83L95J21k0l23m9l33r9j27M39L46Q8
$$ -424 -416 -375 -73 103 590 232 272 -25 -208 -244 -362 -79 316 437 417 94 45 -288 -387 -514 -75 271 359
3853C59Q5k32k19n52J09r9K49O65j29L31l32k78j38j79N7L22M51QK3m97k9j05
$$ 359 444 212 -7 -559 -450 -549 -300 365 236 567 235 -43 -181 -360 -303 19 470 478 501 4 -25 -130
3875a30m28J97N65j04N53l25p2j57n06k01K91J37N76m7r0r5m16j21j98J60L17
$$ -130 -558 -361 204 100 653 328 256 99 -407 -608 -317 -180 396 349 259 164 -252 -373 -571 -411 -94
3896i4J64K25P7k15l70k36p6K47K76J50L54j00j60k81m08k6K10K96K52K84nl15
$$ -94 70 295 372 157 -213 -449 -525 -278 -2 148 502 402 242 -39 -447 -473 -263 33 285 569 564 249
3918B49m07m01Q7lK55N54J36N0l30l79j56k02L64j0M28L29j90p5n40J19l42mM64
$$ 249 -158 -559 -472 -475 -220 334 470 520 190 -189 -345 -547 -183 -193 235 564 374 299 -241 -122 -464 -468 -4
3941dM2K94O8l17k44m8m34N37Q7M60jo0k65l6n63J92J07M1L51L58k41j51k24k00
$$ -4 38 332 400 83 -161 -209 -643 -106 -19 441 440 380 115 79 -484 -292 -185 -144 207 565 324 173 -51 -251
3965b51k62M5K94L58K33O4l37m55p1j95K9M34N18m2K21l81j47m13j04L44j93P82
$$ -251 -513 -468 -174 184 417 481 144 -311 -382 -577 -548 -114 404 362 583 202 55 -358 -462 -118 -311 471
3987D71j28q9Pn76j85J37J86j07P57J36j67j47k99k90l13J43O31J6L57k36j65
$$ 471 343 254 261 -315 -500 -363 -177 -284 473 609 442 295 -4 -294 -607 -464 167 183 540 304 139
4008A39k18o67R9L20K2P23n5j42l5m42j61o7J84K66M64J91l03j28l60k71q7L31
$$ 139 -79 -746 -647 -327 -305 418 363 221 186 -256 -417 -484 -300 -34 430 621 318 190 -170 -441 -528 -197
4030a97J42K96K55j39j58m80q2j15K48K45J71K99l2l24r3n05j00K33M54J50n5
$$ -197 -55 241 496 357 199 -281 -363 -478 -230 15 186 485 453 129 36 -469 -569 -336 118 268 213
4051B13K2J09n29m5l70K59L63N5L23j5k01m28k8o6j02M62K74L11l34J3m82j88
$$ 213 235 344 -185 -230 -600 -341 22 77 400 385 184 -244 -272 -338 -440 22 296 607 273 286 -196 -384
4073c84k93L48M67J25L37j35l58l33k46j23L96K92K60M2J22l42k16m01Q6PL93
$$ -384 -677 -329 138 263 600 465 107 -226 -472 -595 -199 93 353 395 517 175 -41 -442 -356 -349 44
4094D4J85L61k8l74l40l59nN6M37L46J85j63n3o12j51j0N7N24K38K86K9l30n74
$$ 44 229 590 562 188 -152 -511 -516 -460 -23 323 508 345 292 -320 -471 -481 -424 100 338 624 653 323 -251
4117b51l20M06j84N73N8k8K7j00k40k55j63K83j11N70K10j26j50m51M3l87J97
$$ -251 -571 -165 -349 224 282 254 281 181 -59 -314 -477 -194 -305 265 475 349 199 -252 -209 -596 -399
4138c99L95P8K29rj2l66m01J2q2M54L74J25Qk21j28l16j89J18M10K75k17L54j59
$$ -399 -4 74 303 294 282 -84 -485 -473 -555 -101 273 398 406 185 57 -259 -448 -330 80 355 138 492 333
4161C33o39j75J23R5L75L17N4K00l48n02j70k49L95J20M21L3m1l14J41m30k49
$$ 333 -306 -481 -358 -263 112 429 483 683 335 -167 -337 -586 -191 -71 350 383 342 28 169 -261 -510
4182e10M15n0N94J1k14k6k15l12k90L91K97K44m1O6k25l1m68j15K92M86J44J75
$$ -510 -95 -145 449 460 246 220 5 -307 -597 -206 91 335 294 360 135 104 -364 -479 -187 299 443 618
4204F18J4l70l78l46j50L76L42L24K54k45k80l91k3j51J52N05J47Q4j17k97l69
$$ 618 632 262 -116 -462 -612 -236 106 430 684 439 159 -232 -255 -406 -254 251 398 482 365 68 -301
4225c01k28J1L02K66L05J26l58k38l4l54K73k18L60K54K02L8m37L0l35n2J45K55
$$ -301 -529 -518 -216 50 355 481 123 -115 -149 -503 -230 -448 -88 166 368 406 -31 -1 -336 -388 -243 12
4247A2K79K22K5m83jl29J44k03M01K54J74k75M3n53j5j84K65J93M24N0q6m32J14
$$ 12 291 513 538 55 54 -275 -131 -334 67 321 495 220 263 -290 -305 -489 -224 -31 393 443 357 -75 39
4270C9l97p1K91J36N25K0l49l38j5m56J72Q8J72O02M6J0l34l81k62qK38K51N84
$$ 39 -358 -429 -138 -2 523 543 194 -144 -159 -615 -443 -355 -183 419 465 475 141 -240 -502 -510 -272 -21 563
4293E63K1k08%n68j28j58K12M47Q6Q2J29k57l89n47J86J30M01J84L25j43o62p0
$$ 563 584 376 376 -192 -320 -478 -266 181 267 349 478 221 -168 -715 -529 -399 2 186 511 368 -294 -364
4315c64N7k7k7M28L16j54K78k89l16n6k42K35J17K85K88j2m21l27j54j14J81K29
$$ -364 -307 -334 -361 67 383 229 507 218 -98 -154 -396 -161 -44 241 529 517 96 -231 -385 -499 -318 -89
4337h9M59K58l53m24j48j67P6K04J02L41L22m4j95m53l96j28P5M51N42J26k34
$$ -89 370 628 275 -149 -297 -464 -388 -184 -82 259 581 537 342 -111 -507 -635 -560 -109 433 559 325
4358C25m45j65n9j1K32M1N13k6qj37n46J02r5k07N85K21K62M0m43n27k53J71J51
$$ 325 -120 -285 -344 -355 -123 -82 431 405 397 260 -286 -184 -279 -486 99 320 582 622 179 -348 -601 -430 -279
4381b79K37J91L98l70j73n37Q6j7K81K21K58l48M70k68n06pmK10L71M9J42r4j94
$$ -279 -42 149 547 177 4 -533 -447 -464 -183 38 296 -52 418 150 -356 -363 -367 -157 214 263 405 311 117
4404A17j57n47K95K49J86J65j80J76l69j06l73k27O30Q6K08K03j51n3l34M8l61
$$ 117 -40 -587 -292 -43 143 308 128 304 -65 -171 -544 -771 -141 -55 153 356 205 152 -182 -134 -495
4425d95L47J05K52L51l35n6p25K87m5P7L14K06O6j93j87k98j04j85M51L45J77
$$ -495 -148 -43 209 560 225 169 -556 -269 -314 -237 77 283 349 156 -31 -329 -433 -618 -167 178 355
4446C55K02o3j12l64m07j47L57P2L27L31j05m81k70j10M9k4N30M36j56m1j01m41
$$ 355 557 494 382 18 -389 -536 -179 -107 220 551 446 -35 -305 -415 -366 -390 140 576 420 379 278 -163
4468a63k25J64q0K64M28j91k5L6j12n80J4J45L40K35J1j03r5k41k2j34P0K58J98
$$ -163 -388 -224 -304 -40 388 197 172 208 96 -484 -470 -325 15 250 261 158 63 -178 -200 -334 -264 -6 192
4491A92K91j59j44n84O2N3J89K00J21K01k88Q7n41r4j28N22J1L67J35k64k82J46
$$ 192 483 324 180 -404 -342 -289 -100 100 221 422 134 221 -320 -414 -542 -20 -9 358 493 229 -53 93
4513I3k91k19L43K2M08P8p5k72k10m92K13K24K82K60J9m0k63o00L12m20M56M67
$$ 93 -198 -417 -74 -52 356 434 359 87 -123 -615 -402 -178 104 364 383 343 80 -520 -208 -628 -172 295
4535B95J19J62m54K22o29l8k4QM99J18J08j41q3k09l12m5K73J53L15L6O1j42n00
$$ 295 414 576 122 344 -285 -323 -347 -339 160 278 386 245 162 -47 -359 -404 -131 22 337 373 434 292 -208
4558b08j17p1K06K44M03j2k69n8j18o17K23K38K77J61J98k21Q1o76j74M09q5K89
$$ -208 -325 -396 -190 54 457 445 176 118 0 -617 -394 -156 121 282 480 259 340 -336 -510 -101 -186 103
4580A03J74J7Lk76q4n73K54L17K45J16J15j3k14l31o1j71J56J42K36L29q0k08
$$ 103 277 294 297 21 -63 -636 -382 -65 180 296 411 398 184 -147 -208 -379 -223 -81 155 484 404 196
4602A96n25j8J06J81J25K78j7pl37j71q8o0r6L09L98n5J36l16r7l65L13j6K10
$$ 196 -329 -347 -241 -60 65 343 326 319 -18 -189 -277 -337 -433 -124 274 219 355 39 -58 -423 -110 -126 84
4625H4K61K61k77m29K9m61J84j4M99M72k95r6l84j0M7l18K31L33J38K40Q5l06
$$ 84 345 606 329 -100 -71 -532 -348 -362 137 609 314 218 -166 -176 -129 -447 -216 117 255 495 580 274
4647B74m40j09r9K61Q4N20k73M1k89J9m21J21L4J77N35l14J98l70k3l08j24J17
$$ 274 -166 -275 -374 -113 -29 491 218 259 -30 -11 -432 -311 -277 -100 435 121 319 -51 -74 -382 -506 -389
4669c89L60L12K64m25k46j47n2N2j07N31J36J65k03l47j54k51J03N2M38L82j32
$$ -389 -29 283 547 122 -124 -271 -323 -271 -378 153 289 454 251 -96 -250 -501 -398 -346 92 474 342
4690C42R5n39p5j49k43J24M36M72L9j74k72n7l40q4M22J53P4R0r7j54l70k7j20
$$ 342 437 -102 -177 -326 -569 -445 -9 463 502 328 56 -1 -341 -425 -3 150 224 314 217 63 -307 -334 -454
4713d54K88L08K67m6Om12O8n75J35J71M55R9jJ64l68m98k8j38J98L70j18M48k3
$$ -454 -166 142 409 363 369 -43 25 -550 -415 -244 211 310 309 473 105 -393 -421 -559 -361 9 -109 339 316
4736C16k3n18l29j18N96L30J5M5j62n8k47m12J31M90l9L83Nj03k17j57l69N2M29
$$ 316 293 -225 -554 -672 -76 254 269 314 152 94 -153 -565 -434 56 17 400 405 302 85 -72 -441 -389 40
4759D0j36L53R1j23j22l78j09o5L66K42K06k4k3k09l66m5j09J38L94L10J87j37
$$ 40 -96 257 348 225 103 -275 -384 -449 -83 159 365 341 318 109 -257 -302 -411 -273 121 431 618 481
4781D81k61m39k89K51j14M45L27K38m66J87m05j45k64K44L18J27M38n73k6k19
$$ 481 220 -219 -508 -257 -371 74 401 639 173 360 -45 -190 -454 -210 108 235 673 100 74 -145
4801a45j13j15K6M48J63J80l08k59l83k0J73R1L08J45L19m42k37m9l66J33K25
$$ -145 -258 -373 -347 101 264 444 136 -123 -506 -526 -353 -262 46 191 510 68 -169 -218 -584 -451 -226
4822b26L20K14J7k2j58m03j0j10R6K47L82m5%j83q8m50lJ70N88J38R7k87k00l26
$$ -226 94 308 325 303 145 -258 -268 -378 -282 -35 347 302 302 119 31 -419 -422 -252 336 474 571 284 84 -242
4846b42n5J61K7R4L79o2J03k15j68m73K86j1K34J13K24n1k28k88j62j54K57M46
$$ -242 -297 -136 -109 -15 364 302 405 190 22 -451 -165 -176 58 171 395 344 116 -172 -334 -488 -231 215
4868B15J33j44n4j6l24j78r8L52K05L37K18n20K0k27m19K80J92J37L30j04j66
$$ 215 348 204 150 134 -190 -368 -466 -114 91 428 646 126 146 -81 -500 -220 -28 109 439 335 169
4889A69J5m95J30k1K07k2N29j21r8l41j96n18K98K24M94K06k04M0m15m0q5j57
$$ 169 184 -311 -181 -202 5 -17 512 391 293 -48 -244 -762 -464 -240 254 460 256 296 -119 -159 -244 -401
4911d01N9K08N11J31l24j29l69P8k18L74J42L48j32j79k15k79j60J64R9M13K70
$$ -401 -342 -134 377 508 184 55 -314 -236 -454 -80 62 410 278 99 -116 -395 -555 -391 -292 121 391
4932C91o2j55j58k76J27L7J36j00L73J79o31J53o4k23K3M8J36N72q8J53m18m68
$$ 391 329 174 16 -260 -133 -96 40 -60 313 492 -139 14 -50 -273 -250 -202 -66 506 418 571 153 -315
4954c15j5j5O8N26N8p3k81p4J30l89J79Q8L35K22j46q1l33j21k63Ol8P13K83P3
$$ -315 -330 -345 -277 249 307 234 -47 -121 9 -380 -201 -113 222 444 298 217 -116 -237 -500 -494 -532 181 464 537
4978E37j02n42J71l68Mj6P4O64L3j27k32k45j85k47O66J5J02R5Q6n52j68j19J53
$$ 537 435 -107 64 -304 -300 -316 -242 422 455 328 96 -149 -334 -581 85 100 202 297 383 -169 -337 -456 -303
5001c03J07L08R6L28k69k08k35j39k97K99N24k01M19k00k56j97r2J01rJ17M83
$$ -303 -196 112 208 536 267 59 -176 -315 -612 -313 211 10 429 229 -27 -224 -316 -215 -224 -107 376
5022C76j32ln9k87j22%q3N8M86L97n13m1m76ON1L56J25J8J09n1k35j33k91N9L38
$$ 376 244 241 182 -105 -227 -227 -310 -252 234 631 118 77 -399 -393 -342 14 139 157 266 215 -20 -153 -444 -385 -47
5047d7J25K55J07k90j21m06rp8K49L17K19qn7k19j7l09j19K64O2M38kj63k47l4
$$ -47 78 333 440 150 29 -377 -386 -464 -215 102 321 313 256 37 20 -289 -408 -144 -82 356 354 191 -56 -90
5071i0l75J38Q6M41j4J60j04k20m32qj93L06P25j07Q2k69k34km38P6P7O02M08
$$ -90 -465 -327 -241 200 186 346 242 22 -410 -418 -611 -305 420 313 395 126 -108 -110 -548 -472 -395 207 615
5094F15k56j35l89j7J8lJ26K97R9n7K6j79m88N4l8K52J08N04j22j4m06l89k0P4
$$ 615 359 224 -165 -182 -164 -167 -41 256 355 298 324 145 -343 -289 -327 -75 33 537 415 401 -5 -394 -414 -340
5118c40K31J14L50o1j95j00k38k11J16J45K66K93L46l99n40q8j51P4K70M55J68
$$ -340 -109 5 355 294 99 -1 -239 -450 -334 -189 77 370 716 317 -223 -311 -462 -388 -118 337 505
5139E05q0k34j22l84q6J11K06L14K27j72j13k17k76j23K03r5L53L00J9k34Q2j69
$$ 505 425 191 69 -315 -401 -290 -84 230 457 285 172 -45 -321 -444 -241 -336 17 317 336 102 184 15
5161A5q9k86L58j13L56o5J95k14m96P9k00L19J39L64j44r5m1k97k73J21L42J33
$$ 15 -74 -360 -2 -115 241 176 371 157 -339 -260 -460 -141 -2 362 218 123 82 -215 -488 -367 -25 108
5183A08J81J24k34k96j20j44n2J56N90K8K32k96k6o02j25K20K46K41J07J36k25
$$ 108 289 413 179 -117 -237 -381 -433 -277 313 341 573 277 251 -351 -476 -256 -10 231 338 474 249
5204B49k2n03j5k59L66N38k64L84k27l12p3j23km4L21N41j70k76k02j50k51J6
$$ 249 227 -276 -291 -550 -184 354 90 474 247 -65 -138 -261 -263 -307 14 555 385 109 -93 -243 -494 -478
5226d78K23P24%r8L48m69l58k66J54K69l65O68M18l63l40l22j79q6M91J78K16
$$ -478 -255 469 469 371 719 250 -108 -374 -220 49 -316 352 770 407 67 -255 -434 -520 -29 149 365
5247C65q2J5k30m45Lj17K92M16K38Q0K0m50k48l26j94Q83k18L25j67Mr4m52j37
$$ 365 283 298 68 -377 -374 -491 -199 217 455 535 555 105 -143 -469 -663 220 2 327 160 164 70 -382 -519
$$ [...]
8191a80
##END NTUPLES=NMR FID
##END=
