##TITLE=1H_LR-739-B2
 D2O,8 sc, 
 19.10.2021
##JCAMPDX= 6.0         $$ Bruker NMR JCAMP-DX V2.0
##DATA TYPE= NMR FID
##DATA CLASS= NTUPLES
##ORIGIN= UXNMR, Bruker Analytische Messtechnik GmbH
##OWNER= root
$$ XWIN-NMR		Version 3.5
$$ Tue Oct 19 15:24:20 2021 Russian Standard Time (UT+4h)  she@DPX200
##.OBSERVE FREQUENCY= 200.1313468511
##.OBSERVE NUCLEUS= ^1H
##.DELAY= (6, 6)
##.ACQUISITION MODE= SIMULTANEOUS
##.ACQUISITION SCHEME= undefined
##.AVERAGES= 8
##.DIGITISER RES= 18
##SPECTROMETER/DATA SYSTEM= spect
##.PULSE SEQUENCE= zg30
##.SOLVENT NAME= D2O
##.SHIFT REFERENCE= (INTERNAL, D2O, 0, 15.7039)
##AUDIT TRAIL= $$ (NUMBER, WHEN, WHO, WHERE, WHAT)
$$ ##TITLE= Audit trail, XWIN-NMR		Version 3.5
$$ ##JCAMPDX= 5.01
$$ ##ORIGIN= Bruker BioSpin GmbH
$$ ##OWNER= she
$$ F:/spectra/data/she/nmr/H-F/1/audita.txt
$$ ##AUDIT TRAIL=  $$ (NUMBER, WHEN, WHO, WHERE, WHAT)
(   1,<2021-10-19 15:21:44.43 +0400>,<she>,<DPX200>,
      <created by zg, POWCHK disabled, PULCHK disabled
       configuration hash MD5:
       00 E9 B6 7A A2 85 ED C7 34 08 36 98 17 FE 4E 26
       data hash MD5: 16K
       D3 7E 38 2F 69 57 03 27 C0 52 A8 F2 B1 C6 ED B9>)
$$ ##END=
$$ 
$$ hash MD5
$$ C5 A8 06 C3 BB D0 13 5C 0D 50 06 60 10 50 07 64
##$RELAX= 
##$RELAX= 
##$RELAX= 
##$RELAX= 
##$RELAX= 
##$RELAX= 
$$ Bruker specific parameters
$$ --------------------------
##$DU= <F:/spectra>
##$EXPNO= 1
##$NAME= <H-F>
##$PROCNO= 1
##$TYPE= <nmr>
##$USER= <she>
##$AMP= (0..31)
100 100 100 100 100 100 100 100 100 100 100 100 100 100 100 100 100 100 
100 100 100 100 100 100 100 100 100 100 100 100 100 100 
##$AQSEQ= 0
##$AQ_mod= 1
##$AUNM= <au_zg>
##$AUTOPOS= <>
##$BF1= 200.13
##$BF2= 200.13
##$BF3= 200.13
##$BF4= 200.13
##$BF5= 200.13
##$BF6= 200.13
##$BF7= 200.13
##$BF8= 200.13
##$BYTORDA= 1
##$CFDGTYP= 0
##$CFRGTYP= 5
##$CHEMSTR= <none>
##$CNST= (0..31)
1 1 145 1 1 1 1 1 1 1 1 1 1 1 1 1 1 1 1 1 1 1 1 1 1 1 1 1 1 1 1 1 
##$CPDPRG= <>
##$CPDPRG1= <>
##$CPDPRG2= <>
##$CPDPRG3= <>
##$CPDPRG4= <mlev>
##$CPDPRG5= <mlev>
##$CPDPRG6= <mlev>
##$CPDPRG7= <mlev>
##$CPDPRG8= <mlev>
##$CPDPRGB= <>
##$CPDPRGT= <>
##$D= (0..31)
0 1.2 0 0 0 0 0 0 0 0.06 0 0.03 0 0 0 0 0.0002 0 0 0 0 0 0 0 0 0 0 0 0 
0 0 0 
##$DATE= 1634642503
##$DBL= (0..7)
120 120 120 120 120 120 120 120 
##$DBP= (0..7)
150 150 150 150 150 150 150 150 
##$DBP07= 0
##$DBPNAM0= <>
##$DBPNAM1= <>
##$DBPNAM2= <>
##$DBPNAM3= <>
##$DBPNAM4= <>
##$DBPNAM5= <>
##$DBPNAM6= <>
##$DBPNAM7= <>
##$DBPOAL= (0..7)
0.5 0.5 0.5 0.5 0.5 0.5 0.5 0.5 
##$DBPOFFS= (0..7)
0 0 0 0 0 0 0 0 
##$DE= 6
##$DECBNUC= <off>
##$DECIM= 32
##$DECNUC= <off>
##$DECSTAT= 4
##$DIGMOD= 1
##$DIGTYP= 9
##$DL= (0..7)
0 120 120 120 120 120 120 120 
##$DP= (0..7)
150 150 150 150 150 150 150 150 
##$DP07= 0
##$DPNAME0= <>
##$DPNAME1= <>
##$DPNAME2= <>
##$DPNAME3= <>
##$DPNAME4= <>
##$DPNAME5= <>
##$DPNAME6= <>
##$DPNAME7= <>
##$DPOAL= (0..7)
0.5 0.5 0.5 0.5 0.5 0.5 0.5 0.5 
##$DPOFFS= (0..7)
0 0 0 0 0 0 0 0 
##$DQDMODE= 0
##$DR= 18
##$DS= 0
##$DSLIST= <SSSSSSSSSSSSSSS>
$$ [...]
##$SUBNAM2= <"">
##$SUBNAM3= <"">
##$SUBNAM4= <"">
##$SUBNAM5= <"">
##$SUBNAM6= <"">
##$SUBNAM7= <"">
##$SUBNAM8= <"">
##$SUBNAM9= <"">
##$SW= 18.0517286264689
##$SWIBOX= (0..15)
0 0 2 0 0 0 0 0 0 0 0 0 0 0 0 0 
##$SW_h= 3612.71676300578
##$TD= 16384
##$TD0= 1
##$TE= 0
##$TE2= 300
##$TE3= 300
##$TEG= 300
##$TL= (0..7)
0 120 120 120 120 120 120 120 
##$TP= (0..7)
150 150 150 150 150 150 150 150 
##$TP07= 0
##$TPNAME0= <>
##$TPNAME1= <>
##$TPNAME2= <>
##$TPNAME3= <>
##$TPNAME4= <>
##$TPNAME5= <>
##$TPNAME6= <>
##$TPNAME7= <>
##$TPOAL= (0..7)
0.5 0.5 0.5 0.5 0.5 0.5 0.5 0.5 
##$TPOFFS= (0..7)
0 0 0 0 0 0 0 0 
##$TUNHIN= 0
##$TUNHOUT= 0
##$TUNXOUT= 0
##$USERA1= <user>
##$USERA2= <user>
##$USERA3= <user>
##$USERA4= <user>
##$USERA5= <user>
##$V9= 5
##$VALIST= <valist>
##$VCLIST= <CCCCCCCCCCCCCCC>
##$VD= 0
##$VDLIST= <DDDDDDDDDDDDDDD>
##$VPLIST= <PPPPPPPPPPPPPPP>
##$VTLIST= <TTTTTTTTTTTTTTT>
##$WBST= 1024
##$WBSW= 4
##$XGAIN= (0..3)
0 0 0 0 
##$XL= 0
##$YL= 0
##$YMAX_a= 191483
##$YMIN_a= -281137
##$ZGOPTNS= <>
##$ZL1= 120
##$ZL2= 120
##$ZL3= 120
##$ZL4= 120
##$ABSF1= 10
##$ABSF2= 0
##$ABSG= 5
##$ABSL= 3
##$ALPHA= 0
##$AQORDER= 0
##$ASSFAC= 0
##$ASSFACI= 0
##$ASSFACX= 0
##$ASSWID= 0
##$AUNMP= <proc_1d>
##$AZFE= 0.1
##$AZFW= 0.1
##$BCFW= 1
##$BC_mod= 2
##$BYTORDP= 1
##$COROFFS= 0
##$CY= 11.3945322036743
##$DATMOD= 1
##$DC= 2
##$DFILT= <>
##$DTYPP= 0
##$F1P= 2.36226072786647
##$F2P= -0.459571619588291
##$FCOR= 0.5
##$FTSIZE= 0
##$FT_mod= 4
##$GAMMA= 1
##$GB= 0.15
##$INTBC= 1
##$INTSCL= 1
##$ISEN= 128
##$LB= 0.24
##$LEV0= 0
##$LPBIN= 0
##$MAXI= 10000
##$MC2= 0
##$MEAN= 0
##$ME_mod= 0
##$MI= 1.114404
##$NCOEF= 0
##$NC_proc= 0
##$NLEV= 6
##$NOISF1= 3.799351
##$NOISF2= 2.8
##$NSP= 1
##$NTH_PI= 0
##$NZP= 0
##$OFFSET= 15.70392
##$PC= 1
##$PHC0= -14794.64
##$PHC1= 7.600831
##$PH_mod= 1
##$PKNL= yes
##$PPARMOD= 0
##$PSCAL= 0
##$PSIGN= 0
##$REVERSE= no
##$SF= 200.130013532006
##$SI= 16384
##$SIGF1= 3
##$SIGF2= 2
##$SINO= 400
##$SIOLD= 16384
##$SREGLST= <1H.CDCl3>
##$SSB= 0
##$STSI= 0
##$STSR= 0
##$SW_p= 3612.71676300578
##$SYMM= 0
##$S_DEV= 0
##$TDeff= 0
##$TDoff= 0
##$TI= <>
##$TILT= no
##$TM1= 0
##$TM2= 0
##$TOPLEV= 0
##$USERP1= <user>
##$USERP2= <user>
##$USERP3= <user>
##$USERP4= <user>
##$USERP5= <user>
##$WDW= 1
##$XDIM= 8192
##$YMAX_p= 0
##$YMIN_p= 0
$$ End of Bruker specific parameters
$$ ---------------------------------
##NTUPLES= NMR FID
##VAR_NAME=  TIME,          FID/REAL,        FID/IMAG
##SYMBOL=    X,             R,               I
##VAR_TYPE=  INDEPENDENT,   DEPENDENT,       DEPENDENT
##VAR_FORM=  AFFN,          ASDF,            ASDF
##VAR_DIM=   8192,          8192,            8192
##UNITS=     SECONDS,       ARBITRARY UNITS, ARBITRARY UNITS
##FACTOR=    0.0002768,     1,               1
##FIRST=     0,             0,               0
##LAST=      2.2672688,     0,               0
##MIN=       0,             -281137,         0
##MAX=       2.2672688,     191483,          0
$$ Real data points
##PAGE= N=1
##DATA TABLE= (X++(R..R)), XYDATA
0@%%%%%%%%%%%Lj1J6j6J7k5L2m0M9n7P1q4R7j15J36j55J79k09K40k75L14l58M07
34B16m59N17n83O54p30Q15r09J013j127J249j383J527j685J861k052K260k490
51a306K745l023L334l683M072m513N016n598O278p085Q063r275J0828j2896J5806
66H763k0242K7913m4935J55126m1625j63886M7542j40636Q1314K12621J3293l4365
78A00883R0600r9079j33659O082l2749n9688J13330J09984K3617J8182l9147j40500
90d2144r1830j631N2026Q7407J02927L8931m7356p7831o5572o5399m626O6623
102d8475N7939O0317P3160j9898p2030m5414q4738n7027P9994P6862M3069R3939
114A57698n054j25331m4126l5669p8254O7461J15090K730M1453L7688j11940q1521
$$ y = [0, 0, 0, 0, 0, 0, 0, 0, 0, 0, 0, 0, 3, -8, 8, -8, 9, -16, 16, -24, 25, -32, 39, -45, 52, -63, 73, -82, 97, -112, 128, -147, 167, -191, 216, -243, 274, -309, 345, -385, 430, -479, 534, -593, 656, -727, 800, -885, 976, -1076, 1184, -1306, 1439, -1584, 1750, -1933, 2139, -2374, 2642, -2956, 3322, -3763, 4300, -4975, 5853, -7043, 8763, -11479, 16434, -28501, 126625, 85000, -78886, -31344, -171980, -90666, 121955, 135248, 100883, 191483, 92404, -41255, -35173, -67922, -127610, -14280, 95704, 119321, 137503, 98356, -42144, -133974, -135605, -83579, 3828, 106755, 145686, 98330, 20499, -45073, -110472, -115098, -48475, 9464, 69781, 142941, 123043, 51013, 5599, -79139, -136166, -56172, 20690, 63759, 157698, 152644, 27313, -16813, -52482, -130736, -63275, 51815, 54545, 95998, 133686, 21746, -59775]
126e9775O199m6133J1886J14629M0242mK8219n2808r5669l0034j4408R845Q2788
139e023P7319K7259o445o1335q3185m4842l727M1910P1571M9839J8715j0265m9785
152B2006n6199l8438j6255K3051N4659N9093M1454q452n4210o1290n8290j8876
164a11747N4330O5472M1863M0887j6292p5010l8781k2784l1218L9449O7790J9266
176C3225L1802K2194o2326o0972j8536l0999J6821Q4289M6562Q823M094n3895
188B1082p4188j9240K484J8233O0840M8259P144p369l6677o0731l6020l922K1421
201e8684N2700N5578K4038j1693m0604n4828m1320m334L1040M8022M6177K6003
213G2095j3467m2259m1301l3142j0016L3065M7058L2550K4114o969m9016m3298
$$ y = [-59775, -53576, -99709, -87823, 26806, 67048, 67044, 95263, 42455, -53214, -83248, -97656, -87811, -5023, 72296, 99555, 93110, 31775, -51410, -96252, -99979, -58069, 13502, 63341, 82056, 71791, 22006, -34193, -72631, -88886, -65835, -11176, 47917, 89371, 80919, 26709, -34581, -92871, -111747, -57417, 8055, 49918, 90805, 74513, -497, -39278, -62062, -93280, -53831, 13959, 33225, 65027, 87221, 24895, -36077, -54613, -85612, -68791, 15498, 62060, 70883, 74977, 21082, -53106, -72346, -69862, -51629, 9211, 57470, 64614, 57245, 20568, -40163, -76183, -80105, -58684, -5984, 49594, 73632, 61939, 21335, -33493, -74813, -79147, -48107, -85, 46092, 72095, 58628, 16369, -24932, -58074, -68090, -35025, 12033, 44583, 68697, 61728, 12712, -30586]
225c0586k4391j2411K9251N6641L3709J5449n525m8276n4361k3658n937K3437
237d6658N6118M3058J1390p176l8604n4301k8000j325K0403M6038M3677J5536
249F0156r182l2402m6132l0849j178K4175M1555M0418J5590j5286l5415m1445
261b9995k8119Q63K9171M1090L5684J4651j4750l8705m1777k7418k198K8380M4062
274A0939L6184J6811j2379l8805m2908k6887l189K5402M2539L6088J4593j0792
286D7596l4324m0623k5506j539K3606L9486L4808J2691j1740l3109l9390k4827
298e2871R65K4587L8545L3793J2271j3520l3628l8233k5082O63K5208L7363L3662
311D3723J3502j3515l3133l7087k5005j49K4697L6524L2108J2867j3030l2061
$$ y = [-30586, -54977, -67388, -38137, 18504, 52213, 67662, 62137, 13861, -40500, -64158, -70095, -46658, 9460, 52518, 63908, 56732, 18128, -36173, -64173, -65498, -45095, 943, 44620, 60156, 50974, 18572, -27560, -58409, -59587, -35412, 6143, 46561, 62151, 46865, 11450, -29995, -58114, -57251, -28080, 13010, 48694, 63345, 48595, 9890, -31887, -59305, -61503, -33123, 10939, 47123, 63934, 51555, 12750, -30158, -57045, -60234, -34832, 7707, 43795, 58388, 47596, 13272, -27351, -52857, -54396, -30790, 8696, 43504, 56195, 44455, 11346, -28044, -52871, -51906, -27319, 11226, 45019, 57290, 43770, 10142, -28091, -53173, -52510, -27302, 10061, 43723, 57225, 43710, 10577, -26510, -51515, -51664, -26967, 9557, 41665, 54532, 41502, 9441]
323I441l6116k3369l99K3684L5995L1202J2328j2421l2433l4983k3191n12K3259
336b7515L5487L0644J2496j1584l0783l4479k2134j16K1945L4173K9384J1228
348D8746j1157k9890l2920k0513Q93K1747L3132K7859R883j2563k9931l2683k0329
361d7726J409K2880L3239K8087R934j3009l0146l2634k1152J81K2233L2992K6759
374C3047J1409r852k9335l0767j8899k066K0449L2991K4178J0274q691k8537k9816
387b5615j4963J94J9637L2642K2814N762r114k7682l0884j3982K259J8273L2894
400A2235K5168N556j0485k7382l3066j6613L057J9354L1362K6031P287j1639k5532
413E333k8881j7109J610J9205K7296K2605Q691r497k5009k5408j5316l29J9561
$$ y = [9441, -26675, -50044, -50443, -26759, 9236, 40438, 52766, 40345, 7912, -27071, -50262, -50774, -27515, 7972, 38616, 51112, 39528, 8745, -25734, -47868, -47984, -26039, 8134, 37518, 48746, 37589, 7699, -25221, -45734, -44841, -23094, 10038, 37897, 47780, 35217, 5286, -27397, -47726, -46317, -23437, 9802, 37889, 47823, 34814, 4668, -27966, -49118, -48937, -26704, 6288, 33047, 44456, 34604, 5269, -25498, -44397, -46463, -26014, 6977, 31155, 41429, 32738, 4201, -25615, -40578, -40384, -20747, 11895, 34709, 40471, 31357, 3675, -27209, -41191, -38932, -20659, 12235, 37403, 42959, 32474, 5092, -27974, -44587, -41530, -22176, 9186, 35217, 42504, 30865, 5333, -23548, -40657, -39047, -19842, 7454, 30059, 38750, 29253, 4244, -21164, -36480, -36809, -17248]
426a7248K9087J9451P373r182k9495k6561r419K6J9720L2797J6688K785o592k8304
440A126k8869p812O20J3849L2840K0689K282m465k3920l2254j0759K936J3472
453b0265L1845K3581L33r584k1201k9260r346P374J3928K4559K0479J169j0268
466B3344j8504k4749j4299L194J6498K4211K0833O813j2042k6670k3677j1891
478c6939J201K1985K8416J1689L889o864k8579k1747j678k469J1931L2557J2778
491B6170j02K069k3493l2081l460K827Q699L5121K2313o967p074j8629l1286n358
505c1251J1556Q986K3457K0501l838q893j3851k4963j1939N660J1165K1228K1252
518B9070L389j1338j9918k3363j1967N158J9409K4239J3998J298j0856k4628j7750
$$ y = [-17248, 11839, 31290, 38663, 29481, -14, -26575, -35994, -35968, -16248, 16549, 33237, 36022, 29430, 1126, -27743, -35555, -34935, -21086, 11754, 32443, 34725, 30260, 6340, -25914, -36673, -33737, -20265, 11580, 35161, 35494, 25910, 4709, -24551, -33897, -26523, -12595, 11964, 32443, 33612, 23344, 4840, -19909, -34208, -31014, -14516, 9695, 30528, 37341, 25299, -1371, -25048, -36939, -35738, -13753, 14663, 26352, 30241, 23377, -5202, -26949, -28627, -31096, -19165, 13392, 26170, 26068, 28137, 4644, -27437, -30897, -28070, -19371, 15750, 38063, 31096, 24022, 5393, -25893, -31251, -19695, -10709, 12748, 33249, 29411, 20518, 6667, -18296, -30235, -24575, -13410, 7818, 29070, 32459, 21121, 1203, -22160, -34127, -28969, -9560, 14679, 28677, 29975, 19119, -5509, -23259]
531b3259k016J70J3742K7573R637Q75K056k3118k7984j984P5P065L4041J9365
545C6238p307l579j7626l1345l193J1609O687K2033J9032p239q724j1534k1874
558a6822p584O847Q215J9349J8037J66p422j7558k5201q500P105J3924K4892J7807
572C3255m932j2218j6398k0886n553Q145J1075J7421J4468J643o347j6208j9389
585a5924q025L66J1928K3897J3402m33m875k0848k3205o14O394Q966K4360J2643
599B8032q995o159j2548k2286k140Q640M630J9270J7632k899p013j2696k4675
612b1207q716Q852J0575K0753J8064m956j1772j2748j9583o347J0244R560J3511
625F230J5169r34j0777j0955j5561r566N234J2731J5503J3366K132r400j8083
$$ y = [-23259, -25275, -25105, -11363, 16210, 25847, 26722, 28778, 5660, -22324, -24308, -24233, -17168, 16873, 36238, 28931, 25352, 7726, -23619, -26812, -15203, -8516, 13517, 32549, 25310, 16586, 5052, -16822, -24406, -17559, -9344, 10005, 28042, 28208, 20786, 3228, -21973, -30473, -23368, -9444, 15448, 33255, 28323, 16105, -293, -21179, -26732, -18587, -7512, 9909, 24377, 26020, 19673, 3465, -15924, -23949, -23583, -11655, 12242, 25644, 25211, 20336, -512, -23717, -24331, -17937, -8971, 15389, 28032, 19037, 12878, 330, -21956, -24096, -15456, -10826, 8444, 26076, 23177, 16164, 3468, -21207, -29923, -21071, -10496, 10257, 28321, 23365, 11593, -1155, -20738, -27085, -16841, -7281, 6230, 21399, 20465, 9688, -1267, -16828, -26394, -21160, -8429, 7074, 20440, 22572, 13172, -4911]
638d911j6100m230L780J4056K0798Q677m149o080j5510j7422l01N799N617J8314
652H338J4146m630n295j0797k1388o570R543R044J6355J5832m113j1750j1329
665b614j6877n519R456J0887J3051J2634j791j0867j0882j3775p140O693J1052
678e692J3282J2455N47j0077j3330j3916o308O510J3360J4261R247j385r194j3828
692d068j2395l040N164J0634J4678R109j692p447j3637j4627l729O187J0105J5276
706A0518J1387k930q754j2340j4686m688P572J0075J3167J1147k597r865r837
719a831j2521n459O758J0309J0890J0417j33j0248j1568j1322n227O439J2470
732a026J2288P610r23r896j3062j0420l769N703J1519J2764P691r24q414j2840
$$ y = [-4911, -21011, -25241, -21461, -7405, 13393, 22070, 17921, 11841, -3669, -21091, -21392, -15593, -9976, 8338, 22484, 17854, 12559, 1762, -19626, -26196, -16653, -7609, 8746, 24578, 20465, 8715, -2614, -19491, -25010, -15554, -4667, 8384, 21018, 19227, 8360, -2522, -16297, -23437, -16744, -5692, 7590, 20045, 20592, 10515, -2815, -16731, -23039, -16529, -3169, 11092, 20339, 18954, 9760, -4068, -16463, -19503, -14339, -3705, 10973, 20082, 18390, 10943, -2694, -17321, -21050, -14863, -4758, 10518, 21905, 18975, 10221, -2119, -16805, -21493, -13921, -3846, 9321, 20468, 17871, 8006, -1831, -14352, -19811, -13053, -2744, 8146, 18563, 18430, 8182, -3386, -14708, -19935, -13496, -1026, 11262, 18872, 17949, 8053, -5009, -15429, -19198, -13495, -1976, 10788, 18479, 17555, 9141, -3699]
746c699j1260l943M963J0921J2351Q646q51q572j2017j1002l199N446J0228J2001
760A0013P125j997q203j0766j0528l033N852R989J1592P634j962r526j1048j0014
774a4872l330O207J1153J0671P014o70r230j1791q757l748M652J1161J1052O580
788A6092j282p767j1553r193k682N001R571J0947O604j746p904j0830q563k910
802a6215N575R753J0083O240j484q303j1091q109k140M663J0273J0267N417j584
816A3345p768j0390q818j890N265R027J0287N844k047p599j0161q322j936N237
830i926R462R349N864j987q041r699q033k023M947R275R654N005j676p373r827
845e029p718j454M770Q800R154N131j948p462r220p197j461M972Q677Q540M800
$$ y = [-3699, -14959, -18902, -13939, -3018, 9333, 17979, 17128, 8556, -3461, -14463, -17662, -12216, -1988, 10013, 17138, 15141, 6938, -3828, -14356, -17389, -11537, -1548, 10044, 17678, 15716, 6190, -4858, -14872, -18202, -11995, -842, 9829, 16843, 16173, 6943, -4848, -13605, -17353, -12701, -1540, 9512, 16092, 14810, 7043, -4510, -13703, -16385, -11384, -1813, 9134, 15738, 13992, 6088, -4742, -13305, -16215, -10640, -887, 9196, 15436, 13952, 5649, -5442, -13551, -15691, -11028, -755, 9512, 14929, 13345, 5577, -4813, -13631, -15521, -10256, -1229, 9058, 14902, 12855, 5256, -4905, -13227, -15163, -9926, -464, 8885, 14749, 12762, 4721, -4978, -13011, -15034, -10087, -812, 8842, 13847, 12171, 4798, -5029, -12747, -14201, -9431, -631, 8523, 13654, 11706, 4244, -4976, -12173, -13634, -8662, 15, 8555, 13355]
860A3355k126p343q936p333j287N496Q280Q923N033k685p275q919p253j383N199
875h254Q508Q347M798k171p409q095p145j512N384Q193P730M439k198o891q178
890d454o274j194M960Q012P395M307k636o893q127o173o85N308P803P667M103
905A3119k835p045q155o259p35N602P553P694M053k565p150p279o794o34N261
920f169O865P563M022k522o956o760o388j064O285O791O179M600l148p106p025
935d833n268q82N858P430N879L735k368p493o699n218j063N181P723O620L070
950A1672k150p221p625n370J25N356O919O531K860l107o175o206n690mN561N707
966A183O168M120l583o651n315n963q87O796N889N886M151l645p810n276m881
$$ y = [13355, 11229, 3886, -5050, -12383, -13670, -8174, 106, 9029, 14062, 11377, 4102, -4817, -12070, -13453, -8254, 254, 8601, 13399, 11228, 3819, -4276, -11421, -12933, -7549, 644, 8374, 12813, 10615, 3724, -4454, -10728, -11922, -6962, 1050, 8445, 12752, 10116, 3223, -4904, -11077, -11762, -6454, 1349, 9016, 13119, 10284, 3239, -4916, -11175, -11910, -6308, 1245, 8939, 12992, 10427, 3277, -4002, -10796, -11430, -6169, 696, 8259, 12281, 9759, 2803, -3957, -10345, -11409, -5124, 1667, 7846, 12446, 9298, 2192, -4833, -10101, -10983, -5125, 2305, 8184, 11919, 9551, 2058, -4641, -9859, -10922, -5741, 1982, 8602, 11672, 9522, 2301, -5324, -10694, -10569, -5213, 1706, 8237, 11097, 7990, 1815, -4391, -10081, -10085, -4524, 1183, 7351, 11471, 7888, 1237, -4078, -10041, -10928, -4132, 1757, 7643, 11794, 8149, 339, -4937, -9818]
981i818o63O520O327M652L437k063p711n388m111j348N147P038M879L269k133
996H034p084o377m193k73N414P151N075K533l404o339n717m088M03N192N538N229
1012G094K825k981n881n386m788o88O169N680M828L440l370p268m798m046L3O937
1028b200N583L487K607l486o448l827l859n07N367N627L920L858k902p149n155
1043e084l723o87O094O931L293K406k715p205m349k378k98M358O122L451J772
1058G988j874n875m979l078j32M888N692M474K021l793n837m740l056Q11N732
1073a758N167K998K322l703n718l685l190l66N737M737L471K868k987o831l697
1088d635l071n44O064N835K169K056k379o874l765j586n48N349O135J802Q95k190
$$ y = [-9818, -10481, -3961, 2366, 7018, 10455, 8392, 681, -4707, -8818, -10166, -5019, 2019, 6898, 10167, 8034, 950, -5427, -9620, -9893, -4479, 2672, 7747, 10280, 6876, 537, -5180, -9268, -8865, -3673, 1865, 7094, 9919, 6938, 1057, -4329, -9117, -9805, -3636, 2044, 6872, 10312, 6942, -326, -5124, -9170, -9137, -2200, 3383, 6870, 9477, 5991, -457, -4284, -8143, -8650, -3283, 2344, 6264, 10122, 7220, 71, -5084, -8807, -9494, -3400, 3531, 6824, 9230, 6515, -690, -5039, -7417, -7715, -3357, 2765, 6216, 7988, 6114, 239, -4740, -7818, -7950, -3062, 2630, 7104, 9125, 5332, -505, -5245, -8301, -7490, -1758, 3409, 6407, 8729, 5026, -692, -4377, -7567, -7933, -2196, 2541, 6012, 8880, 5893, -938, -4635, -7706, -8250, -2186, 3649, 5818, 7874, 5495, -1379, -5144, -6730, -7278, -1929, 4206, 6008, 6903, 4713]
1104D713n915m043j441p5M231N620L570O14k175n629n136k393J410M682N310L297
1120F640Q55l695n110l668j985Q55M741M309K371J669k605n326l544k332N9N001
1136a765N403K631J126l311o406l179j161N78N449M779J151O54j973n124l499
1151d647j129l37L838N710K999K87k251n986m430q58J759M288M557K132j10k700
1167C122m380l395j616J092L892M402K625O45k817n087l566j257J294M552M002
1182C508K100M58l240m838k520j308P83M326M152J876M80k494n069l135q58J225
1198d554M083M527J550m83k191m570l408n28J208L809M299K208n23k341m585l611
1214e110o33J541M235L765J499n2l084l764l294m41J314L367M120J997m99k700
$$ y = [4713, -1202, -5245, -6686, -6761, -2530, 3090, 6660, 7274, 5099, -530, -5666, -8059, -6649, -1967, 3343, 6640, 7495, 3800, -1310, -4978, -6963, -6108, -1367, 2942, 5313, 6982, 4377, -949, -4493, -6825, -6766, -1765, 3638, 6269, 7395, 4084, -2322, -5501, -6662, -6084, -635, 4144, 5295, 5949, 3976, -1148, -4647, -5776, -6113, -2275, 3435, 6434, 6721, 4470, -1516, -5946, -6804, -5045, -757, 3800, 5932, 5822, 3122, -1258, -4653, -6269, -5177, -1285, 3117, 5742, 6387, 3570, -1517, -5083, -6340, -5046, -494, 3508, 5608, 6066, 2826, -2012, -4532, -5840, -5057, -731, 3421, 5297, 5777, 3283, -1786, -4921, -5779, -4554, -471, 4056, 5606, 5123, 2932, -1638, -5046, -5574, -4366, -557, 3742, 5950, 5427, 3086, -1499, -5110, -5743, -4202, 33, 3798, 5297, 5245, 2161, -1603, -4897, -5338, -4024, -657, 3463, 5460, 4961, 2261]
1230B261m040l192p03J755L765L975J622m14l048m162k496p52J663L372L755J985
1246E346m27k454m380l091l24J526L285M411J382q84k425l719k784n81J856L216
1262d7L346J828q72k581l407k907o08J978L645L263J421o93l094l528k503j96
1278d955J907L358L175J618j010k665l330k781l52K002L343L322J363p71l194
1293A030l318k171J92J348L572K879J239j092k501l303k259J25J553L362L141
1308C797R03j067k680l206k305J24K146L167K623J015j115k395l409j963j58K058
1324b465L235K895O17r54k689l072j843l1K291K896K551R46j066k441k900k212
1340d242K20J897K776K991P66j095k786k871j742J83J951L023K446O93j164k350
$$ y = [2261, -1779, -4971, -5674, -3919, -154, 3821, 5443, 5029, 1981, -2181, -4677, -5429, -3766, -394, 3361, 5346, 4919, 2465, -1915, -5006, -5330, -3804, -519, 3892, 5274, 4390, 1965, -1754, -4538, -5119, -3263, -47, 3299, 5127, 4255, 1674, -1733, -4640, -5248, -3270, 375, 3638, 5059, 4366, 1272, -2256, -4759, -4955, -3048, 310, 3485, 5103, 4093, 1428, -1902, -4683, -5035, -3033, 310, 3632, 4995, 4224, 1030, -2288, -4459, -4267, -2919, 653, 3532, 4771, 3679, 1178, -2125, -4384, -4259, -2706, 656, 3797, 4700, 3633, 953, -2253, -4558, -4434, -2288, 879, 3502, 4517, 3402, 1007, -2402, -4365, -4523, -2465, 770, 3665, 4282, 3328, 639, -2433, -4276, -4307, -2016, 880, 3431, 4377, 3311, 870, -2030, -4242, -4022, -2125, 651, 3642, 4408, 3313, 527, -2344, -4086, -3903, -1952, 1071, 3517, 4210, 3046, 696]
1356F96l145j626L99J744K739K746M86j215k473k882j403K70K078K667K438M94
1372D013r38k694k864j654M64J764L182K222N25j179k267l127j251K88K047K759
1388A290K269K67j231k214l037j091M30J924K390K481K70j052k445k964r34K50
1404c397K172K710K303l03j168k467k611j217J016J658K825J844Jj109k163k503
1420b409j379O08K110K534J823L05j594k119k378j139O52J962K679J742j61j296
1436A940k061k494q03P13J726K854J472J4j280k441k419r71R49K011K375K108
1452C693l01j585j994k481q24J058J466K578J261K29j543k042k202o72J094J361
1468i04K519J794k36j589k138k208n91P33J870K507J535l15j628j891j982m21
$$ y = [696, -2449, -4075, -3676, -1932, 807, 3553, 4039, 2824, 351, -2531, -3934, -3664, -1586, 1081, 3519, 4013, 3075, 381, -2483, -4137, -3673, -1909, 1273, 3495, 4020, 2841, 574, -2553, -3804, -3516, -1469, 1290, 3559, 3826, 2595, 381, -2656, -3747, -3317, -1393, 997, 3478, 3748, 2696, 251, -2713, -3647, -3397, -1225, 1485, 3788, 3485, 2317, -150, -2761, -3978, -2962, -1304, 1521, 3365, 3366, 2257, 94, -2409, -3788, -3180, -1070, 1464, 3287, 3592, 1998, -121, -2499, -3638, -2986, -1024, 1655, 3397, 3236, 1940, -121, -2615, -3418, -2705, -979, 1875, 3347, 3361, 2081, -360, -2779, -3750, -2801, -790, 1585, 3693, 3392, 1807, -187, -2668, -3492, -2434, -968, 1610, 2871, 3100, 1557, -485, -2687, -3359, -2265, -904, 1615, 3409, 3173, 1584, -554, -2762, -3353, -2620, -750, 1757, 3292, 2977, 1349, -542, -2524, -2945]
1484b945Q56J604K213J521m68j534j860k035o12J108J859K056J223l12j432k010
1500g68k103m01J159J935J933J261k75j569j977j640o37J140J660J926J118k78
1516B484j237j874k028l32J222J638J947J323o74j495j746j866m47J547J576J581
1532A619J137m40j627j657j476k48J243J491J814J091p02j268k034j653k08J266
1548a652J648K032Q15p43j445j568j550k18J252J351J879R24n00j536j595j639
1564b545n9J491J340J630O84n57j641j488j094k39J421J547J313P39n43j996j111
1581a108j159m15J662J413J443R33p54j796j382j361j96J786J457J565N46o89
1597A945j352j932j118K42J108J392J715M71p73j251j727j180o9J676J163J684
$$ y = [-2945, -2089, -485, 1728, 3249, 2781, 1247, -613, -2648, -3260, -2152, -293, 1763, 2986, 2674, 1242, -768, -2871, -3272, -2113, -178, 1755, 3016, 2741, 1172, -805, -2445, -3082, -1942, -282, 1644, 2762, 2484, 1247, -627, -2655, -2987, -1765, -127, 1820, 3143, 2469, 974, -772, -2638, -3085, -1538, 38, 1619, 2756, 2316, 689, -968, -2444, -2692, -1449, 42, 1856, 2947, 2245, 977, -1057, -2710, -2918, -1652, -4, 2028, 2843, 2100, 655, -913, -2463, -2681, -1429, -78, 1801, 2725, 2225, 689, -906, -2545, -2604, -1113, 227, 1857, 2541, 1984, 343, -1145, -2239, -2478, -1057, 490, 1803, 2542, 1999, 3, -1108, -2267, -2682, -1020, 393, 1836, 2769, 2015, 219, -1163, -2524, -2720, -934, 523, 2088, 2634, 1945, 593, -1339, -2457, -2215, -1107, 285, 2000, 2471, 1698, 447, -1280, -2460, -2529, -853, 310, 1994]
1613A994O54j163j481j252j427L95J460J793Q77Q36j121j491j219j277J88J638
1629e96J108J410L69p15j474j498q59R5J536J379J057N19n69j929j011j012L37
1646a853J462J237R29N26p13j516j220r39j28J720J165J470L02j487j199j107
1662a351p54j98J697J463Q10O07p56j713j118r17N14J206J283Q14O32q79j519
1679a79j166n11J20J263J643O96K73j139j375j155p47O96J205J488N45M37p70
1696A324j655j165m50J30J546R34R88Pn31j355j482j04K47J144J416R05n6p71
1714A072j539r57n57M85J286J359O90Mj003j215j000n14K37J449J258P06P7j168
1732F70j311m59r21N70J108J576M20K43q41j760p18o02O70J125J317O45q1j105
$$ y = [1994, 2648, 1485, 4, -1248, -2675, -2280, -820, 973, 1850, 2686, 1565, 74, -1145, -2422, -2234, -596, 512, 1922, 2291, 1576, 102, -1396, -2255, -2160, -624, 755, 1812, 2331, 1762, -167, -1178, -2190, -1853, -391, 846, 1775, 2301, 1588, 72, -1148, -2087, -2215, -495, 670, 2140, 2442, 955, -244, -1351, -2105, -2303, -606, 857, 1667, 2274, 1518, -195, -1313, -2230, -1716, -510, 773, 1587, 2219, 1340, -179, -1345, -1856, -1736, -473, 1170, 1866, 2139, 1000, -375, -1530, -2277, -1581, -376, 1112, 1657, 2094, 1324, -331, -1496, -1946, -1816, -270, 664, 1652, 1659, 1128, -227, -1709, -1813, -1566, -422, 994, 1899, 1843, 1072, -467, -1424, -1981, -1496, -210, 1149, 1839, 1843, 840, -375, -1375, -1889, -1652, -203, 1055, 1761, 1838, 670, -641, -1100, -2021, -1451, -343, 1233, 1653, 1896, 1055, -705, -1423, -2025, -1355, -230, 1087, 1732, 1651, 546]
1750E46j255o68l17L97P97J545R44n18q34j198r22j48L47J279J390L70j7r79j470
1769g11r00j37M13J362J183L40J08j334j041r49M4N74J121J152M78m15p74j382
1787h68o43j89M09J460J149O40m56j131r03j084m7N21J172J307L21j71r18j425
1805h56p16j04P17J104J221M68o32m84j637n85k89R85J264Q59M42n47p83j260
1823h33p03l47R73J194R14M50j56j336j264k66j85O10J427P61L71m52j019q78
1841g39r27J83P53J245Q61K36k45j251r44n42l34R09J291P62K68j69j238r02r36
1860a719K22R50Q12R74M14o24j251o85o10J48O29J387O15M01o47p45j286m52K08
1879a259N56J001Q38K52l39r50j453j59K19O70J221P32J32l72j067j067o11M41
$$ y = [546, -709, -1377, -1694, -1297, -500, 1045, 1989, 1471, 637, -561, -1483, -1631, -1284, -5, 1385, 1755, 1738, 759, -711, -1611, -1748, -1335, 27, 1210, 1550, 1658, 324, -717, -1666, -1622, -1048, 73, 1225, 1703, 1288, 514, -868, -1511, -1700, -1291, 169, 1318, 1958, 1502, 371, -532, -1616, -1663, -1142, 30, 1337, 1658, 1487, 569, -856, -1572, -1676, -959, 145, 1366, 1834, 1202, 718, -919, -1504, -1793, -808, 456, 1315, 1757, 1210, 427, -833, -1536, -1883, -910, 284, 1198, 1648, 1492, 156, -1108, -1374, -1559, -949, 478, 1239, 1610, 1158, 139, -739, -1666, -1483, -730, 515, 1376, 1612, 1367, 116, -828, -1370, -1704, -795, 496, 1258, 1526, 1357, 119, -783, -1719, -1497, -547, 265, 1239, 1653, 1029, -222, -907, -1517, -1369, -740, 647, 1262, 1663, 1016, 271, -1015, -1467, -1259, -703, 298, 1136, 1388, 1049, 99, -1354, -1513, -1294, -624, 597, 1329, 1461, 1089, 22, -1045, -1656, -1215]
1897a215P73R52P38J71p26p47j162j63J59Q66R46Q66k47k70q77j239j56P2O98
1916e61J341N64K44o11j060q02n25M92K75J361M85K1m39q67j000q2P8P60J034
1935G08N84j63k24j126n36m30P3P57J000N53J75o40j056p80j85K74N33J440L32
1954A289L7p71q91r23k32K21J025R21O35j69n36p32o01q14N78J027L78Q91j1n25
1974G97r98q16l49K88J095O77M24J75p87o73j049m6M97Q73O41N55j55o44j030
1993e25r10R8N63O76R76O81o15l00j015p30L4K9Q74R67O85l06o02q74o13l40M59
2014g88P82J017N77m15p37p89q82j8M36J063Q63K96j61r72o28r43l4N21J007O09
2034H04N27l28o15j096p54L68K89J079R10k0l06q47p12o19j29Q20R16Q06K42k92
$$ y = [-1215, -442, 510, 1248, 1419, 693, -54, -1216, -1379, -1220, -354, 592, 1458, 1211, 941, 64, -1175, -1331, -1259, -561, 780, 1344, 1588, 977, -83, -885, -1410, -918, -643, 718, 1203, 1224, 785, -82, -1082, -1164, -1086, -326, 708, 1292, 1129, 905, -221, -757, -1187, -1114, -357, 643, 1196, 1371, 731, -325, -1105, -1290, -1016, -483, 957, 1289, 1326, 555, -336, -1259, -1491, -1270, -245, 676, 1311, 1142, 606, -126, -727, -1541, -963, 64, 442, 1333, 1322, 797, -201, -1017, -1366, -1078, 17, 694, 1118, 1293, 506, -167, -1216, -1262, -765, 108, 749, 1304, 1149, 505, -525, -1435, -1337, -774, -98, 878, 1559, 944, 644, -371, -1101, -1067, -1038, -164, 803, 1488, 1182, 580, -294, -907, -1247, -788, -6, 1011, 1588, 1173, 436, -353, -1235, -1253, -817, 246, 1109, 1405, 1244, 272, -356, -1299, -1333, -812, 195, 804, 1331, 1003, 388, -708, -1462, -1094, -805, 274, 1184, 1164, 858, 11, -701, -1320, -1449, -629, 287, 1093, 1335, 1043]
2054A043o89r57m54j50N00R62M98L97K5r65r92m59J29P98N93R08J10m04p54o05
2074d66p49r9P40P00O20M79l21p01q08o74J48M84Q35Q10M15n53r38m88q78K75
2094a169Q65N14J025j82k84o95p25m66n3O71Q17R31q9l59q11q25n60L06O24R13
2114D48Q29K40q43o17q12n88M1P46R34P43rm94m38j123l55M46M36Q86N23K97o11
2135F79o35q49m63L03O91N68P51J41m57o86j011k53K2P66R64P97J4n51q54p24
2155g87m33L38N56R21N84l64j91r38o45j82L8J138P63L91K89j102m21p23o03M26
2175i45O53Q78N79J34q76o26o75m63O30N58N91P46M0m69r66o87k97K93R74O23
2195F95Q16l96o28q73l94k73J28O26R13Q51k99o79p96m62m05K36R18R63K71j63
$$ y = [1043, 354, -603, -1057, -1207, -707, 255, 753, 1150, 1175, 210, -782, -1241, -1112, -314, 279, 1187, 1297, 893, 139, -466, -1215, -1314, -574, 126, 746, 1225, 904, 203, -605, -1279, -1131, -647, 188, 998, 1413, 860, -78, -566, -1444, -1169, -304, 210, 1235, 1053, 769, 74, -651, -1117, -1170, -499, 318, 1249, 1160, 801, -10, -835, -1395, -1089, -465, 448, 1277, 1517, 674, 57, -755, -1343, -1302, -556, 378, 1121, 1112, 618, 180, -943, -1298, -852, -416, 470, 993, 1290, 679, 44, -805, -1268, -965, -274, 294, 1045, 1186, 729, 43, -968, -1221, -1199, -433, 531, 1328, 1342, 791, -63, -787, -1220, -882, -326, 595, 1179, 815, 624, -314, -959, -1141, -1103, 35, 798, 1189, 1478, 376, -45, -768, -1371, -945, -292, 586, 1165, 1299, 423, -203, -878, -1341, -711, -153, 438, 1184, 1224, 755, -211, -898, -1195, -902, 72, 695, 1511, 1115, 487, -386, -780, -1053, -925, -299, 614, 1465, 1166, 487, -309, -771, -1176, -940, -22, 941, 1212, 1049]
2215A049n86r40o48k55N45P58P35P74m24m18j072o90l28M46R03Q07K58P1n66q60
2235d41p35K16R2Q58P66O86m35m88p96q27R5K76P27Q91M91m50o30q77l60m71N63
2256h49R89P19M64k93n14j068l53l33Q47M18P08N57k49p39r05l59j29M95O43P04
2276G53M42m21n37q21o46K19K23R32N74N14j85r30o97n43Q5L02J010N70J2J71
2296A027p48q48l57n00R14M82J001J58L7p96n41p95kK49O49R51L88l58q30p86
2316g05l24j40P26N83O73M25k46r32n94n49O2N06N68R44K12j30r24p32m86m5L97
2337g11P16J007J77m49m74p46o51N7L11R36Q21R9l81m28p56o25J85L74R26L34
2357G22K58j66n96o54m30O4L36Q78N62J65m49n71r72q6k82N99J012O51P1j01j057
$$ y = [1049, 463, -477, -1125, -1380, -835, -77, 658, 1432, 1008, 590, -482, -1172, -1500, -1054, -151, 656, 914, 985, 419, -441, -1176, -960, -868, -10, 756, 1442, 1007, 519, -277, -1104, -1009, -733, -6, 885, 1376, 926, 296, -581, -941, -1412, -849, 140, 859, 1323, 1030, 516, -552, -905, -1238, -391, 27, 735, 1292, 1043, 304, -601, -960, -1089, -594, 49, 753, 1195, 774, 237, -584, -1230, -1011, -788, 144, 718, 1232, 1047, 117, -580, -1123, -1038, -736, 274, 844, 856, 1027, 279, -569, -926, -1426, -512, -30, 971, 1129, 1166, 370, -171, -966, -968, -719, -70, 881, 1269, 911, 81, -705, -1029, -1169, -443, 140, 813, 1238, 992, 60, -534, -1083, -1021, -515, 53, 997, 1209, 1079, 155, -577, -1063, -1108, -711, 5, 1012, 1189, 740, 266, -480, -1131, -1074, -763, 173, 994, 1093, 712, 284, -472, -1097, -912, -538, 388, 722, 980, 814, 218, -436, -866, -802, -466, 412, 974, 1139, 690, 119, -853, -939, -1221, -622, 390, 1041, 1112, 1011, -46]
2378d6n99m93K11M06Q18O91j70J16j223l19m67j07M67R52O11L06k16q72j082k6
2398a042K52K73P69Q78p0k89p69r61K8j08P17R33K18j48J70r61l97q41N15O66
2418a67N68Q88l10k32q51p71n2m8O34R26K71p6L52j241o59n00L95N21Q92M83J41
2439A164n59o75o58l13lR25N05N77K56o78q29n87l55M6R78P01Q82n75n3r97q06
2460a054p1J90O02Q64L06K24m33p07m69l32j4N84Q25M31R4n08q99n73k02O16M74
2481e2Q56K17P9n58r79l51k62rP42Q52M94L7l99j057o15j98L74J107J83O28p9
2502A010l89r74p80O0K99O62P17K92q1m32j002k54l68L58Q86R20J29k18l98p04
2522b67n93k83L90O88R24K60m14p6p84p88k04L08M94Q79M74K8o74p91o26ON06
$$ y = [-46, -645, -1138, -927, -521, 297, 988, 818, 934, -289, -608, -1075, -1182, -715, 237, 848, 1154, 938, 66, -1016, -1042, -790, -517, 252, 1130, 1060, 771, 2, -959, -931, -1039, -322, 611, 829, 681, 851, -110, -507, -1348, -833, -167, 401, 1289, 979, 747, -104, -875, -927, -975, -341, 585, 856, 780, 1132, -109, -768, -1268, -873, -352, 540, 1023, 1164, 605, -70, -728, -1041, -1044, -119, 386, 963, 1219, 541, -288, -875, -1230, -1184, -206, 495, 1377, 802, 749, -248, -1054, -1125, -935, -333, 531, 837, 1061, 628, -79, -548, -880, -894, -310, 515, 946, 1040, 532, -367, -940, -1142, -526, -52, 804, 1021, 1100, 542, -437, -788, -1050, -1059, -317, 535, 1029, 1066, 667, -390, -1005, -1203, -829, 278, 461, 1089, 1010, 621, -353, -1133, -1073, -774, -112, 605, 897, 816, 384, -618, -872, -1240, -882, 4, 924, 1053, 835, 437, -267, -860, -1143, -753, -65, 859, 1119, 705, 629, -155, -943, -1147, -839, -345, 534, 1008, 1036, 362, -429, -1055, -1049, -543]
2543e43O09O29K83J44p42o61q88J31K38O54R10K36o1n41o35o49Q7L6Q63N88J67
2564H55j01l94o90p33k0L13O54O46P82m07n32r62l58k35L80P58P39J43K08p26
2584C20o09n90j50M95M37Q76K99r3n01q82p77K35R8Q69P18K34k94l75n71n61N
2605h17J44Q91M29L86k37m42q06m23J0J23O10Q37J44P7q57m42m66j01L17P13O43
2626G33K15M5o74q19n4k90L14M54P26M96k49p06n58q11J84M73N02O44N74n18l30
2647C51q43o03K27K99P86M72M69m90o60n29n19J57L27M35Q30K75j60m87p16n03
2667h82j39N84O57M10L96q9p47q15k79k43O37P38M25L63m25m03o76l73O2L21O71
2688A93N98J8m1o27o94l27j11L77Q46K62M57k48q15l60n59J73M41M98N24N68l36
$$ y = [-543, 66, 695, 978, 1122, 380, -281, -1169, -1038, -800, -146, 764, 1000, 939, 398, -237, -886, -799, -763, 100, 688, 855, 754, 360, -330, -1063, -1083, -770, -116, 530, 1312, 905, 373, -589, -947, -1182, -802, -44, 695, 838, 1046, 320, -289, -879, -1029, -534, -97, 779, 1078, 985, 484, -398, -1175, -940, -842, 27, 745, 979, 685, 310, -261, -822, -817, -673, 218, 647, 1033, 796, 354, -452, -875, -865, -742, -132, 705, 849, 926, 69, -373, -839, -940, -623, 90, 733, 948, 993, 319, -500, -554, -844, -530, -76, 650, 1146, 897, 191, -367, -1178, -994, -521, -19, 625, 1199, 681, 351, -492, -1095, -868, -569, 217, 689, 1158, 668, 8, -521, -1040, -883, -556, -121, 709, 984, 824, 337, -379, -882, -1021, -437, 220, 630, 1026, 937, 190, -625, -904, -1147, -510, 228, 653, 1016, 591, 188, -488, -861, -799, -478, 193, 791, 809, 768, 141, -553, -880, -991, -614, 232, 494, 951, 703, -112, -472, -1031, -858, -417, 81, 605, 1173, 837]
2709H37q45k55n15j81N09P60N77P4j94n60o31l75j39M77N12N30M52l11p25q51
2729h54k3j19O51N88M09M16l13p80m91l96K34J59M18R44k5j86k97q27m75l7N14
2750d90N75M74L99k24n47r83q5J63L43R26K31pj57o86o58j69l8O81N26N07M1O5
2772H87q29p46J25p6K62Q00L82O9j49p45n75l53L9O18N54L98L41j82p96o40l38
2793i54L62J30Q33M57R1l03n28p84p0J36K48P43K75J85m01m25p37j46J2N01O94
2814C19N93Q3l47p49n91j05q6P66M06M39O2j28o12n23n73L03N16N40O4N82n48
2835D11n57m07k23m9N87N86M8N21m64l27o55l10K35K84Q93J77K08m85l84n26n83
2856a020K36K87O05M01L48o34o2q91j25K61M48O51J6J34k53m95n04k00J21N74
$$ y = [837, -8, -263, -778, -959, -450, 310, 887, 961, 767, 207, -424, -799, -938, -461, 51, 581, 1033, 722, -3, -854, -877, -996, -345, 243, 652, 1068, 755, -25, -516, -912, -678, -519, -101, 843, 818, 632, 335, -492, -967, -1004, -490, 85, 559, 958, 734, 187, -796, -881, -718, -375, 551, 782, 775, 618, -68, -726, -895, -933, -252, 274, 781, 822, 887, 58, -688, -563, -639, -377, 423, 805, 874, 725, -20, -595, -948, -909, -291, 263, 661, 1002, 820, 24, -616, -954, -592, -462, 371, 828, 919, 616, 88, -696, -766, -630, -382, 361, 636, 821, 420, -5, -742, -888, -876, -375, 319, 912, 995, 648, -101, -692, -797, -883, -117, 289, 728, 790, 662, 50, -473, -1046, -743, -227, 313, 377, 959, 411, -146, -553, -776, -825, -238, 348, 396, 917, 453, 126, -529, -839, -604, -320, 573, 750, 958, 473, 89, -437, -1020, -784, -497, 108, 509, 857, 223, 161, -730, -855, -594, -146, 505, 521, 655, 402, -93, -597, -797, -676, -102]
2876a02M18N86J3l30n47o73J69j49L93M44N76M8l18o47o00k66K99J40P10O76L8
2897H78o28l32m35k59L4O97K90M09K50n66k11m68m78J26N74K80N23l7m25l38k62
2918c78l99Q8N19M33L52p9k54m85k55m29M95K52L11M09k0j14o87l15l03K38L89
2939b32O38K98j9l44m13m27k29j25Q82M34PP4j88m77l27k62m0P26R2P13N7m01
2961D37m25m36k70lL30M97P28j23k87o01l56k26J91K21N92M40l53K32o40m48r5
2982e95KN22K74K80K53r5n67n59l79K07N04L15M82m1j58p82o9m66K13O08L26M61
3004G36q7k11l81o53J1L4J41Q01K6Q8l44k45l22m42K33L39Q91qL4m42m94j14l0
3027d39N6K70N42L19k88k08o39J27l89O7P06K54J99L1l48l16m74k94K33N61K98
$$ y = [-102, 316, 902, 915, 585, 38, -635, -466, -615, -222, 222, 798, 846, 528, -119, -719, -985, -686, -546, 164, 840, 878, 250, -82, -517, -776, -742, -45, 245, 654, 904, 338, 127, -341, -819, -693, -119, 161, 684, 647, 222, -116, -378, -777, -689, -170, 263, 615, 536, 282, -203, -458, -887, -392, -140, 171, 580, 560, 446, -241, -556, -859, -621, -232, 406, 704, 685, 341, -72, -499, -728, -853, 29, 463, 470, 544, 356, -121, -448, -710, -750, -24, 68, 781, 838, 437, 12, -424, -694, -697, -367, 130, 858, 735, 448, -153, -509, -735, -544, -323, 269, 709, 356, 588, -52, -500, -595, -593, -71, 203, 483, 736, 641, 74, -485, -864, -657, -153, 162, 644, 603, 445, -337, -406, -872, -659, -51, 275, 736, 649, 438, 57, -596, -585, -551, -410, 391, 417, 505, 161, -84, -406, -848, -615, -276, 615, 607, 641, 199, -295, -409, -439, -383, -113, 429, 748, 460, 252, -387, -260, -649, -582, 124, 378, 577, 608, 260, -56, -530, -824, -591, -30, 268]
3048B68M34l74j16j87m41l33M87L20R7M71l9l42k17k44o70N29J49M39M56r0j78
3069D19n09k44l53M23N0M44P00k43n20m73o4k34J76P96q8j6K65o21j02n1n02K88
3091d59L38L08K79l9q0m70l78Pj5O68J97J7r8j14k61n46j15J43L50L84M36q4j88
3114B80l07j34m31O3M19L64K50j8j78j55m38m06M71J42J76K49K01k62k58l81k56
3135f09K8M14M05L30j28j90m97k07j81K62L71J30L39J18k46l19n68O6M6M15M14
3156C93J1J58l35p2n48j98J94L81L34M11m49k1n33k74j34M09J91K50J08J6j38
3177A54k94l43J34q5M31K75J80R7m34k41j71j20K01K82jK79op7l86l84P1m6M29
3200e5L52k1L93l39m91l36J88m3J11M00L02j47k18j60l27k84J90O79j08M98q8
$$ y = [268, 702, 328, 212, 25, -416, -749, -262, 58, 155, 626, 587, 245, 28, -216, -886, -357, -208, 231, 687, 597, 419, -90, -334, -687, -264, -214, 230, 930, 687, 167, -306, -370, -604, -428, 368, 280, 264, 529, -92, -194, -245, -747, -459, -121, 187, 466, 427, 347, -123, -501, -494, -509, 159, 356, 373, 275, 161, -100, -646, -761, -618, -268, 116, 552, 468, 280, -27, -161, -592, -529, -110, 254, 504, 486, 308, 153, -285, -691, -220, -78, 98, 347, 548, 286, 28, -353, -609, -581, -167, 238, 568, 440, 250, -247, -454, -635, -373, -2, 128, 467, 585, 339, 20, -548, -482, -436, -21, 393, 404, 562, 227, 155, -393, -591, -397, -16, 318, 729, 280, 259, -274, -548, -682, -273, -82, 168, 276, 292, 154, -140, -483, -349, -434, -3, 272, 452, 549, 115, -126, -297, -417, -216, 66, 65, 344, 338, 261, -125, -509, -438, -484, -55, 297, 276, 669, 330, -161, -497, -309, -352, -241, 159, 461, 314, 96, -64, -391, -675, -485, 194, 86, 584, 496]
3221D96k71m40l43lK41J24N59j74o4K12n64o3j44J31K95K49K00j32j78k47k99
3242d15L7M7K32J59K05J67k17p2l82q9j3K25L61L22l79J11l37k47k3O0M34l0M45
3265F01j72n02J42m53j8m5K38J73M06k94m8k33k78r0K77L80J70K37k39L7k11m30
3287c52q6K54P2pL92M58m67q5r5o08K85Q3N13M1l9l17k7m06L9L3L64M08j12mk12
3312A25k79J4k9J4K2L43J41K3J39o68j67q0K44k1K13K34n2r1k46j58j2j90M06
3335g5M35l4j09l9l7l61p9J4L11K83J8l0k11j58k59O4J39K33m3K63P8m20K7k19
3359b09o1K01m9K52J22J88n51j4l97J12M90l24M64K55j62j10k27l23m3J25o7K29
3381i9M81J37k87k87j78j07L3J30M41Q2K69m77k92k41J3J05J23L25K6N4k01j57
$$ y = [496, 225, -215, -558, -561, -320, -196, 363, 189, 125, 337, -227, -290, -434, -303, -8, 241, 441, 309, 131, -116, -415, -378, -331, -99, 60, 265, 432, 215, 143, -239, -328, -341, -116, 245, 567, 188, 299, -38, -285, -308, -248, 186, 156, 601, 429, -73, 69, -384, -402, -447, -209, -36, 370, 76, 28, -205, -483, -573, -296, 84, 254, 491, 252, 289, 78, -352, -438, -184, -112, -119, 273, 731, 264, 179, 84, -524, -239, -156, 357, 398, 359, 42, 15, -391, -352, -319, 45, 453, 341, 337, 125, -154, -140, -169, -155, -133, 210, 351, 374, 513, -155, -322, -402, -158, -179, 34, 268, 216, 125, -121, -279, -291, -481, -75, 360, 326, 217, 178, 141, -220, -299, -285, 26, 309, 327, 297, 86, -72, -331, -267, -128, 105, 62, 325, 403, -17, 10, -209, -270, -69, -118, 134, 256, 444, -107, -121, -518, -406, 84, -240, 224, 479, 317, 207, -20, -343, -386, -261, -328, -99, 382, 519, 232, -55, -233, -340, -307, -177, 264, 346, 615, 138, -154, -395, -382, -277, -154, 171, 197, 251, 50, -107]
3403a07j27l38J71L05J20K54M6k87M5q3k10J63k66L32L54k64L5R3k42o4k54K02
3425a22J90L69k4j85m15j15J8K9J30J60J03L45m35Lj27l36j03L60M38N0j1m19
3447i7J3j54j17L42k29K54K05J61j61k18j19l60L20K18N7R7k1j77Qo06L21j9K12
3470g0K19J68j84j9k74K2k78L87K6J77k7R9p5k09m9r8Q5R1J04K90l51O6k08J62
3494E4m07PJ90N22N0l73R0j79J66l02p7J56J75J06O9l1k22m95K79l3N49j68P1
3517A97J30m3j84l36L8J18R8J08O9J16l00Qj51l22L16J26p5K04K10q8j78j60j31
3540b30m5J05K96J71L08l88j6l57P5r7J52K76k64K09p9k18l6J26l69N50J27j76
3562A20O9J50m05k04R1j68J98K11K33M2m3l13j17N1L6n4K23J16R2j09j10m50L9
$$ y = [-107, -234, -572, -401, -96, 24, 278, 324, 37, 82, -1, -211, -48, -314, 18, 372, 108, 143, 236, -6, -70, -324, -122, 68, 437, 413, 228, -187, -302, -284, -255, -125, 35, 138, 483, 48, 51, -76, -412, -515, -155, 283, 333, 322, -97, -84, -238, -355, -13, -242, 12, 217, 378, 217, -1, -120, -480, -160, 58, 115, 212, 191, 14, 22, -584, -263, -282, -70, 149, 317, 133, 114, -160, -138, -416, -29, -3, 174, 147, 246, 171, -38, -87, -185, -100, -9, 95, 385, 34, 100, -108, 54, -353, -346, -156, 366, 416, 43, 133, -46, 120, -182, -259, -103, 72, 178, 247, 216, -6, -501, -222, -255, 294, 126, 197, 327, 284, 100, -236, -198, -80, 18, 126, 195, 311, 11, 19, -132, -454, -138, -12, -87, 117, 327, 239, 61, -99, -230, -275, -170, 126, 297, 605, 217, 201, -156, -81, -178, -26, 250, -14, 195, 116, -102, -138, -12, -381, 169, 296, 120, 189, 339, -66, -270, -179, -347, -149, 62, 295, 337, 294, -19, -136, -85, -49, -103, 120, 236, 328, 219, 109, -341, -302]
3585c02K45J10k16K93k49J13k11P2j42J15o2J83K59jj44L8j35k61L82k16L93l13
3607d9L20j54q0n9m19J33K16K02J0M01k97k53k29J44P5L9K17k45J28P1j20q1k37
3630b67K31j78J49J27P9n0J02k21j81j16L17J68o3K91j60n9k81r4n9L76J68J40
3652D19k79k9j59l3j03j30J0L29L36k12M6j44k41Rj22L70J82j12J97j18k91M7
3674b8k4m73K85K42J3R3j84J19j03k11J25M1J03P5K63l47J47l82P4p1j49L68L66
3697C42j95K01j72j99M0r4k1K2J81K09j00j41k84K32k50L82k46L50o3j17m3k25
3719a91j17r2L12l3L71j86P9j46p8l14J05J51Q4L53k9k73L39l38j67j14K08p3
3741a49K99K22m11J93k28k60O5J37o6M71J2k15k6o0l17L05j52L52k16J60K87k31
$$ y = [-302, -57, 53, -163, 130, -119, -6, -217, -145, -287, -172, -234, -51, 208, 207, 63, 101, -34, -295, 87, -129, 264, -49, 271, 117, 37, -22, -441, -308, -92, 110, 120, 521, 224, -29, -258, -114, -39, 0, 217, -28, 100, 171, 51, -30, -267, -36, -214, -65, 62, 141, 91, 193, -28, -209, -325, -8, 160, 97, 388, 228, 169, -112, -206, -265, 111, 279, 419, 140, 111, -48, -81, -184, -314, -304, 25, 361, 149, 195, 51, -190, -181, -303, 67, 249, 137, 334, 216, -75, -28, -52, -525, -240, 2, 15, 108, -76, 43, -60, -271, -146, -105, -2, 73, 336, -11, 136, -246, -172, -243, -392, -24, 342, 147, 348, 176, -23, 17, -77, -98, -76, 105, 314, 214, 73, -211, 21, -229, 153, -93, 257, 194, 77, 34, -191, -308, -400, -88, -121, 250, 64, 143, -3, -81, -395, -290, -139, -55, 298, 269, -4, 335, -3, -170, -284, -76, -149, 150, 372, -39, 154, -74, -334, -269, -132, -198, 273, 285, 70, 44, -16, -333, -28, -180, 172, -44, 116, 403, 172]
3763A72n69J06L5Q5J67m8J57k7o3L1l08n5P8J82O1m2J31n3m9j23j78M9K02K20
3787A61j02L75k76j50k98J21O1N0L78k03rK8j05k31r5M8K61J53j53K91j69j66
3809c0l34J97o4j0M03J08K7j04k60k09n4K69n6J8M3N21o03q0j23L75n8M5K11o6
3833A66K6k10j67o8J11j11K93q3L63j50M1l00l9P6k12K51o5L40j70p8l1n4q9r8
3857b58K92j52J47L31k74j27j02n8K26j88M79J71k94j22r8r9q4N0p0J64P9qK54
3880B59l99j04m9p9K93J03J54K46m04O2l40r6K1K08J13K62N5j21k54k17j67K16
3902b38L21P2kK49m00k60K52n01J02N90J5P7L1j87Q0k80r9N1M4L60J9M9j06k80
3926d1j60l8n7J94k8M34j41j68n0r0k92J36L44J87j27J16j54j64R6n67K86L94
$$ y = [172, -397, -291, -256, -171, -4, -52, 105, 78, 15, 46, -262, -317, -239, -57, 4, -38, 93, 40, -9, -132, -310, -261, -59, 161, 59, 434, 158, 8, -290, -169, -108, -58, 320, 117, 108, 136, 31, -200, -295, -247, 14, 167, 14, 305, 136, -30, -364, -167, -231, -241, 162, 270, 297, 193, -67, -276, -330, -61, -117, -99, -56, 465, -138, -218, -341, 34, -24, 21, 232, 166, 192, -18, -185, -253, -142, -253, 40, -43, 320, 170, 211, -89, -128, -52, -264, -13, -78, 262, 92, 14, -17, -71, -160, -258, 34, -118, 29, 360, 86, -41, -143, -201, 25, -163, 316, 487, 193, 71, -27, -126, -210, -160, -230, -66, 13, 5, 259, -140, -244, -293, -372, -79, 24, 178, 424, 20, 82, -258, -354, -333, -125, -12, 250, 305, 184, -70, -287, -454, -238, 83, 155, 153, 402, 2, -258, -6, -507, -405, 185, 200, 277, 308, 121, 201, -79, -178, -127, -83, 277, 296, 345, 239, -41, -201, -239, -296, -102, -130, 304, 163, -5, -55, -145, -437, -301, 43, 230, 103, 219, 65, -99, -3, -570, -284, 110]
3948A10PK70k07M1k95j36K7j1M3L13P5m6N8l84j1j33J6l6L05L53k44P9j82l51
3972c39N5O7J27K11J09M8j24j91n4j77k7L59N5K07k17K8j04k65j10J64Q8N0K07
3995A67J32j40j72j50L9j73K45J62L86J8l97k80r9j0M1J43o2M28J42k82K17o34
4017b79Nj39J17O52q6n5k4l73n4j50J24q0K96L43p3j50j55J52k44P3k6J21L99
4040C94j91P8l31n3l7j20O0L03K73J83j99o67J51k06L9J66J93J8M17n07n0Oj43
4063b23j8J9K29K88m9k85j25N6j61k44L33K41K8M1L38m96k96J41k26j45N21KJ90
4086A59J1k25q0k38j4M4N93j14L46l70j57j33k15K9J78K14K40m0L5O9m93k80J0
4109d31L00K67Q7k32K06k44j53l87K65J98l4L30j61r0J09m08k05K99J48K43J29
$$ y = [110, 117, 387, 180, 221, -74, -210, -183, -194, -151, 162, 237, 191, 249, -135, -146, -279, -263, -299, 6, 359, 115, 194, 12, -339, -284, -217, -90, 121, 230, 278, 154, -37, -91, -268, -295, 64, 119, 326, 109, 137, 33, -232, -342, -178, -90, -40, 167, 299, 159, -13, -163, -124, -297, -52, 110, 496, 514, 117, -163, -262, -272, -231, -88, -150, 278, 420, 138, 355, -279, -274, -413, -296, 356, 270, 215, 191, -182, -236, -386, -262, -342, -46, 297, 224, 74, -81, 71, -173, -100, -126, -5, 394, 203, 281, -50, -103, -140, -260, -200, 103, 376, 559, 360, -307, -156, -362, -323, -157, 36, 54, 471, -36, -86, -80, -223, -241, -222, 7, 295, 246, -39, -164, -108, -269, -513, -180, 61, 89, 130, 468, -28, -324, -183, -409, -554, -33, -31, 159, 170, -55, -135, -373, -387, -343, 250, 136, 482, 112, -45, -178, -393, -364, -186, 28, 268, 228, 263, 332, -161, -441, -431, -131, 136, 223, -9, 197, -47, -200, -587, -322, -124, -158, 172, 11, -79, 30, -378, -583, -284, -136, 107, 236]
4130B36L4J4k7o24k8L15j78J48O49j2l23p9j06l39J0K36Q9K82POj57l61m18M19
4154b07RK75K10O6J0m56l07j16L12R8L71k6J68j37k12j05q5o8J68L76l1J62k46
4177B29j63l8k56j18K97o3M52j92K33l03k82j05o8M12L6K01l0K13p21K2L7j28
4199c35L00M44JP6k44j65l89j62K22K72J47J39l6q5k5l44p4J33n5l8M17K8J14
4222C41k40k65j30q1M9O41N2L1j04k31l35pJ2J32L58K88j43k52O9m29k52J79M38
4245A21q0O0J36M1k16n11J39N6L18L06k13L20k91j50j10j7Pk52N12J17Pk33k74
4268b07M9l36L15K03M1K64J44J88o44n90L16K9r1L85L37l40O7k9l15j8o0J85J13
4291FK99k44K21m38J53l90K13n7%N87j4k34j87k22k05Q6J51L24K48J45q6l17j82
$$ y = [236, 270, 284, 257, -367, -395, -80, -258, -110, 539, 527, 204, 125, 19, -320, -310, -74, 15, 297, 304, 310, 153, -208, -626, -207, -198, 77, 287, 353, 363, -93, -400, -516, -204, -106, 265, 239, 407, 270, 58, -47, -132, -200, -32, 344, 313, 475, 229, 66, 28, -228, -346, -49, -112, 340, 148, 381, 78, -204, -309, -377, 35, 71, 272, 242, 455, -266, -244, -207, -335, -35, 409, 410, 486, 242, 77, -312, -474, -252, 20, 167, 306, 270, 185, 160, -184, -258, -125, -180, -218, 199, 227, 341, 101, -164, -294, -375, -326, 315, 367, 398, 294, 63, -272, -279, -267, -135, 223, 511, 368, 116, 185, -244, -496, -317, 121, 41, 101, 237, 278, 62, -449, -310, -254, 64, 370, 157, 477, 186, 36, -74, -91, -84, -336, 176, 293, 300, 67, -207, -158, -494, -179, 24, 65, 329, 473, 661, 17, -573, -257, -228, -319, 66, 403, 63, 130, 101, -214, -232, -292, -107, 6, 305, 61, 282, -156, -3, -393, -180, -237, -237, 350, 336, 102, -85, -307, -512, -426, -275, 49, 297, 442, 356, 39, -143]
4314a43k01j31L50L85J73q9j71l3m40R1j82L68O7K93m0j71j1m30l9M0J73J4M09
4337B82Mj18L6m06j32o5L01L5J83K70m04J78l96k35L11K5L00L01k6l95j1l48p
4360c17q8L40J66K12J83j42m54J23j48r4J03J20K87J26M1l51m06l28L81J48J83
4381H5K60k04J41j43l15k84J41J42J81K06o9K21j20n53N3j91N01l3L9J96k42L8
4403E0l27q4l4L87j1N6PP4J3k84J1m28N23L9J47L10m48K11m76k86L84m9O27j87
4427B25J5j51k59N6m17K54J95k3J17K73k21J22l69q5j84K62M00m2J43j20N0n45
4449c04K03j50n3L61J68L80k94j80l10j46n2M27J17M02r6k40j54q7l16p5K64K69
4471A34L01Oq3l86j80J0J12j61J98K72L63n08k24Kn8M8o7K88%M90k81m46r7K05
$$ y = [-143, -344, -475, -125, 260, 433, 344, 173, 140, -300, -209, -391, -23, 44, 337, 297, 126, 115, -315, -354, -314, -141, -127, 282, 286, 168, 204, -202, -334, -399, -98, -63, 120, 390, -14, 164, -232, -467, -156, -131, 169, 470, 444, 49, 38, -310, -317, -405, -65, 101, 313, 496, 354, -100, 23, -125, -219, -116, 4, 291, 417, 458, 107, -299, -627, -246, -98, 85, 345, 141, 282, 139, -176, -460, -319, -177, 4, 210, 141, 362, 242, -311, -258, -449, 52, 19, 58, 254, 12, 50, -277, -361, -395, -8, -19, 37, 44, 118, 131, -153, -142, -570, -47, -8, 139, 449, 1, 212, -264, -550, -166, -215, 412, 225, 240, 89, -170, -114, -531, -277, -82, -105, 12, 285, 64, 186, -183, -268, -452, -190, 210, 168, 311, 191, 241, -304, -101, -251, -304, 57, 225, 605, 311, 131, -179, -325, -377, 50, 167, 569, 473, 233, 79, -8, -324, -399, -135, 134, 435, 441, 358, -28, -208, -198, -86, -247, -49, 223, 586, 78, -146, -144, -202, -154, -221, 67, 67, 557, 276, -170, -267, -62]
4495f2q6L21Nj22L29l00m0k82j26o6M33J89r4L17k31k40r7j26j3J79p3L87K41
4518D43l04l06n3j91J71j69N66J74l5k4m28k17j36K71j00N50j14J85k13r2p3J60
4540F5l14r5N50J92j53J07n32ol69K79oM50L5J10j84q8j23p4L0p5O16j14j60J66
4564C07j54k78l04J85M68j02J57R5l7k57m08m2J53J44J78M67l30j26j19k04j81
4585c88K19r8K74L32j27k1k14j79j23k18O62p1J18J33k33j13j77J31r9K70L46
4606D24k07k92M72l03k98n9J38K45k59L91k05J98k02l78J34J0J42LK86p1r5lj70
4629i9j91J18J93j79L69J6m7l8r0n06J56J00R0L26Kp4l3m13J30L4J4R6K89K02
4653D65k65l06n7l7j40J03K96J96L8j03l89K21m17P3N0L19KJ63j78k5j88m13N09
$$ y = [-62, -148, 173, 178, 56, 385, 85, 45, -237, -363, -429, 4, 193, 99, 416, 185, -55, -152, -278, -291, -112, -185, 202, 443, 139, -167, -220, -411, -240, -409, 157, 331, 296, 272, -156, -373, -509, -238, -338, 212, 98, 283, 70, -22, -95, 65, -249, -344, 206, 398, 245, 352, -180, -186, -555, -276, -282, 168, 203, 313, 129, 41, -82, -156, -126, -201, 415, 301, 141, 307, 153, -125, -429, -244, 224, 122, 279, 374, 337, 80, -328, -370, -217, -73, 105, 572, 242, 116, -3, -207, -388, -169, -267, 7, 339, 212, 191, -23, -202, -325, -543, 119, 48, 166, 299, 66, -47, -224, -93, -192, 78, 424, 217, -75, 397, 94, -204, -263, -125, 120, -139, 252, 47, 245, 43, -335, -201, -191, -49, -46, 240, 169, 74, 71, -99, -290, -172, 21, -158, 211, 227, 180, 142, 52, -454, -298, -198, -108, 218, 220, 146, 113, -300, -170, -136, -122, -26, 263, 465, 200, -106, -163, -200, -340, -237, 59, 255, 293, 190, -199, 22, -395, -322, -272, 47, 49, 212, 34, 9, -179, -592, -83]
4676h3O6J30K98k97J75l56K5k57R9J1L68p4K22k20n5m00J48l1m6L20K28p4j17
4699H0o3l17j1M7N7L62K98k21Om82j1J22M0p6K28J32o3j55o7k11m2J01k4M95J0
4724B35m1K09l40l00O4j63J84N55k01P1j54k98J4o9JL0K97K59j58o9j09j87mk51
4748d25K68N0K33J89k13j28l62M07k68j55N27K32k02J03k78m8k49K20J6OL32m3
4770B12M3k74p5k47J59J28K58J30%j66j69k98L52l35R3L52K75j34j96j26Q1k71
4792b08j23L26M2K67p7K02m55l41J48m22N12L83j12J86l5k34l15k30K66j32M03
4813E1N9K25l02j45j42j89Q8K01J40L42q3j25k35j68J40l29N87J65K2j3p3k00
4835A6k46J61k40L47L6K47N5l80r9q5r2K67p2K07K14j09J53m39J4j85j9K21r4
$$ y = [-83, -17, 113, 411, 114, 289, -67, -42, -299, -200, -189, 179, 105, 327, 107, 52, -348, -200, -231, -277, 43, 271, 197, 80, 17, -300, -311, -264, -207, 155, 453, 232, 238, -244, -255, -133, -93, -169, 59, 191, 128, -27, -94, -305, -347, -246, -270, 225, 235, 194, 403, 63, -237, -173, -336, -152, 403, 202, 273, 119, -179, -165, -234, -233, -203, 94, 353, 195, 126, 17, -170, -174, -425, -157, -107, 126, 315, 102, -26, -388, 19, -249, -404, 123, 355, 153, 256, -22, -70, -319, -99, -83, -77, 255, 212, 255, -19, -94, -341, -182, -54, 204, 334, 334, 168, -1, -299, 53, -282, -189, 163, 438, 304, 108, -18, 63, -208, -331, -5, 37, 304, 227, 429, -26, -367, -219, -641, -129, 254, 142, 328, 293, 59, -256, -486, -220, -352, 51, 110, 335, 33, -112, -254, -443, -355, -154, -14, 328, 245, 120, -115, -283, -143, -472, 115, 280, 302, 289, 216, 16, -230, -69, -309, 38, 74, 321, 376, -4, -103, -188, -280, -13, -85, 122, 336, 227, 380, -59, -45, -230, -249, -28, -122]
4858a22K31J35L3l15k15j57L1M14J34K08j28l35K6Kl05J73k05M36L62j88J7l30
4880i8j01Q4j08J13J51K13J49K4m79n8L5o2K13k30L76M0j72K0o6j66RO2j23J86
4904A2K82l54j4j41J51m7J74j54M19o9Q2l56j05J54l13K52J57K50j73j28J6l50
4926b55J67p8J12J96J99j24j66l21J35j06J19J36j07M82M7k79k23j46j74N4M12
4947H0J10j94J35K13l38j93j14J40J20J43P0J27l61R3n30K08J06K56K06Q2l72
4968a3K91l32k13J71lJ19L31p2M6l56j17J20l36K87l7K93j5K02k97l4k62J24J92
4991H9j53K37J29lk72kk53p1J09K37j8M25k02K0k62l20l1RN45j86M5Q9Q3l14l
5016g3j20j2J26L42k9P2m45K5l9O0k0k1J92j7N00l44ml99J64l9J99r4J44n1j31
$$ y = [-122, 109, 244, 277, -38, -253, -410, -379, 35, 169, 377, 249, -86, -60, -58, -363, -190, -395, 41, 403, 215, 232, -98, -199, -115, -223, -110, 41, 254, 403, 427, -52, -110, -75, -137, 76, -154, 222, 262, 90, 110, 44, -122, -113, -51, -174, 12, 294, -60, -74, -215, -64, -111, 63, -91, 328, 259, 341, -15, -120, 34, -279, -27, 130, 380, 207, 79, 95, -255, -88, -166, -54, 142, 341, 217, 51, -270, -135, -241, -122, 14, -93, 389, 436, 157, -66, -212, -386, -332, 80, 190, -4, 131, 344, 6, -187, -301, -161, -41, 102, 172, 299, -62, 31, -499, -291, -185, 71, 277, 359, -13, 278, -54, -267, -96, -99, 20, 351, 279, 325, -31, -148, -28, -364, -77, -114, 179, 164, 366, 69, 35, -227, -103, 89, -64, 173, 302, 299, 27, 25, -228, -299, -190, 47, 29, 454, 252, 272, 10, -310, -341, -332, 213, 27, 72, 161, 244, -70, -73, -193, -205, -79, 263, 234, 306, -139, -114, -153, -93, -113, -134, 58, 41, 541, 197, 193, -206, -42, -81, 118, 24, 168, 117, -14]
5041a4L16l48r4m2M4L67l0K40k30k34O6k14J46J78j27K28n4l60J35k19J51j57
5063b52K74r4K89j51R9l32Q7j89q4L72L15l8j66J5m36M49m43O1L66R9m5K6k84
5086f2j63p0K24p1J47K30l75J04J63p5k07l3m8K10J63K2k52K6j42j02K40L4K08
5109A71L5N0n3n7j48j33r5L48o2J5K9q3L53n16J40p6j8J03K96j75M7j93p3R1m30
5134d34K65O2K85j98o3J74n8j27j11k5J97K72N3J5k12k08Ln7K77O6n2j1j93Nj34
5159b09m4K95j42J65J16p3l3j5j75J42j38K6J36n1N2J97m21L43m65L06oL1L64
5182D01k46J66j86r0p1M3l37Q26l01L1j70J21m63J18k65M82j54K97L8m61L25m0
5204F4q5m45K23K46R1m6j4K26l22j52J33j85N9L69K8j21O2k26K3m3J15J42k35
$$ y = [-14, 302, -46, -140, -182, -138, 229, 199, 439, 209, -25, 41, -173, -27, 151, 24, 252, 198, -162, -27, -246, -95, -252, 22, -72, 217, 66, 165, -167, -80, -269, -353, 19, 334, 296, 130, 145, -291, 158, -285, -224, 142, 241, 196, 222, -62, -225, -295, -71, -142, 5, 235, -140, -36, 127, 52, -155, -188, -236, -26, 137, 159, -93, -67, -209, -311, -71, -37, 171, 206, 256, 203, 146, -2, -135, -230, 118, 56, 71, 100, 17, 370, -146, -6, -82, -100, 3, 299, 124, 171, -22, -95, -4, -434, -169, -107, 178, -20, -83, 91, 33, -94, -205, -230, -33, 239, 292, 307, 95, -113, -110, -167, 110, 176, 124, 113, -80, -75, -209, -253, 42, -100, 65, 181, 108, 75, 60, -115, 27, -111, -85, 51, 0, 52, 249, -172, 171, -294, 12, 6, 37, 401, 155, 321, 135, 45, -26, 17, -320, 506, 205, 236, 66, 187, -276, -158, -423, 59, -95, 202, 240, -221, 104, 64, -21, -466, -243, 3, 94, 48, 34, 260, -62, -214, -81, -266, -207, 162, 190, 69, 131, -95, -72, -115, 0, 142, -93]
5227i3M1Q8J6l34R0Q2j65K99j3K51j58Q5j50k36q6K05N4K52p0j54N6k27k07K01
5251a73Q0J80j8n5J33j32j98N8O4J78R2K4k84L16j39l45O2J21K3Q4lkO7l29L9
5276a57J12L1j8o6L69l76Q5O3j54K31k43M5L8K92r7p1o8j91P5j78M89o8L1k6k44
5301i6O6J00l03L33N8k18N8O0o8J12k66L75j67j87K51j24p7J68m8n4j56J59k02
5324b26K44K38l31K29k9j36N6K4L0r5K7M8r9J98l53l2K12m5j95K19J45k19M8J24
5348H2k3j37K64j38K06k37k07J21J12P4k27J27p6K16k23J7j74J89j25J64p3K00
5370A32k32L30k19l1k3J51k67o4L11J2O9j01o7kj46j98L66o7K24k22j29R4j32
5393b11J57J45j70l4jJ19k55k32N29k63J73k62L01K02q2j40k8M2P5k33J60J30
$$ y = [-93, -52, 36, 52, -282, -192, -110, -275, 24, 11, 262, 104, 189, 39, -197, -283, -78, -24, 228, 158, 4, 60, -167, -374, -173, -93, 87, 69, 14, 147, 15, -183, -125, -61, 117, 209, 233, -51, 265, 126, -219, -157, -36, -13, 71, 68, 66, 133, -196, -157, -45, -14, -32, -98, 271, -105, -20, 43, -111, 120, -123, -78, -40, 252, 155, 84, 16, -175, -100, -278, 211, 143, 174, 148, -96, -30, 70, -233, 100, 158, -60, -2, 58, -10, 102, -164, 211, 44, -143, 108, -16, -93, 75, 27, -27, -183, -24, -226, 18, 256, -75, 154, 125, -11, 45, 69, 99, 4, 31, 79, -20, 178, -175, -207, 5, -40, -235, -16, 129, -90, -42, 82, 59, -78, 186, 48, 254, 17, -190, -69, 43, 117, -110, 17, -59, 157, -66, -49, -223, -34, -159, 5, -68, 132, -100, 230, 11, -20, -43, 108, -159, -223, 88, 100, 169, 68, 1, -1, -147, -345, 21, -46, 178, -44, -173, -79, -211, -54, 91, -79, -113, -114, 5, -250, -482, 47, -216, -43, -305, -4, 198, 116, -24, -52, -10, 65, -168, -8, 122]
5415A22k28K16k61J86j90n2J43L0l1q7K81P4m11L50m09L27k05L92j04l36L47k34
5437h0J74J3k81K68j8j32J03j82mn0R3J86k25j9M76k12m2k92P0J19q0J01J4J97
5461A97j38k00P8L7J56j67L0J19n6j76L18k42P8%j66J46n7K80k48j25J85q4N4
5484A9r7K45N3k28r5Q0J84j61j68J89M2R9k32L36l67K51k3k87K10j03j01J07J43
5507I6m00K71m8J37j27J37J03k45N2O1k38Q8K39n4%ol50K03j04K71k30o6L48O2
5531B00k20j1K32j82J12k1j90oL41O7l19k80J77R9Pk7J62K01k8k98M4k90Q1J85
5555C6j14P2Q1m5n2J00k19K43l00J49L7m9P9k38P5K77l1Jj11ro4J07j34k9nJ94
5581E1O6j00J41j01O0o1n0k63L39pj12l9K11j61NJ98k19J31j61r6L81r4Ok35m9
$$ y = [122, -106, 110, -151, 35, -155, -207, -64, -34, -65, -152, 129, 203, -208, 142, -267, 60, -145, 247, 143, -193, 154, -80, 94, 107, -174, 94, 76, -56, 47, -135, -139, -189, -96, 90, -135, -154, 322, 110, 68, -224, -154, -35, -115, -14, 0, 197, 59, -141, -63, -26, 130, -37, -7, 112, 56, -120, 198, -44, 34, 34, -132, 14, -43, 237, -11, -136, 49, -35, 19, -78, 167, 220, -8, -103, -23, 161, 0, -168, 21, 63, 162, -70, 266, -101, 150, 127, -160, 50, -53, -154, -47, 96, -304, -33, -81, 56, -71, 66, 169, -76, -24, 37, -201, -113, 126, 72, 72, 66, -284, -81, -185, 86, -144, -210, 138, 200, -20, -31, 201, 19, 131, 110, -80, -86, 255, 322, 3, -277, -100, -1, 6, -21, 141, 342, 314, 16, 60, -230, -149, 36, -78, -6, 75, 30, -22, 78, -141, 102, -198, -49, -12, -61, 18, -220, -145, 132, 101, 102, -9, -18, -82, 25, -109, -138, -143, 51, 117, 17, 158, 57, 117, 56, 6, -257, 82, 75, -37, -76, 135, -26, -21, 177, -42, 89, -72, -168, 213, 119, 125, -110, -159]
5606a59j57N34k43J74k3k71J32j08Q5km6L7m4o1K93l4k03q4J55n2j59K63r2L8
5630b7J20p6k32J48k19K13J03K0J5j35n9j05Q0N2J28m0p7K7j06O0K43o9k36J63
5654iP6j79J72J31j29n4o1J19k53K07K24o7j13k10Q0J93k80J60o2J35K1k87P5
5677a11M7p0J57M9o7M6Mk76K64j17K38l12K19k3k73N17k07M0j37J78j57m6k53
5700b90K67K48m25J60p2oK78j77J81J90r9l57L05j95K0Q8k87K27p4J06r1N1k01
5723a53JQ4K50m2j17L22k01L0m89M29lk04J25q9Q0K8k65l07K50L34p7J93j26K2
5747G5P2l01J24K5Lj11k82N27j85j9p8Q0K18m4q8j50M82r9j63k02J00m2n8J28
5771A2R4j23p9n5J08j08J35j09K22P4o3Q1m00J39k41J09JK30J91k6k42K1o4k91
$$ y = [-159, -316, 218, -25, 149, 126, -145, -13, -121, -36, -38, -84, -47, -91, -152, 141, 107, -96, -180, -25, -77, -236, 27, -65, -27, 93, 17, -215, -67, -286, -73, 30, 50, 65, -70, -129, -234, -154, -102, 26, -14, -91, -64, -170, -110, 133, 64, -172, -9, 67, -112, 60, 191, 62, 8, -53, 66, -187, 20, 244, 177, 64, -146, -66, 127, -153, 7, -55, 80, 101, -186, -111, -64, -134, 23, 72, 5, 51, 55, -221, 43, -74, 164, -148, 71, 48, -225, 292, 85, 125, -12, 166, 9, -37, -290, -23, 225, -200, -40, -112, -118, 160, -17, 164, 354, 255, -102, 203, 8, 28, 116, -171, 56, -18, 88, -3, 48, -153, -152, -68, 182, 140, 23, 345, 144, 174, -315, 114, 111, -93, 32, -57, 23, 51, -214, -521, -271, 63, -14, 179, 53, 75, 147, -154, -30, -5, -2, -113, -395, 132, -53, -72, -150, -70, 148, 104, 16, -134, 348, 249, 86, -116, -16, -58, -116, 12, 106, -17, -96, -151, -43, -151, -16, -125, 97, 171, 108, 189, -211, -72, -313, -204, -203, 27, 218, 192, -50, -29, -93, -384]
5795c84K99O8J10k08J76M8l02K57k76M11k10J94j54J09Pk57N4M1q0J47k43J70
5817b3J68k11K38k53N2o4j10K38P9J07k29M3q7k37j84N52k4j47K05K9m24K05m5
5840a22J29j31L85k15p5K41l75ok9K71k82L78j8P9n5p5j24k97K26p3J34K48j8
5863A96j76N1j19k29K04J28q4Q8P3j37J33r6j46l7J63m3J52k3K35j20j38k22O0
5886h7J91k5J70P5k5l31J06J72k28k08K40L5J25o9K8l27r8J63k10M09m7O1J37
5909B57o44J46J13K85K7r5j49L6Q8k09K2l0J78j7J53l7o9J86l21k6K5RJ16j17
5933g3Q1L0J41j75j82J49q2J42k4j44M74k10j22k32O4K83k22K84l68L11j10jp4
5956f0m3K26j66j23L89R7l10q3J69l46J12K59k23M12Q0k39l79K5M7k3K12k00L68
$$ y = [-384, -85, -17, 93, -115, 61, 109, -193, 64, -212, 199, -11, 183, 29, 138, 145, -112, -58, -17, -97, 50, -193, -23, 145, -66, 172, -81, -29, -93, -203, 35, 114, 221, -8, 35, -52, -289, -473, 79, 55, -92, 113, 142, -282, -77, -122, 7, -124, 261, 46, -29, 212, -163, -169, -198, 73, -209, 169, 151, 230, 175, 100, -24, -321, -95, -168, -34, 214, 196, 20, 71, -48, -277, -73, 55, -29, 59, 132, -5, 128, 32, -114, -151, 12, -31, 121, 98, 333, 213, 75, -147, -87, 104, 79, 249, 324, 299, -32, 74, 246, 18, -190, 50, 85, 210, 141, 169, -158, -256, -93, -303, 106, 59, 120, 257, -387, -241, -128, 157, 184, 89, -60, -24, 64, -145, -123, -153, 25, 8, 161, 124, 55, 241, -80, -106, -81, -72, 44, -73, 8, 38, 179, 4, -178, -29, -111, 31, 7, -137, 337, 127, 5, -227, -163, 120, -102, 182, -186, 125, 15, 14, -60, -103, 123, -43, -166, 223, 320, 10, -73, 96, -250, -138, 121, -102, 310, 390, 151, -228, -203, -156, -179, 33, -167, 201]
5979B01k37l6R3l23J49r2K14j09M14k25L3k17J23j30J59k67L22J16P8nm40k00
6001c79k0L86l38N31j7r7R1k76K75l47J78j34L7P6P7J90l06o4K2K98l25J63J63
6024A84k7j62m3K36m57R5K96j34K12j74K74k50L5k04m7R7M1J15l5l8k73K19j67
6047b07n6K75K75m24J68J39k00J32P7l43%L24N4n6mk17n2L7QJ01k5L84l36j47
6071i3o5L27n04L62r4N6L48m63J46j04n3R4l2O7MJ09k2j39j46K0j01L19k93L89
6095A32J40R6k30j1j02l46l2M02K04J6k1j60m04K69p6r3K52j49L78j38J23k58
6117hp6k04J75J7J27J7K30l40n8o3O3j02M55M1j78L2j22j60P6M9j16L68m2m1J63
6142C03k00k73l8K65j25J97K5k0J84m44K30j51l17Q1L96m9K00k34j2J7j02k9K22
$$ y = [201, -36, -72, 21, -302, -153, -245, -31, -140, 274, 49, 82, -135, -12, -142, 17, -250, 72, 188, 266, 261, -179, -379, -399, -13, -351, 180, 163, 66, 157, -119, 156, -191, -13, -147, -110, -34, 43, 233, -73, -137, -115, 183, -142, 21, 184, 157, -5, -48, 188, -269, -174, 122, -12, 200, 26, 300, 50, 85, -119, -166, -69, -28, 87, 52, 14, -259, -40, -207, -263, 12, 287, -137, 31, 170, -30, 102, 179, -164, -164, 160, 214, 158, 154, -63, -115, -78, -70, 31, 6, 390, 54, -93, -158, 169, -335, 27, -67, -11, 337, -126, 20, -84, -137, -43, -75, -8, -4, 105, 83, -56, -202, -182, -283, 36, -257, 132, 272, 368, 138, 127, 25, -321, -353, 49, 253, 269, 248, 88, -316, -47, -123, -216, 36, -113, 265, 127, 250, -8, -84, -288, -113, -96, 31, 48, 278, -62, -120, -183, -120, -222, 233, 274, 96, 128, 6, -154, -78, -29, -145, 223, 181, 140, 303, 103, -170, -208, 57, -68, 129, 154, 134, 318, -126, 104, -47, -364, -283, 113, 64, 264, 30, 18, 35, -67, -96, 126]
6165A26k67K90N4k71K54l22r3j38L05j4K97k77J70L4k22j04J76r7R1J77j6r2J60
6188B21l82j13Q1o6J68R1J66k23K7R0m1k10K07J98j04j62L81k73L5j63j95P4J95
6211BK96k87N9l1n3j24l55K98K18Q2Q6j24k06K2j34R4q8L87m2K84j69m24LP1n4
6236a89K14m5J87om01L59l01P5N9j60L22k02J25k05K84k18k34L28J52p7j37N10
6258D40k60q3k17p8J23j64K9M43j3P1k83q8J8j41J19J46j4K35j66%l03J55j71
6281b02M4o8J77L44k1m0k53l18R2M43k8j24K05j04Q6l58r1j4Q2K37j90K61K4m02
6305b18p2N1J56J0L57l60K87J03j34m58K26j90L53P1o2L9k05O8j05j32J09R5l3
6328d4L01O6k20m2k77M2j16J12K01J66K4k74K30l58L65m02L70j16J71k42L2M7
$$ y = [126, -141, 149, 203, -68, 186, -136, -229, -367, -62, -76, 221, -56, 114, 148, -74, -178, -2, -99, -8, 169, 153, 61, 221, -161, -274, -193, -259, -91, 0, 166, -57, -30, 60, 19, -191, 16, 214, 110, -52, 329, 56, 91, -72, -267, -193, 2, 298, 11, 70, 39, -14, -138, -493, -195, 23, 105, 191, 67, -139, -117, -251, -157, -245, 142, 100, 384, 215, -209, -206, -135, -189, 25, -20, 167, 161, -240, 119, -182, -107, -48, -208, 114, -88, 37, -168, 116, -102, -336, -8, 144, 67, -70, 440, 180, 97, -120, -198, -75, -239, -210, 233, 220, 291, 8, -80, -62, -203, -84, 62, 48, 283, 117, 117, -186, -31, -202, -158, -226, -49, 295, 274, 234, -19, -337, -245, 198, 170, 46, 251, 147, 233, -125, -216, -230, -148, 89, -101, 160, 184, -218, -290, -239, -83, -73, 284, -76, 211, 314, 180, -278, -52, -242, 111, 182, 120, 159, -46, 22, -83, -215, -106, -11, -44, 257, 323, 103, 61, -216, -174, -290, -178, 23, 189, 213, -61, 169, -189, 176, -226, 144, 28, 199, -43, -11, 36]
6350C6j97j65K1K24K37N0o2o7m9l90K6K40p9K54R4o9J71k29k95J28L6m5K34j83
6374g9K04p2K1j10k12J18m6K80K09j66M4q1k44j32J61nK13K89j43n6k79NJ16p3
6398c8L3j8L32j85l31J90j13L6R8J04k00P2L91m21R7j71l2o5n5K90J03J02Lj77
6422D5l3j52p3J11l7L18P1K1l39Q6l79L57R4J55O9L2k02l47k7J11l2R5J88P3j64
6447D1J94j49j95n9J11L3j6M0K81j90l69K59l69K39JN5J36j7L39m13l15L05j53
6470b11K32P3K22k25k08J77k95J50k39K36K27Q6j74m0n5p2j06r5K06L90k25j55
6492a01L78m38J48j59K18j9J16J47k36J91n11M3J34n8J55m5O7l5K37j62j42r7
6514a69O8R0K31m6Q3L7l3l77J5R0j39J40j11O6K21j01k56J78k56J81K6L08R9j48
$$ y = [36, -161, -326, -305, -81, 156, 206, 144, 77, 28, -362, -336, -96, -175, 79, 173, 104, 275, 46, -249, -121, -85, -130, 104, -79, 125, 53, 74, -36, -248, -130, -176, 104, 313, 147, 191, 110, -134, -266, -105, -110, 103, 392, 249, 193, -86, -81, 35, -38, -5, -23, 309, 124, -207, -17, -130, -94, 4, 108, -92, -20, 371, -50, 47, -124, -156, -221, -276, 14, 117, 219, 222, 45, 12, -140, -213, -102, -139, 179, 250, 271, -68, 18, -361, -4, 90, 245, 314, 346, 144, -203, -230, -119, -151, -56, 132, 205, 41, 235, 86, -109, -168, -57, -24, -40, 0, 281, 91, -278, -19, -388, -149, -148, -93, 43, 26, 365, -48, -363, -58, -211, 21, 94, 316, 91, -117, 60, -235, -85, -324, -88, 139, 225, 51, 11, -44, -116, -222, -317, -111, 279, 54, -101, 277, -161, -13, -172, 46, 27, 143, 290, 54, 245, -266, -223, -89, -147, 8, -37, 30, -5, 232, 70, -72, -169, -101, -11, 220, 174, 257, 294, 261, -116, -101, -11, -150, -10, -121, -55, 166, 65, -191, -13, -269, -88, -62, 246, 345, 197]
6538A97j10k87p3mL41j44M71l85K7r8J54k14l3K14r8K4K11r7l86K42m38K60l0
6561b56K99J4n1K01j90l4p5L3m3J07J95J51n09K57j71j48J2M11p5J66J7j55J24
6584B80n81J27J7J83o5M01k42Q9k26j87j40J35M63j6j77J99j58l42J74p4J20K21
6606B01k48N90l58j45N2k94l2K5N0L71L0Kj15j60J58j92J10o3K83k06J9k53n2
6629b27L24l53Q7J51J92J49j40j63J20l01K17j90J75K32k2Mj15j38j86K0N2L39
6651B27j8j27j0o9k09L37k14n6P4J25J09l5j60R1o8rj30J07J01j7J47k53M9N9
6675E1l91L72j02L70j87o0j20L09j39p0k11L91j42J89j57n4q2m2K32l17Q2L74
6697B96k02k31K33k69k06J72L4P0K10K40n5l26J16k10j60K82j92K74J86l70kj67
$$ y = [197, 87, -200, -273, -277, 64, -80, 391, 6, 33, -65, 89, -125, -158, 56, -42, -18, 193, 96, -290, -48, -486, -226, -256, 43, 57, 6, 207, 17, -17, -92, -59, -102, 5, 200, 351, -158, 99, -72, -220, -208, 203, 128, 294, 311, 156, 280, -301, -174, -157, 26, -39, 362, 120, 209, -17, -204, -344, -209, 254, 238, 61, 260, 102, -240, -66, -140, -20, 201, -47, 543, 185, 40, 92, -202, -234, -209, -159, 212, 242, 244, 129, -31, 127, -65, 45, -18, 265, 59, 78, -175, -227, 97, -256, -169, -18, 174, 323, 183, 20, 140, -161, 56, -134, 41, 273, 251, 255, 140, 2, -184, -164, -112, 227, 209, 82, 72, 3, -206, 131, -83, -139, -65, 60, 169, 134, -26, 65, -3, -12, -142, -35, 66, 49, 196, -57, -8, 51, -340, 32, -70, 300, 113, 53, -67, 242, 103, 33, -178, 213, 71, 260, 103, 49, -33, -75, 157, -160, -78, 296, 94, -137, 96, -173, -379, -207, -173, -103, 107, 347, 292, -34, 82, -128, -288, -6, -198, 76, 262, -108, -110, -277]
6719b77j13L06k1M8K7M06k51l7j40j92L9J38m9N6K78kr5j14k72J26P5j33K94K53
6743C50m03Q3j18q0J29m5l1L67k07K37m21P0j31r5J85J63J73k88J86j44k79%J20
6766a79J40n2K90Q1j84n5j32o0R4j3J49J02J00P9l36k19J46j80L43nN2p5q9J84
6790A81k48K9J58k26P5K47N0l15J0j07j87j04M7N58J9N7l46J85L8k62o4K07J65
6813A67K6r1J21j35k74j4k2K01J02j35J18N7M8p8k51J65O7r5O9l6J15q5k2j6j10
6838a08K9K1mL50k51q1O2j02j88L11q5K98l56O03m85Pn9j3Q1j53L24K9p3J33k84
6863Fm6l5k13L56q4m5J19O7j95k95L69j39q7M01no8n5Q4l95J46J43L43k42J81
6887C11j35j44k90J08O2o5M73l13K96l57j06R5j69k5M9K7L34M1J78k12j52j27
$$ y = [-277, -390, -84, -105, -57, -30, 376, 125, 88, -52, -244, -205, -67, -116, -60, 218, 216, 121, 7, -265, -139, -64, -197, 97, 350, -53, 30, -88, -168, -39, -84, -115, 252, 45, 282, -139, -69, -200, -295, -110, 53, 226, -62, 124, -20, -299, -299, -179, -39, -91, 199, 280, 96, 41, -91, -151, -57, -70, 79, 181, 281, 360, 24, -195, -49, -229, 114, 109, 161, 86, -3, 181, -67, -38, 120, -106, -31, 216, 266, -49, -39, -146, -333, -437, -390, 168, 187, 244, -102, 83, 121, -141, -205, 2, 167, 193, 102, 223, 88, -186, -200, -222, -21, 81, -54, 64, 121, 169, 91, -160, 5, 72, -23, 46, 10, 125, 40, 18, 2, -108, -79, -58, -62, 288, 37, -44, 18, -84, -272, 39, -46, 252, -104, 499, 14, 21, -38, -51, 30, -123, 201, 230, 157, 290, 6, -40, -75, -288, 68, -16, -61, 58, 125, -70, -365, 4, -135, -222, 179, 174, 106, 51, 135, -260, -114, 29, 372, 130, 311, 176, 32, -258, -150, -88, -153, 320, 7, 303, -54, -160, -65, -234, -259, -210, -183, 151, 192, 370, 158, 6, -121]
6909a21j37J05K39P2j91l8J2r1M3J28j25J36J00j38J68Rk78p6K66j76J42nJ26
6932A70K92m28k88J82K8p5R3J8K36j91k9J56l46N0j68K04L49J24j05l13J62l37
6954b16n8K94r3N6J31L3p1k95K09j14K02J04k30L52m17j30K57l48J50K9J40J26
6976A11J80j8l25k50K50n64N36J34M8k2K27k54k96J00J47J84k04J51j18P8j80
6997h5Q6j92q5K10N5K9J35O0l49J16k1K03k95K36J99k58J47K6k67k12J22K05J17
7020A82j3Q1k95L30j59k62r3J39k4K04on1N1J36m21R0J50J05Rj6P6l69L38p3k11
7045a02j77M70j66J36M7j4j18j61j79L15j88L49kn1k75R9R3l93L80%R2j69n9l8
7069a11o5J66p3p8J8K28K3L4q4L6l48r8M77l1j9L4M9j19l12j3L37L6k13J81J50
$$ y = [-121, -258, -153, 86, 158, -33, -71, -59, -150, -107, 21, -104, 32, 132, -6, 162, 171, -107, -183, 83, -93, 49, 44, 170, 462, 34, -254, -72, -44, -119, -26, -8, 228, 37, 8, 164, -182, -132, -300, -96, 253, 377, 272, -41, 121, -216, -274, 20, -73, -17, 114, 147, 76, -219, -10, -124, 78, 182, -48, 304, -113, -243, 14, -334, -184, -155, -15, 111, 291, 273, -52, -302, -52, -616, -80, 54, 102, 80, 307, 53, -243, -143, 4, 188, -16, 135, 17, 95, -85, 1, -191, -276, -66, -11, 18, 153, 213, -136, -20, -41, 162, -133, 103, 302, 44, 191, 217, -50, -262, -140, 65, 182, 169, 250, -45, 285, 126, -136, -229, -90, -114, 90, 84, 33, 84, 220, -201, -111, 39, 144, 153, 137, 213, -156, 182, 109, -102, -279, 191, 25, 161, 208, 194, 76, -85, -264, 51, -137, 212, 210, 159, -116, -17, 76, -317, 63, 63, 155, -14, -73, -111, -176, -10, -83, -161, -143, 85, 108, 142, 58, 94, -254, -352, 125, 94, 75, 109, 158, 39, -273, -286, 51, 87, -126, 55, 205]
7094B05P3l37l5J72j65K76l62K34J3R1k11O1l56K29j0K77M7k28P5j47K1K58j97
7117a6J56PJ0r3J01n0j71j98n0L61m2L31m22k9K21j90k36K51L2J38J32k67J92
7140A68l73J2o9J03J94R5o1N2pJ4l22Q0P2m8K81K6K0j38n1j65j13J59n8N65k36
7165B00p1m4k21Q6k37PM01o0P8RL4m8n36N03k75P2L43j02k8m3Q7n72R8J40K3K71
7191A15J89m57K30k04Q1J60l27k9J19L61K7j20k63j54n4L77J0L0j18K01k78J63
7213E9l76J26K04j14K91o2N1Rl36J28P8j07k8N2R7m8Q2j90j12QN6J39J47l57M36
7238B33j73M1m1l30M09O0L5l28L80j23l93J34k6kJ20K7M31m73J03k8j13p1M7j67
7262b48L45j71K75j43k22r4R6L0q1M21j28P2j87q8J44l53L20J15l2J4J82l26K73
$$ y = [205, 278, -59, -94, 78, -87, 189, -173, 61, 74, 165, -46, 15, -341, -112, -122, 155, 202, -26, 49, -98, -77, 181, -16, 140, 147, 157, 64, 165, 115, -56, -254, -304, 57, 15, 346, -76, -105, 116, -74, -310, -59, -27, 111, 243, -24, 168, -205, -193, -262, -159, 35, 130, 69, 121, 114, 128, -194, -114, -42, -90, 191, 217, 237, 99, 48, -117, -230, -71, -129, 436, 200, 129, 85, -136, -50, -287, -280, 121, 61, 139, 148, 182, 134, -402, 101, -174, -102, 241, 139, 111, 68, 155, -417, -319, -179, -156, 115, 304, -153, 77, -127, -46, 114, -213, -242, -123, 238, 265, 145, -118, -272, -326, 51, 61, 91, -27, 174, -104, 59, -317, -191, 13, -101, 190, 128, 179, 188, -148, -20, 58, -49, -77, -25, 72, 24, 106, -84, -196, -188, -132, 7, 154, -203, 233, 60, 101, 60, -270, 139, 199, 234, -94, 286, 163, -230, -96, -122, -124, -4, 23, 454, -19, 84, 56, -57, -128, -81, -248, 97, -74, 201, 58, -164, -258, -162, -132, -213, 208, 80, 152, -35, -123, 21, -332, -12, 103, 71, 85, 267, -59, 214]
7285B14k14J3r5k35M04K3r2OM6j68l7J72n6R8j1j09K51n05J83q2J32K27j93K31
7309B03m5k17J28j7r6j32L63l50J17J70J15q6l40j62J20L82l2q6K25k75L28m27
7331a14p4j3M35j66J52j33k83J37j1m1M3O1J8K65n7l75m9J89j14K29k52L06q2
7354G1O5J2l63J27j86K88j09L55k55L3j02p0Q8MJ14p2K18N6l65J52j83K2J13J8
7378C1K49l47o5L62o2k65J20j77l5l4L63J35k07P6k54j04J54q2J12m1J3J19j04
7401d3K94l30j52J08j02L66k6r8K15k59J56k61J13L49k49J07j89J12j91J14o5
7422c1J4j60J30J73N4j5o1j8m3l25J45J67R5O3o7k14L6j84M2J86Q0m4K35j19j74
7447c5j4O0r7pL43j75P8j93N4j51J81j20P8K03J33l26J86l70N4R1L8q0K38j76
$$ y = [214, 0, 13, -82, -317, 87, 110, 18, 24, 70, -98, -135, 37, -19, 79, 68, -41, 210, -295, -112, -194, -62, 165, -28, 203, 158, -59, 69, 52, -44, -176, 187, -163, -46, 124, 239, 153, -187, -349, -229, 153, 121, 35, 260, -15, 313, -114, -188, -201, 234, 68, 220, 87, -196, -59, -70, -111, -68, -7, 11, 276, 219, -156, -205, -16, -130, 99, -153, 153, 71, 136, 148, -215, -88, -274, 14, -95, 260, 5, 38, -64, -134, -46, -42, 72, 0, 218, 274, -91, 61, -122, -100, 13, 31, 280, -67, -132, 230, 168, -97, 23, -154, -189, -223, 140, 275, 68, 144, -110, -214, -60, -142, -30, -71, -58, 61, -43, 251, -79, -231, -123, -225, 141, 115, 17, 232, -27, 129, -132, -19, 330, 81, 188, -1, 111, -80, 34, -31, -17, -177, -47, 126, 180, 165, 104, 86, 43, -282, -137, 30, 125, 188, 121, -93, -57, -241, -199, -13, 67, 23, 258, 139, -35, -49, 11, -86, -93, 250, 75, 153, -40, 14, -137, 44, -76, 2, 205, 338, 12, 198, -172, -118, -27, 11, -69, 169, -7]
7471gM7j27j66L89k11n9lJ48k1l7K99m30J29l70K65K91M9l07J90n7j98K68m5j05
7495f8K24M8%l66l3J03lN1k56L75j6P7k96K15J14q2P5j77m2J52q2J8j25q8P0J87
7521G5o8k90L62J24k8k69J15o1r4n1K27J09j49J03q8k35N7L48J6j55L0j26l0N5
7545b3j71J5kP2J53K66k94J65n2k3j64r6L6K75j72L3L3J01k34J08J77j70k1m4
7569c2J54j70J02n5o9n1J06l3O9J2o1n9J21J17n42M46J5j19K65k08J74l95k1K22
7593a2K2O2K6K82l60L0k73l7K79K23l87J03J14N0m36L46j53kJ92k9Q9M8o8k47
7617a38R5J08qJ33p1o8k6m2k8J27l54K7L8L59k76O9j23J85J19j06j93J64J30r2
7641B9J90r1j84Q6k01J1m5K67M0qj35n7J53k51K00j90K51n7K37j05p7j87l3J27
$$ y = [-7, 40, -87, -253, 136, -75, -134, -137, 11, -10, -47, 252, -178, -49, -419, -154, 137, 186, -121, 69, 12, -186, 82, 37, -68, 156, 204, 204, -162, -195, -92, -95, -44, -300, 75, 59, 136, -160, 55, 169, 87, 162, -15, -57, 95, 13, 31, -94, -182, -112, 75, 7, -283, 79, 203, 175, -94, 21, -40, -134, -185, 42, 151, 2, 105, 17, -218, -161, 187, 203, 48, 78, -48, -78, -23, -194, -179, -181, -109, 44, 310, 16, 181, 129, 106, -58, -154, -118, 157, -15, 18, 51, 152, -82, 26, 203, 33, 12, -32, 122, -48, 54, -1, -70, -121, -15, -48, 21, 33, -28, -87, 34, 151, -391, 55, 70, -49, 216, 8, 182, -213, -234, -12, 10, 72, 98, 380, 20, 50, -223, -260, 19, 242, -145, -42, 72, 122, -314, 32, -121, -123, 69, 40, 129, 177, 109, -138, -43, 65, 57, 190, 119, 51, 25, -17, -45, 82, -272, -245, -207, 152, -124, -55, -178, 7, 126, 20, -173, -9, 121, 29, 219, 128, -56, 30, -171, -160, -205, 62, 102, 94, -41, -98, 55, -196, 4, -186, 65, 8, 245, 140, 63, -124, -157, -30]
7665c0J29j38LM3K4J25k39n7J89j84J72O2j12N8NJ98k99J68k35j4N27m54j1j7
7689h7J29j46N5K5Q5K0MO7j15j44p2P6Q6j1O5J3J97l21o3L6Q9N2N7J16K5k47J31
7716A22j31qj06J35j74K52L0l90O5O7J94j2j33l5L61O9l31j5j18O3L4k62O01j04
7740A74r6m8k61K33J71l29O5oL1J72J32n57M47j88j31M5n6J46L22l60J52k34j51
7763c27J99K16j60j12L88k04k04K43k0J76j14L6p0k08P6m4J17j15N5j73L34p5
7785A4J08R7k13n9P0L9O4j59J38Q4j04j35j51K73j05K37m60N13j96k8o0J01k93
7808b25J33N9k9J51j09n4K9r9K90k1j13k51K11O1j10J94k67J43j30j67M00j57
7830f1J13J35j01J03k90J22j97K90j5m4j15K87m26j5j96L07J76J27j21r0l56M6
$$ y = [-30, 99, -39, -36, 7, 31, 156, -83, -140, 49, -135, 37, 99, -13, 45, 50, 248, -51, 117, -118, -132, 395, -59, -70, -87, 42, -104, -49, -24, 61, 81, 85, 152, 37, -107, -179, -103, -17, -28, 37, 50, 247, -74, -137, -101, -12, 40, 97, 213, 238, -9, 122, -9, -17, -123, 12, -162, 90, 120, -270, -205, -138, 56, 44, -89, -124, 237, 306, -25, -40, -158, -95, -61, -323, 278, 174, 78, 30, -231, 2, 173, -156, -91, -97, -66, 106, 238, -319, 128, -60, -191, -146, -202, -56, 266, -94, 58, -176, -327, -128, 88, -72, -184, 204, 0, -204, 39, 19, 195, 81, 117, 47, -161, -85, -129, -12, -127, -72, -245, 89, 14, 122, 219, 6, -53, 17, 56, 120, -39, 99, 183, 79, -56, -207, 66, -39, 198, -262, 251, 55, 27, -33, 68, -225, -92, -33, -62, 89, -20, -74, -45, -144, 146, 125, 12, -239, -28, 33, -77, 117, -150, -7, -137, -304, 96, -61, 52, 187, 86, 189, -101, 21, -176, 114, 99, 55, -60, 227, -199, -214, -410, -103, 73, 200, 79, -11, -367, -321]
7852c21L52k3P6N5k76%K25j40M5l30K78K19J6j5m0j3K89k56k01J40O2j19M2J22
7876A87k57J70L5l06l9J75J02lQ3j11o7j41Q5K52k94L34j69l9P9l6ln3J81j79
7900a4J26j59JR5J26j29r3j11k7K38n4K52j68r8k3J02kj32J3O7J44k93J79l05
7924b65K47l8J54O1l18L25m1oj89J6j09J66L9Q7k19O2lp3o4k3J77MM2pj96K31
7950F0l7j19J82j08M1j70J76Q2K3k62K03K4%j66K82m37J37M2j81K59J99m37J50
7973e7Q6p0j88L02K6p9O2k70K6J81J66k09J84k97L69j52p2k59N61m93K26K36k19
7996F0N2n4K9ol52L28j15k4k26L29J02k75L43j4l7k86J90j48k8M5L1JK01J0l7
8021A19j81K06l37K43NK7j07JK71m53L41J1j42j9K24k09L9O8k32J60p6R3j30m0
$$ y = [-321, 31, 8, 84, 139, -137, -137, 88, -52, -7, -337, -59, 160, 176, 161, 121, 108, 397, 141, -60, 80, 142, 23, 65, 187, -70, 100, 135, -171, -210, -35, 67, 64, 147, 36, -31, -172, -87, 165, -129, 205, 36, -3, 76, 40, 37, -16, 165, -14, 112, -47, -46, 49, 175, 46, -47, -158, -185, 53, -1, 251, 83, -15, -38, 64, 62, -70, -57, 10, 154, -139, 40, -265, -18, -56, 98, 159, -159, 166, 125, 119, -70, -54, -163, 3, 42, 129, -90, -28, -31, -104, -168, -191, -14, -10, 32, 25, -171, 60, 23, -96, 86, -22, 19, -151, 25, 107, 130, -132, 71, 95, 95, -71, 211, -226, -89, -47, -228, 31, 230, -207, -57, 29, -41, -229, 73, 99, 20, 82, -188, -162, 19, 185, -24, 160, -137, 232, 80, 8, -251, 310, -183, 43, 279, 60, 112, 58, 87, 81, -271, 57, -58, -82, -308, 21, 123, -152, 191, 177, 140, -146, 44, -104, -132, -87, -56, -55, 146, 156, 119, -62, 144, -193, 50, 55, 82, -25, -24, 247, -206, 135, 146, 4, -15, 209, 0, 39, 107, -125, 35, -41, 52, -78, -118]
8045a18J72l79M96J17l07m0O6J41o8N9k15L30j51k23K31J7j62Q5J20m17L26J2
8067I2k22J17J35l43j2K83J55j53j59L71o5j47M9k03J09J4K2j25O2M2N1j17K2
8090b2j47L88j45N7r6k37L02j10K05j86o0J07J16l56N4K08o3L34l20J56p9M0k43
8113i7Q6J36k21r4K85j71L3J79j76J89j7k5k63K06M0k81J98Mq6J12o0k7K12p0
8137I2Q5l19R6J07j62K9J20p3l25M19p4M4k95J02J28k9L03l65j2NL06k95J74J1
8161G2k00J78k56K87n7J23k90k6L07j91P7J73j19r3J64J9k34k23L63l25L71q4
8183C6j40KM8J4J50k25L8K19
$$ y = [-118, 54, -325, 171, 288, -19, -59, 7, 148, 80, 139, -76, 254, 103, -120, 111, 128, -34, 51, 171, -246, 80, 92, -130, -13, 122, -221, -233, 50, 205, 52, -107, 264, 199, 52, 101, -102, 7, 21, 43, -82, -20, 22, 73, -44, -22, -169, 219, 74, 131, 35, -202, 100, -10, 195, 9, -51, 56, 172, -184, -130, 78, 15, 349, 29, 185, 106, 146, -97, -11, 125, -96, -190, 95, -76, -43, 136, -40, 149, 132, 107, -156, 50, 90, -191, 7, 11, -75, 37, -23, -50, 162, 92, 177, -142, -46, 61, -101, -72, 48, -25, -350, 69, -5, 39, -256, -154, -26, -55, 248, -117, -129, -124, 182, -113, 61, 72, -128, 50, -206, 81, 24, 147, -143, -169, 138, -53, 24, 197, 78, -15, 149, 168, -66, -289, 74, -251, 120, 36, -104, -102, -54, -40, 110, -115, -77, 142]
8191A42
$$ Imaginary data points
##PAGE= N=2
##DATA TABLE= (X++(I..I)), XYDATA
0@%%%%%%%%%%%%%qJ6j6J6j6K4l2L2m0M8n6O6p4Q8j04J19j37J56j74J98k26K55
35A35k86L21l60M02m48M98n54O16o83P55q33R17j012J117j230J354j490J644j816
54i53K007k222K466k748L076l462L929m501N220o162P452r331J2327j7853L1309
69B0554j24108j77583J70058J0297P5609K15804j3614j45849K7786o8806j33627
80a43479N4193P0927j3037J09845J01124n2148p0796o2872j11428k8878Q7298
91e9251J03504P1044L4836m1627j06404r3146k6788P997M9839R6248N6290K892
103I5434l46o3731j04954l0440n254Q507J15957J00237p887L652m3588j43024
115g5437l7217N0196k528Q0444J27056k6867m6866J158j05632p8469O5437L1335
$$ y = [0, 0, 0, 0, 0, 0, 0, 0, 0, 0, 0, 0, 0, 0, -8, 8, -8, 8, -8, 16, -16, 16, -24, 24, -32, 34, -40, 48, -56, 63, -74, 82, -92, 106, -120, 135, -151, 170, -190, 212, -236, 262, -292, 324, -359, 396, -437, 480, -532, 585, -645, 709, -781, 863, -953, 1054, -1168, 1298, -1450, 1626, -1836, 2093, -2408, 2812, -3350, 4102, -5229, 7098, -10755, 20554, -103554, -281137, -111079, -100782, -25173, 190631, 177017, 31168, 58954, -9852, -143479, -89286, -18359, -31396, 78449, 179573, 127425, 56629, -6243, -117671, -146549, -59251, 44253, 115297, 150133, 108506, 2102, -91044, -117832, -109835, -59996, 36252, 92542, 95434, 95088, 31357, -73597, -104037, -109291, -100784, 15173, 115410, 107523, 111175, 67587, -75437, -112654, -62458, -64986, 15458, 142514, 115647, 68781, 69939, -35693, -114162, -48725, -17390]
127a7390K2252J05532J9529p0478k4120n1705q1849J3020N5526M0602P2868M2968
139A26755l9324o3877o9497n6112J0660N7263O6771N9143J0062l6668m9132n5907
151c9863l6437P127L3119N1389N5294K5154j3229n2425p2565m1809j703L4675
163e1273P9619O2430k050k1892m8487q1344k4366K9945J5392M9784O8834o120
175G0472k5438j1958o7441n5622K4603K6951L5989P7975K1453m7482l6590n0186
187c7274n1709K1508N3302L6698M5689J9457l7737m4294l9865l9830J676M1715
199c0664M6478M4357K2958k2990n1455n1795l4841k55L7495N4345M1846J2621
211F8100j7034m5416n1628k3859O132K6941M9869M3095M338j8117l3534n2108
$$ y = [-17390, 4862, 110394, 129923, 59445, 35325, -16380, -98229, -85209, -29683, 10919, 83787, 126755, 87431, 23554, -45943, -102055, -91395, -34132, 32639, 91782, 101844, 65176, 16044, -39863, -76300, -69173, -36054, 15335, 70629, 95783, 82554, 30129, -42436, -84245, -85948, -51273, 28346, 90776, 88726, 66834, 18347, -62997, -87363, -57418, -42026, 7758, 76592, 70472, 45034, 33076, -34365, -89987, -65384, -38433, -2444, 75531, 96984, 49502, 12912, -37274, -88983, -67475, -14173, 22525, 68214, 87671, 49934, 5640, -34225, -74055, -72379, -30664, 15814, 60171, 83129, 60139, 8684, -43111, -77952, -78207, -40712, 13633, 55479, 68100, 51066, 5650, -45978, -69837, -63705, -36764, 13105, 56200, 60538, 42421, 8887, -43221]
223d3221k6818J5942K7732M3584M9573N218k9220l4300m9016l4185J5918L7356
235b1437M0517M5728J3673l1574m1121m2389l4164O638L8199L9754L7288J6342
247F7454k2615m0481l8965k8316J690L3099M2609L3919J1964k0007m1052l9990
259d0691k0560O904L2714M3760L1872N868k1015l9966m0840k0683Q102L1943M3799
272B1207L5203P131k1355l8996m2583k3916P932L1386M0878L4908Q887k0454l6859
285C369l8883k2852O172K9894L8454L1443Q777k0174l6094l5874k0635O272L1002
298a9129L8789K9174P416k0232l6956l5621j9123O715L0339L9133K8961O530j8883
311C7113l6257l6226j8635O655K8903L7705K8970O409j8405l4918l4848j8453
$$ y = [-43221, -70039, -54097, -26365, 17219, 66792, 72010, 42790, 8490, -40526, -74711, -58793, -21437, 19080, 64808, 78481, 46907, 5786, -36603, -70767, -64129, -25930, 13824, 51112, 67454, 44839, 4358, -34607, -62923, -61233, -28134, 14475, 48394, 60358, 40351, -701, -40691, -61251, -54347, -21633, 22127, 53999, 59867, 38852, -1114, -41954, -62637, -54535, -22592, 21207, 56410, 63541, 42186, 3190, -39393, -63309, -55377, -23991, 16887, 51795, 60682, 40228, 3369, -35514, -58366, -52194, -22300, 16154, 47597, 56374, 36200, 106, -35768, -56403, -50131, -19129, 19660, 48834, 56250, 36018, -938, -36559, -55682, -48967, -18628, 20505, 49466, 55996, 37113, 856, -35370, -54005, -47350, -18447, 19258, 48228, 54637, 36232, 1314, -33534, -51987]
323e1987O868K8261L6332K8336N893j8381l4085l4522j7828O638K7219L5867K7777
336D6388N939j7999l3177l3410j8172O254K6620L4428K6760N671j7575l1318l1203
349c0794j6959O827K6395L3023K5242M833j7912l1815l0635j5377P910K6422L3767
362B0927K5035L656j8347l1650l1741j5401P104K5211L3545K5457M163j7223k9413
375A323l1808j6830P227K2446L0451K6078L583j7009k6400k9584j6144R826K2993
388a3848K7322K4411K903j9755k6000k5713j5183R653K6161K6488K3129N023k0477
401B4114k8500k6386j6348Q178K7036K8847K2664M368j8303k9022k6013j4107
413d3472O609K2768K7921K0736L451j4722k5298k5946j2323P245J9921K6740K2429
$$ y = [-51987, -45119, -16858, 19474, 47810, 53703, 35322, 1237, -33285, -51113, -44475, -17256, 18611, 46388, 52327, 34328, 1151, -32259, -50431, -44177, -17557, 16871, 43631, 49302, 31727, 409, -30794, -47753, -40926, -14531, 18492, 43734, 48567, 30655, -1160, -31795, -47172, -39262, -12840, 20927, 45962, 49618, 31271, -379, -32120, -47521, -40417, -15206, 18339, 43796, 47959, 30736, 1323, -30485, -47315, -40088, -17642, 12809, 38887, 42470, 25461, -939, -30523, -46667, -36841, -13848, 13474, 37885, 40788, 21033, -4967, -30680, -45863, -36210, -10049, 16439, 39568, 44591, 24114, -4386, -30772, -47120, -38942, -11906, 16941, 39605, 43973, 25670, -3352, -29365, -43472, -36863, -14095, 13826, 34562, 38013, 23291, -2007, -27953, -40276, -33031, -13110, 13630, 36059]
426C6059L02j6733k2911k7370j2436J3363K1704K3909K3611j567k1555k0789k4202
439b8615j5202J3849K2678J9838K3196M113k1658k1437k1603j9288R068K5906
451i155K0689K1419O880k2390k4930j8608j4090R154K6472J9676J5147M272j7329
464A7207k3550j6653j0790N297K1407K3908J6784K805j4141k5088k4812r760J0813
477b6573J9554K5163J9940n783j8994j7277k4078j1132J7108J5767J3710K3776
489C1181M11k2406j2890j8965k1819J3163K5297J3818K2302P902k7720k2714j1936
502b4376j5821J0469L0057J4600J1308O595j8923k2136j0583j1339L289K2054
514d806J8861J3019N710j4018k3883j8764r152O478K1080K3184J4149l428j7979
$$ y = [36059, 36361, 19628, -3283, -30653, -43089, -29726, -8022, 15887, 39498, 37931, 16376, -4413, -28615, -43817, -29968, -7290, 12548, 35744, 39857, 18199, -3238, -24841, -44129, -35061, -9155, 11534, 32953, 39833, 17443, -7487, -26095, -40185, -31031, -4559, 15117, 30264, 34536, 17207, -6343, -22996, -33786, -28489, -7082, 16826, 33610, 36415, 22274, -2814, -27626, -37386, -26573, -7019, 18144, 38084, 32301, 13307, -3970, -28048, -39180, -22072, -6305, 7405, 31181, 31592, 9186, -3704, -22669, -44488, -31325, -6028, 7790, 30092, 37994, 10274, -12440, -24376, -40197, -29728, 329, 14929, 26237, 32832, 13909, -8227, -18810, -30149, -26860, -4806, 14055, 27074, 32784, 18766, -5117, -23881, -33033, -26555, -5475, 17709, 31858, 28430, 10451]
527A0451j9971j9578n778J4621J5719J4276J8777k209j9007j0136j8385j8935
539d0155J3624K1125J1567K3331P056k6182j8709j0584j7538J0699K9065J1265
551A4564R609P135k0179k0218o634q732M131K0894J3607J0215N642j4649k0016
564d631j4329j1539O764K3954J7825J3134J717k0831k2403j1574o421Q741K1388
577A795J4352Q551K209j2667j6825j4047r268N994J5721J6308J6333J310j7042
590A2724j5612j5298j1448J3076K0998J0309J2839J531k2475j5432n986r955Q196
603a6533K1560Q522R087O881j6225j8674r666j1747M622K3337J5464J0040L971
616C0639j8139k1755q281n782N594K1426J2795M530K783j1544j8562r317m310
$$ y = [10451, -9520, -29098, -34876, -20255, -4536, 9740, 28517, 26308, 7301, -2835, -21220, -40155, -26531, -5406, 6161, 29492, 36548, 10366, -8343, -18927, -36465, -25766, 3299, 14564, 24173, 31308, 11129, -9089, -15723, -24455, -20324, 570, 14177, 24392, 30034, 15385, -4631, -18960, -30499, -23735, 219, 18044, 31178, 32895, 12064, -10339, -21913, -28334, -19593, 1795, 16147, 24698, 26907, 14240, -2585, -16632, -25900, -19906, -4185, 12123, 28456, 29766, 12724, -2888, -18186, -29634, -16558, 4440, 14749, 27588, 29119, 6644, -8788, -14774, -24729, -16533, 5027, 13549, 22636, 29517, 13292, -5382, -15048, -26795, -22173, 1164, 16628, 26668, 30639, 12500, -9255, -17536, -23318, -17724, 3702, 16497, 21027, 23810, 12266, -6296, -15613, -19923]
629a9923K182J5961J6435Q407l82j0846j7136j5476n191R598J6156J4302J1702
642B5789k997j7966j3071r601p627J0639J7159Q009R072M313j5941j5191p261
655a4674r636M299K1221J2911O235L462j4878j9774p520l449M751J8829J3350
668A5127M186M01j1736j7112q556k642L920J5030J4065O092n7r740j6905j0850
682a8777l486O037J5094J4840O463k524j2273j4261r987k035Q465J3493J1066
695A2115P023j406j2052j3537r431m673P571J5609J1397P234K09j3606j5167q163
709a6877m387O277J6398J1937N072j25j1769j5087p336k077M370J4310J1919M090
723A6715p24r049j4769r287j002N888J3148J3390M762l409j0488j3764r268l44
$$ y = [-19923, -17741, -1780, 14655, 23062, 22680, 11834, -5302, -20778, -25969, -16371, -215, 14087, 25789, 22792, 4826, -8245, -17846, -25473, -14834, 2325, 10334, 19406, 23719, 7778, -7413, -14674, -24310, -20011, 1210, 14121, 20356, 23818, 8940, -10834, -18354, -21803, -17052, 1777, 15127, 19313, 19714, 7978, -9134, -17690, -20332, -16412, -1382, 12683, 18775, 18718, 8978, -7927, -18777, -22263, -16226, -1132, 13708, 20171, 17647, 5374, -8887, -18874, -20909, -12444, 1049, 12115, 19138, 17732, 5680, -7857, -17288, -21961, -14390, 1219, 12616, 19850, 20059, 6453, -8714, -16877, -21264, -14987, 1411, 13348, 18420, 18295, 6526, -8561, -15897, -17974, -13604, 706, 12625, 16715, 15991, 6942, -7827, -17114, -18116, -12228, 920, 14310, 19072, 15663, 5175, -8589, -17857, -18201]
737a8201P342J2611J1828N532k803j0863j2640r374k121O697J2692J1596N895
750A8191j736j0537j2890q859j954O888J2357J0601N076k651j0193j1605p367
763a4679j733O192J2528J0123M447j990j0432j2795p788l06O458J2235J1224L790
777A7274l104r257j2443q260l95O481J1044J1049N121l310r805j1366p915j120
791a6006P023J0694R870M664l087r261j0718p415r77O770J0374R887M060l193
805A2685q869j1429p292K0O669J0504R550M046l293r543j0214o986p06O462J0659
820B263Q852L860k519r293j0477o654l43O268J0409Q738L677l506q277j0063o657
835a3722R9O093R536R035L605l423q786r731o320k72O608R529Q077L251k755q606
$$ y = [-18201, -10859, 1752, 13580, 19112, 16309, 5446, -7194, -16568, -18689, -11992, 700, 12296, 18191, 16455, 5918, -6972, -15831, -17785, -10897, 1460, 12061, 17137, 14486, 4293, -7312, -14679, -16412, -10220, 2308, 12431, 16878, 14888, 4456, -8339, -16127, -16433, -9975, 2260, 13484, 17274, 14170, 4913, -7530, -15790, -16185, -9704, 1340, 12389, 17510, 14200, 4395, -6971, -14886, -16006, -8983, 1711, 11581, 16245, 13158, 3897, -6821, -14236, -15213, -8443, 1931, 11818, 15878, 12685, 3816, -7613, -14905, -14885, -8216, 2288, 11838, 15884, 12591, 3048, -7166, -14152, -14858, -8396, 2263, 11115, 14975, 12456, 3163, -7314, -13968, -14311, -8043, 2366, 11104, 14781, 11275, 2998, -7065, -13722, -13623, -7530, 2006, 11041, 14646, 11223, 2437, -7294, -13614, -13886, -7278, 2251, 10328, 13579, 10824, 2218]
851B218r114o319K22N850R351Q021L014l107q462r393n296nO192R714P647K285
867A2818k941q405r286n325R4N858R949P308K796k888q065r418n369N06N263R194
883B089P826K202k701p848q954m789M26N376Q995O874J845k488p951q534m330
898a1962M70N887Q669P017J766l004q073q744m250M25N976R387O452J480k625
913H871q121q258l780L89M919R426O129J411k447p354q305l484K98M690R056O331
929I771N69k397o988q805k838J359M696Q639O293L07l158o520q059l557J173M954
945d561P845O604J469l349p110p857m146J313N719Q105N725R56l371p264p053
960f975k691P33M710Q295M968O52k121o865p829k371O31M431Q907N313p6k421
$$ y = [2218, -6896, -13215, -12993, -7143, 2208, 10229, 13243, 10136, 1674, -7719, -13015, -13020, -6828, 2886, 10533, 12818, 9877, 1472, -7814, -13139, -13045, -7187, 2762, 10070, 12866, 9978, 1913, -7505, -12874, -12368, -7105, 2089, 9915, 12117, 9416, 1568, -7386, -12175, -11749, -6373, 2622, 9496, 11341, 8853, 902, -7632, -11962, -11492, -5605, 3064, 10081, 11847, 8843, 770, -7974, -12224, -11799, -5823, 3564, 10016, 11496, 8871, 750, -7508, -11288, -10899, -5980, 3446, 9575, 10986, 8539, 1185, -7120, -10604, -10306, -5616, 3440, 9771, 10340, 7943, 955, -7850, -10688, -9329, -4633, 4006, 10299, 10606, 7448, 928, -7131, -10688, -9515, -4561, 3284, 9888, 11357, 8008, 898, -6959, -11105, -9792, -4073, 4032, 9757, 10713, 7342, 78, -6975, -9666, -8933, -4223, 4072, 9040, 9692, 7571, 706, -7123, -9494, -8863, -4432, 4475, 9788, 9712, 7291]
976G291o914q297k188K210M032Q169N565r51k558n754p655k766K018L597P702
991C501O170j56l054n835p563l095J731M899P565N597m31l448o685o518k239J915
1007g646M723O876M462K15k804n977o628j707O40M025P782M883j89k400o437p799
1023g981j178J845M358P546M693j871k638n727o475o90J997L026O896N059q71
1038G989k291n247p861j936K493L861O917N874j593l532n409o849j181L111M074
1053a580N199M545o67k828m851n656k321J550M173O326M151j08l226o224n685
1068g202j283K381M447O968K973j714k443n337n924k25J551L419O679L905j040
1083G155k177n175o956q71K688L210O262M343k124k542m417o046j304L284L273
$$ y = [7291, 377, -7920, -10108, -7898, -3866, 4303, 9868, 8917, 6359, 605, -7050, -9816, -7798, -4201, 3501, 9671, 9515, 6461, 626, -6937, -10032, -8301, -3402, 4163, 9760, 9329, 5881, -804, -7322, -9561, -7646, -2923, 3953, 8415, 8630, 5826, -151, -6779, -8486, -7846, -3821, 3961, 8844, 8655, 6255, -182, -7981, -9159, -7314, -2956, 4590, 9283, 7412, 4774, -953, -7428, -8118, -6121, -3095, 3801, 8860, 7989, 5698, 451, -7410, -9346, -6853, -2992, 3925, 9799, 8206, 4674, -735, -7584, -8765, -5654, -1580, 3619, 8164, 7497, 4669, -182, -5838, -8159, -6609, -2436, 3890, 8041, 7933, 4707, -1517, -7202, -8485, -6104, -1657, 5311, 8284, 6570, 4127, -1210, -7134, -7359, -5808, -2389, 4290, 8195, 7155, 4978, -197, -7153, -8024, -5336, -2126, 4136, 8479, 6355, 3813, -604, -6650, -7954, -4670, -1397]
1098a397N269M347j933l675l462n279j369K899L565M531L990m35l505m658n221
1113f333j603K282M917N263L404j355l464m969m793l22K491L535N247K620j273
1128E647k285m549m732p91K028L021N648L580j317l060m882n482k28L491L622
1143b89M670K751k193l110l437m256p74K886K890L906M260j061l704m013m867
1158f341j256L544M466M028K299j313l709m257k946p47K380L645M225K312o57
1173E673l299m365l929n28K502L876M589K086j849k935l901l793k36K768L054
1188b87M232K519j707l040l504l779o96L055L213L686K765j411l916l310l300
1203e480m81K640L786L377K451r65l860l750l290o65K783M159L805J793j429l617
$$ y = [-1397, 3872, 8219, 6286, 2611, -851, -6130, -7499, -4600, -1035, 3496, 7486, 7051, 3546, -1112, -6333, -7936, -5654, -737, 4526, 7930, 6575, 3111, -1858, -6651, -6973, -4482, -947, 4300, 6920, 5647, 3362, -1187, -5919, -6710, -4682, -1661, 3987, 7567, 6250, 3190, -1692, -7174, -7402, -3911, -289, 4381, 7132, 4939, 1829, -1608, -5864, -6638, -3752, -862, 3044, 7304, 6243, 2539, -1474, -6341, -7597, -4053, 413, 4441, 6740, 5427, 1718, -2539, -5485, -6232, -3852, -207, 4018, 6330, 5673, 2374, -1991, -5920, -6448, -3946, -70, 4519, 6605, 4756, 1821, -2080, -5873, -6109, -3341, -287, 3945, 6464, 4757, 1717, -1787, -5566, -6262, -3207, 6, 3692, 6457, 5046, 1130, -2180, -5480, -5961, -3321, 465, 3842, 6293, 5328, 1468, -2282, -5572, -6237, -3454, 705, 4510, 6303, 4874, 1257]
1219A257l668k435l53K440L347L241J841j065l276l639l106J34K264L533L887
1234D402J342j546l352l744k415J62K582L279L255J688j698k775l689k699k57
1249e465K661L593L192J949j589l548l283k574k35K771L654L146Q69j342k890
1264I09l508k247N5K333L178L367J346j617l338l419k102K72K672L335K984Q80
1280E100j545l051l363j953j12K548L649K913R83j481l170l507j861L15K482L201
1296A148K587J052j534k821l171k074N57K392K956K650J242j709l222k883j694
1311d524J08K523L383K484O36j466l014l088j629O11K232L148K533Q83j919l037
1327a36k756j874P95K326L337K367M24j818k868k498j570O94K229L134K176L78
$$ y = [1257, -2411, -4846, -5199, -2759, 588, 3829, 5670, 4605, 1329, -2310, -5416, -5282, -3018, 515, 4402, 5744, 4198, 846, -2898, -5313, -5151, -2569, 710, 3965, 5653, 3955, 1180, -2509, -5208, -5465, -2804, 789, 3981, 5930, 4341, 793, -2490, -5064, -5299, -2528, 1126, 4272, 5141, 3799, 909, -2599, -4846, -4791, -2458, 720, 4087, 5433, 3816, 478, -2941, -5043, -4771, -2099, 1236, 4220, 5100, 3555, 504, -2859, -4812, -4924, -2376, 1273, 4186, 5169, 3688, 518, -2989, -4850, -4535, -2053, 1148, 3735, 4787, 3253, 432, -2739, -4813, -4256, -1864, 1092, 3742, 4984, 3275, 53, -2830, -4524, -4416, -1893, 1490, 3974, 4610, 3144, 130, -2958, -4587, -3976, -1744, 1404, 3937, 4820, 2901, -136, -2892, -4766, -3971, -1645, 1692, 4059, 4483, 2665, -203, -2701, -4271, -3577, -1348, 1786, 3962, 4340]
1343D340j741k812k676j789R84K608K625K181N47j837k758k759j362Q99K539K623
1359A612K282L39j836k716k652j329R96K110K834K005J57j428k783k654j136R39
1375c260K470K640J891L7j396k818k442j458R62K785K238J945K50j627k945j938
1391b666j258P22K656K265J759L6j800j893k704j083R44K426K295J871M1j683
1407A928k873j841j128N72L288K298J281R9j655k938j715j138J094K535K238J583
1423C628p4j854k908j765q51J217K470K258J420k32k109k359j343j110J011K495
1439a06K287J317l34j819k322j700o81Q50K565J945J174K75k041k738j477l53
1455c158O66K602K092J025Pj894k519j427o15J038K012K466Q89j04j809k415j602
$$ y = [4340, 2599, -213, -2889, -4678, -3694, -1086, 1539, 3720, 4267, 2430, -328, -3087, -4449, -3550, -1011, 1612, 3894, 4233, 2397, -319, -2971, -4300, -3304, -1194, 1640, 3645, 3802, 2374, -409, -3063, -4199, -3260, -790, 1850, 3741, 3778, 2382, -436, -2878, -4336, -3374, -589, 1649, 3594, 3844, 2217, -728, -2666, -3924, -3202, -546, 1719, 3478, 3514, 1714, -179, -2883, -3966, -3022, -596, 1699, 3570, 3611, 1928, -945, -2786, -3914, -3342, -54, 2244, 3525, 3624, 1969, -969, -2684, -3822, -2728, -193, 2045, 3628, 3554, 1700, -1208, -2973, -3824, -2607, -137, 2121, 3541, 3309, 1200, -1159, -2502, -3612, -2601, -106, 2181, 3498, 3164, 1345, -977, -2677, -3358, -2508, 57, 2002, 3176, 3451, 1410, -1328, -2805, -3158, -2492, 110, 2202, 3227, 3234, 1340, -1179, -2606, -3221, -2183, -171, 2295, 3184, 3080, 1271, -1144, -2746]
1472b746o61J131K556J921R11j67j987k400j407k32R64K517J845P61k11j877k153
1489a235j304n85J204K144J879J012m08j947k482j053j59J165K485J654O03m03
1505B570k120j888r00m03R30K124J571P11J36j917k303j052l46J225K455J664
1521B457L02k88k121j929q66j42J008K254J577M89n77j619k106r62J07J160J766
1538E10J661N88o55j706j992j310J63J459K026J519K12l29j813j832j095j18J535
1555a177J975J145N16m77j791j913m89j55J023K185J180M29p68j315k132o67J39
1572b292J248K466P54P7m65j509k099m08O9J100J747J631L1p27j440j800j048
1589b665K43J644J957J008J71o33k039j325m74K4J454J640J026N0o05j661j475
$$ y = [-2746, -3407, -2276, 280, 2201, 3112, 2945, 958, -1442, -2849, -3081, -2117, 400, 2245, 3006, 2795, 918, -1235, -2539, -3124, -1920, 224, 2103, 3115, 2707, 760, -1722, -2775, -2934, -1769, 716, 2370, 2973, 2570, 450, -1438, -2338, -2741, -1811, 313, 1884, 2595, 2731, 814, -1489, -2541, -2887, -1662, 793, 2457, 2759, 2471, 350, -1579, -2445, -2587, -1579, 675, 2252, 2741, 2164, 545, -1561, -2523, -2416, -1256, 510, 2171, 2759, 2104, 398, -1594, -2904, -2741, -1282, 744, 2263, 2475, 2146, 333, -1499, -2594, -2712, -1177, 798, 1943, 2459, 1982, 191, -1722, -2211, -2366, -1343, 842, 2022, 2451, 1683, 368, -1764, -2431, -2292, -1044, 1422, 2176, 2253, 1788, 279, -1820, -2228, -2159, -1059, 688, 2319, 2350, 1623, 183, -1617, -2665, -2422, -778, 1179, 2187, 2358, 1725, -314, -1639, -2113, -2089, -635, 1005, 2031, 2081, 1476, -185, -1660]
1606a660l91J23R72K021J165J49p18k042j797M5K9J503J893R75j84p65j646j822
1624b150m6O10P67J851J041m2n14j629j658n21L91J244J837Q78J15j002j427j357
1642a612o88N46J249J949M17L7o71j788j248l31M79J235J859N88o3o12j803j291
1660a748m45N32J353J569Q19m65o49j077j846N1K73J430J518R91m40j261j117
1677e12j523p8O12J376J316J021l32q56j658j084m17Q49R72J527P38m20q17j523
1695h09r70j07K77J349J497R54m36j198j393q57l59O53J318J437P80l61r69j484
1713f78j038k40Q15J189J403O02l18q95j634r20j44M29J497Q44O44Pq51j508q11
1732a607k35Q78R98J412L08j21j349r87j030j81Q69J271J195M98k18j352j094
$$ y = [-1660, -2051, -1928, -956, 1065, 2230, 2379, 1661, -381, -2178, -2133, -2104, -601, 1292, 2267, 2083, 1318, -328, -2150, -2196, -1586, -819, 1032, 2073, 2031, 1517, -112, -1770, -2291, -1900, -656, 1181, 2059, 2174, 1172, -255, -1612, -2300, -1754, -505, 1444, 1861, 1898, 1227, -561, -1809, -2140, -1661, -426, 1433, 2021, 1958, 1346, -457, -1748, -2193, -1661, -308, 1261, 2080, 1615, 966, -111, -1957, -1906, -1633, -203, 1315, 2306, 1866, 605, -512, -2035, -2113, -1501, -125, 1191, 2212, 1880, 1024, -634, -1718, -2135, -1286, -314, 1213, 1951, 1531, 714, -809, -1779, -1886, -1609, -260, 1237, 2191, 1755, 557, -836, -1693, -2052, -1399, -81, 1356, 2136, 1775, 806, -678, -1716, -1956, -1141, 48, 1451, 2053, 1735, 840, -794, -1714, -1858, -1429, 68, 912, 1556, 1563, 712, -796, -1607, -1842, -964, 34, 1446, 1754, 1633, 284, -703, -1733, -1914, -1045, 226, 1421, 1919, 1701, 349, -745]
1749g45j141J50P96J007J103O00k14j087j032j420L3Q22J165J361L09o3j267j274
1767h97q22K59M21J094J296O04p39p87j253r92L81M40J550R33K75n94j111j137
1785a079p12J22Q52J201J098J3l78j042r28p11K2O47R73J446J96l90j001j376
1803a047p43K94P46J141J162M08q40j178j054o94L03Q47J105J017J46m25r72j463
1821a247m64M59N44J167J098K85n52j076j355l32M0R43J081Q48L88r17j264o24
1839i78o95M40N91J430M84K00m57j187q94n68M14O41J033Q44R5n71o61j457j46
1858a442J2J209J227M42j19n23r29r58j10j86J010J127O55Q5q89p84q31o14L45
1877a273R37Q64R98p4q00q72o77o17N42O33J077P83j18m62j128q98l15M31O54
$$ y = [-745, -1886, -1736, -940, 67, 1170, 1770, 1556, 469, -563, -1983, -1950, -1128, 37, 1398, 1707, 1644, 377, -897, -1719, -1460, -1039, 55, 1351, 1955, 1216, 429, -824, -1816, -1435, -995, 555, 1488, 1763, 1169, 58, -1079, -1791, -1669, -817, 384, 1482, 1495, 1117, 75, -853, -1564, -1542, -895, 78, 1524, 1720, 1330, 329, -1047, -1790, -1496, -750, 391, 1553, 1961, 1121, -57, -1111, -1805, -1502, -655, 450, 1467, 1613, 1188, 216, -1247, -1711, -1252, -708, 459, 1557, 1842, 1290, 214, -1141, -1473, -1433, -490, 591, 1439, 1827, 910, -354, -978, -1673, -1233, -642, 788, 1272, 1472, 1015, -172, -1066, -1634, -1220, -579, 454, 1298, 1393, 822, 161, -1296, -1442, -1430, -221, 1006, 1448, 1329, 806, -123, -1081, -1191, -1377, -367, 760, 1415, 1500, 611, -173, -1004, -1618, -1273, -336, 528, 1526, 1452, 652, -220, -897, -1514, -972, -339, 738, 1521, 1403, 941, -187, -1085, -1400, -969, -315]
1896c15J051Q50oj071q40p32o70O27R97Q80M81J46p44j016j031j71L86J142Q29
1915G93N12M02j099j133q21j71L83J089P91N76Q7q87p68q95l41M51J237O68M08
1934A282K7r26q20o04m23L01J181O88O27k17p08j038o33j10L31R67Q80N50n1j315
1954a1o64o48k37O54Q08R78N76k48q13r84p05j82O33J079N25P41j95r11j316l83
1974a303p5O27P69R48N59m24q26q31n08k42N07Q12P36N53k04o85q12p11k99N15
1994h94J126M77P14l01r54p40o36k76P67J140N53K66j12q62r70m67j62N43J317
2013E29N50K29m95n31j100o23J99M74J219M98M38n05n71j072n30L5O85R24P27
2032A080J63m50n76p82o29Q3O42R22P03p4j32r70p64o36J00P09R90N03L69n07
$$ y = [-315, 736, 1586, 1580, 509, -331, -1063, -1733, -1106, -109, 771, 1252, 1398, 654, -362, -1393, -1564, -1178, -36, 793, 1305, 1707, 608, -525, -1346, -1517, -1134, -45, 746, 1322, 1409, 522, -246, -1141, -1482, -1031, 206, 874, 1282, 1309, 383, -437, -1041, -1464, -1163, 18, 706, 1333, 1116, 408, -630, -1263, -1373, -1042, -75, 805, 1355, 1304, -11, -675, -1323, -1560, -906, -98, 880, 1456, 1208, 395, -589, -1294, -1476, -843, 236, 761, 1502, 1307, 396, -920, -1303, -1378, -751, 18, 966, 1525, 1101, 275, -556, -1064, -1306, -799, 13, 749, 1302, 1098, 413, -399, -1110, -1409, -894, 232, 709, 1423, 1122, 168, -572, -1208, -1484, -717, 423, 976, 1242, 1130, 268, -702, -1169, -1331, -788, 529, 1079, 1308, 813, 282, -818, -1441, -1242, -768, 451, 949, 1387, 882, 311, -761, -1291, -1256, -571, 353, 1080, 1243, 793, 217, -565, -1194, -1111, -469, 453, 1156, 1082, 950, -20, -784, -1420, -1320, -611, 379, 882, 1251, 744]
2052G44q68r01l6o5N97J059N20L02m28q97o74n48j2O88J124N58o5k81p76q28l78
2073a165k29Q90O68P78K29l20r61q46k84K26P19O96O77J69k70j366l84n17M82
2092h08L98J187K65J97m07j187o42k34M19N41Q76L66N12q74n56j169j53J50J052
2111f7Q83K71J03k96q47j029m9J75Q46P45M45J54o22j100p28j6J95N62J018O25
2131A268j85n12n80j002m87M24J033Q59L87K80q99p74q97j06L17O45J031L13K17
2150A332p25q52p84l67L57P19J034N43o4p54q79p63m6L42Q67J019J42p1m99j083
2170e32l71l99M07J016P41M06l22o71q29l96j85M21Q22R28J35j84l79j049n73
2189a014k66N19P41P04O97k94n98r96m38k36L80P18J038L19l98o94n71p47r5L84
$$ y = [744, -124, -1025, -1061, -1126, -529, 530, 1050, 1352, 924, 27, -647, -1195, -1207, -519, 605, 1163, 1098, 817, 41, -787, -1165, -1394, -504, 164, 942, 1171, 851, -110, -956, -1240, -1014, -295, 401, 1078, 1247, 977, -389, -773, -1290, -808, -410, 777, 1042, 1239, 832, -355, -997, -1231, -812, -271, 605, 971, 1483, 609, 53, -1116, -1269, -1119, -67, 816, 1087, 1190, 894, 47, -982, -1031, -856, -10, 735, 1180, 1334, 712, -388, -1116, -1132, -937, -375, 643, 1268, 1083, 571, -9, -1011, -1498, -1074, -41, 818, 1205, 1485, 586, -188, -1085, -1191, -874, -229, 802, 1115, 1332, 607, -245, -1029, -1396, -1039, -320, 714, 1257, 1193, 439, -440, -1203, -1249, -907, -40, 979, 1121, 1050, 551, -532, -903, -1302, -895, 121, 862, 1268, 946, 275, -554, -950, -1135, -714, 108, 1036, 1171, 987, 608, -441, -1014, -1280, -761, -20, 684, 1381, 1087, 489, -507, -945, -1181, -801, -83, 955, 1274, 876, 182, -389, -1136, -1231, -847]
2209h47J186O25L52l13q28o67m28j41L95P68N60N62j52o32r46p10j09O34Q27P07
2229H43K00p6q24j147k86K91M02O95Q22L27m24p59p72m90J35O16P19O71K29j25
2249A047r16p00n44j01Q82M11Q46K37k78n82j112l40J27M07O79J108J27n89m13
2268B96p55q53L71N13M84P10J06J16q02q56n23J44O54Q61N67o2j86o77o74n87
2288a153j18O66P86N97N54l53o66j004l81L0M13J140N96J27k48q95o93p17M08
2307i11M55O46O04N03m51p60o40n64K30N26P35M96L87n13n70j149k19L39M44P59
2327C47P43J38o76n18q31m68K68M03J026O97j2k96j009l76o21P3P12P12O38K46
2347A196o29o23q53j32J46M89Q32N63r8k47p57o87l87K45O27O02R06k74l79p01
$$ y = [-847, 339, 964, 1316, 1003, 175, -492, -920, -1061, -666, 102, 662, 1224, 1072, 440, -506, -1216, -1325, -691, 136, 843, 1043, 967, 143, -1004, -1290, -999, -597, 98, 920, 1247, 823, 64, -708, -1198, -1063, -447, 272, 943, 1172, 1047, 131, -569, -1113, -1214, -332, 79, 925, 1162, 884, 302, -810, -1150, -1023, -616, 63, 1171, 1298, 709, 296, -459, -1312, -941, -428, 56, 766, 872, 988, 186, -670, -1193, -1049, -395, 466, 1033, 971, 785, 108, -566, -1153, -1271, -605, 181, 778, 1332, 979, 313, -691, -1072, -1042, -629, 511, 1107, 1234, 986, 91, -602, -1319, -911, -456, 190, 794, 1297, 846, 86, -554, -1118, -888, -362, 373, 869, 1256, 743, 173, -976, -1195, -856, -412, 347, 1090, 1228, 552, 34, -797, -1265, -997, -594, 432, 1129, 1117, 821, -188, -564, -1185, -1112, -400, 312, 950, 1196, 567, -56, -909, -1041, -895, -406, 426, 989, 891, 644, -113, -800, -1187, -942, -315, 287, 1193, 919, 540, -161]
2367a61q17j30K26M71R17M68P6m62r56k99l35N8P85O62P21k64k96p41p11k87J65
$$ y = [-161, -978, -1108, -882, -411, 506, 974, 1050, 588, -368, -667, -1002, -944, -159, 503, 1224, 960, 664, -77, -788, -1075, -910]
$$ [...]
8191D9
##END NTUPLES=NMR FID
##END=
