##TITLE=1H_LR-738-PE-K
 CDCl3
 8 sc, 
 10.11.2021
##JCAMPDX= 6.0         $$ Bruker NMR JCAMP-DX V2.0
##DATA TYPE= NMR FID
##DATA CLASS= NTUPLES
##ORIGIN= UXNMR, Bruker Analytische Messtechnik GmbH
##OWNER= root
$$ XWIN-NMR		Version 3.5
$$ Wed Nov 10 10:47:49 2021 Russian Standard Time (UT+4h)  she@DPX200
##.OBSERVE FREQUENCY= 200.1313468511
##.OBSERVE NUCLEUS= ^1H
##.DELAY= (6, 6)
##.ACQUISITION MODE= SIMULTANEOUS
##.ACQUISITION SCHEME= undefined
##.AVERAGES= 8
##.DIGITISER RES= 18
##SPECTROMETER/DATA SYSTEM= spect
##.PULSE SEQUENCE= zg30
##.SOLVENT NAME= CDCl3
##.SHIFT REFERENCE= (INTERNAL, CDCl3, 0, 15.7039)
##AUDIT TRAIL= $$ (NUMBER, WHEN, WHO, WHERE, WHAT)
$$ ##TITLE= Audit trail, XWIN-NMR		Version 3.5
$$ ##JCAMPDX= 5.01
$$ ##ORIGIN= Bruker BioSpin GmbH
$$ ##OWNER= she
$$ F:/spectra/data/she/nmr/H-F/1/audita.txt
$$ ##AUDIT TRAIL=  $$ (NUMBER, WHEN, WHO, WHERE, WHAT)
(   1,<2021-11-10 10:46:36.96 +0400>,<she>,<DPX200>,
      <created by zg, POWCHK disabled, PULCHK disabled
       configuration hash MD5:
       00 E9 B6 7A A2 85 ED C7 34 08 36 98 17 FE 4E 26
       data hash MD5: 16K
       1A 03 1A 56 6E D2 BA 90 6C 43 7F BA 61 50 8E 5C>)
$$ ##END=
$$ 
$$ hash MD5
$$ 5A C2 F3 93 C1 3B B0 1E 16 31 BA F2 57 B1 CC BD
##$RELAX= 
##$RELAX= 
##$RELAX= 
##$RELAX= 
##$RELAX= 
##$RELAX= 
$$ Bruker specific parameters
$$ --------------------------
##$DU= <F:/spectra>
##$EXPNO= 1
##$NAME= <H-F>
##$PROCNO= 1
##$TYPE= <nmr>
##$USER= <she>
##$AMP= (0..31)
100 100 100 100 100 100 100 100 100 100 100 100 100 100 100 100 100 100 
100 100 100 100 100 100 100 100 100 100 100 100 100 100 
##$AQSEQ= 0
##$AQ_mod= 1
##$AUNM= <au_zg>
##$AUTOPOS= <>
##$BF1= 200.13
##$BF2= 200.13
##$BF3= 200.13
##$BF4= 200.13
##$BF5= 200.13
##$BF6= 200.13
##$BF7= 200.13
##$BF8= 200.13
##$BYTORDA= 1
##$CFDGTYP= 0
##$CFRGTYP= 5
##$CHEMSTR= <none>
##$CNST= (0..31)
1 1 145 1 1 1 1 1 1 1 1 1 1 1 1 1 1 1 1 1 1 1 1 1 1 1 1 1 1 1 1 1 
##$CPDPRG= <>
##$CPDPRG1= <>
##$CPDPRG2= <>
##$CPDPRG3= <>
##$CPDPRG4= <mlev>
##$CPDPRG5= <mlev>
##$CPDPRG6= <mlev>
##$CPDPRG7= <mlev>
##$CPDPRG8= <mlev>
##$CPDPRGB= <>
##$CPDPRGT= <>
##$D= (0..31)
0 1.2 0 0 0 0 0 0 0 0.06 0 0.03 0 0 0 0 0.0002 0 0 0 0 0 0 0 0 0 0 0 0 
0 0 0 
##$DATE= 1636526796
##$DBL= (0..7)
120 120 120 120 120 120 120 120 
##$DBP= (0..7)
150 150 150 150 150 150 150 150 
##$DBP07= 0
##$DBPNAM0= <>
##$DBPNAM1= <>
##$DBPNAM2= <>
##$DBPNAM3= <>
##$DBPNAM4= <>
##$DBPNAM5= <>
##$DBPNAM6= <>
##$DBPNAM7= <>
##$DBPOAL= (0..7)
0.5 0.5 0.5 0.5 0.5 0.5 0.5 0.5 
##$DBPOFFS= (0..7)
0 0 0 0 0 0 0 0 
##$DE= 6
##$DECBNUC= <off>
##$DECIM= 32
##$DECNUC= <off>
##$DECSTAT= 4
##$DIGMOD= 1
##$DIGTYP= 9
##$DL= (0..7)
0 120 120 120 120 120 120 120 
##$DP= (0..7)
150 150 150 150 150 150 150 150 
##$DP07= 0
##$DPNAME0= <>
##$DPNAME1= <>
##$DPNAME2= <>
##$DPNAME3= <>
##$DPNAME4= <>
##$DPNAME5= <>
##$DPNAME6= <>
##$DPNAME7= <>
##$DPOAL= (0..7)
0.5 0.5 0.5 0.5 0.5 0.5 0.5 0.5 
##$DPOFFS= (0..7)
0 0 0 0 0 0 0 0 
##$DQDMODE= 0
##$DR= 18
##$DS= 0
##$DSLIST= <SSSSSSSSSSSSSSS>
$$ [...]
##$SUBNAM2= <"">
##$SUBNAM3= <"">
##$SUBNAM4= <"">
##$SUBNAM5= <"">
##$SUBNAM6= <"">
##$SUBNAM7= <"">
##$SUBNAM8= <"">
##$SUBNAM9= <"">
##$SW= 18.0517286264689
##$SWIBOX= (0..15)
0 0 2 0 0 0 0 0 0 0 0 0 0 0 0 0 
##$SW_h= 3612.71676300578
##$TD= 16384
##$TD0= 1
##$TE= 0
##$TE2= 300
##$TE3= 300
##$TEG= 300
##$TL= (0..7)
0 120 120 120 120 120 120 120 
##$TP= (0..7)
150 150 150 150 150 150 150 150 
##$TP07= 0
##$TPNAME0= <>
##$TPNAME1= <>
##$TPNAME2= <>
##$TPNAME3= <>
##$TPNAME4= <>
##$TPNAME5= <>
##$TPNAME6= <>
##$TPNAME7= <>
##$TPOAL= (0..7)
0.5 0.5 0.5 0.5 0.5 0.5 0.5 0.5 
##$TPOFFS= (0..7)
0 0 0 0 0 0 0 0 
##$TUNHIN= 0
##$TUNHOUT= 0
##$TUNXOUT= 0
##$USERA1= <user>
##$USERA2= <user>
##$USERA3= <user>
##$USERA4= <user>
##$USERA5= <user>
##$V9= 5
##$VALIST= <valist>
##$VCLIST= <CCCCCCCCCCCCCCC>
##$VD= 0
##$VDLIST= <DDDDDDDDDDDDDDD>
##$VPLIST= <PPPPPPPPPPPPPPP>
##$VTLIST= <TTTTTTTTTTTTTTT>
##$WBST= 1024
##$WBSW= 4
##$XGAIN= (0..3)
0 0 0 0 
##$XL= 0
##$YL= 0
##$YMAX_a= 159364
##$YMIN_a= -78449
##$ZGOPTNS= <>
##$ZL1= 120
##$ZL2= 120
##$ZL3= 120
##$ZL4= 120
##$ABSF1= 10
##$ABSF2= 0
##$ABSG= 5
##$ABSL= 3
##$ALPHA= 0
##$AQORDER= 0
##$ASSFAC= 0
##$ASSFACI= 0
##$ASSFACX= 0
##$ASSWID= 0
##$AUNMP= <proc_1d>
##$AZFE= 0.1
##$AZFW= 0.1
##$BCFW= 1
##$BC_mod= 2
##$BYTORDP= 1
##$COROFFS= 0
##$CY= 11.3945322036743
##$DATMOD= 1
##$DC= 2
##$DFILT= <>
##$DTYPP= 0
##$F1P= 2.36226072786647
##$F2P= -0.459571619588291
##$FCOR= 0.5
##$FTSIZE= 0
##$FT_mod= 4
##$GAMMA= 1
##$GB= 0.15
##$INTBC= 1
##$INTSCL= 1
##$ISEN= 128
##$LB= 0.24
##$LEV0= 0
##$LPBIN= 0
##$MAXI= 10000
##$MC2= 0
##$MEAN= 0
##$ME_mod= 0
##$MI= 1.114404
##$NCOEF= 0
##$NC_proc= 0
##$NLEV= 6
##$NOISF1= 3.799351
##$NOISF2= 2.8
##$NSP= 1
##$NTH_PI= 0
##$NZP= 0
##$OFFSET= 15.70392
##$PC= 1
##$PHC0= -15521.88
##$PHC1= 36.60082
##$PH_mod= 1
##$PKNL= yes
##$PPARMOD= 0
##$PSCAL= 0
##$PSIGN= 0
##$REVERSE= no
##$SF= 200.130013532006
##$SI= 16384
##$SIGF1= 3
##$SIGF2= 2
##$SINO= 400
##$SIOLD= 16384
##$SREGLST= <1H.CDCl3>
##$SSB= 0
##$STSI= 0
##$STSR= 0
##$SW_p= 3612.71676300578
##$SYMM= 0
##$S_DEV= 0
##$TDeff= 0
##$TDoff= 0
##$TI= <>
##$TILT= no
##$TM1= 0
##$TM2= 0
##$TOPLEV= 0
##$USERP1= <user>
##$USERP2= <user>
##$USERP3= <user>
##$USERP4= <user>
##$USERP5= <user>
##$WDW= 1
##$XDIM= 8192
##$YMAX_p= 0
##$YMIN_p= 0
$$ End of Bruker specific parameters
$$ ---------------------------------
##NTUPLES= NMR FID
##VAR_NAME=  TIME,          FID/REAL,        FID/IMAG
##SYMBOL=    X,             R,               I
##VAR_TYPE=  INDEPENDENT,   DEPENDENT,       DEPENDENT
##VAR_FORM=  AFFN,          ASDF,            ASDF
##VAR_DIM=   8192,          8192,            8192
##UNITS=     SECONDS,       ARBITRARY UNITS, ARBITRARY UNITS
##FACTOR=    0.0002768,     1,               1
##FIRST=     0,             0,               0
##LAST=      2.2672688,     0,               0
##MIN=       0,             -78449,          0
##MAX=       2.2672688,     159364,          0
$$ Real data points
##PAGE= N=1
##DATA TABLE= (X++(R..R)), XYDATA
0@%%%%%%%%%%%%%%qJ6j6J6j6K4l2L2m0M8n5O4p3Q8j02J16j33J51j69J92k19K46
36A30k76L10l48L89m33M82n36N94o58P26q01Q85r74J073j183J306j438J583j749
55i18J934k145K386k665K993l382L857m448N209o236P702r983J4059k3667R4241
70G8937Q0427l4824K4448r868j1677k3804l042j6427j8589k7687j2575j2139j5000
83a820k5089j0330l513p219j3629M42M710J207M09R065P564P264P661Q762P068
98g448Q833N619K052J140L188j316l419l510n232p802o221p778q424m658m387
113c9363q235n063J755L96k555L952Q604M732L989R515J1001Q786O449P659R320
128B0942P789K372J798N511J668n055m228K78m624j0941o805m113p705j0154n958
$$ y = [0, 0, 0, 0, 0, 0, 0, 0, 0, 0, 0, 0, 0, 0, 0, -8, 8, -8, 8, -8, 16, -16, 16, -24, 24, -31, 33, -40, 48, -54, 62, -71, 80, -89, 103, -116, 130, -146, 164, -184, 205, -228, 254, -282, 312, -346, 380, -421, 464, -510, 563, -620, 686, -752, 831, -918, 1016, -1129, 1257, -1408, 1585, -1797, 2060, -2388, 2821, -3415, 4287, -5696, 8363, -15304, 78937, 159364, 124540, 148988, 139120, 127443, 103639, 100597, 84170, 65581, 37894, 25319, 13180, -1820, -26909, -37239, -40752, -47971, -61600, -61158, -56448, -55241, -54832, -45767, -38203, -30939, -23278, -14516, -7448, 1385, 7004, 9056, 10196, 13384, 12068, 8649, 5139, -93, -7895, -14116, -21894, -30318, -34976, -39363, -47598, -52661, -50906, -50510, -53065, -49113, -40509, -35777, -31788, -22273, -11272, -2486, 3963, 11622, 20942, 28731, 31103, 32901, 38412, 40080, 35025, 30797, 31075, 26451, 15510, 8705, 4592, -3113, -13267, -19225]
143a9225m243n059n655l143O04J378l14J659O325N942L328N963R639O207L557
158F963O990Q073L729K070L426L282J33r73k12j160k756l806l244j752l449n148
174A2166k423j183l339l329N07j34j493j044J452J179p71Q09J326J040n55l98
190C810M65k02j407k207m42n85l520k776p93j643l902j734K97j759k669L25J345
207a7397R0r4J420K900J927R29K025M161K600M52K209M024J529l62J708K705o47
224A0179q56M09P49j291k046o44j7j436k500j386P1j316l045o98O44j846j827
241f856M2L93q19j528M20J172p86p72Q96P07j60l34O51J256j48QJ337J349J4M24
261b734K047J408q1Q58K340J338J30Q54K276R33k08Q64J537N10o50N34Q93j15
$$ y = [-19225, -23468, -28527, -34182, -37325, -36721, -35343, -35657, -33998, -27673, -21731, -18403, -12440, -2801, 3406, 6963, 13953, 22026, 25755, 27825, 31251, 34533, 34666, 33693, 33481, 32321, 29565, 25759, 22515, 20763, 17314, 12166, 9743, 8560, 5221, 1892, 2399, 2265, 772, -272, 1180, 2359, 1588, 2397, 3723, 4763, 4208, 3810, 4275, 4073, 2666, 459, 17, -568, -4088, -6864, -7657, -9300, -13202, -14936, -14639, -16398, -19067, -18742, -17397, -17307, -17401, -15981, -13081, -11154, -10225, -8200, -4039, -1439, -987, 1222, 5246, 6775, 6413, 8121, 10826, 10179, 9323, 9732, 10481, 9190, 7144, 6500, 6483, 5047, 2547, 1161, 1232, -84, -3129, -3827, -3183, -5029, -6856, -6814, -6421, -7240, -8768, -8348, -7176, -7962, -8734, -7838, -7131, -7291, -7625, -6974, -5718, -5866, -5858, -4521, -3172, -3158, -2734, -687, 721, 640, 1498, 3838, 5176, 5306, 6160, 8436, 9369, 9161, 10025, 11562, 12072, 11422, 11956, 12849, 12734]
279A2734j341m17Q53o11j936r74L60j216k414j283Qj540k887j328o76j521k800
296f989j275l80j539k213j005Q10j444j593N20J296Kl29J849K083P53J003K548
313e903K943J459J230L127K824J007J242K249K270J45J4J373J150r11n98K89l80
330A3530j826j360j96p78k564j299k07k53k260j251L32j27j871r42Q78p66j262
347b222j163M09n13k313o01j66j449k231j106k65j663k172p82K72j005j573M0
364a8503J123j05l04J524K592J017O44L213L060J660J317L382L166J581J494K646
380I507K704M62L30J590J436q29q90N33j07k014j692k45l59k354j808Q5n52k106
398C691j368M34j14j655p36R67J92j059l03J021J51j199J94J129k26j387P0J315
$$ y = [12734, 11393, 10976, 11829, 11218, 9282, 8308, 8668, 7452, 5038, 3755, 3763, 2223, -664, -1992, -2668, -4189, -6989, -8264, -8644, -10183, -12396, -13401, -12591, -14035, -15628, -15108, -13812, -13810, -14139, -12290, -10207, -9454, -8451, -5903, -2960, -1501, -271, 2856, 5680, 6687, 7929, 10178, 12448, 12593, 12607, 13980, 15130, 14219, 13621, 13910, 13530, 11704, 10344, 10148, 9370, 6806, 5507, 5300, 5047, 2787, 1536, 1868, 1741, -130, -1072, -194, -960, -2222, -3385, -2976, -3489, -5802, -6403, -6569, -8018, -10249, -11355, -11620, -13283, -15455, -16237, -15965, -16970, -18543, -18503, -17380, -17485, -17789, -16265, -13673, -12656, -12012, -8799, -5739, -4079, -2762, 620, 3786, 5367, 6861, 9507, 12211, 12673, 13003, 14593, 16029, 15200, 14310, 14843, 14736, 12722, 11030, 10785, 10426, 8072, 6264, 6349, 5797, 3691, 2323, 2757, 2643, 988, 252, 1219, 1411, 352, 49, 1070, 1221, 22, 216, 1345, 1119, -268, -198, 1117]
416A117o01j262N56P65p30o69K08J441l94m06O18J411k55n78R48J009l69j163
434A646R15P29r43j682O14J03j684j348R0l95j431j506N6J10j139j451R09M16
452e991j172m01R10J114j339j08J227M97q53j08J192j24j149k02N85k37j013m14
470g586L38M20r62L69J605M53l37J178K607R04J315K383K678J305J242K098K582
487A2592Q65M20J119J261n74p91l62l47j963k724j378j152l339k865j263j631
503b132k521j995o79n25p96p46J375J206N47J094K188K493J236J533L296K076
519G650M45J249J617J014n68j85K2j170j906j517j068j787k460k044o16j731k197
536e252l52J4n05n89P63J283K96L64J237J953J123L59Q16J243K5j047K3l06j949
$$ y = [1117, 516, -746, -190, 575, -155, -824, -616, 825, 431, 25, 643, 2054, 1799, 1221, 2169, 3178, 2809, 1646, 2561, 3290, 2347, 665, 1279, 1382, -302, -1650, -1560, -1955, -3386, -4892, -4836, -4726, -5865, -7316, -6407, -5991, -7163, -7564, -6654, -5540, -6879, -6987, -5760, -5263, -6116, -6224, -5032, -5156, -6305, -6507, -5922, -6159, -7172, -7586, -7248, -6828, -7790, -7421, -5816, -5363, -5700, -4522, -1915, -1011, 304, 2687, 5365, 6670, 7912, 10010, 12592, 13457, 13877, 14996, 16257, 15683, 14892, 14530, 14183, 12220, 9496, 8118, 6966, 3627, 762, -501, -2132, -4653, -6648, -7327, -7852, -8648, -9394, -8019, -6813, -6266, -5172, -2984, -491, 745, 2278, 5574, 7650, 8095, 9344, 10961, 11975, 11407, 11222, 11244, 10074, 8168, 6651, 5583, 3796, 1336, -708, -1324, -3055, -5252, -5604, -5590, -6095, -6684, -5921, -4638, -4342, -3978, -2741, -788, 335, 694, 1510, 2753, 2778, 1731, 1754, 1448, -501]
555e01k292j473j644k891k860j928k169k362k367p84n30r85k08P52J911J363J697
572a7271L639L252K560L147M346L731K907L006L670K091J867J885J642P30l29
587B0873k84k13o73j961j232j026j400k497j414q17j078k010q12K82o69q18J03
604D354P05l86l10J93L72k70q65q49j61p52j766j384j351k151k690j490j149j863
622a1813k349j204o79j248m72M06R50O1P80J874K014J794K111K238L160J633J642
639H98K687K503L43J263J632P57K6j30J34m11j094q87o52m63j783j662j87q02
657B172j100r97j29m04p29l92O05K1m56m4P98j1n42q7N94n30j047l98L92o34j127
678d045o66L66p73p59k22N77l56m9P32J264M97J60J737J473Q68Q17J650J516Q68
$$ y = [-501, -2793, -4266, -5910, -8801, -11661, -13589, -15758, -18120, -20487, -21271, -21801, -22786, -22994, -22242, -20331, -18968, -17271, -13632, -10380, -7820, -4673, -327, 3404, 6311, 9317, 12987, 15078, 16945, 18830, 20472, 21202, 20873, 20589, 20376, 19703, 17742, 16510, 15484, 14084, 11587, 10173, 9356, 8278, 6268, 5456, 5738, 5069, 4251, 4354, 5059, 4673, 4363, 4556, 4928, 4658, 3793, 2944, 2783, 2031, 265, -1119, -2470, -4621, -7311, -8801, -9950, -11813, -14162, -15366, -16045, -17293, -17765, -17359, -16409, -16348, -15568, -13694, -11680, -9886, -7775, -5537, -2377, -744, 898, 3585, 6088, 6431, 7694, 9326, 10083, 10109, 9979, 10113, 9702, 8608, 7721, 7069, 6606, 4823, 3161, 2974, 2172, 1072, 75, -54, -458, -1187, -1579, -974, -953, -1409, -1453, -655, -666, -1208, -1295, -701, -1231, -2278, -2676, -2284, -2918, -4045, -4711, -4345, -5118, -5877, -6099, -5522, -5878, -5927, -5195, -3931, -3434, -3274, -1537, -64, 804, 1621, 3271, 4787, 5655]
697E655M39J399J223l01J46M27J32o31j087k41k13j800j311n31j158j508j560
714i20n00p41j436p67K22l14p06p00J002o2m19M08Q05M79l93N49R39J91J37J46
734b080Q09K05j47j31O97J91p46K92O03J15k21O62R16K42l00Q87J103J45Q1R65
754D288O82J14Q7N19Q29o54m40L14k4j129n22l63n88j112j177o81n48j768j062
773c235l51p22j299j129J0J17j310j47J42M34l92L98Q89L94N30Q77J012R58O56
792b168N93J511O65J04J124J146K81k07K71J066N4n73K48J90n78m88m2J61n33
811B825o22l06M13o62m56Q7r5j54q91N96L48k70q32N20L82n19l48K24J72n57m40
832e85R9R2o54l49L81l90l65l46N67j97n71J12Q19K54j1M06J216M80O27M00Q80
$$ y = [5655, 6094, 7493, 8716, 8415, 8561, 8988, 9120, 8489, 7402, 7161, 6948, 5148, 3837, 3306, 2148, 640, -920, -1420, -2161, -3597, -4364, -4142, -4456, -5162, -5862, -4860, -4922, -5341, -4933, -4128, -3649, -4042, -3493, -2554, -2363, -2226, -2080, -1271, -1066, -1213, -1344, -647, -456, -1202, -910, -307, -192, -413, 249, 1165, 1407, 1107, 1994, 3097, 3242, 3323, 4288, 4970, 5084, 5171, 5690, 6519, 5865, 5425, 5739, 5715, 4586, 4064, 3701, 3113, 2001, 824, 143, -405, -2173, -3235, -3586, -4308, -5607, -6736, -6726, -6609, -7919, -8066, -7924, -7490, -7882, -7484, -6595, -6201, -5671, -4794, -3782, -2824, -2168, -1575, -64, 601, 705, 1829, 2975, 3256, 3049, 3320, 4386, 4440, 3867, 4115, 4305, 3727, 3239, 3197, 3358, 2825, 2203, 1897, 2310, 1648, 1192, 1279, 1184, 1030, 139, 735, 1083, 813, -19, 501, 883, 364, 16, 240, 412, -145, -585, -486, -394, -1048, -1397, -1016, -1406, -1771, -2117, -1550, -1747, -2318, -2206, -1387, -1133, -1144, -738, 478, 958, 1585, 1985, 2865]
853B865P78J98Q84R45K77k71J52L44j79n87l06j19q27j206o98o59j074j333j027
872a843p65j054j367n17o4j170n84j20K4l35n41O04Q41J1j26R84Q21K44J53P99
892d005N93J62O65O22N07O3J80Q94M78j88K49O56N63l7N68R85M21r0O28R32M83
913E329k27Q31N15M25rO6N27j15l95l23k11o40q23o88k30q01j434q12m84r07j207
934a613m95Jj069o51l48R0j88j10J23M12j58O2N68N41M66NQ95M76j58L31R83K37
956D00k02L3M52N4l26j58P53o6l21j63j3K97j98j43L66L35p47M8Q23l53%l99O52
979A124l00n43k51J96k03n09n38j08m46p23k56k1n0p58k22M76j5q64N51J46K87
1000c027j6O73O25J50K48R00N57K98M10M47P17L80J4K93M97M4m57N76J35l06n40
$$ y = [2865, 3643, 3841, 4725, 5670, 5947, 5676, 5828, 6172, 5993, 5406, 5100, 4981, 4154, 2948, 2250, 1591, 517, -816, -1843, -2608, -3662, -5029, -5546, -5610, -6780, -7364, -7484, -7460, -7795, -8336, -7732, -6891, -6880, -7006, -6022, -5201, -4957, -4804, -4005, -3412, -3250, -2585, -1963, -1456, -1393, -1213, -319, 159, -29, 220, 876, 1439, 1402, 1970, 2955, 3376, 3286, 3914, 4846, 5329, 5102, 5933, 6448, 6873, 6864, 6930, 7457, 7342, 6947, 6624, 6413, 5773, 4950, 4262, 4032, 3231, 1797, 985, 501, -406, -1613, -2108, -2107, -3176, -3827, -4175, -4085, -4273, -4383, -4260, -3848, -4006, -3944, -3376, -2835, -2369, -2364, -1469, -993, -1151, -820, 163, 400, 198, 231, 683, 737, 411, 253, 1006, 940, 619, 456, 443, 740, 542, 399, 765, 1100, 353, 401, 1224, 871, 871, 472, 1124, 824, 281, 30, 226, 23, -486, -1024, -1132, -1578, -2301, -2557, -2578, -2628, -3386, -3608, -3132, -3147, -4011, -3460, -3314, -3027, -3043, -2370, -1745, -1595, -1347, -447, 110, 408, 818, 1265, 1982, 2362, 2376, 2669, 3166, 3210, 2753, 3329, 3464, 3158, 2618]
1021B618M18j62n57n06J16q6n25j81j65J46m68k56J30K14o55L8M19k34o77P9L47
1042E3J29o28m8K72k42PJ12l0rj13l34L09j93J3j45P32m29l45J26O32j04k01O57
1065B21P8j75KK58N35m45j11L91M2k52o14J99M80o45p46L51K74j130n06J79q6
1086a700p23n8J07k79n52L3j63M37K99l60J82O75k18jJ059M24k32O61Q69L23l2
1107G51O34P53nK75L66L52k20pN66j76j07j79K22J17k58q18K43L06p11m56k6R3
1129A715m75m09j61jm11n07R2k3q17k62j06J96n15m09L91k96n85j71N3J16m08
1150b993k18K29q9O9Q8L01K38L42O0N95N17J7R1R43M17n1O18Q11K95j32O45L39
1172C132L23j03J06L25m46R9m79L45l55p50m38qn68q31O4r6o33p94J16k97m19
$$ y = [2618, 3036, 2874, 2317, 1811, 1927, 1841, 1316, 1135, 970, 1116, 648, 392, 522, 736, 81, 119, 538, 304, -373, -294, 53, 182, -446, -494, -222, -464, -457, -345, -375, -384, -497, -831, -522, -715, -702, -847, -115, -544, -889, -763, -131, -235, -436, 221, 299, 124, 126, 384, 919, 474, 363, 754, 796, 544, -70, 129, 609, -36, -782, -431, -157, -1287, -1793, -1614, -1700, -2423, -2481, -2374, -2653, -3205, -3172, -3335, -2898, -2599, -2959, -2777, -2102, -2320, -2321, -1262, -838, -1070, -409, 460, 783, 751, 1385, 2138, 2133, 2408, 2774, 3126, 2906, 2899, 3465, 3289, 3182, 3003, 3225, 3342, 3084, 2266, 2509, 2815, 2104, 1648, 1622, 1715, 1240, 831, 670, 669, 258, -249, -157, -180, -997, -1259, -1365, -1169, -1684, -2093, -1702, -1998, -2583, -2754, -2701, -2585, -2993, -3211, -2982, -3071, -3002, -2914, -2613, -2375, -2033, -1973, -1378, -861, -844, -753, 190, 607, 556, 1174, 1985, 2280, 2148, 2793, 3132, 3455, 3352, 3458, 3783, 3337, 3436, 2957, 3302, 2947, 2197, 1759, 1751, 1183, 352, 416, 320, -313, -1107, -991, -1288, -1707]
1193a707l59J78ll08r9J01k46l5qK35N82k72K56K6J35j28K6K65K40k22J56O50
1215e37J32j05LL55L58p1P5L48M39j25J98O07j09m3L78M10l4m05K74O1J18n80
1237A747j60K55k94n30k71J07n66n83k39p8n57n97r0R2m10j29J06l7Ll84N40P55
1259a320m21M23J86M01k9L22M88O03K63l01Q12L75J5J11L86k0k73k12N45o5m70
1280A819l54M41n58l77J18J85k62n33n19P49m64o14N5K62j03k70k0Lj64m39p8
1301a123J74j21m95rJ20l56l76j38K93k16k39M8M60k97j39M80L31J91J1L50N79
1322d72Q7K79M77M74L56J3L76N47j10J09L95K93n07k2K63L9m48k95j28r2n14o9
1344A051l37j07m25n99J55k05m02o9L6p0n33L31J78k55k52K44N29k92j36J69M07
$$ y = [-1707, -2066, -1888, -1891, -2199, -2298, -2197, -2443, -2478, -2486, -2251, -1669, -1941, -1685, -1659, -1524, -1652, -1626, -1361, -1121, -1343, -1187, -537, -405, -510, -507, -152, 206, 135, 210, 558, 997, 872, 1070, 1677, 1568, 1525, 1903, 2313, 2279, 1874, 2148, 2209, 2327, 1747, 1587, 1842, 1548, 1018, 747, 854, 288, -295, -534, -612, -1169, -1766, -1856, -1764, -2174, -2303, -2197, -2234, -2231, -2615, -2075, -1320, -1741, -1318, -1132, -731, -760, -438, 50, 653, 916, 615, 1427, 1802, 1817, 1928, 2314, 2294, 2021, 1809, 2354, 2289, 1819, 1465, 1906, 1348, 971, 1089, 1274, 1012, 479, -40, 709, 245, -369, -314, -52, -155, -425, -445, -442, -606, -1045, -1123, -949, -1070, -1565, -1574, -1454, -1810, -2186, -2324, -2031, -2247, -2486, -2438, -1978, -2275, -2414, -1934, -1603, -1412, -1401, -1051, -472, -385, -106, 371, 845, 1201, 1214, 1590, 2137, 2027, 2136, 2531, 2824, 2317, 2295, 2558, 2597, 2149, 1854, 1726, 1634, 1120, 1051, 714, 607, 182, -417, -262, -467, -869, -938, -902, -972, -1505, -1174, -996, -1251, -1503, -1259, -730, -1022, -1158, -989, -582]
1365e82MJ07O4O38j90p2o3M10J82l70K01J66J56j57L90K45m69K06L19J43j29j52
1387A047J99jk80J55j23r5k29j91p6J63n40m52L31l04m96j54J82j52l67k72K91
1408a364k60m02P3L30j64po21O85L5K8J31J71L8j00M10K63K92j77M77L03L19k8
1430D32J13N57k6L78J97K68nJ27K47K35J08n95L21K48n84K5k41j19m66n05K63
1451I78m06n93m29j21k08j89n86KK32j81k48K00j69O9K6K14K77J1L5K97K44k46
1473g91K88J6O03n53M1N35J95k30r6Q8k01J81j87m1L00j94O9N66l35j3O68L20
1495A229l51L5L13M39k8j46j50N5J75o47K19L9p56l16K6r9p92l48L20p67j64q1
1517a795j65K19m80J92pK32J69m3O24L05J74Q3O93NK78P4O20k4K6L5K51j96J5
$$ y = [-582, -578, -471, -407, 231, 41, -31, -94, 316, 498, 128, 329, 495, 651, 494, 884, 1129, 660, 866, 1185, 1328, 1199, 1047, 1246, 1245, 965, 1120, 997, 902, 673, 482, 406, 569, 29, -423, -92, -396, -892, -1046, -864, -1016, -1383, -1655, -1364, -1624, -2026, -1953, -1623, -1787, -1794, -2415, -1730, -1695, -1667, -1536, -1365, -1327, -1427, -1017, -754, -462, -639, -162, 141, 460, 432, 545, 1102, 1076, 1454, 1651, 1919, 1914, 2041, 2288, 2523, 2631, 2036, 2357, 2605, 2021, 2046, 1805, 1686, 1220, 715, 978, 572, -21, -450, -571, -779, -968, -1554, -1552, -1320, -1501, -1749, -1549, -1718, -1649, -1623, -1409, -1132, -1121, -1086, -789, -545, -791, -503, -487, 116, -437, -396, 139, 334, 104, 8, 96, -105, 76, -111, -152, 148, -46, 23, 589, 254, 241, 909, 1229, 878, 913, 1226, 1665, 1637, 1491, 1341, 1396, 1571, 924, 1143, 1182, 426, 110, 136, 37, -755, -1103, -783, -1550, -1714, -1795, -1960, -1741, -2221, -2029, -2036, -1804, -1635, -1678, -1054, -749, -575, -492, 201, 206, 484, 558, 1178, 1154, 1180, 1215, 1466, 1270, 1285]
1540A285J7r7j94l50k0L14j70o62K64J10j46m57K03M6k0k59M13k29J41k54K65
1561B00N7j05j93k65K02k33n27K55o9m56N2o7o0J1j49Q4J19q7R7K50M28j42P9
1584e19N51K99oK05M99J19J22L55k03m9K7J35K71n56l07j4L1k29m07l01K12k89
1606e4j10k18j09J55k02J43K01k27j40J31J01J16k30J07K49l15k29M14m2l16k26
1627h01jr7j51ll74L51k96K33K17l4J97K50M11LK92K29N48j14M73K83J64J84n0
1650A914%L80k97j87k67M6j57m28m70j93j71p50%j45l35k09r5O7j90j27J66M88
1672i60l60J02M23J77L61k96N24RJ77r8o6O59k73j85o5J70j34l18j91K76qp3k80
1695d29J53j45J79R0N3K03j96N01J10Q8M7L8N12R1k89M24j71j67k40J42k20j83
$$ y = [1285, 1302, 1205, 1011, 661, 641, 955, 785, 123, 387, 497, 351, -106, 97, 143, 123, -136, 277, 48, 189, -65, 200, 257, 152, -41, -306, -104, -337, -864, -609, -678, -1134, -1082, -1149, -1209, -1198, -1347, -1263, -1144, -1231, -1134, -884, -456, -598, -519, 32, 331, 325, 530, 1029, 1148, 1270, 1625, 1422, 1373, 1400, 1535, 1806, 1250, 943, 929, 960, 731, 324, 23, 235, -54, -164, -382, -491, -336, -538, -395, -194, -421, -561, -430, -329, -213, -443, -336, -87, -402, -631, -217, -259, -575, -801, -802, -899, -1050, -1053, -1427, -1076, -1372, -1139, -922, -956, -759, -509, -98, -95, 197, 426, 974, 860, 1333, 1616, 1780, 1964, 1914, 1914, 2294, 1997, 1810, 1543, 1589, 1432, 1004, 534, 341, 170, -580, -580, -725, -1060, -1269, -1364, -1297, -1487, -1614, -1448, -960, -1320, -1218, -795, -618, -257, -553, -29, -20, 157, 59, -7, 652, 379, 194, 129, 299, 165, -153, -344, -68, -76, -149, -429, -276, -421, -242, -152, -99, 104, -92, 409, 519, 607, 654, 692, 1204, 1295, 1006, 1430, 1259, 1092, 852, 994, 774, 591]
1717E91l98J78o6m35n40j07k02l72K40j82m36J53j5L69l25Q2J8N01P8R8J92N55
1739b3Q8q9L84L22N9J08J24J56J29k28Q9J41k11q9n7J88l74j44L4j63m9j47N1
1762B99L1k14k01K20o8k69l34K42J99j80q4L7L47l94NJ27j32l91L71k52P5j98
1784g64l3K23l1o8j8K77k60l22J78P3M18m72K19K10K30O1j38P52j97j9K66J91
1806G76j58j7K47J58M0J43n22L30k50k16J59j87k21k81P7J17m63j98J42j08l33
1827g65j81M42j18j96q8J23R2K51j47m2L26j57K0K17K19J76j58Q1K28n0n3J06
1849C26R1m2j10N67j00j43j53K51J46k40q4J58J96m00M12J61J46m95O9Q7k12l94
1871B37J98K30m97k27l44J80j89p25J99k8k03l78L67J02m83j44J94N19k95J39
$$ y = [591, 193, 371, 305, -130, -670, -777, -979, -1351, -1111, -1293, -1729, -1576, -1591, -1222, -1547, -1465, -1447, -946, -868, -770, -578, -23, 65, -24, 360, 682, 741, 849, 973, 1129, 1258, 1030, 1119, 1260, 1049, 960, 903, 1091, 717, 573, 607, 444, 395, 248, 299, 330, 116, -85, 135, 67, -202, -536, -294, -95, -275, -359, -322, 25, -369, -364, -237, -369, -760, -389, -641, -566, -764, -797, -574, -605, -673, -691, -414, -674, -996, -818, -745, -327, -799, -580, -370, -140, -79, -217, 535, 338, 319, 585, 776, 618, 601, 848, 1006, 1046, 1189, 667, 997, 747, 531, 690, 503, 282, 1, 78, 195, -268, -466, -324, -432, -765, -946, -504, -622, -818, -906, -783, -691, -440, -587, -629, -303, -460, -440, -223, -4, 172, 14, 95, 323, 273, 220, 326, 417, 375, 265, 832, 732, 589, 436, 687, 833, 593, 509, 667, 863, 463, 875, 1036, 1182, 687, 756, 843, 631, 237, 435, 665, 168, -59, -403, -223, -412, -1137, -938, -966, -1169, -1547, -1180, -1078, -1561, -1705, -1511, -992, -1287, -1148]
1891a148J24N70k0j19L64j82K94K59p5K64k3K46J14l03r8J36j09k6k17J50J27
1912C28k40n2r5K94RK7JK52R6J18K54J83o0k38K67PJ14l69j3L33l14n10o9j27
1936A96k54n33j79O4j77l19k42p6Oj16O3K92J53m7M18J69j0M13J71N17P9K56J95
1959A039L20k13J2K05k4o75O0M0j94l52l15L7j91j40k50J72q0n00K35O0J79j83
1981g58r2N87K87j31K93L86L2N4J90N8J04k83K9J23l68j14lk60m08P1k19R2p15
2004a045m9R8M9j35j47L98J52p7J04M55J30K19L3L33L8L81k29j7K44J14j69J21
2026A001l41l15k10J64j5o11K3j76M2m26K03j96l3M0M8J35J02q8J32K58J35P1
2048e7J10K62J83j96J87K02r4k31J65J07m5j39m9K77j37k85k78M87k74P9j38p8
$$ y = [-1148, -1024, -454, -474, -593, -229, -411, -117, 142, 67, 331, 308, 554, 668, 365, 267, 403, 294, 268, 51, 201, 328, 88, 36, -59, 235, 244, 271, 272, 524, 620, 738, 992, 1175, 1115, 877, 1144, 1151, 1265, 896, 883, 1216, 902, 392, 323, 196, -58, -591, -770, -706, -883, -1202, -1444, -1520, -1514, -1630, -1567, -1275, -1122, -1169, -751, -582, -592, -179, -8, 509, 588, 844, 1039, 1359, 1146, 1158, 1363, 1339, 664, 724, 764, 570, 218, -97, -60, -251, -391, -641, -469, -549, -1049, -814, -754, -575, -758, -850, -263, 24, -107, 186, 572, 604, 658, 848, 906, 1010, 727, 756, 879, 511, 397, 394, 134, -274, -203, -422, -330, -1045, -1094, -996, -947, -1082, -1229, -831, -679, -756, -652, -197, -67, 152, 185, 518, 556, 937, 708, 691, 935, 1049, 880, 1001, 660, 345, 135, 299, 284, -327, -304, -480, -438, -864, -661, -857, -890, -850, -802, -667, -565, -653, -521, -263, -128, -57, 53, 315, 498, 302, 489, 691, 597, 366, 531, 638, 593, 454, 405, 682, 545, 260, -18, 469, 195, 274, 136, 58]
2070E8m6L1m7O7j8k6j24J56l10L98o4j34k58R1j05R1j24n0K30M9k56j34J85N6
2094b84Q8m06M56pk30J27O4n9p7Q3L04l05K36j76J81K71m68J92L05m0j70j12M20
2117C93L1k89M58p2rk69O04r3j10k4L5j58J07r3J21k91q2k00M3L39q76O9q7O1
2141c92l20N5r3l29J02j63J48L2j81K21J60J12J80p6R9N16j5K15p2j86L00RM04
2164G26q1m7k47K68l2j67K15k38Rj50J58n3p9j42J12K09j71j35K94k05J19K6l2
2187C57O0J50k37r9O6k94J2J5q2j11l3P7l06o9q6O2r9k23K25N0j08n6j7j1J97
2212e60L50j31J57Q4j0q4M53r2j99J54R5j50J92R4P3Ok89J3L0k09K4k45M63j86
2236C3j66J88L1l63K02J27K1J44l74L09J17l40j34J81J02k64k30K70k4j7o1j23
$$ y = [58, 12, 43, -4, 63, 45, 19, -105, 51, -259, 139, 75, -59, -317, -226, -331, -240, -364, -414, -184, -135, -391, -525, -340, -284, -196, -602, -146, -153, -383, -256, -192, -251, -328, -245, 59, -246, -10, -186, -5, 266, -202, -10, 295, 255, 85, -27, 393, 424, 135, 593, 521, 512, 243, 847, 754, 644, 620, 655, 497, 604, 511, 632, 341, 259, 59, 102, 441, -435, -366, -453, -392, -712, -657, -750, -1079, -977, -1140, -992, -960, -1141, -920, -760, -648, -468, -544, -445, 71, 56, 271, 199, 13, 313, 322, 726, 645, 598, 351, 619, 587, 420, 635, 397, 406, 256, 414, 361, 282, 140, 252, 461, 290, 155, 449, 244, 363, 389, 357, 417, 567, 330, 231, 297, 3, 15, 30, -52, -163, -196, -119, -425, -494, -580, -518, -617, -840, -615, -565, -673, -729, -746, -757, -560, -210, -341, -184, -100, -110, -194, 259, 167, -32, 122, 217, 67, 259, 353, 426, 432, 143, 156, 186, -23, 1, -244, 219, 33, -133, 55, 86, -277, -75, 52, 73, 217, -157, 152, 269, -71, -205, -24, 78, -186, -416, -146, -170, -187, -248, -371]
2258c71m3K04j71K25P7N6k53j8L92J37j33J46o9J89L54k05K37k21J15o5j11K81
2280G53j25J84n5m62J2lL8l49J41j01m63K68O8k24L0l16J46J41J43m26R6M52l3
2303h5l84J18J64J12o4N4R5j81qk3K92l40K18j99K12j75K38j90k0N7l80K49Q5
2326a55o7q6k77Q66k49j18L56M0j30N82l54J24j3p7L61k42j56j37J67j74m37j6
2348a92K72j86j4n9j48q3M9m72J60J25j08l1R5l5J14j42K69K13j15M40J1J80j02
2371B41L12o0K71J15j45J86j18J70O0Kj47j13l54O8K35k88ok68q4j44L70l52j70
2394b19rk40M77n11J38L04k23N0j22m5J71j19KO0j37J93l09K89J92n10L7N6m66
2417i41J05k03J87K05k72j26J34M3J17O5K16J73j04K71J79L06K09L10k52J66K39
$$ y = [-371, -414, -210, -381, -156, -79, -23, -276, -294, 98, 235, 102, 248, 179, 368, 722, 517, 754, 533, 648, 583, 472, 753, 628, 812, 757, 295, 307, 304, 342, -7, 134, 33, -430, -162, -94, -318, -288, -604, -458, -317, -174, -600, -504, -52, -85, -469, -351, -187, -75, -139, -85, 10, -171, -179, -202, 90, -250, -32, -231, -19, -194, 44, -146, -166, -109, -489, -240, -155, -222, -308, -585, 281, 32, -86, 270, 310, 180, 762, 408, 532, 519, 442, 803, 561, 405, 268, 435, 261, -176, -192, 80, -106, -120, -179, -327, -410, -361, -833, -673, -548, -656, -687, -592, -627, -513, -655, -386, -173, -288, 152, 163, 343, 241, 553, 493, 764, 879, 734, 920, 802, 972, 1032, 1034, 887, 774, 420, 488, 723, 435, 429, 161, 77, -67, 303, -49, -219, -228, -468, 9, -502, -364, -60, -283, -233, -355, -400, -229, -348, -346, -286, -423, -230, -539, -250, -58, -568, -531, -475, -941, -836, -1039, -852, -647, -919, -1045, -911, -868, -751, -686, -470, -297, -401, -130, 49, 355, 564, 874, 622, 788, 1027]
2438A027J29p2L15k82M00J57o58N9j1o5p3k72l31k0kk74nj28k79j00J29k26j81
2461g63K1M22j78K0Q7q3M02l34J44J67j07k83K20J02N0n7k22j12J08r8k31K81
2483d44k38J78R9r4r1l9J08K67k8j14L84K06J12K39l00M72J81j63J52M8k5j69
2505G41L55mj20k43J28j87j29j2k78q9K5m23k0J17j91m1O3J20k43j19J90P2N8
2528b30OpK01r9m3J60N5k50Q8o1m4pj16J33l1k01J23q6l7J26j46J16K33j30K2
2553b25J29k17K43j0J83L0j84N9K20o2j00J29K44m3n14L00P4j51L2J97R7l41n
2576H5j23r4M47k10j14pp0K09N5j97J40j90K79N6k3J89l64K58k52j88K67j36m3
2599b6n7QQ0j86L83k20j04k47K11j1j99J51O1R5O6k36J94j5J72j09O0r1K49k28
$$ y = [1027, 1156, 1084, 1399, 1117, 1517, 1674, 1016, 1075, 1064, 999, 926, 654, 323, 303, 301, 27, 22, -106, -385, -485, -356, -582, -763, -742, -320, -498, -478, -391, -474, -72, -406, -262, -95, -202, -485, -265, -163, -113, -170, -392, -504, -396, -494, -725, -444, -682, -504, -405, -499, -590, -629, -521, -254, -282, -396, -12, 194, 306, 545, 245, 717, 898, 735, 887, 935, 910, 741, 1096, 1092, 972, 729, 857, 670, 541, 529, 251, 162, 187, -236, -256, -139, -330, -371, -308, -188, -431, -550, -360, -288, -230, -224, -231, -30, -129, -172, -12, 43, -207, -119, -180, -224, -231, -347, -214, -245, -446, -323, -409, -446, -320, -466, -350, -117, -247, -225, -96, -313, -70, -80, 103, 133, -51, 8, 228, 166, 66, 195, 439, 396, -118, 182, 256, 105, 137, 334, 431, 90, 85, -38, -132, 315, 105, -9, -16, -86, 123, 178, -19, 121, -69, 210, 266, 243, 432, 68, 326, 74, -114, 153, 17, -26, -83, -75, 5, -181, 202, -18, -122, -369, -158, -169, -368, -217, -156, -61, 5, -231, -37, -52, 120, 11, 71, -20, 229, 1]
2623AQ6k19o5Q4J6L77m09P1k11M58l41r9J35M2k04K56l3M4k45j7L84J42j03o6
2647H4o4K1j9j21K77J37M1l05K43j90K5J1j62P7p5j79K34k75j16K09j99L8o4K5
2671c47O2j65K55k65J12R2j44J33K38J06j52M6J60j3l2J95K1n2P1p1j97J47m2
2694A58qJ79M7m46L11j95k1K15j44j62L17l37R2L55l01j39J11Q0OK9J18j6k38
2717A1J1J45q6J4l5J01J93l47j54M40k85j40M1j37J58o7m14J62k0J08l84J60Q8
2740d37J66k8m0J20j45J78K06J49k91J38K00J10k09k4J8n2K66l6L5k1o8k38R1
2763H8l32J00J62O6l91J85K4O7j89j04K15M2j95m9Q7K42J27j43k0K1K98m1L88
2786F48k67j39o8Q6J27p4l6k36N0j0o8K9j62j7o2J11k41J61j53L14j75q3j35J33
$$ y = [1, 87, -132, -197, -113, -97, 280, -129, -58, -269, 189, -152, -251, -116, -74, -278, -22, -55, -11, -256, -273, 111, 253, 150, 84, 20, 41, 22, -99, 178, 315, 356, 51, 294, 104, 129, 140, -22, 55, -20, -199, 35, -240, -356, -147, -346, -308, -372, -347, -285, -450, -195, -460, -348, -256, -400, -267, -29, 77, -75, -29, 131, 118, 86, 281, 302, 250, 321, 250, 53, 200, 158, 150, 329, 376, -70, 241, 46, 25, 240, 96, -66, 251, -86, 6, 361, 60, -79, 32, 112, 118, 147, 265, 249, 11, 22, 167, 81, 95, 60, 161, 354, 7, -147, 293, 8, -132, -91, -228, -70, -137, -551, -389, -409, -301, -685, -525, -437, -271, -299, -339, -219, -364, -186, 20, 169, -122, 16, 216, 326, 117, 93, 111, 59, 325, 289, 324, 303, 235, -3, 88, -244, -144, 18, 84, -307, -122, -98, -31, -220, -324, -109, -67, -262, -311, -224, 18, 145, 2, -18, 3, 301, 260, 648, 381, 242, 174, 260, 387, 313, 277, 41, 91, 81, 13, 42, -120, -137, -199, -88, -329, -168, -321, -7, -182, -265, -400, -267]
2810b67K66K5J16K05J41l57O2J6j54j13M87j45k45j21K29N2o4P8m19J88k38p3
2832c31L24k75K4J24J9L07m33L53J29j39j87J02K30R0m78K57J38K62k46K1p1q1
2854A39M2l45J30Q2q9k49K79k74K0J21j67o9j15J62j26N4q6J1J80L2j7J16N5R3
2878b1R6j07j39L32n5R7r6j66K56o9J24k5j15J26k40J93j45J48Q1r9k55K42J31
2901B94%L6j01O3J91k38L20k86j79K27J2O9k42K42k09q3R8k04mM5o8m22j08K36
2925c11j75k14J59m3L8jJ66j96P2J73p4J9l25L62j2J05K14k52L72n18J34L06k86
2948b87J82J15n0J22K09r2j96N09l56J88J61P4q0l3Q4r8J52k06J26J77j63rJ27
2971F56j43j25kR4k76l1L7M4j51j66J66k96M3l6j33j17j18N9K9j39l1J80j80k50
$$ y = [-267, -1, 24, 140, 345, 486, 129, 191, 207, 53, -60, 427, 282, 37, -84, 145, 197, 133, 211, -208, -20, -258, -331, -7, -282, -258, -134, -115, 192, -241, 112, 241, 102, -85, 17, 247, 337, -141, 116, 254, 516, 270, 291, 220, 139, 181, -164, -34, 48, -41, -290, -11, -285, -265, -144, -311, -380, -495, -333, -459, -405, -491, -480, -300, -268, -285, -169, -114, -21, 75, -32, -171, 161, 106, 203, 107, -59, 197, 128, 252, 227, 112, 238, -2, 191, 46, 194, 275, 176, -79, 163, 294, 294, 330, 229, 292, 483, 245, 565, 279, 100, 327, 339, 408, 166, 408, 199, 116, 214, 10, 6, 51, -17, -439, -547, -311, -486, -700, -541, -584, -546, -547, -381, -577, -505, -332, -406, -387, -712, -350, -362, -257, -43, -295, 77, -441, -307, -1, -287, -105, 10, -40, 82, 291, 199, 3, 512, 156, 344, 505, 579, 499, 466, 550, 452, 604, 398, 524, 701, 538, 529, 656, 513, 388, 386, 480, 204, 173, 210, 254, 103, -63, 103, -193, -150, -186, -319, -436, -554, -495, -466, -605, -636, -456, -636, -886]
2995h86K11j72J50J41M8J87R5l6K98k35o2M15l09R8Q5J24r0J29N7%K8l6q9q8N3
3020A16r6J2K12L1k35L84k02J57J18j20J29L2j56k9K71k12k49L29l0l21K68l57
3042E2K05m96M13l43Q8q8j25NRJ78k04lj27J15p3O2m24K74L33j06J99q7kQ7o3
3067a21M7M26l07n6P3J20k47L73k35j92L60l01r1J21j4N7j27K35l85J52k4j85
3089c21L72p7k0J62M6Q7j68L5j48K58L4l5j9j76L02l15Q9j86L03k04j48j4L2M3
3113f8J2j9K30n19J31J78l43K28j58J17K46P9j34j41L80J30l26L5j8K03j24K02
3135C21j86L03j11m8m26K27J50l18J35n1l10K88k44J32n5q8j43N78m23K12j93
3156b50M20m46L33M0l5j37O0L23l4j44pL05mm24K45r3k30J91k63K13L2k2l88J01
$$ y = [-886, -675, -847, -697, -556, -508, -321, -226, -262, 36, -199, -261, 154, -155, -57, 28, 152, 62, 191, 248, 248, 276, 240, 151, 63, 116, 20, 32, 244, 275, 40, 424, 222, 379, 497, 377, 506, 538, 382, 353, 624, 412, 163, 492, 462, 141, 409, 52, 257, -239, 174, -169, -81, -169, -294, -289, -280, -102, -306, -309, -436, -321, -394, -332, -756, -482, -149, -255, -56, -143, -145, -58, -121, -74, 352, 45, -11, 62, 182, -65, 308, 73, -119, 241, -60, -151, -30, -44, 13, -114, 121, -264, -112, -136, -321, 51, -26, -46, 116, 162, 249, 81, 116, -32, 226, 260, 225, 206, 30, 332, 17, 106, -80, 223, 19, -129, -143, -111, -68, -56, -75, 155, -364, -233, -55, -398, -170, -328, -211, 35, 114, -20, -161, 219, 349, 23, 58, 40, 243, 119, 321, 135, 438, 327, 279, -147, 80, 230, -88, 47, -4, -314, -26, -270, -138, -193, -281, -424, 154, -269, -57, -250, 170, -276, 57, 97, 62, -75, -15, 308, 274, 130, 123, 428, 424, 0, 245, 152, -78, 113, -150, 63, 95, 73, -315, -214]
3180b14K55k96r0J63K1K08r6o5J06k4J27J16J8j11n9J81j51P1K42l70L77j14o0
3203B35o9l67R9O3Q5l61K44j45K52k41q7O8K51l34k9K5M26j55L6n9o1M6K12p8
3227E6J81k6N6q7K9n1m7j39J77l93L14o5j85j61L61j59O2l56J50J43q0j81J31
3250b70J12N6j05J16M18m03k12J16L85j08k15J59K10Q6k47j34K51k70L1J44p2
3271D8j92J54j56Q8l60L69j68J22j77J34J19q8L11j36J95k32J42L17r8m3m79N31
3293D01j01pk39jJ31K6jr5J08l47Q1j60j46L34L8jl18P4j8J04j01M23j44k5l8
3318b2J24k10k80M41j2N1j54K68j03j06J2j55J30k47O2MK18m1p7l7j10P9n7J50
3342g2R2N0n2l64M53J7j77J63O1j75K17J94k92K07R5K6j04j72k7L11k70k7Q5J0
$$ y = [-214, 41, -255, -345, -182, -161, 47, -49, -114, -8, -32, 95, 211, 229, 118, 59, 240, 89, 160, 402, 32, 409, 295, 235, 166, -201, -102, -39, 46, -315, -71, -216, 36, -205, -292, -224, 27, -307, -336, -311, 115, -40, -4, -63, -124, -78, 134, 56, 237, 211, 267, 180, 209, 158, 111, -28, 149, -244, 70, 5, -180, -341, 20, -139, -77, -433, -283, -140, -220, -401, -270, -158, -102, -207, -91, 327, -76, -288, -172, 213, 105, -110, 49, 259, 345, 98, -36, 215, -55, -24, 120, 48, -144, 10, -146, -58, -418, -49, -217, -95, -272, -138, -19, -107, 204, 68, 263, 31, 173, 490, 392, 349, -130, 401, 300, 293, 54, 53, 184, 210, 209, 114, 222, -125, -44, -204, -350, -16, 22, 21, -297, -223, -241, -137, -238, 185, 41, 16, -22, 102, -108, -388, 53, 41, 92, -62, 206, 103, -3, 9, -146, -16, -263, -201, -197, 21, -20, -97, -134, -244, -165, -222, -72, 20, 70, 18, -346, 107, 124, -53, 110, 171, -4, 213, 407, 115, 322, 417, 443, 339, 167, 140, 451, 181, 154, 239, 249]
3366B49l39J21l14L3J17j81R8J37j57q7L09j05o2jP4J3M9j87L49k44N7l74N74
3389A29r7m07J37J04k02J29R7pn7j83L14l56J80J19RK5K9l9%J04k20L36j96L13
3413B61N3k7K6j91O2R2k06L27q1rk6M8n1K0o7k00J9J9j67J73K1j53O9j29J1n9
3439a65J44K32m51J19o0K26j80L6O1n9J8j65J72j09m6K54N0r5oj74O5j00J15J5
3463a03o6j89K97l5K47k44k4p4L8J88L2J25m8j11R5K71M6j23Q8l05K60L24m54
3486B35m5Q8R3l01J90k50L73l13j22L1L2Q9L8j28j74k4J22J13j37J78n1k51m1
3509b55K55k4o4j68K09k21N7j5J5j19J91j19J89j00M8j74J32j91r2J78K46o2J75
3532I1r3m5q2J00L1k5J1K50rR1R5m39J78q6J53k95K61NJ99j72l71L09j73j14K13
$$ y = [249, -90, 31, -283, -250, -133, -314, -216, -79, -236, -323, -14, -119, -181, -182, -108, -95, -46, -233, 116, -128, -71, -445, 129, 32, -375, -238, -134, -336, -207, -110, -117, -174, -357, -43, -399, -219, -100, -91, -66, -37, -76, -76, 28, -192, 144, -52, 261, 314, 287, 313, 122, 184, 276, 70, 397, 316, 307, 281, 329, 278, 298, 231, 31, 50, 69, -98, 75, 96, -57, 12, -117, -106, -165, -21, 211, -240, -121, -181, 45, -135, -99, -38, -97, -79, -244, -72, -181, -227, 27, 77, -18, -24, -198, -133, -233, -118, -103, -169, -358, -61, -96, 151, -93, -117, -191, -153, 35, 67, 192, 144, 33, 128, 399, 445, 322, 410, 105, 365, 689, 235, 190, 278, 371, 70, 260, 10, 383, 70, -52, -21, 11, 100, 138, 10, -164, -188, -66, 47, -90, 88, 37, -214, -255, 0, -24, -88, -256, -47, -268, -211, -226, -211, -330, -139, -258, -69, -169, -121, -295, -163, -354, -446, -268, -22, -84, 91, -2, -47, -129, -29, 2, -23, -12, 238, 229, 320, 415, -24, 154, 68, 221, -74, 187, 192, 391, 219, -152, 157, -16, -130, 83]
3557H3l01L00j96M2K11k12K00n5j11J74N3l67M01j24l81L05q0J55Q5L8n7l23J61
3580AM0j40j49O4o8L8K28J00l60L84n97M55n5J56R3l73K77k06J17j40K27P5j97
3603c0K78j17M8R8j32o8L8L6p3k53L14j01r1K03j87J2K5r3L6j21k26L01J1k29
3627c21N1J11J68j62R2j70J6K97r2J82j67k93L60K47l79j3J53K8n5P6j70J7m6
3650g0k2k62J53M3j7J04k74J73N5k9K55j93J73K27k88m5L13k69M6qO2Q8r2J12
3674B35oJ01k32j65m0J07k7n9M0R6J33j70l06J59Q6j52L36l5J15k1m5j30K66k09
3698G7j7m5j55J74L56k83N7k58J38N1O2n8j35k0Q4J57j73m9Ko0N8l14K68k47L21
3723io4o8K6J43M3q7J25k13M58k10k7Q7l20J05O4r1K60l2j36K78l27P4j13K77
$$ y = [83, -218, 82, -114, -72, 139, -73, 127, 72, -39, 135, 188, -179, 222, 98, -283, 22, -58, 97, 182, 220, 163, -160, 1, 41, -99, -248, -184, -252, -214, 14, 114, -246, 138, -459, -4, -59, 97, 190, -183, 94, -112, 5, -135, 92, 167, -30, 248, 131, 179, 277, 145, 77, 115, 151, 78, -175, 139, 38, -53, 150, -37, -25, 0, -93, -57, -178, -404, -103, -92, -321, -270, -159, 9, -153, -61, -231, -215, 82, -10, 172, 5, -288, 72, 319, -60, -73, 80, 108, 53, 129, -41, -24, -70, -92, -354, -201, -158, -175, -71, -345, -172, -117, -146, 109, -84, 89, 316, 28, -17, 296, 27, 73, 65, 127, 215, 123, 235, 229, 330, 98, -67, -107, 0, -27, -86, -46, 50, 183, 13, -293, -134, -48, -200, 136, 101, 216, 195, 150, 20, 286, 77, 60, 15, -140, 34, 390, 107, 164, -94, 44, 95, 157, 99, -36, -56, 28, 185, 12, -37, -35, -95, -37, -351, -83, -330, -9, -73, -141, -115, 28, 71, -16, 109, -104, 354, 144, 117, 204, -116, -11, 53, -38, 222, 190, 54, 332, 5, 79, -34, 243]
3747B43n03J33l3pJ52j47K64Qj49J04K1K0k0L5j55M8L15l45L4L5K9r7O2J14j17
3772D4M5l42K38J73j92J40j0m46K41K82K2m37O6mJ13M5l87K19N4Q8j21K51O1j31
3796A2LK78j72K1l3QK07k76j4J33m7M0Q5k85J34j31K07j55m1J29j57p8O5n9K39
3821A13J38k96o4K42k41J98l4K18l73n4J71J36k08J26j21k02M6MK08j76L29r7
3843F3k49K42p4p0J57k09J30k09q5q4M46j85j5J99K1q3J81M2k82J12j66L84j44
3866A22m2j01n1J32J00K4Kj10j85J02R9j35J5j06M14j55p5k0o7j33K91Q7j60K8
3890G6j19P0J44j85K55k10N7q0j40L97l40k2n6K76m27J18j55L67l81K65k94O7
3912c17K40k11J21j05K3L15j65K28Lj35J09k0j69J50O6l9N8o0Q2M7o0l53J59m
$$ y = [243, -260, -127, -160, -167, -15, -162, 102, 110, -39, 65, 86, 106, 86, 121, -34, 14, 329, -16, 18, 53, 82, -15, 47, 161, 44, 89, -253, -15, 158, -34, 106, 96, -350, -109, 173, 195, -242, -176, -180, -67, -22, -409, -190, -136, -48, -169, 82, 143, 12, 15, 293, 121, 142, 109, 117, 324, 48, 34, 167, 120, 160, 245, -40, 94, -37, 170, 15, -26, 103, -54, -132, -67, -126, 113, 251, -45, -109, 133, -108, 90, 56, 274, -99, -153, 18, 154, -54, 72, -49, -251, -205, -201, 7, -169, 160, 63, -186, 56, -18, -88, 69, -140, -10, -219, -304, -388, 58, -127, -142, 57, 78, -5, 176, 218, -64, 48, -118, 266, 122, 80, -21, -72, 60, 160, 184, 186, 76, -109, -7, 92, -43, -28, -134, 280, 125, 50, 30, -37, -170, 121, 208, 48, 76, -43, 27, 171, -14, 241, 31, 88, 8, -132, 265, -75, -97, -153, 123, -304, -186, -341, 26, -355, -90, -384, -317, -77, -288, -167, -272, -249, 66, -99, 129, 132, -3, 106, 86, -83, 67, 133, 94, 152, 92, 174, 221, 161, -192, -33, -37]
3936c7J25k20J15J2k28L40J14k15j11K09j7P8J17j94J24Np9j05J93n7j63O1j15
3959d8Q0L24l53K9l6r8K6J56j66N6n6M1k5j91j80J61J04l13M25j74K59q8j8p1
3983a56K29J75k57lK91j81j92K59j01nr9Q0N4k22k3J52j18J04J30l30L13j62R5
4006C3m4j37L37j78r8R7L18k46K92k15q9N6J11j45Q5m6K88k78N7m2j17k54J96
4029a9No8P3j00q4K38l80J10L0J9J00j85Q7L0N8K52J21j03j08j19J29l36L99q1
4053F8J74j22j11r9J82j05K6j66M84l98Q7l42K00J64p0M3J14l6m32K38K07j14
4075hj42J13j20J16O4r9N2P3M8k8k5J28j86J08K18k30O7l67O1j08o7J98j24J38
4099a20n6K25k24J1P4J06k01j3J82O4QR6j2j09J53j32J24k06K07j2k00J25r2o4
$$ y = [-37, 88, -132, -17, -5, -233, 107, 221, 6, -105, 104, 87, 165, 282, 88, 212, 217, 138, 33, 226, 169, 6, 67, -48, 32, 356, 3, 32, -4, -102, -76, 80, -86, -30, -86, -45, -70, -261, -441, -280, -176, -489, -64, -238, 21, -67, -85, -156, 73, 248, -9, -12, 279, 98, -94, 165, 64, 59, -40, 40, 94, -128, -151, 1, -117, -13, 117, -213, 100, -62, 33, -11, -148, 189, 11, -87, 10, 328, 82, 374, 159, 70, 126, 237, 92, 177, 131, 419, 141, 198, 156, 39, -215, -19, -14, -82, -9, -109, -193, 45, -335, -225, -195, -176, -76, -261, -174, -144, -86, 166, 287, 184, 76, -43, 86, -250, 149, 68, 242, 120, 9, -90, 92, -13, 13, -153, 331, -67, 20, -322, -122, 42, -28, 15, 129, 93, -339, -101, 106, -8, -150, -37, -157, -41, 23, -76, -24, 49, 97, 69, 44, 172, -14, 94, 312, 82, 149, -218, -157, -265, -332, -134, -258, -120, -176, 49, -175, -164, -90, 16, -185, -198, -16, 48, 56, 152, 140, 31, 184, 52, 176, -30, 177, 165, -35, 90, -2, -66]
4123f6MK37K8j09K4l20L7J00N5P7l02j8k8M99m53J28j23L44k76K13j78K32J36
4146B41j65k03R3K3J16L9k75K72k30k84M53kj45J08l56L72j65l6J8m3J51q6J87
4169H3l53m5L90n8j2R8j54K90k73J75j99k36K94L3N9k07K30j92R9jj93K09j87
4192a50J35%j46K92j30j50L02l06J83n2mqM8j31K08O2j56kJ18j11L08m34j34L30
4216G2j18k09M29l96o8N9L19j73qNR3K19l53K11j57l41M01l6J4J73JM6k8j66k
4241a3o4J4n4K00k55K72q9o0J8L41l25K2j48M96m29N2K41k01MQ3k72J80J25j78
4265d0K19l02Q0J09K19j07l07J61J04n5p5K61l21J4N7K00j55K3j63j87K12J19
4287F6J9o6l8p7kM7J09k18L3j48J89P8k7N6J88k66j49O9J42K46l30K26n22M43
$$ y = [-66, -62, 175, 203, 94, 118, -202, -165, -65, -10, 67, -235, -253, -281, 218, -235, -107, -230, 114, -162, 51, -127, 105, 241, 76, -127, -34, -11, 105, 144, -131, 141, -89, -373, 80, 78, -67, 41, -315, 57, -108, -144, -126, -169, -18, -104, 83, -270, -315, 75, 17, 5, 103, -51, 239, -34, 141, -58, -294, 0, 33, 92, -115, 115, -77, 22, 21, -172, 37, -150, -15, -15, -161, 131, 1, -149, 153, -153, 30, -22, -26, -34, 14, -117, 91, 153, -3, -5, 113, 2, 310, -124, -258, 72, -46, -255, 174, -222, -290, -231, 88, -85, -93, -88, 5, 224, -129, 82, -75, -416, -15, -51, -37, 136, 137, 183, 155, -11, -13, -77, -63, -117, 83, -172, 100, 11, -49, -31, 310, -15, 7, -141, 355, -74, -22, 219, 18, 22, 105, -167, 13, 138, -40, 179, -123, -43, 66, 285, 178, -129, 32, 136, 81, 6, 267, -54, -40, 17, 217, 62, 85, -78, -265, -53, 66, 85, 19, -19, -96, -98, -51, 58, -160, -127, -275, -86, -8, -35, 21, 209, -57, -206, -137, 5, 251, -79, 147, -375, 68]
4311F8j48r6K6J7J5L32k56k51k9K69n1J4J39j06J71k24Q3pl6J9J11j16J66L17
4335D27l67q8L13j94j30K49k60K32j58j2l9p2J0K11j64p6J43m0n4K6j77K63j47
4358a04Q5j00M5J3ql5n0K97J39k52j03O5j5N8j15K46j98j56K52r3j74J99j4l6
4382e4p0Mlj35J73K43j92j28K41k7k08J73OQ5j76J30J65l2N0L7k66l5K75o7O4
4407B53M1l32M6J7L5r2j45K90j29j72N1J84o9j62j16K62N3j52J37j54K80l05K94
4430A15R9k91O3J43p9q8Mj39J59O3J80j85N4R0k26J47l87M32k01J38M3m12K77
4453am5n5o7L56l94J82r7J43J90j97R7rk20J35J83j46J54J05k90J46j82L6J43
4476A67k52J87nol24Q7J18%l19L38p2L47n42J54N1k6J96j31J35j58R0p6n1J72
$$ y = [68, -80, -176, -150, -133, -118, 214, -42, -293, -322, -53, -104, -90, 49, -57, 114, -110, -27, -34, -70, -51, 60, -56, 110, 427, 60, -28, 285, 91, -39, 210, -50, 182, 24, 12, -27, -99, -89, 122, -42, -118, 25, -15, -69, -43, -220, 43, -104, -19, -119, -74, -61, -69, -104, -154, 143, 282, 30, -73, -8, -23, 35, -80, 166, -32, -188, 64, -29, -203, -4, -18, -54, -124, -120, -123, -258, -85, 158, -34, -162, 79, 52, -156, 17, 23, 108, -68, 62, 227, 195, 245, 282, 16, -19, 256, 189, 253, 294, -38, 8, 25, 60, -32, -177, 113, -16, -188, -137, 47, -22, -184, -300, -38, 15, -137, 0, -154, 126, -179, 115, 214, -77, -14, 129, 50, -38, -34, -173, -14, 49, 229, 44, 98, 188, -38, 109, -278, 154, -47, 91, 134, -278, -1, -46, -101, -168, 188, -206, -24, -121, 22, 212, 15, 112, 103, -117, 18, 201, 55, 209, 314, 24, 170, -12, 24, 167, -85, 102, 97, 91, -233, -146, -28, -28, -347, -9, -81, 266, -276, -122, -71, -97, 99, -32, 103, -55, 35, -41, -92, 80]
4500H0o9rK2J44l38J79j6j6K8J40K9r8k65J95L6k17K49J11Q0k40M7Pj65J56J57
4525B27j45j98K3K09O3J32n5k11M4J43j30k2j68K35k9j9j94l3J64p7J24l31J01
4548a47L0J32k6J14j66k58M44o6n7L57j46m26J75Q2m3J46k60J4K78j53K9k15J54
4571hJ38j06l4j66J0R1q4K6q7L61j7p1j60J70j29R0K6M6j55N3m1m1J18j11K58
4596A77l02Q9j41K29l49L77j14k30N07k54L8j67K91j45l8P8k82J17K27O6j79P2
4618F7m6k25L29N1m7k16R9K20m51K44J01l07J27O2M8r2J07l49M61l18L8M0p7J38
4642Dr9K00k45P2K02l26L45m6l33K97k09L60l38L36k21k68L10j01J59j57k29L41
4664E4l49K42J66j05J60j75N6k79J23L38l40r4p5J66P2J30o0j00K57k41o5Q2p8
$$ y = [80, 11, 2, 24, 168, -170, 9, -7, -23, 5, 145, 174, 76, -189, 6, 42, -175, 74, 185, 265, 25, 72, 79, -86, 70, 227, 82, -116, -93, 116, 179, 311, 256, 45, 89, 232, 102, 80, -88, 147, 118, 99, -95, -128, 36, -41, 83, -248, -147, -117, 15, -11, 103, -63, -321, 123, 57, 0, 357, 211, -215, -40, 42, -1, 145, -115, -101, 177, 24, 53, -162, -8, 130, 24, -10, -176, -166, -75, -159, -133, -220, 141, 124, 53, -107, 63, -66, 24, 50, 96, -59, -6, -47, -88, 30, -81, 177, -125, -36, -177, 52, -297, 80, -34, -264, 243, -11, 27, -140, 151, 6, -32, 46, -236, -119, 108, 174, -5, 67, 21, -204, 125, 176, 129, -87, 12, 232, -219, 25, 126, -181, -54, 8, 56, -36, 71, -278, 183, -135, -97, -57, -134, 4, -95, 105, -140, -68, 134, -192, 153, 107, -226, 71, -138, 222, -116, 220, -1, -269, 41, -60, 99, -58, -287, 54, -295, -53, 113, 8, 168, -7, 49, -230, -107, 231, -109, -203, -278, -112, -40, 90, 30, -70, 187, -54, -119, -37, -115]
4687a15K14l74K86L8j48M30j21k68M1J21k91J78l2R0m0M7m3J27Or8j35J95j5j6
4711G7P7k62J29J72l22L02k24o3M5K42k41j15J38j10J55k3k49K71L22k63j42j57
4733b41K79q2j11K66k45k7Q7k04L84j35J0qq0J02K40k81J29j15m0j44Q9mL02j32
4757C9m8K06k96Rp8L99l22J51r5j60K36m8j00M9j13K18J09O0k24J21qp7J74k45
4781d3J69j18K14k63J76L7J2k39J24o9j43J29j04J35j29J23L3l01o5K56J65J71
4803B70l89K83k24K31k94q4l4K30o4J24j12N6j1j49M03n20J32J06K95m02J88k
4825C3j58k11L81M3j63Q2l4J14j73J72j01J68pj07l05K31j85J98p5K1J90m1j47
4848g4K12j93J10J16l78K10mJ06J4j04j53K69n50N60k29P6j59K58J9l87J83j90
$$ y = [-115, 99, -275, 11, 49, -99, 331, 210, -58, -17, 104, -187, -9, -41, 49, 9, 56, 13, 140, 146, 48, -87, 108, 93, 77, 154, -108, 21, 193, -129, 173, -51, -114, -69, 173, -68, -183, -45, -155, 0, -23, -272, -1, 321, 58, -84, -241, 38, -44, -155, 111, -134, -161, -74, -278, 106, -29, -19, -27, -107, -5, 235, -46, 83, -32, -72, -216, -127, -131, 171, 39, -9, 197, -99, -90, -168, 231, -91, 60, -35, -195, 41, -7, -107, -58, -171, 47, 156, 216, -8, 113, 105, 28, 202, -43, 126, 8, 222, -41, 135, 172, 184, -55, 69, 0, -143, -14, -118, 17, -112, 11, 44, -257, -322, -66, 99, 270, -119, 164, -60, 171, -123, -207, -241, -11, -75, 49, -63, -7, -18, -167, 236, -284, -152, -46, 249, -153, 35, 33, -125, -336, 45, 88, -75, 7, -27, 87, -86, 86, -15, 153, 146, 39, -266, -35, -220, -22, -97, -76, 114, 73, -74, 138, -55, 55, 171, -207, 3, -1, 105, 119, 15, -138, 131, -419, 141, -88, -12, -171, 87, 106, -281, -98, -288]
4870b88nK42K51l39J75j89K35l0j9L54r5K3j26j05j47Q9k2J96J07m41M0L35k21
4893B0J09O4k60QQ7k04J50L9oR4J15k30N9K12l69L97l27J82l62Q1j68K25m8j08
4917b40J87KL0J37j31m2n3l9J7P3J10m14K97J64k53j13M32j67J78r7j36J27nJ3
4941G7J12M9j43m3p2L6k02r0K02J40j76J6n9P2K03j74J09J11j04K1m0R5j52R8
4965H6J62p4k7m0R7k27k80J98K10p8J71J13l24r0L10j89j6qK3j53j0L2J14Q1j86
4990a05P5mj14N0O5J38N0l04J36R2P8q0j45J00p7P0j48K44j52oQ1Q1r8J9j19L46
5016B73k41P4L0m6L4j8l7r3k41M68m38K51q3nO6j10N1r4K01N7lk25J73P3j79p9
5042a41J99j27n7o9J24J61m1j77k43L90k08p5M44l68P4P6J26l1j06P4p7R0O0J30
$$ y = [-288, -293, -51, 200, -139, 36, -153, 82, 52, 33, 387, 292, 315, 189, 84, -63, 26, 4, 200, 307, -134, -94, 241, 20, 129, 193, -67, -59, 28, -176, -26, 13, 7, 101, 216, -14, 45, 257, -112, 285, -42, 140, -222, -141, -309, -84, -132, -240, -53, -51, -21, 116, -15, -57, -110, -149, -132, -59, 51, -363, -66, 98, -155, -268, 164, -3, 175, 78, -58, 69, 64, 77, 189, 238, 95, 52, -20, 16, -186, -276, -74, 66, -110, -94, -153, -81, 122, -52, 57, 168, 64, 85, 45, 140, -12, 86, 248, 174, 147, 107, 204, -23, -303, -105, 105, 27, 198, 311, -13, -103, 207, 18, 2, -6, 17, -136, -146, -114, 0, 81, -105, -30, -34, -148, -98, -33, 105, 155, -149, -13, 79, 157, 77, -68, 32, -45, 25, -123, 121, -31, -37, 44, 125, 27, 46, -73, 273, 32, 106, 136, 90, 124, 106, 69, -24, -265, 203, -235, 16, -67, -72, -6, -116, -65, -159, 42, 99, 96, -129, 44, 117, -62, -141, 58, -69, -126, -195, -71, 90, 49, -128, -371, 19, -189, -264, 180, -188, -114, -38, 88, 57, -49, 25, -52, 38, 98, 228]
5066B28K0l44K92n0l2p9J72n01L76l43K56k7LJ86j59J39l71J44M07k09j07j64
5088a63K57o5q0J33k50L70m45L51J65j73j47K78j95k45L56k26j53K61j74J81r8
5109f2M9jKP7n7J32j89m4q6J33NR9m02M43j82L7j96K14m8J07J05j86K55j72J08
5134A41j86J57r2l85K92j8J37q6j42P5K7J5R7j18P1J87l3k10j30K9J36j29nK19
5158D9J37j14R7j82M7m2J54J02j51m3q7J0j3o3L46k66J49j07j49J95j90O8J25
5181G2p1J48j42j12K07m1J10k23k51L50l0k79K66o4J21k47L51k85l9J33J53K78
5203D05l18r7J19p0l25L5L52r3o0O4k3j1K5P7p8k80L17J3L33j70k09K5J67r6j09
5228gn6j20K79k04J19P0k16jJ22R0K17k59j27L5j50K11P5j5k07K22P7m40M23q8
$$ y = [228, 248, -96, 196, 146, 114, 35, 207, -294, 82, -261, -5, -32, -29, 157, -2, 137, -234, -90, 317, 108, 1, -163, 94, 29, -51, 82, -168, 202, -243, 108, 273, 100, -47, 231, 36, -209, 147, -79, -232, 29, -145, 36, -62, -13, -14, -12, 65, 8, 140, -49, -93, -179, -46, -41, 58, -344, 99, -83, -46, -242, -28, -76, 31, 136, -50, 205, 33, 141, -45, 112, 20, -365, -73, -91, 46, -40, -182, -107, -80, -65, 32, -86, -15, 172, 139, -71, -201, -172, -36, -165, -170, 49, 186, 72, 169, -13, 34, -8, 146, 248, 97, 54, -33, -23, -36, -99, 247, -19, 130, 23, -126, 69, -121, -53, 72, 1, 149, 7, -105, 102, 61, 171, -52, -303, 47, 17, -262, 4, -60, 61, -186, 165, -120, -159, -26, 127, 405, 87, -10, 109, 39, -286, -251, 101, 8, -52, 12, -11, -22, 3, 80, 2, -278, 39, 52, 385, 215, 6, 31, 198, 102, -7, -63, -183, 96, -108, 11, 81, -135, -136, -14, 76, 293, 34, -93, -58, -208, 3, 78, 63, -144, 78, 155, -285, 138, 50]
5252E0J56j37k06L20j00k4j60O6K57j84J94l48M0P5o9k2J3N6l01J38K39J8k55
5275a84J5K55o1j63J07K82o3l00m4K75j65j01M31l58R4K78k61j0L4r2J54l78L61
5298A06k34j11L59k32K47lj53J00k10r1rM10j59M9k75L89J5l05PK83k65rK01J7
5322A27L6l9j62J41k76J45rQ8J44j76J4J32p4j38p2J29k15J44J06qk15K56Rj07
5346b0j44J75K40k10j97M24m1j93j79L60M1j22o8j49k36M62J90l61K17m02J92
5367b1k41J54J28J01j90N6P8M7k10J1p4P7O5P2l7j14J35o0j42m5K48n2P7m9J2
5392B6J51m96J18K86j15j4j39M9K39q5k37K28m4K4P7k14K07R8j84K97j53j6j25
5415b2jL7j1J15K30m10K15k93L61j96j78J84R6j33L13k48j18j4K70k94j08L37
$$ y = [50, 206, 69, -137, 183, 83, 59, -101, -35, 222, 38, 232, -116, -76, -1, -70, -92, -79, -23, -324, -186, 53, 71, -184, -169, 86, 25, -138, -31, 251, 188, -112, -156, 119, -46, -147, 284, -74, 20, 298, 37, 27, 61, -31, 123, -255, 106, -128, -239, 120, -112, 135, 132, -21, 79, -131, -222, -231, 179, 20, 69, -206, 183, 198, -107, -100, 183, -82, -91, 110, 127, 163, 124, -38, 103, -173, -28, -37, 51, 195, 19, 33, 165, 91, -47, -119, 10, -205, -61, 45, 37, -178, 78, 87, -20, -164, 11, 251, 41, -156, 268, 227, 34, -145, 215, 256, 134, 66, -83, -319, 143, 333, -28, 189, -213, -21, -262, -108, 20, 121, -69, -13, 65, 112, -98, -87, -161, -84, -19, 53, 16, -98, 37, -23, -165, -210, 38, -14, 63, 14, 26, 177, -319, -201, 85, -30, -44, -183, -134, 105, 20, -217, 11, -33, -9, 68, -146, 61, 159, -25, 272, 119, 103, -22, -23, 14, 3, 118, 348, -62, 153, -140, 221, 25, -153, 31, 127, -6, 307, 59, -59, -73, 197, -97, -205, 132]
5437A32j38p4r6K05j7r3k8O7k03K27R8l59L97K4j63Nk08K46j69Q0m9k59R8L16
5461C9r9p3J00m9o0K03J18j68O0l25R7R0r2J56J53j15R7J14j71j42J52o6J43j7
5485A45k06J68qj11K09k00J04Jp5j22J88k06J01J63l58L2K45r7J62m29K63K7n0
5508e4n7J34r9J28O2k79P5j79K13m5J81j66m2J92P8k47J77j77K24j72J15j20k31
5531b89K35K94m13J60R3k67P9K10N3j75k8P6J42p2l7j0K28k98K8j14o3J37J57
5554A26k37K40l93K17o1L3k72K13l3J98k00J44p7L0L6j9J1J80K4k18J31j00m1
5577f8N9o1K16r5q3r2L27k70J35M2j49o2m6O1L74j98k51P3m5K56k7k72K62m5j86
5602a45j13L00q6k1J79j21J78k12K13p8P8j54J07l21m1K26K35k55k45L23j12j1
$$ y = [132, -6, -80, -176, 29, 12, -81, -109, -42, -245, -18, 80, -279, 118, 142, -21, -16, -224, 22, -147, -67, -116, -375, -277, 39, -60, -133, -33, -82, -142, 61, 179, 11, 71, -254, -157, -67, -159, -3, 150, 35, 132, 246, 75, -67, 85, 19, 162, 145, -61, 107, 99, -12, 197, -3, 101, 102, 27, -95, 93, -113, -12, 151, -207, -175, 70, -27, 135, -294, -31, -4, -54, -111, 23, -76, 52, 114, -165, -90, -269, -56, -101, 80, -86, -128, 64, 142, -105, 72, -105, 119, -53, 62, -58, -289, -54, 240, -173, -13, 80, -187, -108, 102, 155, -20, -48, 28, 170, 98, 61, 51, 279, -19, 9, -105, -168, -31, 126, -111, 129, -264, -47, -108, -75, -347, -134, -167, 31, -169, -25, -102, -72, -36, -55, -44, 136, 160, -58, 73, -27, -68, -9, -70, 146, 51, -32, -124, 203, -67, 68, 110, -39, -101, -147, -86, 288, 90, -161, -88, -133, 123, 96, -176, 86, 41, -145, -258, 42, -44, -65, 114, -7, 171, -41, 172, 94, 172, 18, 125, -196, -237, -11, 224, -31, -276, 47, -65, -76]
5624g6j89L56k31L78m49L09R5j9k09J6J02J14p5j17J39j21j19M7n2o8K70k57K66
5647A10J34l02k0J33P7l56L4jK65l91K59K71j72k04J66L29k72r8L4L8Q9j93o1
5670a31J06J8L14j35l49K34n4K6J62l65K13M5j62J15l0q3Q2m4R8Lj09P6j34J83
5694G9l29K99kk5K90k01k62L34j37l9J20J4j69j49K81J4k10L8j26j43L99J69j91
5717E4J48r6o6k81L82O6l40J36j95M69l45M19l01o8J06r4J86l10K96l02M23j61
5739A26j70j45J20L1K35J0l04P9Jj96P9L94j93J20j24j89J24Q5J36k64J81k94
5761a58n8J73j78N2J12qqJ0N7q7J29j56k47L38p9j2O6r8M32m20J40o8l8K08Q5
5786A87j45Q3q1k9J89k10J58r4j44R9l4J05j08J7J87j22J77m58J97j20J29J90
$$ y = [-76, -265, 91, -140, 238, -211, 98, 193, 174, -35, -19, 83, 197, 122, 5, 144, 23, -96, -49, -101, -169, 101, -156, 110, 244, -58, -78, 55, 132, -224, -190, -191, 74, -317, -58, 213, 41, -163, 3, 332, 60, -38, -4, 34, 123, -70, -131, -25, -7, 307, 172, -177, 57, 3, 29, 191, -174, 39, 84, -78, 37, 7, -76, 6, -38, 60, 63, -46, 30, -104, 79, -250, 49, 47, 22, 312, 111, -151, 183, 46, 7, 127, 141, -28, -177, 104, 118, -92, -54, -180, -323, 76, 245, 54, 202, 106, 40, -241, 141, 207, -133, 3, -192, 277, -68, 351, 50, -18, 88, -6, 180, -130, 166, -136, 287, 126, -44, -189, -69, -38, 197, 207, -97, -18, -17, -213, -134, 260, 67, 187, 63, -126, -2, 83, 219, -45, 136, -158, -216, -43, -221, -169, -57, -65, -73, -63, -6, -93, 36, -120, -367, -29, -108, -120, -54, -152, 280, -140, 0, -68, -106, 102, 187, 42, 125, 44, 15, 204, -6, 152, 58, -86, 13, -21, 84, -24, -7, 180, 58, 235, -223, -26, -146, -17, 173]
5808A73k80J06o9J32%j8q1Q7pL09l60k58K62K25k44K87k89J40j65j20Q5N7P0R1
5832A33k36J65Jj62j8j4p6O1J21N9M4K3j4j99n1P6Lq1L66l14p9L70j73J58r0q4
5858a1R7R1N5j57J04N3k64J22J5K5n6p0p4N3j1K7j38LL05j35j33%J2K38j92nr7
5885a43p9L93j95k8J9J84q2o4j06K47j3m14J25n5M1O0J63l75K63P3l06J56L7J1
5909h8j2J58Ok17k07J83J97k38L37p1j50J07o5R7j27J54Pj03n2J28k8p3K47r9
5933I1j55L3J58p3j0k3p8j11J15M8J58k61K88N1j56j5p4K60m23j5K18L5k40J09
5957g0J83J2j41n1J36O1k97j40L71p8J90k33L6q5J60j51M8L62n09P7r6L18m03
5980c00mK30l1K13j28j9J13r7M3J04j21R4k18K67k61J47p5n0K07p9r8J92j25O3
$$ y = [173, -107, -1, -70, 62, 62, 44, -37, 50, 43, 352, -8, -266, -4, 221, -23, 264, -25, 115, -50, -170, -85, -28, 42, 133, -103, 62, 63, -99, -117, -131, -207, -146, -25, 34, 78, 101, 87, -112, -163, -87, -84, -165, 201, -113, -192, 178, 5, 163, 73, -11, 86, 177, 232, 75, 179, 232, -32, 90, 105, 130, 74, 4, -70, -17, -28, -1, -139, -136, 169, 34, -99, -99, -87, 151, -41, -46, -143, -222, 171, -24, -52, -33, 151, 69, 5, -101, 146, 133, -281, -156, -211, -170, -110, 53, -322, -59, 14, -292, -136, -99, -88, -100, 58, 64, -153, -360, -177, 20, -218, 119, 48, -102, 5, -60, 37, -90, 64, 71, -32, -84, 44, 16, -57, 190, 91, -64, -31, 127, 54, 44, 21, -57, -168, -53, -5, 153, -108, 180, 231, 75, 60, -14, 246, -177, -192, 26, 61, -179, -70, 113, 125, -16, -67, 69, 130, -167, -307, 64, -14, 176, -57, -21, -106, 54, -97, -49, 313, -196, -119, -215, 103, -300, -304, -74, -105, 108, -20, -39, 74, -23, 20, 124, 3, 97, -121, 146, -115, 32, -43, -93, 114, 35, -63, 129, 4, 67]
6004F7j39J0J14j21J78o7n2K43l84K17q8o7K56q1r2j14K27j66O2l14L02Q9j47
6027f7q9n8L57l08J49J04k07J80r7lO0L3j49J64m08L14J74Q1j02k13q9p1M55N8
6051B68l67j23L80k74KLL03k58Q4j05L5J65j88Jn8m3K8j02L51m92K98K69k79K17
6075A15p2L2k49N0J57j25R4L9j25l6J69k59P4J58Qj95L5L53l71K23m6J1j33j4
6099a07J19K57o85L49j55L51p4j44N6K63r3r0n7RJ47l11J83j64M06j53o8j37J06
6122Hp7J16J20j09j67R4l2L4J97k81J52j53L62k57J53k45J2K40m9O6k67J63Q9
6145A69j77R9k42K40j14k95L40m1J08k10j36J93J72k71J52j67r8L33p5J1Q9j20
6167d0jO7J11j00p2L90l14L62j98j13j71K90j0j37J14j16j02j63J37L3J2J26n1
$$ y = [67, -72, -62, 52, -69, 109, 42, -10, 233, -151, 66, -22, -89, 167, 86, -6, -120, 107, -59, 3, -311, -9, 80, -67, -156, -214, 143, -165, -16, 88, -119, 61, -36, -39, 21, 54, -95, 69, -339, -25, 149, 230, 128, -85, -174, -245, 210, 268, -99, -222, 158, -116, -114, -111, 192, -66, 18, -87, -52, 113, -75, -74, -132, -175, -147, -249, 102, -390, -92, 177, -102, 115, 43, 75, -174, -124, 33, -92, 2, 41, -84, -120, 49, -210, -136, 22, 30, -165, -130, 223, -148, 75, 29, 40, -93, -107, 12, 269, -416, -67, -222, 129, 55, -89, -33, 230, 137, 47, -10, -1, 146, -165, 18, -146, 260, 107, 39, -98, 8, -69, 47, 167, 58, -109, -15, -47, -13, 184, -97, 55, -98, 264, 7, 160, -85, -73, 167, 118, 184, -83, 80, 169, -8, 91, -151, 89, -25, -320, 20, -21, 87, -123, -259, -66, 106, -165, -13, -180, -278, 55, -20, -9, 80, -40, -41, 26, 137, 37, -35, 355, 41, 403, 205, 92, -79, 211, 201, 64, 178, 62, -40, -203, -66, -33, -21, 105, 54]
6190E4j72L5Q5j90J48K77j13j07j6k26M60k86J88J1q1J43j52k32K46K49m53J71
6212C9l9j43K33j21j4L1m0L01j78r1m9j14J52K46m40M08J06k33j34J05k4k35J46
6235h8O9K87l10N5k27K7L60q0j84L15m18J64l01L11Q9l78L41J68k35p7L8J6K0
6258c8O1k6N6o8R3j51J19pj55K11o9J25q0K65k86k3J41j43j10r6K00k04J07J43
6282F5N9j97J04P8l36J48J49m27K84l6N5R3J67m27M06j15k24L50M5j02j84OL1
6305hQ4k90K69j99Q0kj64L41N4k36k6m1J81l01L57j28n7N8J59j32j45Q1L2J32
6329I9l92K94Q6k7j71K6K45j8p6j07Q9l3k8J46j30m8o8OJ65o7O3l2m5p6K4O9k1
6356b7J75k11J9O5j22R1K20k94K09J9k06K36j58j61J74j07j24K25kP5p0j31O4
$$ y = [54, -118, -83, 2, -188, -40, 237, 124, 17, 1, -225, 235, -51, 137, 148, 67, 210, 58, -174, 72, 321, -132, 39, 0, -143, 90, -31, -45, -14, -54, 247, 69, -22, -71, -185, -33, 213, -227, 181, 287, 54, -80, 25, 1, -234, -88, -19, 268, -42, 13, -214, -187, 173, 93, -91, 224, -194, -30, -331, -20, 69, -309, 32, 200, -35, -112, -74, -58, -38, 23, -3, 53, -15, 78, -73, 46, 39, -116, 95, 26, 151, 71, 336, 50, 27, 168, 25, -85, -181, 19, -185, -78, 65, 124, -73, 31, 109, -227, -79, 70, -357, -73, -109, -54, 39, 206, -221, 185, 70, -154, 196, 241, 139, -45, -39, -8, 76, -214, 55, -144, -64, -66, -230, 111, 165, -71, -97, -138, 43, -258, 99, -29, -86, -28, 131, -1, -146, -65, -33, 99, -293, 1, 87, 60, -111, -85, 160, 142, 66, -41, 48, 15, -13, 133, 3, -45, -113, -107, 58, -9, 54, 22, -23, -99, -75, -6, -27, 148, -63, -44, 21, -101, -10, 210, -84, 125, 144, -62, 174, 16, -145, 29, -78, -202, 23, 21, 96, 26, -105, -41]
6379d1J72m09J07P6K32l48J58J63k81L99m38O72n76K40J7l49K58j04K9rj08K19
6401G9j00r7L02j49k18J08m9J84J2j30n0P0K9J1KJ40j14j41j16J05K66k21J49
6424G2l4P4k86K16N2K1m8r0J39j21K48l72J88k6p8J01j12K33n46N53l66J98m3
6447b7R1j5J27Qn27K44J05n4n0J04M4n5j37J16j67j7L44J84n14J31J86k38J00
6470a7m51M08m4j58K18o1R6j19Q8J42n5j39J47N1R8k70J86j03J84k87J1K49q9
6493H5R5m29L25j37p9M07j79j7J43j01R3l31J65k66K80P1j72J64j57N9L7j3J9
6516F2j88L73l72J92n0p3j85L43j21R7l18J80L14j77j52r1M02o33J90K89j68k23
6538c09K13K5j3J29l4J54k8k73L45l65J95k92L25q8J28l5l06J88J21K6q4O7j03
$$ y = [-41, 131, -278, -171, -95, 137, -211, -53, 110, -171, 228, -210, 462, -114, 126, 143, -206, 52, -52, -23, -32, -140, 79, -21, -118, 184, 35, -183, -75, -124, 60, 72, -58, -108, -38, -9, 2, 4, 144, 30, -111, -227, -122, 144, -77, 72, 38, 112, -174, 42, 94, 115, 67, -23, 116, -5, 243, -129, 59, 33, -45, 56, -56, 177, -369, 184, -182, 16, -27, 64, 49, 176, 184, -343, -99, 6, -48, -98, 6, 50, -5, -142, -26, -193, -210, 134, 318, -196, -65, 121, -117, -17, -468, -60, -104, -262, -44, -105, -9, -128, -40, 102, 47, -92, 55, 106, 204, -66, 120, 17, 201, -86, -75, 174, 85, 180, -249, 76, -61, -140, 267, 88, 71, 214, 113, 206, -125, 40, -226, 54, 125, -47, 117, -40, 19, 56, 43, 62, -126, 247, -125, 67, 17, -56, -241, 102, -19, 78, -240, -60, 254, 77, -75, -166, 236, -397, -207, 82, -86, -309, -96, -71, -84, 45, 11, 165, 137, -136, 209, -156, 39, -253, 72, -16, 112, 77, -229, -41, 80, 106, 22, 89, -14]
6561a4K39j18j38j68O8j32K46K13l52J70L7m62J80K01l5l5L4l2m3j2J15K78k11
6584B9j17M9ll9l1J22r9q5K55k11J37j01J88k25L8J26j18J75k13K57j80QJ81k01
6608e8J41j84j8M9q2J85om1N1M1j37k00K15r6K64K4N5j91p7L5oJ24o6J7j33K56
6634A62j67L16j88o4j31o7N6J9l6p3L37j56J93r3l09Q4L28m07N0K17N7r4m4k53
6658b63J70qL0J70K3j2k54L65l64J84o7j91K63O6r4Oj21K08j69K04L0k14M0j56
6682a54M6K10l2j58K32k90K56q9o4L84j25p7J25J12l92Mk1j68K43L3Lk76k0L42
6706A24l4j22m3N2l1N7j34O6NJn5J32j7m5nl7J84j50L4r1J63q2P7j94L30l1j32
6733B2K5j65J86Mj6p7K8J3P6k37Q6K57k46j67J41J74k80L8J76lR7j50J42j47P
$$ y = [-14, 225, 107, -31, -199, -131, -263, -17, 196, -156, 14, 51, -411, -231, -30, -65, -100, -66, -98, -141, -153, -38, 240, 29, -88, -39, -42, -81, -112, 10, -89, -174, 81, -130, 7, -94, 94, -131, -93, 33, -85, 90, -123, 134, -46, -38, 143, -58, 83, -101, -119, -70, -152, 33, 27, -14, 37, 78, -59, -259, -44, -140, 124, 148, 203, 12, -65, -30, -36, 88, 22, 39, -94, 162, -5, 311, 123, 59, -72, -139, -83, -64, -100, -173, 164, 8, 201, 108, -201, -117, 211, -196, -146, 71, 128, 34, -10, -263, -93, -101, -71, 99, 122, 110, -144, 221, -143, 41, -26, -217, 46, 112, 18, 24, -97, 111, -58, 146, 176, -38, 2, -154, -108, 102, 70, -88, 144, -146, 110, 21, -43, 341, 216, 139, 264, 376, -16, -12, -33, -201, 42, 75, 78, -198, -218, 124, 90, -32, -75, -23, -54, 3, -131, -65, -60, -59, -114, 18, 1, -44, -49, -86, 98, -52, -18, -109, 54, -28, 49, -145, 185, 154, 22, 47, -118, 68, 72, 56, -21, 7, 20, 96, -141, -55, 202, -44, -211, -70, 104, -176, -138, 38, 35, 132, -18, 124, -23, -16]
6758a6K9J3k65K23N4q1r2j01M95j81nj68J66m1P6O1q0k7Q5J1j71l5J27J4N0n1
6784I0l06K21PJ79P1j02k1l08J63j5K15l76J42N9o6j9J33J71m10K83j88J48%k43
6808a72j80M13p3p7L00n23M70j96J18j0j39p8p0JK58j04J27n9j84O2R4m2J03J26
6832A65j08r5j01K41n3p8J43r0K45k16M9m7N0k77K31l9r5q3N8K5po0L59p6j87
6857d6j26K13J00k45o7J33j39R3l6n5M22m1k43%o1p9J48J95m1L7k01J13o0L05
6881C19n41J12Q2o2J19M7l40L20o0JJ4M8K10j51J24j89oP5k77j59K12P6n4L0J14
6906F4l01J14L9n0K57k96K06lL0k28L44j72j71J57k73J44J51L7J36k58Q9ok07
6929a97J04P3O2J80k07J25k05n4K37q0k68J33p2L16pl46K28R2k41J89k23l89N17
$$ y = [-16, 13, 26, -239, -16, 38, -43, -135, -236, 259, 78, 73, -95, 71, 30, 106, 167, 87, 60, 145, 156, -15, -50, 77, 91, 141, 90, -216, 5, 12, 191, 262, 160, 139, -169, -6, -21, 194, -182, -40, 19, -47, -66, 67, 238, -172, 111, -77, 71, 71, -172, -352, 61, -12, -89, 211, -312, 158, -38, 80, 70, -69, -147, -217, -216, 42, -62, 65, 6, -178, -116, -22, -64, 39, 165, 57, -38, -139, 102, 49, -29, 114, 24, 269, 53, 102, 55, 105, -172, 59, 20, -75, -158, -100, -75, -82, -142, 217, 141, -46, -172, 41, 141, -104, -171, -38, -177, -84, -120, -175, 247, 206, -37, -37, -98, -177, -29, 166, 125, 162, -39, 74, 14, 319, -222, -110, -28, -90, 29, 76, -264, 56, -4, -3, 11, 59, 269, 118, 242, 53, 47, 122, -155, -314, -102, -26, -80, -50, 64, -237, -123, -84, -134, 123, -173, 33, 30, 60, -168, 176, 4, -167, -10, -283, -139, 12, 49, 185, -73, 16, 10, -197, -93, -20, 42, 222, 15, 140, -65, -119, 118, 38, -230, -97, -169, 147, 140, -206, 22, 114, -127, 62, -161, -550, -33]
6952c3j30L23L06n46J24J27k48J61J18j75j7J37l4p5J79k74L42j75J44j23j31
6973@j47K38j70K35k8n9O0j09m59M86j77L04l22j1J16J14O6l30K11j74J23r1K15
6996I1P4qk20J69n6m7l42O46m63L9K47k42l0J77j13J79R6K0k75L9J42P7k29k41
7020b70L95M1j63o4J5J27l0p2L36j87M9j38J39m1J01l20K54k12j36nJ39j80J76
7043d6P9j58J66j20q7K73k24Q4J38j25J82j83k4J02J68j96Q5m4r4j00J70k39Q3
7066a10J31rJ50N3k23k22M38j24n6JO4k0o2Q9l29P9J64l9j38K81r5k4k3j52L25
7091A49nl44L04j89J79j35J07K0j80K13j30J34k0j16K2R3J54j83k63J16l5L88
7113B79j69n9m23L06m3M5J62On2L0m1J15j70JK08j31J4q6J78n24K04K06j88K35
$$ y = [-33, -163, 160, 466, -80, 44, 171, -77, 84, 202, 27, 10, 147, 113, 38, 217, -57, 285, 110, 254, 131, 0, -147, 91, -79, 156, 128, 69, 129, 20, -439, 47, -130, 174, -148, -159, -43, 71, 137, -193, 18, -156, -33, -124, 91, 165, 157, -63, 106, 50, 3, -339, 307, -156, -117, 130, -112, -142, 35, -78, 101, 197, 217, -58, -19, 123, 200, -29, -270, 125, 166, 3, -61, -46, 81, 51, -21, 315, 128, 177, 39, 178, 137, 238, -82, 172, -40, -176, -181, -42, -222, -46, 33, -125, 41, -79, -166, 107, -117, -33, 105, -20, 162, -21, -45, 57, 225, 29, 114, 70, -24, -124, 46, -193, -110, 21, 12, 162, 215, -8, -230, 208, 84, 28, 29, 93, 73, 11, 100, -229, -150, 14, -25, -163, 118, 23, -1, -24, -176, 149, 144, -200, 104, -85, 94, -41, 66, 86, -94, 119, -11, 123, 103, -13, 9, 102, 256, 73, -190, -74, -109, 279, 110, 51, -372, -66, -109, -64, 98, 104, 52, 82, 41, 156, -14, -13, 195, 64, 78, -8, 170, -354, -150, 56, -132, 103]
7137A03p0J9j18J0j12L4l7N2K39p6K10k26j52K79J19l47J10J50l63M70k18j88
7159a12K20P8k78J66J06l10J56qk37K75n4n4J36j12k12K03M3k36O2RK11p2Q3k76
7183b13P5J60r5R6j69K07P7j68p4J12r9J21l95M80j62p8K64j52J70k15M7r9J3
7206i7P7P9M5J2j39K5k6r1j07L72j98k44K76k40L16O3n5J4j50j5Q2J55m7j02N9
7231F4j30j22L64l4n2L6J23N2m12j9K51p4k2lM7m2K83k50p6j82J62K15l55J07
7255f9J98k82J36q9K28l13P7J36k58L50j91j04k5J51l4K17j63J26J24l73J6p2
7277b14K02P6q3K5k2L26k28j56K32j73l21M49R1k44n5N9J50k67J17K38m3j12M4
7300I1j56Jj75K76K3o2L8J41k12J44l1l3jkJ13m46L63jk58M23l54L2jJ75m8q6
$$ y = [103, 33, 52, -66, -56, -168, -134, -171, -119, 120, 44, 254, 28, -124, 155, 274, -73, 37, 187, -176, 294, 76, -112, 108, 186, -92, 74, 180, -130, 26, 18, -219, 56, 2, -52, 84, -28, -240, -37, 6, -230, -168, -159, 52, -20, 63, -213, -138, 22, -73, 23, -146, 61, 138, -30, -104, 8, -91, 30, -365, 115, -47, -125, 139, -13, 157, -58, -11, -110, -97, -20, 59, 104, 116, -23, 2, -24, -115, -222, 150, -48, -292, -16, -256, 60, 123, 68, 82, -68, -83, -1, 154, 107, 5, 64, -66, -188, 176, 142, 90, 126, 249, 301, -111, -130, 121, 47, 25, 22, 69, 27, 310, 60, -16, -198, -36, 179, -176, -69, 129, -153, -17, -106, 122, -191, -114, 22, -236, 114, -77, -181, -206, -55, -89, 128, -35, 91, 215, -158, -142, -214, -12, 64, -19, 6, -16, 310, 82, -74, 158, -15, -336, 113, 204, -40, -95, -36, 114, -153, -36, 202, 159, 47, 91, -65, -64, -239, 37, 60, -2, 36, 177, -35, 109, 78, 45, 44, 42, 155, -291, 72, 71, -187, 236, -118, -86, -87, 88, 40, -46]
7326d6n5M9p0p1L59j81qj96J80j0J34K24j07k15j83j55J73O7K38j91J77j86J49
7349G6K18l28j42J01oR4r7L10Q8m48K03kj76j11K86m7J46j44j22k9K10J45q5k42
7373a02K7j11L46j03k0j27J21J6k20J35L3J50k84j9Q1j42K99o2L7q6k69N36m67
7396b31J66LK1O6O5k70J5J32J90l84J34KL66l98O8K37j09j15J82k21L09k90P3
7419A1l07M49j44N0NM2j04O4j27n2o4J08J69k13k08K64j55R8M5N9L1j85O1O7j62
7444a98J2N42k03M2k88n1Q5N1K11j16N3k64J30o6M8r4J88k99Q1K21j81M1K26k13
7468d2J17k8L17l74j60L79l75K22k95M85k39j08K02P0k35K29N6k08r2J86lj6J4
7491A02j52j9j58J11J44l3k4Q3k24K00j08J79l22K84j53J91k41L10k89J51J64
$$ y = [-46, -101, -52, -122, -193, 166, -15, -23, -219, -39, -49, 85, 309, 202, -13, -196, -351, -178, -111, 127, -64, 113, -73, 76, 294, -34, -176, -75, -81, 13, -84, 226, 314, -134, 69, 67, -109, -220, 66, 19, 165, 21, -101, -130, 80, 225, 140, -102, -75, -186, 160, 57, 37, -90, 31, 47, -173, -38, -5, 145, -139, -158, -77, -219, 80, 18, 55, -31, -300, 236, -231, -65, -62, -41, 25, 90, -180, -165, -33, 157, -227, -93, -91, 275, -123, -55, 182, 73, -42, 140, -81, 228, -62, 11, -296, 153, 9, 59, 64, 106, 2, 66, -61, -113, -177, -69, 100, -113, -321, -57, -212, -114, -69, -10, 21, -164, -103, -36, -198, -186, 356, 153, 195, -93, -144, -59, -8, 203, 87, 140, -124, 6, -60, -12, -106, 82, -217, -136, 85, -96, -55, 171, -42, 75, 47, 364, -10, -170, 209, -166, 56, -239, 246, 7, -101, 101, 171, -64, 165, 221, 13, -79, 107, 104, 88, 102, -50, -69, -227, -116, 28, -5, -29, 54, -170, 30, -78, 101, -221, 63, -90, 101, -140, 170, -119, 32, 196]
7512A96j65k45K18M49n49M8J64j71m0l6P0j6R2Q6k58K09J4j36J31r0K58m13P6
7535a08J50L2q9L39j46k60j1l7k8L44qk87j27M37m28K60L0J1n6oJ36q1K9j21R0
7560F5l15K53j31J54l32K72K02j15M4j33K9j41J93k80J55L8q3M3M24l83r4J56
7582B1j2j73L48j99J24j8n1j80k8J03P9j29J0K07j18J02n8o8J28k19Q4J49p4J5
7606D3j48K62k01QK53k61l8J65P9m7k13J64l3J44k69K72k32J53j15J2K67k73J47
7629A39k80j47K44r3j25M79j99o1j64K54J39k60J84j88K17j47l6J53j03j79J0
7650a63K27J17l27K82p4k95L60k53K64l43j8J37J49J45l52p5L72k91J71l2k34
7671b33K13p4O9k7K9J33jj83Q2K80k18j97L4J13k7r9N1j25K72l1q5j9R2k15J63
$$ y = [196, 31, -214, 4, 453, -96, -48, 116, -55, -95, -131, -61, -77, 15, 101, -157, 52, 66, -70, 61, -29, 229, -184, -108, 42, 74, -15, 324, 178, -82, -93, -130, -158, 186, 178, -109, -236, 201, -227, 33, 63, 74, 18, 12, 148, 67, 96, -25, 65, -250, 3, -128, 26, -306, -34, 168, 53, 97, -36, -7, -148, 45, -235, -80, -42, -125, -82, 342, -41, -135, 21, 9, -164, 184, -15, 109, 91, 40, -140, -168, -65, 14, -115, -105, 102, -16, 86, 28, -40, 88, -131, -47, 102, 28, 43, -105, 157, -44, -36, 217, -44, -82, 83, 162, 115, -98, 66, 33, 177, -92, 180, -52, 101, -14, -2, 265, -8, 139, -141, -288, -44, -137, -262, 217, 18, -43, -207, 47, 186, -74, 110, -78, 139, -8, -44, 109, 6, -173, -163, 64, 181, -146, 136, 62, -233, 127, -126, 138, -205, -223, -86, 63, 208, -144, -219, 153, -138, 33, 1, -233, -20, -94, -25, -52, -23, 110, 109, -74, 8, 288, 70, -127, -93, 20, -7, -106, -55, -180, 92, 61, -24, -43, 49, -166, -3]
7696cL6J61O1m57R4o8N2J21K78l01N5k41J96q1J44j89J54j00j8k70O42j75k45
7719a54K8J87J91l46Q6l8K22j07J00K8j36P9R3n7k32L2j9NJ35j65O4j26LJ40o4
7744e1j6J21l0o7M5N1J34k11OL8O6q9q8J66J88l46M8k6J12K14n25K46j4k18Q9
7769a57J76k99L36l12K25j00J40K33j57j94K23Q3k84M3J02j52L7R0R6k28O8J15
7791H4k69J08n1m0J15J94r0J50j83L0l8nr4J29qK12j40K6k41R4j55K54m0j03q2
7816a43j12N20m45J93K75k52k9j03L04k0k38J05r1o3lj17J53K5r6J10j18K86n2
7839H9l37J4k9J85j0p8L0J8m6K44q5j03J98J51k95K85j91o7K51j33m04L94j82
7862a01K05L1k29J61j64L16l77l1L11o4nK5q1N7p8%j08J60k71K20J73m3k12K65
$$ y = [-3, 33, 194, 255, -202, -108, -176, -124, -3, 275, -26, 29, -212, -16, -97, 47, -142, 12, -88, -106, -376, 266, 91, -154, -126, 61, 252, -94, -8, -46, 176, 69, 169, 197, 61, 140, 233, 176, -56, -24, -43, -38, 97, -68, -4, -130, -127, 13, -51, -67, 54, 24, -43, 2, 53, 187, -24, -18, 20, 86, -3, -91, 75, 263, -83, -35, -61, 51, 265, -260, -14, -28, -246, -157, 19, -280, 56, -256, -31, -131, 9, 242, 85, -109, 114, 197, -87, -44, 58, -94, -57, 33, 129, -99, -31, 84, -185, -77, -128, -168, -53, 141, 51, 201, 18, 48, 10, 5, -89, 40, 32, 244, 104, 130, -111, -17, -172, 82, 42, -61, -143, -255, 265, -180, 13, 288, 36, 7, -96, 208, 188, -50, 55, -36, -99, -102, -219, -66, -41, -137, -27, -145, 141, 89, -248, -234, -263, -78, -88, -166, -136, -118, -164, 80, -5, -108, 90, 241, -54, 231, 40, -27, 224, 91, -313, 81, -101, 104, 135, -94, 67, -97, 219, -158, -189, 122, 58, 53, 78, -3, 54, -24, -24, -132, 28, -243, -23, 150, 107, -105, 160]
7886A60l28Q6J26M9J4j23Q8J24k07j39J93k19K63j14q1J46J19l03k4m4J12J45
7908D3N0J27k88N7q1Qj3L36l47J5j4L69j21O3k28M1j56J66J01k85j7L7N8j00J8
7933a61J3M3K50l88J15L78l41J35j62M86l42N1j57j06L9KJ17J59j52M0l3K88l05
7956c1J89k27K32J31k80M1J25j31l7rN5j60K7N8j7o3LJ87k59J50j61J60N7r8J88
7981A30m3l7n8J3m0L5J63k26J39k6P3p1l6K12k28J0j71L06m48M53k00mJ7j07J38
8006fJ73j24Q5j03M3J19k85J29p0J85j32P1j74L09Jl20J2J45q9j02L45k11r0J49
8030F0j4j52J02l41K94K90l66O7m1J70K3M2j77j60K01k89J24K69j15O2l3p0l9
8053i3M0n7K58k29J5k3R3q0j23qK53j24p4j3j8J93M3j91J88o9K9J94m69K04Q1
$$ y = [160, -168, -82, 44, 93, 107, -16, 72, 196, -11, -150, 43, -176, 87, -27, -108, 38, 157, -146, -170, -214, -102, 43, 93, 220, -68, -11, -92, -84, -97, 239, -108, -93, -107, 262, 141, 204, -24, 17, -139, 27, 128, -157, -174, -137, -79, -179, -161, -148, -105, 145, -243, -128, 250, -91, 44, -118, 368, 26, 77, -80, -186, -147, -145, -28, 131, -21, 19, -14, 274, -31, 158, -69, 163, 294, 14, 55, 180, 49, 12, 3, 58, -102, -75, -17, -34, -97, -94, 93, -166, -16, -177, -17, 40, -58, 130, 87, 50, -8, 5, -35, 0, 163, -63, 76, 50, 123, 52, 16, 228, 0, 10, -161, 145, -303, 150, -50, -54, -37, -144, -6, 167, 43, 128, 25, 68, 187, -98, 31, -39, 146, 14, 85, -89, 220, 221, -99, -87, 58, -31, -133, 212, 1, -89, 60, 46, -106, -4, -345, -51, 239, -127, -60, -101, 69, 92, 134, -43, -203, -2, -291, -167, 102, -13, 49, 16, -54, -93, -53, -110, 148, -81, -66, -89, 4, -76, -199, -207, 46, -78, -152, -165, -183, 10, 53, -138, 50, -19, 10, 204, -265, -61, 20]
8078B0nO2M7m7p2p7M59k63m21L42N2k69J20j25J68j05M7L57m15J38P7r9M6k98
8102b61K81k92L96l51K86j87J67k04M12k28N7j50l2L6R6J25k01j41K32n6K5j23
8124a13JJ35j52K74j97K07k65N0L5K16j44p8J55K4j44K59L0k87j30J3J35K52k25
8147E1j13O2l7J60N8k39M0j83K09j23QL01k24J19r9n7L4J00j08j19Q9q3J20Q2
8171D8j9m6K66l38J07l35J66mJ17L5k14J87k45L9K42J43j21j00p5n4
$$ y = [20, 15, 77, 124, 77, 5, -72, 387, 124, -297, 45, 97, -172, -52, -177, -9, -114, -67, 290, -125, 13, 90, -9, 37, -261, 20, -272, 124, -227, 59, -128, 39, -165, 247, 19, 76, -74, -106, -70, 26, 151, -50, -191, 41, -15, 10, -113, -112, 23, -129, 145, -52, 155, -110, -60, -25, 191, 47, -31, 124, 148, 4, 263, 293, 6, -124, -111, 24, 276, 51, -62, 0, -37, 123, 181, -58, -18, -201, 8, -115, -107, 194, -30, 89, -10, -67, -33, 67, -41, -160, -71, -154, -34, 48, 29, -17, 249, -89, 18, -317, -151, -155, -38, -3, -217, -30, -275, -236, 6, 149, 28, -72, -147, -201]
8191b01
$$ Imaginary data points
##PAGE= N=2
##DATA TABLE= (X++(I..I)), XYDATA
0@%%%%%%%%%%%%%%%%%%Lj1J6j6J6j6J9k7L2l2L7m5N1n9O7p5Q5r6J10j26J38j51
40h0J69j88K09k30K55k85L13l43L79m18M61n08N60o17O81p54Q37r32J043j171
60f19J322j508J743k046K452l035L942n572R428l4953l2932M1364J7820P426N106
75I938K2694J2996M469j98Q500P048j488j2059l452J543p648j6554n815j252r105
90I617j0320j533r40k712O65M418M342P071Q226P176Q218J1630R367P290P716
105G0231N953K894K042M36l768l940n218j2016j2891q767j1750j7652j3988r915
119a8349j3642j5392q928n873p590o394k281Q96K917J262L307R083R184M798O670
134d0332J2770R023L338O835J0064M703P57L026L510K14k368j545k60j346m785
$$ y = [0, 0, 0, 0, 0, 0, 0, 0, 0, 0, 0, 0, 0, 0, 0, 0, 0, 0, 0, 3, -8, 8, -8, 8, -8, 11, -16, 16, -16, 21, -24, 27, -32, 35, -40, 45, -51, 59, -67, 71, -80, 89, -99, 110, -120, 135, -150, 163, -180, 199, -219, 242, -266, 294, -323, 358, -396, 441, -491, 552, -619, 703, -805, 938, -1108, 1344, -1691, 2251, -3321, 6107, -28846, -61778, -20414, -2594, 4832, 9938, 32632, 45628, 50097, 49899, 58399, 65447, 63959, 51900, 48448, 49991, 42343, 25789, 19974, 18722, 9617, -703, -2236, -3176, -5888, -5223, -805, 3537, 10608, 18834, 26010, 34228, 45858, 55225, 62515, 70231, 76184, 79078, 81120, 81556, 77788, 73848, 68630, 56614, 43723, 34956, 23206, 5554, -8434, -18349, -31991, -47383, -56311, -62184, -69774, -76168, -78449, -77553, -74636, -73374, -70067, -60984, -51800, -47002, -40332, -27562, -18539, -15201, -8366, 1698, 6401, 7158, 10184, 13694, 13908, 11540, 9995, 9735, 8389, 3604]
149C604l989k72q64l672j950K492P74j859K728N129J731J178M048M594K315K134
165A8121L024K064P90j143o64j49k024n433l535k114n415o541l039l408n933m918
181b0317j860k163l155j344Q62J020N54J952L416L853L126L343N377N397K962
196C023L413N389L761J994K276L685J210n07R64J284q84j592m42k07j486k536
212A9345j437l08j438l102j299L15j696l480q97K55k264l232j091l54k400l155
228f238j425p31k735l217j371m08k063k854m06J39r06j922N11J785j84O4K143
245a9818K568P20J267L444K950K154J740L066L145J965J258K857K926R05Q63K208
261A4218K066l50NJ619L1j213m79K31o65k134j636n09j317k722j936o88j703k997
$$ y = [3604, -385, -657, -1521, -5193, -7143, -4651, -3877, -5736, -3008, 2121, 3852, 5030, 9078, 13672, 15987, 18121, 21145, 23209, 23999, 22856, 22192, 22043, 20019, 14586, 11051, 8937, 3522, -3019, -6058, -9466, -15399, -20317, -22177, -24340, -27495, -28839, -27977, -26957, -26403, -24451, -21035, -17182, -14056, -10713, -5336, 61, 3023, 6436, 11825, 15586, 17580, 19856, 23541, 24751, 24244, 25208, 26492, 25608, 24016, 23574, 23367, 21881, 19345, 17908, 17600, 16162, 13060, 11761, 12076, 10380, 6900, 6003, 6258, 3994, 762, -329, -683, -3083, -6238, -7663, -8394, -11129, -14346, -15717, -16125, -18188, -21042, -21448, -21309, -22215, -24137, -23626, -21841, -22025, -21961, -19818, -17250, -16530, -15263, -11819, -8869, -6715, -4975, -1909, 1236, 3201, 4459, 7316, 10242, 11147, 12010, 14218, 16284, 15934, 15939, 17558, 17589, 16376, 15897, 16128, 15463, 13329, 11693, 11184, 9867, 7145, 5209, 4521, 2818, -179]
279a79k065n98j502k967j573M72j266k212l95R70o15j351K42J576nl07P42K167
297h866O56M3J099K157Q64j73J386K178L30K26J392J740K93k01J622J888j12K55
315F777J527J274L60J0J407J007k44l49J148L03r78j243M93o73k170j689p16j202
333E042k780k500o89j796l142k102l67j312k085j365O62K95j119O95J949J574
349i040K55K005K960J889R69K018K975J975O18J323K384N48m94K84J155o46j900
366I278l87J97j841k281n90l48j907k368m35n38j851j400k42J83j057j549M26
383f710R8j003j105J78L46j579j511P17M0k133r32P00m0j570k16O74N18r02P64
402a3666J674J445P52J245K784K121J082J828L510K413J296K004L422J496P95
$$ y = [-179, -2244, -2842, -4344, -7311, -8884, -8412, -9678, -11890, -12285, -11315, -11930, -13281, -13039, -11463, -11468, -11775, -11033, -8866, -8210, -8167, -7068, -4911, -4047, -4220, -2834, -656, -326, -100, 1292, 3032, 3325, 3124, 4746, 6634, 6522, 6777, 8304, 9578, 9938, 9948, 11355, 12362, 12118, 11769, 12917, 13220, 12242, 10999, 11492, 10819, 8649, 6960, 6244, 5042, 2262, -238, -927, -2723, -5865, -7967, -8334, -9646, -11731, -13096, -12434, -12139, -13258, -12563, -10614, -9040, -8785, -6780, -3820, -1931, -962, 1056, 4031, 6006, 6624, 7947, 10331, 10879, 10385, 10669, 11824, 11178, 9278, 8891, 9088, 7247, 4966, 4376, 4028, 2121, -247, -682, -1220, -3071, -4471, -4713, -4530, -5587, -7136, -6710, -6612, -7615, -8720, -8542, -8196, -9775, -11286, -10569, -10529, -12662, -13594, -12894, -12934, -14504, -14720, -14046, -13528, -14430, -13666, -11992, -10547, -9795, -8550, -5766, -3645, -2563, -735, 2775, 5188, 6484, 8488, 11910, 13406, 14201]
417A4201J903K229R36l59R45J124j27j287k39M15j205j954m91k11j766k969o76
434A0469k08k662k316q53j217k580k230r34j127k543k235r84p06k419j406l95
450a4346K31j595j036J190P44k7O32K056J452R25J742K568K255Q89J903K750J963
467D296O19J098J771O57k46J68O11l24j943r06K80k272j754n88n04j869j641q1
485b628K13j283p53M96J015m25k88P67J120l1m12J25J228j392j277kj07j625k013
504g272p54r34k091j740o6k72j117o56Q37R15O90J380L138K320K045K759M169
521C351L797K482L392L839K901J794K065K095J051k72k09J41j506k317k216j725
537A8663l124l820k914k117k907l525k270j176j887j998l24P6l60k91O45J729
$$ y = [14201, 16104, 18333, 19269, 18910, 19855, 20979, 20852, 19565, 19326, 19741, 18536, 16582, 16091, 15880, 14114, 11145, 10469, 10261, 7599, 5283, 4430, 3213, 633, -1597, -2531, -3658, -6201, -8436, -9420, -10126, -12545, -13951, -14346, -14115, -15710, -16746, -15556, -14812, -14839, -14207, -12151, -10699, -9774, -8032, -5464, -3209, -2320, -417, 2333, 4296, 4915, 6013, 7784, 8441, 8195, 8363, 8974, 8650, 6707, 5801, 6081, 3809, 2055, 1467, 963, -906, -2547, -2628, -2415, -3698, -4451, -3955, -2940, -3365, -3653, -2886, -1766, -1797, -2209, -2084, -856, -2248, -3525, -3527, -3634, -5259, -7272, -8026, -8960, -11051, -12791, -12857, -13129, -14246, -14902, -14065, -13150, -12460, -11080, -7942, -5622, -3577, -818, 3351, 7148, 9630, 13022, 16861, 19762, 21556, 23621, 25716, 26767, 26495, 26286, 26427, 24921, 22604, 20388, 18663, 15539, 11719, 8805, 6688, 3781, 256, -2014, -3190, -5077, -7075, -7399, -7323, -7683, -7974, -7329, -5600]
553e600J33L55J149J302K68k33Q96k2q74r22p58q27j862k014j570r92j812j979
571a5362p01l34r81m84J208J153N87J353K779K425K117K490L320K754J797J915
587F036K511J611Q46N27O75K2j121j127n55j398k174j840r56j859k432j395o88
604c317j028j000Q7O13J65K55R87J730J815R90J389K242J241L88J757J681L3l83
622I645K76L19r00j233o07r52j441j674j036o48j316j545q71L14j154k67L77O56
640b057j94r6J112O84J99p7R09M21m46k03M65n61j020j224k05q90j283j236n47
659f249p38j130p70J84ln68R6J296P63M12R51J818J625Q61J563J945J184M46J377
678E063J679N92j50K23P26k81j053p1r5r56j525N7n89j234j378m3k16q30j298
$$ y = [-5600, -5467, -5112, -3963, -2661, -2393, -2626, -1730, -1752, -2626, -3548, -4306, -5133, -6995, -9009, -10579, -11571, -13383, -15362, -16063, -16397, -17378, -17862, -16654, -15501, -14914, -13561, -10782, -8357, -6240, -3750, -430, 2324, 4121, 6036, 8547, 10158, 11004, 11531, 12206, 12228, 11107, 9980, 9425, 8027, 5853, 4013, 3057, 1198, -1234, -2629, -3317, -4345, -5345, -5258, -4645, -4480, -4225, -3238, -1508, 307, 1297, 2686, 4928, 6169, 6557, 8314, 9995, 10028, 9645, 9921, 10240, 9340, 8107, 7500, 6548, 5107, 3433, 2397, 1749, 433, -1112, -1983, -1669, -2823, -3090, -2713, -2057, -2251, -2347, -1235, -551, -352, -429, 480, 901, 455, 252, 717, 156, -864, -2088, -2293, -3183, -4466, -5702, -6249, -6987, -8117, -8887, -8703, -8706, -9274, -9178, -7882, -7119, -6707, -5756, -3938, -2313, -1452, 111, 2056, 3240, 3686, 5063, 6742, 7334, 7184, 7407, 8133, 7852, 6799, 6728, 6633, 5677, 4152, 4209, 3620, 2386, 1008, 965, 749, -81, -1379]
697a379O20K28l15o84L47M79m88l72P21J89p23l60J39M5n93q18j41p7j086n60
717d828O8K00j286J0P00M96m73L84J106Q66P9J082J527J083L97J058J701Q06K55
736E231Q19J233O1p8J11M85n63p30m91m8j049j384p45k00j248j487l69l34j268
755b054j010l62M62r93q43M58O88l04l08Q51M56q2o3J028N42q9K20O72K64r6R9
776d64P91K10m60J9O21L01o59J18O61J90m58K45N98K06l57J89J020j01m28L50
796B592R16m9r33N80L00k85p85l85K29q00q34o33J07j486j029m95j41j482q71
815e484n22o1p79q36P3K95l30m08Q62P05L18J69J524J064L62R00J182J394P36
834A164K15J532Q94J39P93Q16L14j41J2L30K40o04o81M55n62p69l36M46p07r84
$$ y = [-1379, -759, -531, -846, -1530, -1183, -704, -1192, -1564, -843, -654, -1377, -1737, -1598, -1553, -2146, -2964, -3105, -3182, -4268, -4828, -4760, -4560, -5846, -5836, -5136, -4640, -5113, -4729, -3623, -2757, -2678, -1596, -69, 1014, 1411, 2469, 4170, 4976, 5231, 6050, 7283, 7344, 7266, 7377, 7862, 7299, 6569, 6078, 6030, 4981, 3597, 2852, 2652, 1404, -83, -452, -786, -2054, -3064, -3426, -2964, -3957, -4800, -4342, -3654, -3958, -4266, -3415, -2959, -3041, -3104, -2076, -1534, -1623, -1403, -731, -467, -563, -464, 327, 537, 77, 96, 717, 1018, 359, 477, 1138, 1328, 870, 1115, 1713, 1919, 1562, 1751, 2771, 2670, 2242, 2592, 3508, 3459, 2526, 3106, 3406, 3121, 2336, 1951, 2180, 1380, 546, -87, 20, -1466, -2495, -2990, -3131, -4613, -5484, -6006, -6067, -6846, -7682, -7609, -7314, -7644, -8052, -7190, -6485, -6167, -5998, -4474, -3410, -3048, -2148, -966, 428, 1164, 1379, 2911, 3805, 3944, 4737, 5553, 5867, 5726, 5738, 6068, 6308, 5704, 5023, 5478, 4916, 4147, 3811, 4257, 3550, 2566]
854B566k48J84j31p86K88nk23k52O0L66m1p78M21P0o52j88j57j61l73j000o2j47
876a249m62q36K08l56k92l04J13m2n8k62P22M39O4K95R96Q87n4M86O39N54J43
897A631K25o9M96j31n08k8j7r44r44J47o96r90n41l17n69q67l46J8k39p58P0Q57
919d520j84M8M87O04J97M44M61J000M42J65N32J096K67Q4M51P51O6j31M14N86
939C260j93j10M53R1J61J10P3L05K14J2K44M28j27l59N36r3m70j19K00n27p26
960C363n59j13p09r30o45n25p34j093n74n17n90q18o06K49j7r97L54M41j99j51
980e370L89P80N02Q9O54Q10N96J88P75R13K04J93K41R58K01J3J07M22k7j42K51
1001B747J16k52m07N0m3N9o51J3J78n90J4l63L99p55o78M2L8p67m07N6j47r67
$$ y = [2566, 2318, 2502, 2371, 1585, 1873, 1868, 1645, 1393, 1453, 1819, 1778, 1000, 1421, 1491, 839, 651, 494, 333, -40, -1040, -1102, -1249, -1711, -2547, -2339, -2695, -2987, -3291, -3178, -3220, -3278, -3540, -2818, -2379, -2315, -2020, -1024, -137, -191, 295, 934, 1488, 1631, 1856, 1787, 2283, 2152, 1644, 1616, 1599, 655, -289, -142, -838, -1828, -2369, -2686, -3255, -4122, -4468, -4450, -4689, -5447, -5377, -4520, -4704, -4656, -4169, -3565, -3368, -2924, -2463, -1463, -1021, -856, -324, 772, 1039, 1123, 1574, 2325, 2391, 2260, 2674, 3260, 3067, 2957, 3410, 3501, 3662, 3772, 3845, 4150, 4364, 4376, 4620, 5048, 4921, 4562, 5098, 5005, 4535, 4416, 4616, 4089, 3363, 2804, 2691, 1982, 1052, 407, -118, -852, -1945, -2519, -3036, -3626, -4444, -5050, -4801, -4818, -5815, -5461, -5020, -5219, -5370, -4981, -4201, -3699, -3610, -2956, -2146, -1550, -1362, -587, 326, 530, 723, 964, 1922, 2123, 2136, 2243, 2665, 2638, 2496, 2747, 2863, 2611, 2204, 2254, 2211, 2270, 1619, 1632, 1810, 1220, 1234, 871, 1270, 515, -163, -121, -83, -850, -1257, -1201, -1348, -2315]
1023b315k79O7o90m00n77J14K3l24m63M81L52k88j64Q67P15j45M87J221N58J90
1043e70J082L49Q71M96P25P13P53K69o4P61M63m05J29O25l35n36kM34p98p74r8
1064D088l66r09o56r0n23n85p45k97j85n05p42m59o2n45n62K01n4n53p40O71k0
1085c638n78j29N72j78J71j29L85J27R8q9N07N72K5J72R76K65n59O55J241J67
1105F33K7M64O05J61N2N70L58J49jK34J92J89o53Q7L7j88r28J4J60p95p72j26
1127D69j02n45p60j0k81m27m03K54m7n79j22K27M36k59m53Q67N21m53J97J135
1147c35M4r0mQ74L44J95k5K14r1J48J4K68J17l30k60L13K4o05M86J46m12l19K35
1170I51l1l87j04J85l7j56k47l6J40O3m82o4K5l93o26J71J01l08o67K97J75o08
$$ y = [-2315, -2594, -2527, -3217, -3617, -4194, -4080, -4057, -4381, -4844, -4363, -4011, -4299, -4463, -3596, -2881, -3026, -2539, -1318, -760, -570, 512, 861, 1732, 2228, 2953, 3666, 4419, 4688, 4624, 5385, 5848, 5443, 5572, 6197, 5862, 5326, 5324, 5758, 4960, 4186, 4088, 3722, 2813, 2157, 2067, 1544, 959, 214, -83, -268, -773, -1515, -1974, -2036, -2581, -3143, -2942, -2996, -3549, -4289, -3618, -3638, -4216, -4345, -3773, -3951, -3780, -3909, -3524, -3397, -3299, -3388, -2881, -2309, -2284, -2112, -1136, -871, -1430, -775, 466, 633, 660, 1124, 1729, 1890, 1942, 2512, 2870, 3019, 3018, 3252, 3444, 3633, 2980, 3067, 3104, 2916, 1988, 2002, 2162, 1367, 595, 469, 367, -178, -938, -948, -1229, -1656, -2059, -1805, -1852, -2431, -2553, -2326, -1890, -2149, -2602, -1735, -1214, -1667, -1470, -335, -291, -381, -385, 489, 833, 1028, 1003, 1217, 1126, 1274, 1288, 1556, 1673, 1343, 1083, 1396, 1420, 815, 1301, 1447, 1035, 716, 951, 920, 533, 429, 614, 577, 421, 174, 138, 278, 341, -141, -205, -180, -573, -1199, -1028, -927, -1235, -1902, -1605, -1430, -2038]
1192b038j30K30K40q8k66O49K22m4K80P38R7K67KQ33L71k09M37M64L80L6J1N47
1214C029j30m96j51K99k47o24L4M0m44p82j18l92j19k27o45N2m61o34l59M90l17
1235b202l43J93P0K03k15K40L11k81L0q7N87K97n25N39N25m02J91L09J78r5K0
1256d57K50M87j2L0J65J50M00p1q2P88J82j9L7M84j85j15L29L30m26J20o2j4m17
1279A892k43j72l70j56p75J44j69o66n51j44k42k82l41J5j53j29O8J25Q4l4K88
1300a811N09J92o6J35N65L61N3O30J23J92J61K53K01q3j81J52K26l17J41o35N21
1321A322l59j61Jn2j08m74k88L52l12m83K79J66j22l06J57j9j79m27L83k75m78
1342a383L30j46l7k52k23j1j14j30J76N9P9q3l13R77O0m31L55M39J02M16K45M24
$$ y = [-2038, -2168, -1938, -1698, -1786, -2052, -1403, -1181, -1225, -945, -207, -110, 157, 159, 992, 1363, 1154, 1591, 2055, 2435, 2471, 2482, 3029, 2899, 2403, 2252, 2551, 2304, 1680, 1714, 1754, 1310, 528, 410, 18, -101, -328, -973, -921, -1382, -2016, -2375, -1885, -2202, -2545, -2352, -2282, -2079, -2294, -2054, -1743, -2024, -1994, -2081, -1494, -1197, -1722, -1183, -658, -1060, -869, -560, -382, -477, -457, -207, 280, 268, 298, 463, 613, 1013, 942, 860, 1648, 1830, 1811, 1848, 2332, 2147, 2032, 2361, 2691, 2265, 2385, 2323, 2309, 1892, 1649, 1477, 1107, 951, 176, 320, 151, -515, -1066, -1210, -1452, -1734, -2075, -2060, -2213, -2342, -2274, -2149, -2065, -2099, -1811, -1302, -1110, -1176, -1041, -476, -115, -62, 568, 691, 883, 1044, 1297, 1498, 1415, 1234, 1386, 1612, 1295, 1436, 801, 1322, 963, 802, 803, 751, 643, 169, -119, 233, -79, -562, -283, -117, -239, -545, -388, -407, -586, -1013, -630, -905, -1383, -1053, -1199, -1236, -1488, -1711, -1722, -1836, -1966, -1790, -1731, -1652, -1735, -2048, -1071, -1011, -1442, -1087, -648, -546, -130, 115, 539]
1364E39oL72N50L50J6J38J07K95K29m31K05K20j37k59m27J79k85j66l17K66n63
1385H75k58k43j11k16l43p1j26l03l50R2M3l71l54N60j44k21o1R3N47m85j34N58
1407a023J36k20J75L79K80k36m8M50L53k98L46M46j43k05K78L98l49J14j17L17
1427A033j77l28O2J53k61m56L41j95j19m08J88J93k75k69j31L21q3l49L38L1J00
1448b91l40J10R2l3l37N13k57j64j99L13j93j5J03k8O0R7l39Q68m3k27K85N45
1470E20N5j2M99K39J68J00M1K78J40m1J9J17K3n61j65k6l04n15K14p83k49l00
1492e43n40l2k11n11j34M77n03p2L79N5k32K80J54L97j24K47L00M19j55J97K0
1513a32L20oj34K78J24k34j19J55K93k43k87K32K29k84l9K81L00j56jN45J33k65
$$ y = [539, 533, 905, 1455, 1805, 1821, 1959, 2066, 2361, 2590, 2159, 2364, 2584, 2447, 2188, 1761, 1940, 1655, 1489, 1172, 1438, 875, 617, 374, 263, 47, -296, -367, -493, -796, -1146, -1054, -1011, -1382, -1736, -1176, -1320, -1541, -1602, -1509, -962, -1447, -1581, -1023, -887, -1107, -932, -553, -273, -509, -557, -107, 246, -52, 294, 740, 597, 392, 670, 1068, 719, 833, 716, 1033, 856, 528, 590, 743, 482, 26, 367, 172, 53, -355, -167, 26, -249, -518, -649, -328, -411, -760, -422, -391, -291, -631, -521, -429, -462, -799, -286, -543, -707, -906, -593, -786, -801, -698, -726, -666, -569, -908, -40, -83, -310, -25, 520, 575, 563, 1062, 1301, 1469, 1569, 1610, 1888, 2028, 1987, 2006, 2123, 2146, 1585, 1420, 1394, 1090, 575, 789, 6, -243, -543, -1083, -1115, -1326, -1837, -1971, -1494, -1997, -2069, -1690, -1635, -1867, -1587, -1433, -1036, -1160, -913, -613, -194, -349, -152, -132, 188, 182, 48, 326, 450, 216, 97, 252, 545, 302, 15, 247, 476, 192, 153, 434, 734, 578, 577, 1122, 1255, 990]
1535I90j00O44j60lq7LJ36n88j22J53k49m99n44K00j44p65r3Q8k62n88P2J51j52
1558a919l7r2K01K89M2O41L82m65L33L40M83L3%M23M83l91k01O85k68P6k08J74
1580A004Or9k57J30k02O5j77N46l62k78J30K09K08l24oJ60J06l72qK7l14K0k79
1603f7l76J69n21m13K38j55o63l6J12j22j40K63L81J2j06M94L99L3J31L44M91
1624D68K63K0K09Q2J54j24M18J4n3l63L50j76m73j03p7J9o15k45K79j26k09k36
1646e24K02N4j08N5J73K85p6k22K92n8J49j86K03K12o50o9L82k52q40pO2l10l01
1669a534J23L8N38p28K29K35k6j34M09N27L05M22j01L83L34K59K03J00L51j17
1689A816Mj4J58j06m7j38p09R1n87j02j50k44o53Q5j67n68K25Nl19j21L42L7J47
$$ y = [990, 890, 1534, 1374, 1371, 1284, 1287, 1423, 835, 713, 866, 617, 118, -426, -226, -370, -1135, -1228, -1140, -1402, -1990, -1918, -1767, -1919, -1956, -2048, -1847, -1558, -1516, -875, -493, -958, -625, -285, 198, 231, 231, 654, 1137, 746, 545, 1230, 962, 1038, 830, 1004, 1010, 911, 654, 784, 582, 647, 470, 1016, 654, 376, 506, 715, 923, 599, 593, 753, 859, 487, 479, 506, 192, 212, -67, -443, -274, -795, -1208, -970, -1125, -1788, -1824, -1712, -1834, -1974, -1711, -1330, -1318, -1424, -930, -531, -498, -367, -23, 468, 731, 751, 960, 1042, 1196, 1072, 1490, 1504, 1451, 1088, 1438, 1262, 789, 686, 609, 628, 13, -232, 47, -79, -288, -524, -322, -268, -376, -321, -148, 137, 61, -161, 131, 73, 222, 36, 239, 451, -199, -268, 114, -138, -978, -985, -923, -1233, -1534, -1411, -1373, -835, -1563, -1334, -1099, -1125, -1259, -850, -323, -18, 404, 303, 686, 1020, 1279, 1482, 1582, 1933, 1816, 1820, 1806, 1964, 1858, 1811, 1673, 964, 1055, 468, 366, 216, -28, -681, -596, -763, -1331, -1106, -1101, -1420, -1541, -1199, -1162, -1015]
1712a015k68M50J46j04J5O09l8L15k96J23L12k78l3K05j2j81J61p4J3l47j2K84
1734b5o2j51K23j2L9J22p7K71J38k84L02K69O5j38J30J93o7r1j88J90m25J66j52
1757D36r0l66k59L81r9n25l82r7J84j81j42L48j56j20j53L07j5l27L59N46L43
1778hk63l9O66N9k08L56K56J20k5l1L18j83k28k2M38q9l72j36NJ49l65j09P8j96
1802A71k94J58j74K9j38oj11P8m27J42M41m40Q7p3Q8q8pO7J06l34J98j39l6K39
1826d63m75K26J91j52O4K53j23O7J4J81N2Q6j11L31K68j16J33L32L21k65J89p3
1848I30L46o50K48p0M9m08j10K46l5l11k67J98p2k67o1J86k55l02J28K23J17j96
1870c33J39O1k4j24L14J76l04p1K35p7j09Q6k0N4k67j48K16Kk69K74K45k7j26
$$ y = [-1015, -1283, -833, -687, -791, -776, -167, -205, 110, -186, -63, 249, -29, -62, 143, 131, -50, 111, 37, 50, -297, -309, -25, -87, -238, -15, -27, 12, 134, 57, 328, 466, 182, 484, 753, 818, 680, 810, 1003, 936, 845, 657, 847, 422, 588, 436, 346, -20, -279, 102, 3, -522, -904, -1001, -817, -998, -1140, -792, -948, -1068, -1221, -914, -929, -1256, -897, -351, -8, -271, -310, 356, 415, 207, 563, 819, 939, 914, 883, 1201, 1018, 790, 768, 1206, 1117, 745, 609, 614, 763, 398, 289, 367, 171, -123, 35, -139, -110, -248, -254, -365, -287, -714, -572, -131, -571, -484, -557, -469, -557, -564, -497, -391, -725, -527, -666, -702, -463, -938, -712, -521, -673, -609, -356, -479, -412, -398, -217, -165, -79, -190, 141, 409, 293, 426, 758, 1079, 814, 1003, 930, 1276, 626, 874, 804, 853, 445, 335, 581, 546, 235, -32, 166, 94, -173, -234, -48, -303, -605, -477, -254, -137, -333, -194, -133, -157, -281, 33, 209, -95, -166, 69, -8, -117, -31, -51, 3, -264, -412, -196, -194, -463, -189, 56, 29, -97]
1893i7l23K24J61K23r5N26r9lK5J13L99n24O3L83l29l43K13j74k18l06l68j51
1915g00N9m98j13l8K8m67N8R6L66l00J21L43K15N7J32O08K09kK88M62j89K87R8
1938A120k2J32Kr8J7k69j36n3Q6n02P5k31R3k54k75o3O9m3K05K89j24K48M5L20
1962F31J31o8j24K09J19j68l48K65k08m01r5o0l03j53k75l20j20k04m78J51O7
1983a752J25j88M24k08M56M57o5J53O22J05L71M73n7M47K37j6l8K19k43L26n72
2004A276p2KK1m21N5p01j36k60K47k88l01j35RR9o2M4r4J23J68J11j7K92l16J77
2028a79K52N1l22O2K28o80l0J60p8n1k2j61j50K41j43j19J92L22k87J68K13Q7
2050b46m7K41L14Q3K94k26O78k64N9J60qK22q8j40P7M1k48O7L4l65j98j88R2l18
$$ y = [-97, -420, -196, -35, 188, 93, 619, 520, 517, 542, 655, 1054, 530, 593, 976, 647, 304, 517, 343, 125, -181, -549, -700, -641, -1139, -1252, -1290, -1262, -1729, -1671, -1575, -1209, -1509, -1388, -1045, -830, -773, -641, -33, 176, 174, 462, 924, 735, 1022, 1120, 1098, 1230, 1232, 1134, 1151, 882, 746, 693, 779, 277, 352, 121, 214, -40, -315, -378, -309, -352, -147, 142, 18, 266, 311, 631, 762, 694, 570, 779, 898, 730, 382, 647, 439, 38, -57, -117, -420, -573, -848, -1168, -1288, -1492, -1970, -1819, -1752, -1627, -1815, -1391, -1599, -1143, -686, -751, -598, 24, 129, 500, 973, 916, 1363, 1600, 1584, 1546, 1765, 1522, 1848, 1276, 1204, 1206, 1227, 806, 861, 160, 24, -236, 11, -277, -578, -713, -704, -605, -667, -623, -717, -594, -426, -315, -332, -40, -356, -179, 73, 124, -198, -136, 92, -588, -618, -458, -536, -587, -609, -770, -920, -679, -822, -941, -749, -427, -714, -546, -333, -246, -293, -52, 262, 345, 639, 413, 1091, 827, 886, 1046, 1038, 1260, 1172, 1032, 1109, 1150, 902, 969, 1003, 638, 440, 252, 344, 26]
2074B6k19Q9Kn24L7J22N3k64K0n1J71j91j15M33m72O7K07R0J32k36L49K2L46j96
2098a02k2L0L7K75k99M57K51q3k04L5O03o84k7M23k05m6n4j4j34j08Q5r1k45J22
2122@j1o2r4n7L43j03j39J23j51J23K17k47p7N45o18P7Q1J65m01K87k10O8q3o4
2146b88n9J4j80j69J17J26Q1l44J56R9J14K1L73j16j99m8N67p5J94M6K96q0k25
2169D21J24J00l68J58j58J85K1n03K10o6k19m32J38K6l30J66j63M1qJ79M1K67
2191a70M5r0J24K12N3N3N8J8Pj48MK85l36K83N5j9k9K5Mk1n35r8N94N9j60j66
2217A07J08J25j5k14L41k3n23L9N54j83j44K42l73j07J36k02p4L7j92m7j39L2
2239e15l32MK32J95o56L55L58j01l4P3J58j35K09L4k6K19l09M64n7j30J60L7j7
$$ y = [26, -193, -104, -102, -626, -589, -467, -414, -678, -658, -709, -538, -729, -844, -411, -883, -816, -609, -519, -387, -623, -274, -252, 94, -102, -124, -94, -57, 218, -81, 376, 627, 544, 340, 375, 978, 294, 267, 690, 485, 439, 385, 371, 237, 129, 214, 123, -122, 0, -11, -73, -167, -224, 119, 16, -123, 0, -151, -28, 189, -58, -135, 410, -208, -131, -50, 115, -286, 1, -209, -141, -224, -288, -347, -333, -513, -682, -565, -439, -358, -702, -546, -447, -333, -312, 61, -55, -254, -302, 265, 190, 384, 430, 726, 646, 421, 545, 645, 277, 435, 277, 462, 483, -20, 190, 124, -95, -527, -389, -363, -693, -527, -690, -649, -657, -478, -437, -170, -125, -215, -91, 121, 174, 227, 285, 303, 310, 162, 166, 451, 115, 398, 453, 434, 405, 430, 434, 413, -122, -220, 374, 433, 273, 107, 215, 340, 325, 111, 452, 429, -94, -55, 499, 316, 172, 414, 41, -66, 70, -132, -206, -169, -361, -408, -547, -515, -847, -843, -611, -416, -1072, -717, -359, -460, -494, -421, -263, -398, -189, -155, -181, 38, -271, 193, 136, 6, 166, 203, 186]
2262A86j01n2Q4K74o9q4j00nrJ53o3J64n01L76n3J34k08L74j47O3J89j2o3j74
2286C56j53r6K88l19l38LL29k50k40j79J06K16k03k1L12m80J02J33m3J17K10k81
2308d31N14j69K45L70j05j60j01N60L7j49N0l2J87l08N0J05m12k0kq9j53L9m94
2331d68M16j24l12J15j15J13J93r5m1J26j04J80J8k18K81j51J47j05k14Q5K66
2352gl4l02M6N4m2j74J48qk24K0n4J2J73j47J44L47k59q4j16L33q8P5K49J59P9
2377C00J51j03L17j34q7N05o0j54k05K14K09l89N9Rm10Jj69K80k31j43l56L36
2399f0k2j72l4M2p7K55j31J54K03l75J5K42R0J6q2K05J25j22o6K86j81k78l2P3
2423G4l39j63J70P3q5n39j42L33l8L4k09K11M2k01j2L42N8j07J73N06k96K63M43
$$ y = [186, 85, 33, 117, 391, 322, 238, 138, 133, 124, 277, 214, 378, -123, 253, 200, 334, 126, 500, 353, 416, 605, 593, 530, 356, 203, 107, 395, 76, -262, -259, 70, -180, -420, -599, -493, -277, -480, -501, -189, -669, -567, -434, -477, -360, -150, -431, 83, -86, 159, 529, 424, 264, 163, 723, 760, 611, 661, 629, 816, 508, 558, 663, 251, 231, 229, 140, -13, 26, -468, -52, -176, -488, -373, -488, -375, -182, -277, -318, -192, -296, -116, -98, -316, -35, -186, -39, -144, -358, -273, -7, -41, -343, -297, -243, -285, -459, -311, -319, -543, -523, -577, -565, -392, -539, -395, -48, -307, -391, -507, -174, -262, -187, 62, 221, 300, 451, 348, 665, 531, 444, 949, 889, 735, 530, 744, 953, 564, 623, 632, 222, 223, 54, 334, 103, -40, -396, -60, -82, -254, -288, -246, -323, -68, -199, -45, 158, -217, -202, 40, 130, 146, 64, 269, 394, 272, 206, 492, 311, 33, 1, 74, -265, -428, -258, -185, -270, -809, -951, -618, -656, -622, -831, -620, -578, -779, -791, -449, -391, -498, -325, 181, -115, 148, 591]
2446E91j49j41l4M25K6J63l59J11J28n86K23q6J66j71j62O7j8m13P7m0P0j89K70
2469c1J51Q6j50M0M47M0k47J39K52j65j48j4J73k45j34n0M0l31k24j29K0J61l84
2492g03l02J7N6j67J61m5o5l29O10R0r9L43j92L34K61J09p5K49l8K49L1J50L1
2515F76o8J6j10pj41M9J86O3o56M87j75j7q6O2K19k89R1K08j61lj31J99J3L0j54
2540C01R6M4m88L14j13j33K0o2q1l43J03k66j00O0n8j10J11k32J6P5J90L2r8K83
2564d39l2K0J8Q5L65J0j57J52oK3q5K31K2m8J82o7J19N3j05j66K8K05r0J51j47
2589C22R9k00J70n5j45j6R1J35j34K4J63l08N0o6K8j47m6k26K99k97R8p5j07l0
2613c73j10K40p0K37r8l57M19m9p8K05J09K5l18L26L70l01m7O7K67mj94J07Kk30
$$ y = [591, 442, 301, 267, 692, 718, 881, 522, 633, 761, 175, 398, 312, 478, 307, 145, 212, 194, -219, -142, -182, -112, -301, -31, 120, 206, 56, 96, 543, 583, 336, 475, 727, 562, 414, 400, 573, 328, 194, 144, 184, -147, -371, -500, -480, -319, -703, -1005, -988, -932, -1099, -938, -983, -1048, -1377, -767, -677, -776, -433, -625, -291, -30, 79, 4, 253, 215, 464, 495, 645, 676, 608, 624, 514, 507, 366, 415, 601, 664, 8, 495, 320, 303, 217, 279, 498, 209, 300, 508, 347, 344, 213, 412, 425, 455, 301, 397, 441, -47, 267, 154, 21, 41, -21, -102, -445, -342, -608, -708, -648, -706, -816, -705, -937, -921, -846, -656, -624, -722, -439, -471, -451, -433, -348, 17, 27, -130, 22, 16, 39, -46, 185, 207, 159, 341, 274, 393, 446, 341, 175, 203, 408, 318, 469, 322, 421, 221, 391, 336, 191, 175, 266, 401, 267, 291, 454, 146, 196, 130, 158, 11, -35, -261, 38, -259, -161, -236, -343, -373, -483, -243, -313, -76, -174, -531, -112, -161, -239, -34, 75, 100, -218, 108, 478, 177, 130, 197, 464, 460, 266, 373, 375, 145]
2637A45L7K27r3p5j5L4l31J0O5M4K61k93p5K88l94J51K39Q8l04k11J93j32Q5j72
2661b28k9m2K22j15M9p3K00j25k6l28K70J28l13J61n1R7k44L41j89P2j49n2M00
2684b4r3J8lJ07j48k3K95K69o0j69N3j4P6K6l73K29l9J39J48m26l8q4J45J38m05
2709b56L17j53j90k05K38r1J03j13K42q4m3J51QJ32j53j22M18O3K3j06K34m7l9
2732C27Q0P7l42J45j67J39p1l63M18l5M8l04k23K36j40J20m8Jj07Q3L4N9k89L54
2756C2N0l0q3M9K08k59l34M55P0J18J26l38j38j02K7l2j6Q6j84k55M18O9l79J64
2780b78R2N3l79J05L58K14J2L2l4J2O3J1K08k05j2K74p3j35K16k96L04l36J16
2803C22j72m4mr0j21j90K7Q8J4k95R2k6J13P6q8n6J39J93p2M4k0K04K2p8J52k18
$$ y = [145, 182, 409, 316, 241, 226, 260, -71, -61, 4, 48, 309, 16, -59, 229, -165, -14, 225, 313, 9, -202, -9, -141, -56, -228, -257, -299, -77, -192, -143, -216, -16, -141, -167, -495, -225, -97, -410, -249, -300, -203, -447, -106, -295, -223, -372, -424, -24, -117, -99, -102, 5, -143, -166, 129, 398, 338, 169, 222, 208, 284, 310, -63, 166, 127, 266, 414, -12, -50, -134, 11, 149, -256, 61, -92, -282, -487, -249, -340, -237, -350, -108, -192, -235, -84, -76, 56, -97, -219, 199, 262, 285, 179, 413, 366, 327, 407, 484, 142, 287, 120, 259, 188, -175, 243, 208, 256, -48, -271, -35, -175, -55, -103, -102, -209, -126, -92, -33, -322, 32, 82, 52, -31, 18, 226, -33, -367, 88, 158, 276, 402, 64, -74, -176, -149, -181, -197, -111, -295, -550, -132, -63, -442, -278, -186, -133, -512, -407, -49, 165, 177, 209, 175, 187, 250, 261, 469, 264, 252, 526, 453, 318, 534, 238, 542, 206, 322, 150, 106, 102, 12, -109, -299, -272, -184, -170, -465, -373, -399, -286, -210, -298, -354, -215, -22, -94, -50, -70, 134, 156, 78, 230, 12]
2829A2k9O8k58K46k14K07J44j60k64J84J86J03l03P3k32M68j50r4K79K87k31p7
2851B45K38J74j92l2P8j55J70j95K90l4k45L2l0j47j08j90M9j08P9j43P3l04l48
2874h03J20N48o23M18q4K5q5K74j24j8j78J23L95l45p5K57M3K70j67l5K62k00
2896bL9j63L37k00lrM3M05m43J79J45q5q7L25r7o7k39K81M08j25m44L37J58l86
2920C07p4K08j52O9k71J2K21q2k06M4n1o2l27l9k8MJ67LQ5k29j70J8L53j55K47
2945a08j5m35K39j8K96l17K62j8r3Q7J63n7j76K0l28K31j09L62L9n4J29k35o1
2968a96M22KK9l00L22J06q7J15j21PL60l21J48j58L06l65J28k4r7J21j28J03j65
2991B07j13K5J3j82j4J29l87J67l27mL44j22k6lJ95Rl75J75k37J04n7M29L3k36
$$ y = [12, -17, 51, -207, 39, -175, 32, 176, 16, -248, -64, 122, 225, -78, -5, -237, 231, 81, -13, 266, 553, 322, 245, 483, 657, 465, 433, 511, 356, 526, 331, 621, 587, 342, 374, 344, 197, 89, -101, -52, -160, -81, -224, -151, -455, -803, -683, -135, -758, -340, -424, -399, -484, -210, -334, -352, -530, -407, -12, -357, -432, -175, -132, 138, -29, -64, 198, -2, 37, -126, 211, 11, 8, -1, 42, 447, 4, 183, 328, 243, 156, 481, 384, 317, 78, 359, 767, 642, 198, 535, 693, 307, 233, 441, 289, 358, 87, 99, 320, 238, 32, 76, 25, -37, -364, -403, -431, -427, -260, -257, -172, -401, -571, -553, -200, -355, -108, -123, -558, -319, -337, -41, -358, -96, -114, -207, -120, 43, -14, -190, -170, -498, -267, -376, -14, 25, -29, 100, -135, -196, 226, 228, 257, -43, 279, 385, 298, 413, 292, 299, 659, 338, 486, 328, 634, 269, 397, 373, 276, 397, 269, 372, 207, 94, 119, 132, -50, -64, 65, -322, -155, -482, -486, -142, -264, -290, -293, -98, -89, -464, -289, -526, -422, -479, -50, -17, -253]
3015b53J80o6K26l17Q9l80K70O5R3M2m60J91n2L76l25L52l04L14k33K84Jk3J15
3038A85j05J29J94j39N6N5J14N2q8P3l9J69j16m33K68k49N5k99L08j94r5J73N5
3061A29L1l42M4m2L3j02mK80k46J47kl83J69K80j15MJ60M3j64N1j01l9l1M4L5
3086a21P1M9m05K51qO9l33L44j59J34OR3J8L21l47l0M8R0J66l99K91mK27l52K88
3111C08k1j11P2L2n9L0l11O8L5j2m0k18J55l68K05l25M78m31J58p3M78j63j4J52
3135B5r9J28j00M8n0K90mk71M89l78J07k33L50k60m7q5N9o7J16J22k04J48k28
3158a44L8P1Q3j48K04q0o8K29j52J59J69k27K90n30O1n7L50K3k59r4R0J21J39
3181B68k72m4%j25l18K64p3j18K57r8J31k30J26QJ24j26K04O4O8l15J69K8J91
$$ y = [-253, -73, -139, 87, -230, -141, -521, -251, -186, -93, -51, -511, -320, -372, 4, -321, 31, -273, 41, -192, 92, 93, 70, 185, 80, 209, 403, 264, 320, 375, 489, 541, 453, 526, 487, 656, 540, 107, 375, 126, 181, -118, 190, -4, -99, 74, 129, 160, -182, -138, -180, -147, -249, -253, 27, -219, -72, -74, -457, -288, -8, -123, -119, 41, 84, -80, -29, -130, -169, -200, -156, -121, -50, -1, -406, -155, -163, -94, -427, -83, -242, -108, -102, -9, 9, 330, -17, -47, 1, 91, 257, -142, 149, 145, 372, 20, 308, 287, 176, 248, 280, 221, 251, -60, 8, 43, 31, -9, -227, -72, -440, -235, -560, -82, -513, -355, -428, 50, -113, -127, 25, -74, 54, -46, 2, -48, 242, 238, -33, 456, 78, 185, -48, 302, 42, -5, -90, -31, -98, 18, 140, -64, 84, -144, -106, -35, 48, -100, 104, 24, -44, 185, 33, 192, 361, 134, 424, -106, -45, -102, 248, 271, 12, -82, 8, 129, 268, -4, -48, -48, -173, -491, -227, -300, -418, -161, -259, -128, -358, -232, -224, -100, -226, -22, 42, 110, -205, -36, -8, 183]
3204A83j96L11O8j30P2Q2k11q5j08J23j59l3j76K79nj36J24j44l1J10r0J7j69
3227c04J16K8L21k6k61J26L6K18k35j01M51k33j02K15j4m08j30L28J03p9l01M15
3249A63l06K05l5k04J16J23l02J53R8J32j17M0m8J17l39N65k0k14J13J66k05k86
3271h5K05j13J62k0m13K14l30M41j66l33N20l86L0JL36m08L13l05L07k97K14J51
3293C8N5k10K89j44K07j65J77K4r3p7J47k74L8j08J33K57p7n0q3J30k65J86j24
3316A1j12O3j52J42j36qM9J3K04k42K31j41l4K64j18k95K70Q3j97n1J8j57J54
3339a41P8j3k10J27L3L9r1l07K65k84J64K25J42m53M2K15Q1pq3J65j9M13l08J98
3363B71lJ66k24J68N5M0j41J1L34l30k1j83O5k56K20k63K80j61j68J82J53j59
$$ y = [183, -13, 298, 366, 236, 308, 390, 179, 94, -14, 109, -50, -83, -259, 20, 15, -121, 3, -141, -172, -62, -152, -135, -304, -188, -160, 161, 135, -126, 0, 36, 254, 19, -82, 369, 136, 34, 249, 235, -173, -303, 25, 128, 49, -252, 163, -143, 62, 27, -177, -61, 62, -240, -87, 11, 143, 26, 66, 18, 135, -204, 361, 341, 127, 240, 406, 201, -85, 120, 7, 169, 149, -264, -50, -380, 61, -105, -438, 82, -304, -274, -273, 63, -345, -32, -337, -30, -327, -113, 38, 93, -117, 172, 28, 235, 70, 247, 271, 178, 101, 248, -26, 12, -96, 37, 294, 217, 167, 84, 214, -51, 135, 11, -101, -38, -190, -48, -184, -192, -143, -130, 74, -168, 63, -78, -112, 152, 34, -261, 9, 92, -105, -156, -138, -295, -141, -63, -76, -286, -159, -126, -87, -178, -485, -220, -504, -340, -115, 27, -426, -384, -169, -88, -95, -178, -13, -32, 381, 73, 271, 268, 434, 210, 378, 433, 473, 332, 343, 677, 347, 326, 143, 208, -48, 172, -91, 189, 28, -140, 42, 195, 36]
3385C6j71O7k0Q2j49K71l58K74O7l33K55j04j94K04r7pn6l2Q1m4k2L2k09K15j67
3410c79J69J6r3k5J90k42J51K02Q0o9j48Q6K17j47K09J83R6j13N8r0Q2j50K7K96
3434F06l11j42p6j12K16j72p1M79l69q9P6J29j17J16j13N0Kk09L10p8j52P2r2
3457d7M9R8m5k15J36j6j97o8j13L99l63K07q0k00K3J22k6J10n8n1J91k5J33O8
3481C2n7N6J62j53L22r9L6qm0K2l60M01ml39n1J70j38K08J56k76Q8J80j17k05
3505a4k7K69m00J90r5J41o7j35L93j88r7J25j95N0J9R5n0Q4J21l94j5M1j0J54
3529ej8p1pj82L7J41m81K98M5J84r1J38j57J42l5P1K52l77J67K71l40j37K83j3
3553A15j5j58K57l7j6n9K8m7J34j44l4K8j11R8k17K21LQ2J54k80j06J20k4K04
$$ y = [36, -135, -68, -88, -6, -155, 116, -242, 32, 99, -234, 21, -83, -277, -73, -170, -177, -233, -265, -184, -228, -250, -218, -427, -212, -379, -210, -194, -287, -312, -122, -364, -213, -11, 69, 0, -148, -62, 155, 8, 217, 400, 496, 383, 441, 351, 433, 283, 310, 606, 295, 153, 77, -35, 181, 9, -62, 417, 48, -41, 35, 164, 47, 163, 50, 100, 102, -107, 203, 125, -27, 45, -47, 2, 100, 55, -160, -24, -40, -237, -305, -418, -19, -382, -175, -255, -455, -432, -310, -336, -226, -284, -335, -144, -169, -36, 32, -25, 31, 193, 40, 362, 263, 299, 291, 251, 273, -87, 314, 310, -29, -80, 90, -48, 160, 316, 40, 128, 308, 191, -14, -41, 228, -172, 18, -77, 64, -3, -138, 255, 67, -30, 95, -100, -50, -31, 64, 14, 98, 219, -175, -190, -149, -159, -5, -23, -94, -101, -283, -246, -105, -586, -288, -243, -59, -150, -12, -169, -27, -62, 9, 261, -116, 51, 322, -18, -155, 128, 115, 100, -58, 199, 162, 146, 87, 115, 68, 202, 58, 24, 52, -59, 39, -178, 43, 46, 128, 282, 2, -104, 16, -8, 196]
3577A96k35q3L49o1rM3k1k3n5k3k50L90l45k7J04o2j4L67k23o2m59M30o5k86K50
3602a74j20J77o5j16L7O07l78L03j15k36Q2j41L18K09k94nj46J63k68K53QP4k36
3625f3n4J0J48k53L94k07J6k99J65m9K26j03j99J06J74lq1R7J5p2M0Q2q8o4J44
$$ y = [196, -39, -122, 227, 166, 157, 200, 179, 156, 101, 78, -172, 218, -127, -154, -50, -112, -126, 241, 18, -44, -503, -73, -138, -424, -174, -294, -117, -182, -298, -261, 346, -32, 271, 156, -80, 2, -139, 179, 388, 94, 89, -57, 106, -162, 91, 99, 173, -63, -117, -107, 41, -212, 182, -25, -9, -308, -143, -192, 34, -69, -268, -162, 12, 9, -72, 25, 40, -32, 8, 90, 2, -62, 82]
$$ [...]
8191B27
##END NTUPLES=NMR FID
##END=
