##TITLE=1H_LR-738-B-CR7C
 D2O
 8 sc, 
 19.11.2021
##JCAMPDX= 6.0         $$ Bruker NMR JCAMP-DX V2.0
##DATA TYPE= NMR FID
##DATA CLASS= NTUPLES
##ORIGIN= UXNMR, Bruker Analytische Messtechnik GmbH
##OWNER= root
$$ XWIN-NMR		Version 3.5
$$ Fri Nov 19 11:47:04 2021 Russian Standard Time (UT+4h)  she@DPX200
##.OBSERVE FREQUENCY= 200.131346
##.OBSERVE NUCLEUS= ^1H
##.DELAY= (6, 6)
##.ACQUISITION MODE= SIMULTANEOUS
##.ACQUISITION SCHEME= undefined
##.AVERAGES= 8
##.DIGITISER RES= 18
##SPECTROMETER/DATA SYSTEM= spect
##.PULSE SEQUENCE= zg30
##.SOLVENT NAME= D2O
##.SHIFT REFERENCE= (INTERNAL, D2O, 0, 15.7039)
##AUDIT TRAIL= $$ (NUMBER, WHEN, WHO, WHERE, WHAT)
$$ ##TITLE= Audit trail, XWIN-NMR		Version 3.5
$$ ##JCAMPDX= 5.01
$$ ##ORIGIN= Bruker BioSpin GmbH
$$ ##OWNER= she
$$ F:/spectra/data/she/nmr/H-F/1/audita.txt
$$ ##AUDIT TRAIL=  $$ (NUMBER, WHEN, WHO, WHERE, WHAT)
(   1,<2021-11-19 11:45:46.18 +0400>,<she>,<DPX200>,
      <created by zg, POWCHK disabled, PULCHK disabled
       configuration hash MD5:
       00 E9 B6 7A A2 85 ED C7 34 08 36 98 17 FE 4E 26
       data hash MD5: 16K
       94 2E 4A A0 B6 15 4F 21 E1 95 F1 3A 0D 8A 99 1B>)
$$ ##END=
$$ 
$$ hash MD5
$$ 3D 5E 28 12 C6 DF AA 50 3B 8F 83 7B 11 E0 B9 82
##$RELAX= 
##$RELAX= 
##$RELAX= 
##$RELAX= 
##$RELAX= 
##$RELAX= 
$$ Bruker specific parameters
$$ --------------------------
##$DU= <F:/spectra>
##$EXPNO= 1
##$NAME= <H-F>
##$PROCNO= 1
##$TYPE= <nmr>
##$USER= <she>
##$AMP= (0..31)
100 100 100 100 100 100 100 100 100 100 100 100 100 100 100 100 100 100 
100 100 100 100 100 100 100 100 100 100 100 100 100 100 
##$AQSEQ= 0
##$AQ_mod= 1
##$AUNM= <au_zg>
##$AUTOPOS= <>
##$BF1= 200.13
##$BF2= 200.13
##$BF3= 200.13
##$BF4= 200.13
##$BF5= 200.13
##$BF6= 200.13
##$BF7= 200.13
##$BF8= 200.13
##$BYTORDA= 1
##$CFDGTYP= 0
##$CFRGTYP= 5
##$CHEMSTR= <none>
##$CNST= (0..31)
1 1 145 1 1 1 1 1 1 1 1 1 1 1 1 1 1 1 1 1 1 1 1 1 1 1 1 1 1 1 1 1 
##$CPDPRG= <>
##$CPDPRG1= <>
##$CPDPRG2= <>
##$CPDPRG3= <>
##$CPDPRG4= <mlev>
##$CPDPRG5= <mlev>
##$CPDPRG6= <mlev>
##$CPDPRG7= <mlev>
##$CPDPRG8= <mlev>
##$CPDPRGB= <>
##$CPDPRGT= <>
##$D= (0..31)
0 1.2 0 0 0 0 0 0 0 0.06 0 0.03 0 0 0 0 0.0002 0 0 0 0 0 0 0 0 0 0 0 0 
0 0 0 
##$DATE= 1637307945
##$DBL= (0..7)
120 120 120 120 120 120 120 120 
##$DBP= (0..7)
150 150 150 150 150 150 150 150 
##$DBP07= 0
##$DBPNAM0= <>
##$DBPNAM1= <>
##$DBPNAM2= <>
##$DBPNAM3= <>
##$DBPNAM4= <>
##$DBPNAM5= <>
##$DBPNAM6= <>
##$DBPNAM7= <>
##$DBPOAL= (0..7)
0.5 0.5 0.5 0.5 0.5 0.5 0.5 0.5 
##$DBPOFFS= (0..7)
0 0 0 0 0 0 0 0 
##$DE= 6
##$DECBNUC= <off>
##$DECIM= 32
##$DECNUC= <off>
##$DECSTAT= 4
##$DIGMOD= 1
##$DIGTYP= 9
##$DL= (0..7)
0 120 120 120 120 120 120 120 
##$DP= (0..7)
150 150 150 150 150 150 150 150 
##$DP07= 0
##$DPNAME0= <>
##$DPNAME1= <>
##$DPNAME2= <>
##$DPNAME3= <>
##$DPNAME4= <>
##$DPNAME5= <>
##$DPNAME6= <>
##$DPNAME7= <>
##$DPOAL= (0..7)
0.5 0.5 0.5 0.5 0.5 0.5 0.5 0.5 
##$DPOFFS= (0..7)
0 0 0 0 0 0 0 0 
##$DQDMODE= 0
##$DR= 18
##$DS= 0
##$DSLIST= <SSSSSSSSSSSSSSS>
$$ [...]
##$SUBNAM2= <"">
##$SUBNAM3= <"">
##$SUBNAM4= <"">
##$SUBNAM5= <"">
##$SUBNAM6= <"">
##$SUBNAM7= <"">
##$SUBNAM8= <"">
##$SUBNAM9= <"">
##$SW= 18.0517287032376
##$SWIBOX= (0..15)
0 0 2 0 0 0 0 0 0 0 0 0 0 0 0 0 
##$SW_h= 3612.71676300578
##$TD= 16384
##$TD0= 1
##$TE= 0
##$TE2= 300
##$TE3= 300
##$TEG= 300
##$TL= (0..7)
0 120 120 120 120 120 120 120 
##$TP= (0..7)
150 150 150 150 150 150 150 150 
##$TP07= 0
##$TPNAME0= <>
##$TPNAME1= <>
##$TPNAME2= <>
##$TPNAME3= <>
##$TPNAME4= <>
##$TPNAME5= <>
##$TPNAME6= <>
##$TPNAME7= <>
##$TPOAL= (0..7)
0.5 0.5 0.5 0.5 0.5 0.5 0.5 0.5 
##$TPOFFS= (0..7)
0 0 0 0 0 0 0 0 
##$TUNHIN= 0
##$TUNHOUT= 0
##$TUNXOUT= 0
##$USERA1= <user>
##$USERA2= <user>
##$USERA3= <user>
##$USERA4= <user>
##$USERA5= <user>
##$V9= 5
##$VALIST= <valist>
##$VCLIST= <CCCCCCCCCCCCCCC>
##$VD= 0
##$VDLIST= <DDDDDDDDDDDDDDD>
##$VPLIST= <PPPPPPPPPPPPPPP>
##$VTLIST= <TTTTTTTTTTTTTTT>
##$WBST= 1024
##$WBSW= 4
##$XGAIN= (0..3)
0 0 0 0 
##$XL= 0
##$YL= 0
##$YMAX_a= 267032
##$YMIN_a= -365093
##$ZGOPTNS= <>
##$ZL1= 120
##$ZL2= 120
##$ZL3= 120
##$ZL4= 120
##$ABSF1= 10
##$ABSF2= 0
##$ABSG= 5
##$ABSL= 3
##$ALPHA= 0
##$AQORDER= 0
##$ASSFAC= 0
##$ASSFACI= 0
##$ASSFACX= 0
##$ASSWID= 0
##$AUNMP= <proc_1d>
##$AZFE= 0.1
##$AZFW= 0.1
##$BCFW= 1
##$BC_mod= 2
##$BYTORDP= 1
##$COROFFS= 0
##$CY= 11.3945322036743
##$DATMOD= 1
##$DC= 2
##$DFILT= <>
##$DTYPP= 0
##$F1P= 2.36226072786647
##$F2P= -0.459571619588291
##$FCOR= 0.5
##$FTSIZE= 0
##$FT_mod= 4
##$GAMMA= 1
##$GB= 0.15
##$INTBC= 1
##$INTSCL= 1
##$ISEN= 128
##$LB= 0.24
##$LEV0= 0
##$LPBIN= 0
##$MAXI= 10000
##$MC2= 0
##$MEAN= 0
##$ME_mod= 0
##$MI= 1.114404
##$NCOEF= 0
##$NC_proc= 0
##$NLEV= 6
##$NOISF1= 3.799351
##$NOISF2= 2.8
##$NSP= 1
##$NTH_PI= 0
##$NZP= 0
##$OFFSET= 15.70392
##$PC= 1
##$PHC0= -15517.6
##$PHC1= 14.60081
##$PH_mod= 1
##$PKNL= yes
##$PPARMOD= 0
##$PSCAL= 0
##$PSIGN= 0
##$REVERSE= no
##$SF= 200.130013532006
##$SI= 16384
##$SIGF1= 3
##$SIGF2= 2
##$SINO= 400
##$SIOLD= 16384
##$SREGLST= <1H.CDCl3>
##$SSB= 0
##$STSI= 0
##$STSR= 0
##$SW_p= 3612.71676300578
##$SYMM= 0
##$S_DEV= 0
##$TDeff= 0
##$TDoff= 0
##$TI= <>
##$TILT= no
##$TM1= 0
##$TM2= 0
##$TOPLEV= 0
##$USERP1= <user>
##$USERP2= <user>
##$USERP3= <user>
##$USERP4= <user>
##$USERP5= <user>
##$WDW= 1
##$XDIM= 8192
##$YMAX_p= 0
##$YMIN_p= 0
$$ End of Bruker specific parameters
$$ ---------------------------------
##NTUPLES= NMR FID
##VAR_NAME=  TIME,          FID/REAL,        FID/IMAG
##SYMBOL=    X,             R,               I
##VAR_TYPE=  INDEPENDENT,   DEPENDENT,       DEPENDENT
##VAR_FORM=  AFFN,          ASDF,            ASDF
##VAR_DIM=   8192,          8192,            8192
##UNITS=     SECONDS,       ARBITRARY UNITS, ARBITRARY UNITS
##FACTOR=    0.0002768,     1,               1
##FIRST=     0,             0,               0
##LAST=      2.2672688,     0,               0
##MIN=       0,             -365093,         0
##MAX=       2.2672688,     267032,          0
$$ Real data points
##PAGE= N=1
##DATA TABLE= (X++(R..R)), XYDATA
0@%%%%%%%%%%pJ5j6J6k4L2l2M0n6O7p5Q8j11J35j58J82k08K43k83L28l76M27m85
33b58N51o24P04p92Q89r94J109j236J374j526J693j875K074k290K524k782L065
50A606l379L724m101M523m993N522o123O808p598Q520r617J0948j2601J4720j7550
65i591K1542k7644L8262o2070K16890m511k15664N2274j71267J00268K43170j1351
77A70308m6687J43411j15404j42672N7004q1697j47417J63352J07100l3213J12460
88A86545M234k50236n7504M4546o4486J15332K06821o1328o1396L0737j45354
99e2089r9880J12588o990k9685J62648O0865n8225O6781n1541k11158k0407O4547
111f2546o147J52980J61240q6884p4545l122j31011m4363J17362j215p958J26601
$$ y = [0, 0, 0, 0, 0, 0, 0, 0, 0, 0, 0, -7, 8, -8, 8, -16, 16, -16, 24, -32, 35, -40, 48, -63, 72, -86, 96, -112, 131, -152, 176, -200, 227, -258, 293, -331, 373, -419, 470, -524, 585, -651, 723, -803, 890, -985, 1089, -1201, 1323, -1459, 1606, -1773, 1951, -2150, 2373, -2620, 2902, -3221, 3587, -4011, 4509, -5108, 5840, -6761, 7959, -9591, 11951, -15693, 22569, -39501, 177389, 172878, -42786, 9488, -161779, -61511, 181659, 170308, 123621, 267032, 151628, 8956, 65960, -15737, -163154, 198, 107298, 74085, 186545, 190779, -59457, -116961, -72415, -136901, -21569, 185252, 123924, 62528, 93265, -52089, -151969, -39381, -46371, -76056, 86592, 147457, 89232, 156013, 104472, -106686, -127093, -62546, -68693, 84287, 245527, 158643, 84098, 80976, -50035, -94398, 22964, 21749, 13791, 140392]
123A40392L862p8818K7602o4492j42110M0779P5469J978J09746P5489j14912p2777
135B208j8017r9216R407J30615K3946J4095P3267n2711q9045J3574m4151o8444
147a04472P2051O7226Q815Q1393K1860j18882o4204j7910n2381N4948J21329J3182
159H2955k713K0723p8448p6507J4314k3278j6294Q7575N4526k839L7227k5708
171G1533j10404l6978K825j5690P0054R6639j473j2186p515q2679n2529L1608
183d6795Q496K0798P8089K0572k7893M225m0352p7385j553K7468J6567P3689O2742
196A18668k9319m0278l8945p5923k2600M8292K9814L7603N8367n410m3534k2330
208A4405n0899n3207J8156L7584K6936N6565K8319m0640l9274l1349m4065O357
$$ y = [140392, 144254, 65436, 93038, 28546, -113564, -72785, 2684, 4662, 114408, 189897, 74985, 2208, -15809, -115025, -105618, 24997, 48943, 63038, 136305, 83594, -5451, 8123, -36028, -104472, -32421, 34805, 43620, 125013, 146873, 27991, -36213, -54123, -106504, -51556, 69773, 82955, 80242, 100965, 22517, -53990, -39676, -62954, -79248, 8327, 62853, 60014, 97241, 71533, -38871, -75849, -73024, -88714, -18660, 77979, 76506, 64320, 56805, -25874, -78403, -46795, -38299, -17501, 60588, 81160, 53267, 57492, 17140, -60245, -61798, -34330, -17763, 55926, 118668, 89349, 49071, 10126, -65797, -88397, -40105, -10291, 27312, 85679, 80269, 36735, 14405, -36494, -89701, -71545, -33961, -7025, 49540, 77859, 37219, -2055, -33404, -77469, -71112]
220g1112N3754L1563K7486K4062l1525n0140k0324k2541m597M7850M5823K1720
232E2019K3413j3179n9149m3326k2064j0367L7492O3737L4637J5047n736m9960
244B2564n2973k2008r580J5964N0799L9120J3052J287k9695n1081k8206l821J1391
257d3187L9616M3093J1461q801k5794m4323k9982L275K0673L5966M3138J7128
269F2263j3481k8043m1040l7195n225K2584L5138M3169K7940o004k9758l9775
281i427l8430j5051J6332L3496L8130K8469J176k4910l4779l2678j6736J1671
293d2737L1119L4131K4473K673k2895l5371l1064j4450J0593L0947L5690K4684
305D7793K595k2273l6077l2921j6740Q432L0405L6767K7361O464j8454l4330l4320
$$ y = [-71112, -17358, 14205, 41691, 65753, 34228, -15912, -36236, -58777, -63374, -15524, 30299, 52019, 75432, 62253, 3104, -40222, -62286, -72653, -35161, 28576, 63213, 78260, 72524, 22564, -30409, -52417, -61997, -46033, 4766, 43886, 56938, 58225, 28530, -22551, -50757, -54578, -43187, -3571, 39522, 50983, 42182, 16388, -27935, -57917, -54642, -33969, 1997, 45135, 62263, 48782, 20739, -20301, -57496, -62721, -40137, -4999, 38170, 66110, 60106, 30348, -9427, -47857, -62908, -46576, -13080, 25050, 53519, 54695, 29785, -4994, -37672, -54408, -42737, -11618, 22513, 46986, 49659, 26764, -8607, -39671, -54121, -43528, -12581, 23109, 47793, 50388, 28115, -7962, -40883, -57623, -49191, -18786, 17981, 45342, 51806, 33352, -978, -35298]
318c5298j8856N252K6578L5829K8489Q195j4977l2637l3513k0377K609K4060L5349
331A0703K9073R933j2574l0125l4330k1723M02K1315L3287L0058J2371r338k6733
344A2319l2778k2557k034J7086K9334K8222J1682q627k4100l0312k2254r15J7926
357b7008K8082K7067J2601j0878k5446k9902k3134j112K0436K9616L0065J7901
369D8288p594k6236l1115k7413r791J7616L0322K9866K2612J44k3928k8997k4647
382c0873j4510R866K6074K4596J8573N804j8695k6222j8791j1963M999K6425K4652
395A9935J2762L089j7447l1756j9922n291O576K7931L0810J1605K02j3935l1914
408g355k5526o158L071K0182L5909K1469K438p235k8434l4419j0409N510J4488
$$ y = [-35298, -54154, -48902, -22324, 13505, 41994, 50189, 35212, 2575, -30938, -51315, -48706, -24646, 10703, 39776, 49709, 37135, 7010, -27320, -49043, -48641, -27326, 5961, 36019, 48390, 39052, 12319, -20459, -43016, -45050, -27964, 1370, 29592, 41274, 32647, 8547, -21765, -44019, -44934, -27008, 1074, 28141, 40742, 29864, 4418, -25484, -48618, -49730, -29294, 322, 30387, 48288, 40694, 14458, -16657, -44070, -53861, -36245, -5923, 23943, 46555, 46699, 22771, -6226, -30873, -45383, -35517, -9443, 15153, 33726, 39530, 20835, -5387, -24178, -36141, -31142, -4717, 19935, 32697, 35786, 18339, -13417, -33339, -38630, -32054, -4123, 26687, 38292, 38494, 24559, -7355, -32881, -39039, -35968, -15786, 20123, 41592, 44030, 36795, 8361, -26058, -36467, -30957, -16469]
421a6469L1396K3872k370r206j7426k9680j2637Q357R028K0489K6308J921j3831
434A9752j3765k7379k2191R209J8844J9586K9874R370k1612k0559k0058k2142
446d1071O165K4896J5156J9100J8669j1227k0080j2530k4085j2606K2420K3274
458H081J7317K2243n486l2110j7619j1106j0382J9745K8531O374P738M011k5922
471A1415k2001m591j2581K117L0616J7436N394R137j8614l7570j3088l408J264
484c4474L2207K9993k391l632q879l0057j2724R000k584R921L0324R371j174L362
498B8263k5392l3974p73R125J2119L5799J9715j6640j1908j3726k7588j873J8221
511h632K583J3942K4556m560j1994j850k4189k2563J1263J2185J0402L0024P419
$$ y = [-16469, 14927, 38799, 36429, 27223, 9797, -19883, -32520, -24163, -15135, 5354, 31662, 33583, 19752, 5987, -21392, -43583, -34374, -15530, 4056, 33930, 43300, 21688, 1129, -18929, -41071, -34906, -10010, 5146, 24246, 42915, 31688, 11608, -922, -25007, -37613, -15193, 8081, 25398, 47641, 42155, 10045, -7574, -18680, -29062, -9317, 19214, 25588, 33326, 37337, 11415, -10586, -15177, -27758, -25641, 4975, 22411, 27805, 36942, 18328, -19242, -32330, -35738, -34474, -2267, 27726, 25335, 21703, 12824, -17233, -29957, -20957, -23541, -13620, 16704, 26075, 24901, 28263, 2871, -31103, -31876, -22751, -10632, 25167, 44882, 28242, 16334, 2608, -24980, -26853, -8632, -6049, 7893, 32449, 27889, 15895, 14045, -10144, -32707, -21444, -9259, 1143, 31167, 38586]
524C8586k5978j6440j5092k0206J5139K9240N142Q005Q608j9986j5713N18j7444
537b5621r841K1328J7185J2812K4000o738l5907j7870j1286p797K5807K9477J627
550A7176M758J078k4003j3839K527j1861K46K4126R695L498J2289j3656k9083
563a7049n971k646R35K9981K4646o722n947j2543k8905m309J6120K254J0448K1482
577B1774o97m685M422k0688k7392k50M845J0520L4146J6753j5304j2407j5432
590d395k4190L501J8129L008J0964J5892r044r728n39j7811j3712J1544Q889Q410
604I18K2420L246k0938j2562j4208j5342J5003K5605Q593J0066K558k0872j4169
617i682L03r674j704J7470R552Q335J7015n652k4175j2600j0619n251K1946K3465
$$ y = [38586, 12608, -3832, -18924, -39130, -23991, 5249, 10391, 18396, 27004, 7018, -8695, -8177, -25621, -35462, -14134, 3051, 15863, 39863, 33125, -2782, -20652, -31938, -39735, -13928, 15549, 17176, 21934, 23012, -991, -14830, -12303, -24164, -23918, 208, 9903, 13401, 25690, 12034, -17049, -23020, -25666, -24731, 5250, 29896, 23174, 17227, 4684, -24221, -28530, -12410, -10156, 292, 21774, 21077, 16392, 20814, 126, -27266, -27516, -22671, -12151, 21995, 38748, 23444, 11037, -4395, -28585, -25084, -6955, -3947, 7017, 22909, 13865, 4137, 3598, -14213, -27925, -16381, -7492, 918, 23338, 26584, 5646, -6916, -21124, -36466, -21463, 4142, 12735, 22801, 25359, 4487, -9682, -9379, -19053, -20757, -3287, 6265, 14600, 31615, 25963, 1788, -10812, -21431, -26682, -4736, 18729]
631A8729K857K256n186k2356j0476L184l861O293J9284N545L87M417j3912k0579
645a3418l990j453K733K2401J7259k040l544j2082k3562n882R461O085J2561J5601
659B0130k820p005k153j3382j3197K882M926Q672K0844R626r295j0959j4882j6781
673b3394L290J4794R794J1915Q934q375j1666o790j2403o265R499R732R443J3153
687B1661L90j3111j0491j0810q783Q246J5688Q850P931K52j4028j2685m956l507
701a5353M256J3723Q910M333L427q294j5089r716n147J410J4713J6396O450Q42
715B0861p311j6787j1508k144K086R201J4283P353M46l290j1174j2954m398J340
729a3996O687J3056R640qn130j0133j2786m920M501Q468J1915R366J69p333r769
$$ y = [18729, 21586, 23842, 18656, -3700, -14176, -10992, -14853, -8560, 10724, 16269, 16656, 21073, 7161, -13418, -17408, -18861, -16128, 6273, 23532, 21492, 17948, 5866, -17696, -23578, -14117, -8032, 4529, 20130, 17310, 10305, 8152, -5230, -18427, -15545, -10619, -1947, 18897, 28523, 19228, 8269, -6613, -23394, -20104, -5310, 4484, 16399, 25333, 16958, 5292, -1498, -13901, -20166, -10667, -935, 8508, 21661, 22051, 8940, -1551, -12361, -21144, -12898, 2790, 11640, 19571, 19823, 5795, -6890, -11846, -15353, -11097, 2626, 11536, 15869, 19296, 11002, -4087, -13803, -18950, -17540, -2827, 13569, 20019, 20861, 13550, -3237, -14745, -16889, -14803, -5602, 8681, 16034, 16480, 13190, 2016, -10938, -15336, -13996, -7309, 5747, 15387, 15379, 10249, 116, -12670, -17590, -13089, -4621, 7294, 16660, 16829, 9496, -273]
744b73j1223o603K860Q190J1272J1547L700n843j0417j2388r134N86Q460J0746
758A480J0663M764m110r577r993p570j089O919R402Q888M704l287q954r364o902
773a4026r95P189J0697Q435M146l037j0138j0845o986j160O476J1061R891N203
787A5911k037q937j1114q285k582M732J0273J0834O024m38p523j0738r017k773
801a5670L696R208R701N886J42o692r839q368l132L300Q316R929O247Jn969r363
817b607q538l419K928Q006R604O425K60n445r029q999l645K655P492R428O930
832A2046M50n436q875q765m698K622P912R570P224K144n530r210r004n500J191
847a3859P330R922P730K843m061q546r076n892n50O300Q948P672L068k716p504
$$ y = [-273, -11496, -18099, -15239, -7049, 4223, 15770, 19470, 13627, 3210, -9178, -18312, -17726, -9266, 1480, 12143, 16907, 12797, 3220, -6773, -14343, -15432, -8513, 889, 9777, 14481, 11194, 2240, -7124, -14026, -15021, -7832, 2865, 11300, 15446, 12409, 2271, -8574, -15560, -16720, -10244, 817, 10708, 15911, 13874, 4937, -6177, -14462, -17044, -12312, -2039, 8795, 14819, 14381, 6858, -3880, -12897, -15670, -11974, -2766, 6935, 12821, 12963, 6271, -3568, -11936, -15068, -11768, -3452, 6477, 12724, 12725, 6756, -2607, -11145, -14564, -11636, -3630, 5974, 12399, 12659, 7214, -1815, -10814, -14459, -11804, -4312, 5116, 12046, 12496, 7060, -1815, -10580, -15278, -12656, -4744, 4826, 12050, 14194, 8664, -546, -9550, -15050, -13859, -6529, 3393, 11123, 13966, 9905, 1359, -7717, -13609, -14159, -7859, 1089, 8761, 11829, 9113, 1609]
862A609q316n003p62N568Q111P282K531k627p510q623m902J4N455Q799P867K252
878A1745k812p181r493o224j00M585Q652Q698M434j647o632r064p327j483L833
893a0016P699Q622N018j606n596p466p088j507L716O493P014M600j111n698p061
908c987o721k191L798P155P882N370r73o366q165o926k958L716P896P293N248
923A0071P40n007p813o624m042Q06O792P757N777J935l868p971o862l455J239
938a0525O377P817M540M04l331p522n838k260Q71N538P412N133R28k457o860q442
954h215l935P13N730R174O715Q24m144o999p414l226J699L805O350O201K271j557
970G992m611p768n906l19M394O736P786K689l598o027o646n258P54N234N521N553
$$ y = [1609, -6707, -11710, -12472, -6904, 1207, 8489, 11020, 8393, 883, -7740, -12642, -12628, -7173, 1626, 9493, 11745, 8933, 1752, -7741, -13965, -14065, -9480, -828, 7870, 12304, 10657, 4025, -5039, -12366, -13849, -10016, -2317, 6305, 11323, 9717, 4121, -3345, -10433, -11940, -8224, -1731, 5283, 9883, 8772, 3074, -3987, -10708, -12899, -9101, -1946, 5936, 11306, 10333, 3967, -4198, -11124, -14082, -10366, -2470, 4823, 10071, 10811, 5804, -2009, -8633, -12675, -11869, -5077, 2680, 8457, 10392, 6524, -1447, -8309, -11764, -10525, -4148, 3669, 8209, 8613, 5282, -2240, -8078, -10338, -9467, -3929, 3483, 8616, 9544, 7087, 227, -8215, -12150, -11437, -5707, 3467, 10182, 11006, 6862, -137, -7551, -10777, -9078, -5273, 1077, 7278, 9549, 7992, 3381, -4387, -10293, -10612, -6218, 518, 8304, 10993, 7395, 1368, -5278, -10536, -9782, -4548, 973, 6526]
986F526K935k431n311m410n125j913L570N416O184N196m19o197p302n926j900
1001a1107N517P857N176K036j960n555n200k906j743J325N636N602M433J965m421
1016F655q700n869k462K287P548P685K804p47m007p121m504n43J242M215N963
1031D446K421N93j200n014o006k833M06L900P936O115m82m749p047o792o87M932
1047d061M677M354L376l00k611l174n155n429k55M116O155P386K800l670o883
1062A326o108l878J248N628M614L930J388k336n048l130k925l67L443L798L280
1077D863L425n51n307n994m543j025M952Q097N304O43l134o616n442j256Q83K249
1093c452M109M029K768J157l046o952n411k006K136O649O806K298k285m054n657
$$ y = [6526, 9461, 7030, 1719, -2691, -7816, -9729, -6159, -743, 5441, 10637, 10218, 4021, -3281, -9207, -11107, -5590, 2267, 7443, 9479, 7519, 1964, -3236, -6142, -7885, -6560, -924, 4678, 9111, 11076, 6655, -2045, -7914, -10376, -8089, -541, 7144, 9948, 9201, 5194, -1927, -6431, -6974, -5732, -1517, 4446, 6867, 7460, 6260, 1246, -4760, -7593, -7187, -3287, 4649, 10764, 10282, 5533, -1514, -8306, -8993, -4061, 616, 4970, 8346, 8046, 5435, 2261, -2894, -8323, -8578, -4462, 1693, 9079, 11879, 8209, 1326, -4782, -8660, -7412, -1784, 2830, 6760, 8148, 5812, 764, -2366, -5291, -5658, -2215, 1583, 4863, 8288, 7737, 2430, -3564, -8107, -9132, -4180, 3917, 9221, 9864, 6730, 114, -5328, -6584, -5701, -3452, 657, 4686, 7454, 8611, 5565, -1387, -6798, -8804, -6668, -19, 6787, 9085, 6800, 2746, -2911]
1108b911l572L61K565L674M601J825r81k705l775m283j211J740K883N614M600
1123H425J78m002o356n971j019L759N766M183K388j461l610l216l214j879L07
1138e722L047M486M996J386k866n598n238k816J902N472M918K855K58l414m433
1153g67l486k321J002L353M167L022J618j583m056m596k523q78L299N800M331
1168F382J363k400n419m727j592J638K793M143K767L00j043k785m580l007l14
1183f481K164N175N191J332j891m015n350l193N19L237M046L855J638j383k957
1198A887l858l425o78K480L094M009K421q32l283l605m112q38K923M242L826K247
1214F498j246l985m072k518p17J937L788L875K273K29k992m316l677k049J735
$$ y = [-2911, -6483, -6122, -3557, 117, 4718, 6543, 5562, 2857, -918, -5201, -6412, -4672, -1789, 3825, 8425, 8603, 4601, -1755, -7726, -8745, -4986, 780, 4963, 7351, 5890, 2280, -936, -4150, -6029, -5722, -2675, 1811, 6807, 8193, 5327, -271, -5509, -8325, -6423, -951, 3967, 6822, 7080, 3666, -767, -4253, -6574, -5572, -2219, 1948, 4970, 6588, 5005, 949, -3647, -6170, -7048, -3749, 2051, 6382, 7745, 5345, -74, -4801, -6393, -4755, -1962, 2181, 4948, 5248, 4205, 1420, -3160, -6167, -6481, -4317, 858, 6049, 7381, 5490, 1475, -3875, -7068, -6549, -3312, 734, 4589, 6227, 4844, 1887, -1971, -5396, -6074, -3594, -500, 3509, 5930, 5098, 1815, -1790, -5902, -6740, -3817, 425, 4251, 6498, 5252, 1267, -2805, -5323, -6040, -4103, -315, 3560, 5833, 6062, 3070, -1246, -4923, -6972, -5237]
1229e237M084M385K423M3k405m279l276j417R74L380L484J984P18j825l875k933
1245c772j526J088K971M192K324L5k295l808m042j437J378L474M110K680J80k256
1261C296l733l549k302R27K582M278L580O17j795l347l866k409O15K472L565L133
1277D064Q89j267l165l281k277N30K020K975L372J118j405k872l372k631K24K558
1293b520L429L087J206j105l238l425k546l24K609L154L127J576q53k836l749
1308b408k278q17K107L601K970J659n63k702l558k395q86J922L032L281J742k90
1324D417k612l525k385r33J269L188L235J642r3k232l191k644p73Q96K762L178
1340B199K019j76j741l336k741p70J094K351L501K067j54j874l040l061j330Q83
$$ y = [-5237, -1153, 3232, 5655, 5698, 3293, -986, -4262, -5679, -4705, -1325, 2159, 4143, 4861, 3036, -839, -3772, -5298, -4210, -1239, 2953, 5277, 5312, 3017, -791, -4833, -6270, -4892, -1418, 2692, 5372, 5552, 3296, -437, -3986, -6288, -5361, -2779, 1499, 5079, 5696, 3901, 554, -3312, -5721, -5106, -2634, 931, 4064, 4953, 3686, 521, -2760, -5037, -4507, -2487, 488, 3860, 4978, 3573, 701, -2671, -5302, -5078, -2520, 909, 3996, 5202, 4097, 859, -2566, -5112, -5436, -2827, 327, 3454, 5030, 4177, 1341, -2408, -4686, -5503, -3396, 205, 3175, 4834, 4271, 1569, -1989, -4384, -5270, -3348, -316, 2965, 4707, 4417, 1805, -1720, -4105, -5038, -3769, -581, 2654, 4296, 4203, 1971, -1220, -3864, -4637, -3741, -979, 2199, 4218, 4042, 2301, -1035, -3776, -4546, -3452, -1101, 2400, 4467, 4313, 2439, -601, -3662, -4992, -4109]
1356d109K559L378K518J41j699k678l176j638N94K483K947K654O06j597k929k676
1372b622j579L64K121L138K152M22j367k920k502j518Q3K376K989K387Q53j392
1388B985l048k815j520j45K155L414K493P27o28k366l423j634m49J569L020L130
1404C465Q46n14k088l198j920k41J225K854K428J105p58j999k784k019m3J619
1420b022K319K725J124r48k025k525k627l71J400K428K898J901m89k467k773k433
1436c885n23J549K108K542J966j44j866k041k140j637J032K596K251J871N59k097
1452B141k454k092j343P46K599K540J474K73j707k917j516q05k6K074K630J384
1468C001R56p78l321k352j466J83K101L397J982m55q06k503k451o46L29R20K871
$$ y = [-4109, -1550, 1828, 4346, 4487, 2788, 110, -3066, -4704, -4110, -1627, 1320, 3974, 4580, 2983, 54, -2622, -4201, -3837, -1716, 1422, 3574, 3996, 2629, -291, -2793, -4311, -4228, -1852, 1137, 3524, 4377, 2985, -63, -2878, -4398, -4543, -2388, 1026, 3519, 4246, 3618, 1252, -2171, -3805, -4254, -2685, 335, 3465, 4311, 3797, 1709, -1489, -3409, -3650, -2425, 429, 2857, 3962, 3204, 1205, -1579, -3598, -3641, -2022, 297, 3022, 4146, 3198, 1173, -1352, -3979, -4350, -2950, -522, 2376, 4277, 3788, 1321, -1452, -3885, -4408, -2859, -751, 1791, 3757, 3613, 1747, -294, -2434, -4071, -3039, -443, 1808, 3679, 4238, 2141, -313, -2405, -3748, -3002, -403, 2137, 3611, 3884, 2177, -740, -2256, -3061, -3087, -1013, 1617, 3001, 3957, 3179, -142, -2494, -3960, -3777, -1676, 1721, 3703, 3248, 2442, -61, -2512, -3158, -2829, -1909, 962]
1485I62K151M1k55j922l215j189M82J174K441K917L45j401j540k798k246J267
1501b786J344J685K619M15j326j218j570k451KJ146J789K566K024j300k366j967
1517a394k031j99K573J807J346J711p21k487j252j426j465J050K515J660J849
1532C536M91k263k635j279j504P43L068J785R81K47j773l115o19k96N04J763K031
1549A665j62O47j45k742j802q19o3K200L416J646p65j429k763k556O47J090R13
1566a022K389J590l46j97j030l423q68N23M84K755K571J6j319j466k794j339J284
1583b192J209J862J848p3j780r77j153j536M99J160O42J979J907j093j737k015
1599a450k414k35L024K368Q41J112j296k658m63r03p93J303K012O30J627Q69k911
$$ y = [962, 3113, 3154, 2899, 977, -2238, -3427, -2945, -1771, 670, 3587, 3932, 2531, 991, -1807, -4053, -2786, -1442, 243, 2862, 3277, 1951, 733, -837, -3288, -3286, -2140, -351, 2215, 4239, 2939, 573, -1394, -3425, -3624, -1051, 756, 2102, 3813, 3092, 605, -647, -2073, -3538, -2488, 27, 1687, 3536, 4027, 1764, -871, -2150, -3654, -2911, 157, 1942, 2923, 3170, 1397, -1718, -2337, -2633, -2129, -366, 1665, 1503, 2150, 2005, -737, -2539, -3358, -3421, -1221, 2195, 3841, 3076, 1647, -1116, -3672, -3025, -1935, -1022, 1367, 2957, 2611, 2414, 1384, -2039, -2907, -2384, -1900, 855, 3426, 3442, 2123, 657, -2137, -3476, -2192, -983, 879, 2727, 2654, 874, -103, -1256, -2792, -2293, -1133, -491, 1488, 3395, 2302, 565, -1450, -3864, -4099, -1075, 1293, 2134, 3246, 1950, -708, -1171, -2074, -2867, -1564, 448, 1078, 2705, 3574, 663]
1616F63j680j182j064R89K979J425P43J39k330k697k66j71L86K693J591o23N60
1633B155p91k571r69m38J10J390L216R52k73j087k815k066O03R59J285K315P05
1650B680j042l37j037k268o38P64P61K238K056m22j362j442k068j039J445R33
1666g78J821J796q1j858j189j242j391Q97J913N13J499N78q09j516j236j803j85
1683c071K382J495J165R95j411k119j296p9m02J559K058M09P94j97k072j537r25
1700b252m41J327J941J295L98j66j351k128p73O1M34K283J147N42n29j198j631
1717a041q36k0N10J360J681R37o61q43k245j258oQ86J545J836R29r21j322j434
1735i03j184l14R62N86K141J197j15j239j548j729l14P96J186J657J146k38j507
$$ y = [663, -1017, -2199, -3263, -2274, 705, 2130, 2873, 3012, 682, -2015, -2281, -2452, -2066, 627, 2218, 1595, 2155, 1364, -1207, -2176, -2614, -2504, -1114, 2102, 3054, 2781, 1694, -1121, -3187, -2584, -1625, -340, 1975, 2680, 1638, 1301, 264, -2004, -2642, -1878, -1117, 1121, 3177, 2755, 1393, -49, -2117, -3156, -1711, -778, 1043, 2839, 2758, 900, -289, -1531, -2922, -2025, -112, 401, 1900, 2478, 1669, 153, -1083, -2886, -3071, -689, 806, 1971, 2966, 1555, -564, -1860, -1939, -2341, -782, 1276, 1685, 2479, 2282, 210, -1327, -2252, -2693, -1366, 575, 1870, 2268, 2102, 751, -1377, -2150, -2089, -1655, 628, 1775, 2317, 1788, 590, -1041, -1877, -1897, -1387, -27, 1654, 2591, 1930, 1087, -1158, -2416, -2422, -1536, 9, 1845, 2774, 1853, 531, -903, -2087, -2401, -1439, -853, 1288, 2485, 2370, 1131, -417, -2146, -2460, -1664, -478, 1179, 2325, 2087, 580]
1752E80r45j423k70M37J271J166J404k88q04j506j242p92N54J501J508J085K03
1769B439j181j534j321p84N61J062J739J087L31r36j399j573n49k5J059J758R72
1786A706L56n06j562j326n78j7J340J203J355P1j50j434j398p94M1Q55J367J561
1804B090K00m12j427j518q38n7Q60J422J049N44k58j210j607j059p7J035J215
1821d8J401N81k61j078j476j034k98R31J157J436P14k85j289j020r86o23P46J475
1839D3J321Q65k15j039j267j142j83M35J072J485P28j0j131j261j178l55O21J006
1857b05J231J131l92o80j457j202m06J95J575J032R92j33n33j356j368m24L14
1874a686J118J130R93L08p64j247j133m83N7Q65J588O23K18m67r06j224p57K31
$$ y = [580, -365, -1788, -2058, -1621, -350, 816, 2220, 1932, 1128, -378, -1620, -2412, -1858, -357, 1151, 2236, 2439, 1258, -276, -1597, -2381, -1820, -758, 981, 2068, 2399, 1463, 64, -1509, -2058, -2083, -1024, 734, 1706, 2062, 1556, -6, -1332, -1910, -1927, -587, 616, 1971, 2042, 1892, 458, -940, -1734, -1693, -838, 529, 2090, 2290, 1878, 451, -1067, -1905, -1962, -1102, 320, 1369, 1913, 1655, 445, -1162, -2221, -2298, -1263, -48, 1353, 1934, 1673, 595, -881, -1915, -2213, -1282, -125, 1311, 2025, 1740, 451, -569, -1555, -2178, -1432, 43, 1364, 2229, 2014, 975, -292, -1434, -1617, -1182, -110, 1375, 2103, 2093, 962, -299, -1477, -1832, -1211, -205, 1026, 2157, 1765, 1085, -372, -1574, -1980, -1785, -210, 822, 1814, 1681, 1148, -208, -1576, -2000, -1686, -568, 562, 1555, 1863, 1099, -148, -1281, -1764, -1707, -842, 746, 1369, 1587, 1120, 214, -1010, -1767, -1536]
1892a536Q20J436R05K81o10j290j309l80O6P36J362J206L22o79j053j052j181
1909a956M20O47J195J059N34l50j086r77j028J87R94P48R16M21k29j101q58r88
1927a452l75P31J075R29R54o03r78j318o43l92M98J512P17P41k62o76j456l55
1945a353o43L65J358J193O80J06q90j543n47l34J94J173J278N41L7n46j194r86
1963a111j28J61P06J327P68j62n81p46j389o42R13L40J483P19m37p79o10j246
1981a414k15K01P15R71R34K44o74p70j373q01N14J280O36R90K47q55p70o75q77
2000a692J24Q47J014M81J088n71j267o42o05n74R28J236P45O07k95j295p92n45
2018a208j26Q51J054M99M8J56o73j362l47n46L26J343J438nr3q65j676k99R9K11
$$ y = [-1536, -716, 720, 1625, 1906, 1296, 6, -1303, -1683, -1617, -881, 481, 1687, 2009, 1330, 277, -775, -1956, -1536, -889, 306, 1365, 1899, 1549, 463, -514, -1542, -1355, -361, 387, 1303, 1724, 1495, 394, -464, -1452, -1827, -1096, -21, 908, 1862, 1259, 281, -1037, -1680, -2072, -1574, -62, 655, 1396, 1134, 458, -998, -1353, -1996, -1631, -273, 920, 1600, 1706, 816, -727, -1274, -1608, -1414, -241, 1037, 1578, 1615, 1069, -125, -1111, -1239, -1078, -372, 955, 1723, 1561, 980, 234, -1155, -1797, -884, -544, 939, 1658, 1221, 442, -168, -1414, -1629, -1428, -713, 258, 1192, 1436, 762, -8, -1381, -2182, -1668, -388, 248, 1238, 1485, 630, -140, -815, -1692, -1568, -721, 293, 774, 1862, 1291, 24, -618, -1223, -1797, -869, 367, 1112, 1719, 1424, 129, -663, -1208, -1334, -483, 571, 1070, 1118, 1274, 601, -761, -1108, -1654, -1328, 15, 1453, 1448, 1355, 490, -1186, -1485, -1386, -1175]
2038a175J216J067K34j30l32j070j239J23L30K43J536N99l72k83p97j603J99N61
2056h93M25J201J114n90j119o27p88m7O96M05K96J131K78q00m28j199q35O62R98
2075a20R13N73N72j343r67j31p04lQ96R19K12P58k62j247n74q17m4R72J256O6
2095I25P81p70j047o25m15j26Q80J233O2l7No58j244L09m61K70J093R57J99K35
2115A566j180j458j3o5L76J166P00j64k66N0j341m10J09j5O84J371K33m60l22
2134E61r56j087K75M59M30J311N08o62m85q15r47J71P93N82L36N70o9o02k03p65
2154e95j117P49J099L18R79P7j337o30l24m83L74J061P9Q18L20p60j027j92m02
2173i93r7O63J024M13J86k18j212n46k12k29Q78J112n5K63k37r24r05J03L09L24
$$ y = [-1175, 41, 1108, 1342, 1212, 880, -190, -1429, -1306, -976, -733, 803, 1402, 1030, 747, -50, -1653, -1454, -893, -468, 733, 1847, 1257, 138, -489, -1277, -1324, -628, -223, 73, 1204, 1482, 682, 254, -945, -1780, -1118, -120, 793, 1366, 1938, 595, -372, -503, -1207, -1210, -314, 605, 817, 1575, 1313, 66, -508, -1325, -1369, -397, 859, 925, 1706, 936, -111, -736, -1151, -1277, -397, 836, 898, 861, 866, 208, -1036, -727, -1188, -918, 175, 1132, 1331, 1566, 386, -1072, -1085, -1150, -774, 392, 1092, 928, 662, 712, -629, -1039, -930, -945, -261, 1110, 1343, 883, 561, -395, -1482, -1207, -748, -318, 993, 1501, 839, 354, -461, -1408, -1237, -444, 138, 474, 1044, 975, 373, 170, -595, -1712, -963, 136, 454, 1433, 1510, 173, -457, -781, -1264, -890, 171, 250, 1068, 1388, 628, -399, -591, -993, -1090, -427, 597, 1010, 1196, 978, -234, -780, -992, -1221, -343, 769, 714, 977, 740, -184, -1089, -986, -677, -353]
2193c53O75M71J83j33o78j007j97O3N02P85P71n0k44q61o76j64R1L93N53Q32J91
2214A147k31p22n12q61K41L32O68P71K92l48o62l86p48q6R22O10L94K26k41m94
2234C12o32m61l12M18N30O82M59k01l85r73j94k81L30Q63N38L34l61j02r16n18
2254h70k99L79N47P81K83L02o39p74n65k51J76R72M66L68mn38p08k52l26J90M49
2275c13Q19L97j7l11p96l82j75Q4L77Q17N97j97k62o49p54k81K62M89O93K99J71
2296H68j70p66o23j62J72O49N97J78J93l36m45p75n30L68M17M88N97J94m70o17
2316a73o04k40K44M41M79M52K86l03l49q24l89o4N58O06M15M96l13o27n95j75
2336f79j40K25P14L34M22j91l75q24k34J57q2P76M45M89j75k76o25m20k73N3Q25
$$ y = [-353, 322, 793, 976, 843, 165, -842, -1039, -976, -474, 311, 1082, 1032, 788, -73, -749, -913, -822, -429, 124, 956, 1147, 916, 194, -318, -1179, -938, -606, 62, 833, 1125, 777, 115, -271, -1019, -1105, -183, 427, 821, 1047, 806, 312, -320, -781, -1093, -675, -145, 537, 996, 795, 410, -563, -757, -1038, -708, 155, 693, 1027, 666, 564, -352, -870, -1169, -790, -243, 538, 821, 1123, 484, -290, -855, -1106, -930, 42, 508, 876, 872, 334, -374, -626, -952, -762, -313, 506, 903, 886, 575, -221, -603, -778, -694, -317, 500, 1097, 900, 638, -11, -765, -1046, -784, -295, 398, 697, 868, 698, -68, -691, -853, -681, -32, 565, 743, 936, 600, 155, -620, -1150, -782, -365, 123, 720, 914, 444, -173, -777, -1017, -773, -332, 147, 599, 885, 582, 233, -591, -980, -1044, -486, 120, 535, 1031, 718, 91, -504, -679, -819, -594, 120, 454, 876, 685, 310, -514, -748, -591, -673, 103, 548, 1037, 862, 586, -39, -459, -732, -679, 146]
2357A46O14J50J5p00l36n75q6J58M71P12J37K2m96m47n26l36K21N93O20O04l35
2378F26l82m41o67k22K49K65P58L65K8k13m18n86j85L15K86L75M05J79j34n44
2398E9n17k87L15L44M39M36K21l24o22m59j64m8M63M96L76j37J80o37p07R6k81
2419g58O21M21N46oj56m50n06m22l88N85N51L25L34p3n75n72l92M70j64P12L86
2440D89P7O5n58n10j40j52K61K17P15L12j18n04l83m63K37J6L39L30P07l47k87
2461C03m37p73J76K29L80M29L40K25n83l56k13j98j24O10L03M67j25k98n40j21
2481c06m46Q4N01L86M97m4l89o26o0j72l1N58M61L03k27p1p90K96m58q9K39M55
2503G1M89K71l28o51l48j9j24K93O43K97r7j57k49o20j75K56O8N39M62r5j9k18
$$ y = [146, 760, 910, 925, 225, -111, -686, -772, -614, -143, 569, 706, 728, 232, -215, -741, -1077, -856, -263, 357, 961, 626, 244, -197, -864, -1086, -837, -572, 186, 551, 579, 366, -52, -638, -823, -508, -222, 153, 558, 737, 603, 59, -458, -745, -430, -86, 353, 789, 1010, 686, 64, -395, -559, -607, -144, 352, 728, 591, 771, 134, -573, -477, -758, -137, 284, 830, 824, 668, 218, -288, -710, -1098, -513, 38, 363, 697, 624, 49, -523, -915, -445, -609, 103, 489, 566, 631, 73, -437, -577, -729, -468, -251, 464, 776, 658, 154, -229, -692, -455, -439, -100, 230, 937, 590, 303, -134, -907, -731, -502, -122, 307, 647, 872, 289, -67, -280, -478, -602, 8, 311, 778, 653, 355, -185, -306, -752, -668, -167, 219, 716, 672, 283, -343, -403, -575, -606, -48, 413, 716, 489, 418, -372, -76, -534, -623, -384, 71, 560, 831, 503, -148, -496, -515, -639, -346, 297, 594, 497, 340, 91, -529, -704, -448, -380, 159, 621, 526, 507, 289]
2525B89m68n07K7M78J68O65J50m63j31l07k18l4K37N3L90M32m07j76m19m64O2
2546f43K76L48K83M41l20l67l4m73l59M85L03K24O27j78m37k93l74p1J46K40M19
2567B43KL12l44l09k06n13M43M72L80J09l54j79m19J05j80l96O87M10K09K59j22
2588F09p18k75j77L9M57O15J61k01j5o39j80k68K29L35L31J49j63k9n7m44j84
2609d25J17R7K36N99J05k98o68r0l67L34J06L44L57l8j04j65o68l4K4J55N30N39
2631F86Q3l32o07j96O8l54M34R6L79N34l65l75k59l06l65P47J92L7K22K24l94
2652A49k38k21l04J79O47K38J54o6l02o39K20j15o3K13M65Q0j37L5l90m75q4K55
2674c99L04L58R0J89k22l30m23j10K23K23M18J55p3k20k22n44K50J17J50M48P0
$$ y = [289, -179, -686, -659, -181, -13, 652, 802, 339, 208, -99, -317, -351, -114, -61, 329, 761, 354, 178, -241, -705, -643, -367, -19, 264, 705, 385, 18, -16, -489, -848, -363, -60, 164, 791, 613, 176, -117, -491, -562, -416, -176, 243, 245, 557, 213, -96, -302, -815, -372, 100, 480, 589, 235, 56, -363, -258, -438, -834, -147, 263, 472, 731, 609, -109, -384, -561, -522, -65, 550, 711, 510, 495, -144, -324, -592, -363, -28, 303, 452, 289, 260, 203, -241, -425, -308, -211, 25, 624, 729, 431, -237, -327, -694, -360, -254, 90, 447, 409, 305, 140, -528, -562, -538, -383, 147, 686, 769, 437, -170, -366, -298, -652, -218, -122, 257, 791, 426, 51, -208, -514, -879, -132, 60, 97, 319, 543, 149, -89, -310, -614, -435, 212, 450, 604, 538, 236, -403, -183, -298, -361, -148, 317, 397, 260, 295, -95, -570, -654, -399, -95, 263, 353, 542, 320, -10, -433, -543, -320, -97, 321, 476, 403, 183, -39, -583, -333, -216, -66, 382, 452]
2695D52M1k17r3o70j21N56NK83M79k47k44k43l01l14J38M10J38K33J21j35n48
2716b77r3k88J43L75J56K50L8j5m08P9l86j23L34J75M90K10l18l1o20q7j93N27
2738f2J18M16p0L0j34o45j85J32L55J63J14K88L3l76k46m38P1K25K42N25l65Q8
2760B79j81n62j72K09l96P56K02L10L99q00k75l28L59k85M78J48L03ok75j32l31
2781c00n6q2L54L93j42j45M61n99l76J07k84M60O96J7j57j58j84k15l05R7K14
2802b04L78J41M7k43l1r2n36L29p8N02Q1L40n24j68n0m16L78O0L07Q6J45l03r9
2825E0m56j50L7J52N17K11M3n0j34k59m58L28J93O7J28J11L2l95j31j78j39L31
2847a50K52J66L73m42J7k65j35j47L8J02O14o4r2%j64n54q6J78L37K38K38j09
$$ y = [452, 493, 276, 183, -487, -608, -52, -47, 236, 715, 468, 224, -19, -320, -634, -496, -86, 52, 285, 406, 271, -277, -370, -658, -515, -140, 16, 266, 304, 289, -119, -40, -426, -549, -215, -40, 450, 660, 342, 311, -309, -396, -589, -62, 56, 472, 402, 432, 298, -347, -532, -400, -45, 118, 232, 520, 553, 177, -69, -507, -436, -211, 31, 556, 191, 279, 98, -464, -636, -427, -823, -67, 135, 445, 844, 44, -231, -559, -200, -485, -7, 141, 444, 438, 163, 31, -300, -356, -438, -84, 309, 167, 22, 483, -116, -492, -385, -669, -209, 487, 504, 347, 189, 5, -210, -515, -418, -204, 174, 315, 362, 119, 88, -4, -540, -211, -289, 213, 294, 634, 110, -58, -108, -524, -146, -86, 221, 307, 452, 149, 50, -406, -556, -519, -367, 150, 361, 404, 354, 220, -39, -497, -169, 24, 91, 219, 330, 362, -33, -164, -342, -481, -150, 102, 268, 641, 199, 216, -49, -184, -331, -293, -191, 423, 359, 267, 267, 103, -451, -537, -359, -22, 216, 454, 345]
2869C45l91r1j76P5m6L41J05J55l5p0l57K8j52R2J32L60l4K35p50mJ9k77J45M11
2893F0M6K38m7l18R5l97K43n24N76O8K22J48k77l14j80OP0J05M46J00n2q4m19
2916a89o9P8j10Q9L88J94J39l17k76j63j40K60K4J81K32K15m24K5k14k67J34p7
2938b87K74J44K66j96j78j16k85K61k26M55K54j76Qo6l89J50j07J5L84j2N6O1
2960B90j56k31l27j11J16N25P3M22o4m61K1j59j47p1L44L01j26R7l45r3n5k14
2982c71j38L95L67J90K1k81l93n7K5M0J08K72j23K69j83O0m00j85mK92K58K61
3004D23M3m04M3n15M6L4K26L46O0J8j92m3k85j46J24J37L6L95N6n3l97j49ro0
3028b66K42j43N96l0l58L0m61M64l63K74L22L1J94j77k73l8k55%K31J2J72J27
$$ y = [345, -46, -137, -313, -238, -284, 57, 162, 317, 282, 212, -145, -117, -269, -177, -45, 315, 281, 516, -234, -238, -219, -496, -351, 60, 106, 344, 297, -21, 74, -323, -80, -604, -28, 40, 262, 410, 133, -181, -361, -355, -285, -180, 266, 366, 314, 230, -189, -258, -180, -290, -201, 187, 381, 520, 203, -73, -236, -376, -116, -92, 89, 321, 536, 112, 137, -77, -344, -210, -287, -13, 131, 397, 201, 23, -93, -378, -117, -343, 112, 366, 190, 198, 132, -257, -107, -214, -199, 185, 173, 229, 290, 134, -97, -424, -535, -419, 106, 179, 601, 537, 76, 97, -62, -209, -280, 64, 365, 239, 336, -9, -102, -157, -371, -509, -114, 253, 443, 464, 183, -210, -267, -242, -202, -94, 178, 55, 324, 141, 201, -199, -384, -388, -96, 162, 423, 466, 62, 105, -410, -364, -330, -104, 242, 302, 320, 128, 85, -200, -346, -222, -85, -49, 346, 402, 349, -48, -197, -206, -266, -24, -167, 429, 399, 41, 71, -390, 74, -289, -15, 307, 338, 532, 355, 82, 44, -211, -211, 20, 32, 204, 331]
3050C31J03l36k19l2k00L7K57L03o2J64l59k34J23k51J17M73j34M12k51k24j67
3071a49l41j23L04M21L18l31J52j28m16J08%J37j47M90N9n3k7o40Q0Q7L08k01
3093i2J92L47k33N6l67l0k02n7K21L37J70R9l23j9n46L9J88o6M98L2p2Q6L8o85
3117c89K58L87k76J01O3L61o72L08l55M4M5j82O58j34K05k27k74j07O1K6J59R9
3139A59r9J22L73m82k71j68l3J55N19j7l6K94m35p5N5j14k97J28O21k17K41j75
3161B48o73J72J85K9rN62j16j13l34jk39k3K3K89J89m6M6M9l92n2k7J82j08M39
3185B80o4j34j9j43K5l12R4J8M53J13J33l91k1j16m9K05j10L26J53L2k79l06J2
3208a00j46J65j1K34J20ok1m59k4N1N5OL05k41J68J48k08p5k23J61p8L05K0R1
$$ y = [331, 434, 98, -121, -153, -353, -316, -59, 244, 182, 346, -13, -247, -124, -375, -258, 215, 81, 493, 242, 18, -149, -490, -613, -309, 112, 430, 99, 251, 123, -293, -185, -185, -48, -195, 295, 354, 301, 274, -366, -286, -199, 109, -92, 100, 447, 214, 270, -97, -127, -329, -386, -165, 172, 342, 441, 118, 99, -447, -408, -220, -286, 212, 244, 172, 258, 296, -389, -131, 256, -20, 81, 144, 505, -167, 141, -214, -170, -125, -307, 351, 217, 422, 195, -79, -186, -125, -99, 60, 159, 60, 182, 555, 73, -198, -366, -399, -244, 275, 258, 222, 516, 81, 6, 61, -53, -350, -222, 399, 182, 423, 248, -425, -253, -68, -39, -48, 514, 398, 285, -49, -50, -289, -312, -289, 0, 189, 143, 189, 238, -154, -206, -233, -51, -159, 280, 216, 82, 63, -80, -55, -367, -273, -255, 198, 311, 444, 53, 32, -84, -133, 72, -38, 288, 441, 473, 194, -112, -100, -246, -81, -92, 142, 262, 256, 235, -224, -248, -197, -142, -136, 169, -72, 96, 244, 36, -39, -262, -101, -179, 126, 146, 237]
3232B37K46j87n19J4q7L25M4n0L75j76l56j01m6L60k9o9J80m5n7j35l60J72K2
3255b42J97M2M3L37l28J61l57M2J63k44J77L5J62O7j46K75o07k4K68n5J13L36
3277D15j02k33J02k83j09K40j01J77R0j48m2j30K14m62K60n8K89L35r6k25j28
3298Elk25J48o2M52L38k38k98l6j97o4k81L78K44N6J84l43N8j28o2l93L32P1K86
3322B22M4l85K69k27j7r0k4L92K35M1j72k26k30p2J72j24K51P3R7j59J4j10r0
3345a16j24rM06J4n0O4o5j81n2J52L9L2j31J75L5j9j23j47p5K61j11R0J47j45
3369F7O0k56m4J5p7M24J17k13L84k24l68k6j53L55l5O9P0j23M2k00O5j34j58M40
3393I7n0J19j8J35j95k51m6LK15J45K9J5j13k68n7J94k54K68J39L1J67k65o8j6
$$ y = [237, 483, 296, -223, -209, -296, 29, 73, 23, 398, 222, -134, -235, -281, 79, 50, -19, 161, 116, 59, -76, -436, -264, -242, -45, -3, 40, 377, 49, 210, -147, -105, 58, -186, -9, 26, 188, 255, 109, 384, -223, -247, 21, -34, 79, 415, 313, 80, 182, -101, -210, 30, -71, 106, 196, 48, 6, -124, 90, -372, -112, -170, 119, 454, 358, 133, 5, 2, -223, -75, -137, 315, 653, 415, 117, 81, -116, -180, -461, -83, 161, 217, 401, 58, 116, -12, -74, -467, -135, -64, 222, 266, -119, 150, -77, -94, -184, -208, 184, 419, 460, 288, 62, -168, -240, -68, -192, 59, 132, 229, 70, 84, -26, -116, -240, -249, 157, 171, 121, 185, 120, -61, -113, 39, 78, 110, -21, 154, 189, 170, 47, -100, -175, 86, -25, 65, 212, 67, 127, -129, -173, -158, -235, 189, 306, 93, 477, 253, -115, -141, -294, 61, 26, 95, 165, 42, 84, -116, -51, -185, -343, 97, 47, 166, 148, 283, 88, -163, -209, -206, 9, 154, 183, 198, 85, -183, -240, -46, -300, -32, 107, 138, 305, 40, -28, -44]
3417d4k32Q6N1L79J37k31K4k69j94J01j73L18P1L53r9n9j77j84l7q5L46p3J87
3440A96r5Q9k35r7j99J92O6J52j62K61O2j75k45N5J34j75L26j08J21J45j64j32
3462A2j51N7kJ45O3r5K55l88j15K11j21n2K50J67j25O0R8m99R4j91Q9J39J48J49
3486A98j75j35q8J07l0p3M27q1J31j16l66m1J64o3J45j34L86j9j37l5o0j29n0
3509a74j44K66j47O09l24j83P3j08k19K17J58N0J1J72P7k37j26L1k19J36K22L1
3531A72k29J91j15q7O7j09J64j34J31M10k09k51n6j19J32n6J05j13L04j44L6q
3553H2j0k05O8J02j83J85K05j44J2k33L8Pr1K87j41j9J21j25j02K14r7j16K62
3576A17m1K1P5j84Q1j39O8k36N48p8R3l62j32o6R6J66k65L02J69k09O1L6n9j79
$$ y = [-44, -276, -190, -139, 240, 377, 146, 170, -99, -293, -192, -365, -47, 24, 377, 278, 219, 42, -142, -179, -264, 82, 9, 196, 101, 190, -45, -142, -341, -149, -83, 69, -93, 168, 230, 55, -190, -135, -1, -176, 150, 42, 163, 308, 144, 12, -139, -82, -84, 61, 124, 29, 284, -104, -219, -8, -129, -181, 69, 236, 111, 171, 269, -230, -136, -327, -238, -99, 49, 198, 23, -112, -200, -93, -123, -196, 231, 150, 281, 165, -201, -242, -78, -141, 4, -130, 256, 237, 100, 65, 5, -124, -174, -318, -52, -199, 410, 86, -97, -24, -132, -351, -134, 24, 74, 85, 257, 334, 97, -29, 2, -217, -81, 141, 172, -57, 134, 19, -68, -1, -110, 54, -80, 51, 461, 252, 1, -55, -174, -42, -98, 7, -106, 198, 54, 90, 82, 72, -133, -65, 37, -146, 39, 244, 100, 112, -121, -83, -76, -167, 120, -21, -40, 81, -44, -146, 68, -29, -145, 117, 76, 97, 172, -12, 69, -70, -2, -238, 310, 232, 325, -37, -169, -235, -139, 27, -238, 64, 233, 24, 85, 121, 62, -117]
3600a17j94M19j33L61k73mN6j33l9k60K15J38K99r7j71L9k07l9L5K35j26O8J9
3623I1R5k43j97J76o7j2J60J71L32m63j78k0N6j9J76P6k93K91Q2k7m57J65j1O7
3647d9J10K8j79L23j75l35K9J02n1Q0L9K09O3p0q5j27J30j84P2R9m6%J36j59j4
3672e4j06M1J69k00J14K12j59q2J66k91M8Q8K90n4n4j94l2m6k69L63J33j90L76
3695B69k03K73p9m11j10LM17n3N4l87N38l36Lq3j07R8K26O2k4k3N1j62k8m5R0
3720C3K46j42P2P9Jk84j2k23O1L37pJ9l52K54j56n3J72j16J51o9L15p4m49J65
3744c2j27J01J0k86P37l31R1j04l4l8k45K77M2L3J89m1l32j33J06j00K99j83K98
3767A97l34K14l5j22K27k30M4J7J03j45j3K83l81O4o3q5K01J61m0R8j86n0M4j49
$$ y = [-117, -311, 108, -25, 336, 63, 59, 115, -18, -57, -317, -102, 36, 335, 238, 67, 106, -101, -140, -105, 130, 4, 72, 91, 186, -57, -254, -78, -145, -157, 3, 174, 506, 43, -135, -155, -99, -118, 58, 134, -159, 132, 214, 187, -270, -105, -116, -49, 61, 89, -90, 233, 58, -277, -248, -146, -197, -117, -78, 131, 194, 124, 39, -88, 42, -142, -70, 29, -17, -17, 119, -40, -54, -160, -119, 50, -150, -36, 176, 17, -65, 101, -190, -142, -54, 236, 182, 128, -66, -98, -144, -413, -50, 83, -107, 269, 66, 339, 260, -151, -261, -258, 159, 106, 160, -227, 311, -25, -22, -105, -212, -114, 112, 174, 150, 127, 178, 16, -12, -57, 33, 279, 137, 209, 288, 289, 5, -7, -230, -169, 168, 161, 180, -172, 82, -74, -127, 45, -71, 80, 11, 326, 252, -197, -32, -159, -58, -48, -334, 403, 72, 163, 59, 25, -13, -258, 19, 61, 94, 283, 242, -90, -223, -117, -217, 82, -101, 197, -137, 77, 42, -80, 147, -83, -39, -22, 81, -64, -77, 206, -175, -111, -174, -259, -58, 103, 63, 161, -25, -75, -31, -180]
3791a80J87oK78l68L42k14k07J24j72M4j82K82K53j69J36j39k45K98N3q7J99o6
3813A61n2j12Q5k82K72k59J67n5K08M9m9K2k28k9J08Q4j87L31m24M09k28j3k78
3836c00M4J31J2K21J53k59J2n1R9k50M4N7J81J42k95oJ26j54R6J36j23k09L32
3859A39J21k50N0j16n7L2j01K98N3j56K83j7n25P4m9L02J0mq3j00J31k85j0k1
3883b81j67L27J35J79k36KK8k61K19lM0J27k77M43k61n3k45n0K96j94J17K22M6
3906A53j46L9N7j73N4RK65p9n6M0k87L8P3n7J9%J08j74j62K49k42K4K80l9j91
3931a98K72J35k75r7m1P9MN1K84j74M6k6j95p7K55j32kJ40J42k90J73k06M5j63
3955b50J15k8L49q6o6k8Lo6M3m2J24K21k59K31j47j3j90n4J01l2J36j63L86k20
$$ y = [-180, 7, 1, 279, -89, 253, 39, -168, -44, -216, -172, -354, -72, 181, 12, 148, 9, -236, 62, 115, 28, 227, 161, 109, -3, 82, -200, 72, -187, -20, -75, 133, 182, 133, 155, -73, -102, 6, 90, -97, 234, -190, 219, -9, -22, -300, -256, -125, -113, 108, 261, 2, 14, -37, 62, -188, -144, -87, 94, 236, -59, -65, 61, -93, 3, 139, 16, -193, 139, 260, 10, 60, -56, -113, -81, -182, 116, 169, 13, 296, 279, -246, -172, -221, 81, 91, 87, 4, -96, 35, -250, -260, -281, -448, -121, 14, 193, -43, -41, -13, -274, -55, -58, -18, 109, -168, 275, 14, -39, -284, -334, -38, -232, -115, 107, 153, 7, 46, 103, -70, -16, -7, 258, 179, 123, 163, -124, -86, -13, -70, -51, -51, 57, -117, -279, -30, -272, -248, 32, -7, -198, 74, 209, -66, -163, -204, -125, -121, -70, 214, 40, 86, 60, -135, -212, 43, -89, -91, 49, 191, -99, 74, -132, -87, -250, -135, -163, 186, 100, 34, 6, 9, -57, -14, -56, 68, 289, 30, 261, 114, 101, -89, -143, -42, -74, 62, -101, 285, 65]
3979F5k17j4j23K04J76q2P2j58J99m0l42J71jj52K54M7K86r7k59L9k42M19m92
4002b87K53J00M0q9J24j34j34J24M6j46J47l3J31k45m7R2N0j53P2L5K15J21m82
4025b00K62j3k21K35r0K63o0m2l66M24m01J48k37L23m1j85Q0J18L9l9NM5j65N9
4049e9L15k11R2k21K8QLL2K96k23O7J42j34l43J67n0J55j48J6J76j31k29J98o7
4073a21J66J0J8J89k87J37j95r6K16k8P2L8j75J10j92J67o2M8m9K20k60J01K53
4096B80k06o4J34m79K03J84j35L30j26o1j08M7j55m9M6J18k0K40j82L6L1l43N8
4119b21K87n0%K5J36k50OK79n11K23l7R4L06m1j29j58k38L43j19J58P3j85mQ7
4143G4j25k42J04R6L9N1Q6Qk44J80J64m32K65k22oK48r3J69j59J5j14K55j3R5
$$ y = [65, -152, -166, -289, -85, 91, 9, 81, -77, 122, 82, -260, -89, -90, -242, 12, 59, 345, 248, -11, 28, -214, 205, -287, -34, 66, 106, 17, 141, 7, -127, -3, 43, -103, 44, 11, 142, -103, -150, -58, -8, -161, -89, -54, 161, 282, -200, 62, 49, -172, 63, -27, 236, 176, 134, -232, 192, -209, -61, -298, 25, -16, -201, -121, -3, 36, -3, 2, 47, -118, -59, 256, 45, 137, -84, -56, -48, -45, -13, 283, 60, 127, 269, 135, -208, -41, -91, 64, -84, -68, 108, -23, -252, -54, -121, 45, 55, 73, 262, -25, 112, -83, -179, 37, 9, 81, 119, -56, 54, -138, 29, -33, 15, -34, 186, -74, 27, 280, 74, 10, 144, -335, -132, 52, -83, 247, 121, 60, -48, -1, -156, -205, -159, -41, -61, 179, -3, 33, 64, -279, -221, 66, 16, 16, 41, 177, -73, -67, 212, -299, -76, -113, -19, 287, 246, 117, -41, -279, 64, -55, 103, 176, -9, -13, 74, -51, -293, -189, -93, -54, -3, 83, 91, -153, 27, 191, -241, 24, -198, -204, 44, -49, 120, -39, -24, -138, 117, 104, 199]
4167A99R2k24k6p8q3l1P7J52J01k0l6j94J25j55J03M7qp2L19k44O5k40L21k96
4191a06N7R2L7j44K02j05q4R7k10J71%j43J37J72J14l65J48q6j56P0L7Q2Ol9O
4216a0rL3j86JJ39J04q7K23j90k4J67k74p5n8L77k43k6J68k4%o8m43L06J84J22
4241A07N2j45k12N5J46j72L83j1j34L6l29M57l26O4L1p6J57n3J25j67K12l68Q4
4264h4J8J34j14K13j16L3k02K93k36q4P4K46N1m1j98j1Q5j75k3q8K93J2O3j68
4288b5r4J21Jj61o5l0M45M1O2m92J42JK32l89L5K25k4o6M0R7Jj60j17K33J03k40
4314h4K48K2m79J30O7J47k67K90J1l48L64j6J03l70K16N1j17J29j38O8j05l6K06
4337I2j70P4o2L4R7j01r8J89J33mk90J08R7r0Rj41J59K04k31p0J74Q4k59L6J98
$$ y = [199, 291, 67, 41, -37, -120, -151, -74, 78, 179, 159, 123, -71, 54, -101, 2, 49, 41, -31, 288, 44, 109, -131, 190, -106, -49, 43, 80, -64, 138, 33, -51, 46, -164, 7, 7, -136, 1, 173, 287, -78, 70, -16, -172, -102, -65, 17, 23, -16, -10, -19, 14, -172, -171, -32, 72, -15, 208, 18, -6, 161, -113, -188, -246, 131, -112, -138, 30, 6, 6, -62, -505, -199, -15, 107, 159, 14, -198, -143, 3, -169, 214, 203, 69, 105, -224, 233, -93, -29, 2, -74, 83, 30, 155, -12, 200, -168, -84, -66, 68, -46, 167, 51, 84, -118, 175, -61, -145, -71, 175, 226, 185, -13, -24, 61, -114, -137, -225, 68, 80, 143, -25, -119, 2, 3, -158, -223, -253, 192, 233, 295, -197, -55, -54, 178, -211, -176, 49, 25, -41, -1, 96, 97, -63, -180, 53, 156, -84, 164, 186, -293, -163, -96, 51, -216, 74, 85, -263, 101, 85, 188, -182, 34, 85, -32, 97, -41, 27, -78, -114, 92, -78, -4, -66, -32, 65, -36, -134, 55, 188, 184, -106, 2, 99, 9, 18, -123, 36, 240, 9, -61, 113, 197, -62, -26, 172]
4362A72k85j02K76p3M12n65J81mj20J58j0j45J04j49R8P7L01k73j46q0L32k87
4384a28J89k07K08%P4o0n4J7r0R6J24k23K45k41J06p7k20K86j11J32J23j93J06
4407A02Qk35J48p9J11j7K5r0k45L87j41j35N6L4L20j13k07j61K79n9k20L37o6
4430C9r5K02Nj41qq5K05j89L4K75j32k10J60r2M5P8p6k7K6o4l2o6J03j6K15K27
4456C81l63j86P4R1Rj30Q4L3j16J66p2K31j55k00L13j83J7k4j1o7J07J77j12j73
4480a09J19l4j04L15Pj14q4J33l86O4J63P3P7m35L15k33K63L3k14J00o5K12j52
4503e6j9J64r4j05k3M2J44L7j49O0K13j86l81L86j67o8n3J21J85L3J6m61L79p0
4527e2J6L3j6L64j91l73K96o1J41j79n9L33j2m69M16l08O9J12j71J71j51L97j88
$$ y = [172, -113, -215, 61, -12, 400, -165, 16, 12, -108, 50, 40, -105, -1, -150, -52, 25, 326, 53, -93, -173, 159, -128, 61, -146, 62, 62, 136, 76, 22, 39, -51, 45, 169, -54, 191, -50, 56, -21, -241, 45, -66, 66, 189, -4, 102, 110, -125, 23, -56, 55, 38, 63, -27, -272, 115, -26, -161, -105, -71, 249, 136, -71, -232, 47, -12, -232, 105, 39, -56, 146, 151, 10, 2, -83, 122, -67, -33, 242, 110, -100, 60, -32, 13, 91, 15, -12, 14, -50, -82, -148, -45, -61, 154, 381, 18, -168, -94, -3, 6, -124, -40, -7, -123, 43, -29, 202, 47, -153, 160, -23, -6, -30, -41, -108, -1, 176, 64, -109, 10, -24, -128, 187, 194, 80, -4, 129, -257, -193, -30, 43, 120, -315, 0, -233, 30, 63, -151, -51, -116, 96, -56, -75, 89, -5, -110, -133, -91, 53, 90, -59, 1, 214, 28, -353, 33, -134, -202, -255, -134, 51, 84, 100, -361, 18, -52, -36, -3, -19, 345, 154, -219, 77, 16, 157, -22, -81, 252, 240, -229, 187, -121, -52, 60, -111, 60, -91, 306, 118]
4550A18l20K68j21k15J24K78k30K08M1p9K4l88N86l45J4o7J99R8k69L64k23k91
4572b26M28k35m9n3K43J28l3J91m41k46K37O0J37J51k29o1J00k60K66l25L25M
4594A12j23J94k87J97o9j07J13j29J88q4J8Q0k56J14J17r4r2L18m15K49j02K44
4616A86p7po0k66L07R6j14j00OQ4k12j29L97j09L44k54O1o4q9K14m11J83J27N
4640A18J20l17O0J32l71P23l37j05M2k02O0K76k46q9j71J86nJ77p8J26j48N5j63
4663a57k78N75m0n2j7P5l32K79m0j99M52j63j19pJ64q6lj84J2K36j39L17j59J11
4687B46j05j31k31K45qL9q3L2R1l1p1j09L07l31K15P2j06O0m21K11L31j84J69
4710B07j42j59J63J9J0k45K79m00J50M5J78%K9l7n5k3k59J57K3J24N0j16Nm0N7
$$ y = [118, -202, 66, -55, -270, -146, 132, -98, 110, 151, 72, 96, -292, 294, -51, -37, -104, 95, 193, -76, 288, 65, -226, 202, -33, -82, -135, 108, 236, 203, 394, -47, -293, -56, 4, 141, 292, 63, 2, 102, -158, 108, -217, 108, 112, -11, 183, -104, 93, 24, -83, 30, -99, 89, 5, 23, 103, -153, -39, 78, -16, -108, 210, -205, 44, -58, 186, 109, 102, 42, -224, 83, 179, 65, -35, -29, 55, -157, -286, 111, 2, 346, 92, 153, 89, 0, 214, -197, -14, 113, 118, 238, -79, -19, 113, -258, 465, 128, 23, 65, -137, -77, 199, -47, -136, -307, -121, -126, 51, -27, 99, -49, 6, -157, -435, 140, 100, 48, 31, 106, -226, 53, 13, -186, 266, 103, -16, -23, 141, 55, 52, -132, -120, 116, -23, 294, 135, 246, 141, 10, -221, 24, 16, 55, -28, 4, 95, 64, -7, -116, 191, -140, 75, 147, 41, 101, -320, -109, 222, 38, 207, 65, -94, 69, 88, 98, -147, 132, -268, -118, -73, 105, 105, 134, 97, 42, 19, -240, -83, -60, 64, 114, -2, 3, -37, 20]
4735B0k59K16L6L6J7K75k20p2k3j31R8j47L57l55K01J81p1l58M3N4P5R8or9J06
4760G2q7P2k79J75j70Q3K56k39K70j04o2n5k29L22J43j11r2j04Q3k9p0K93m30
4783b92K80j28MK39j69r1m3J32Q3Jk85J87K73r5r4j61K42j19J64J11M4k61J10
4806A32%r0j30J10q9N9J91j06j09J77k52oPK10q1o0P8L8j14r9K55J28k22r6l5
4831a04j39J38K39J9l64K26j25K95r1p8N6l82L01l0J82O2k62J36K36n07M11k88
4853f9j71J88j7K72k51J39o4k3K60j93j48K31j08L3j67J55j64K24p6j00K36l14
4875a27%J59M6j07J11N5m8j80J6Q5m8J65j8k64N1M2j61P2K90k7N3J13j89n6k77
4900b44K19Mj27M20k57K38k59J4k92L77o4l11Q5J41K12k84N1j77J52LK47j10O7
$$ y = [20, -239, -23, 13, 49, 66, 341, 121, 49, 26, -105, -7, -154, 203, -152, 49, 230, 159, -199, -156, -102, -27, 71, 65, -34, 72, -15, 57, -222, -47, -217, -134, 122, -117, 153, 49, -13, -68, -297, 25, 168, 57, -35, -139, -56, -85, -155, 138, -292, -12, -140, -136, 103, -66, -157, -200, -68, 15, 16, -269, -82, 191, 96, 2, -159, 83, -36, 128, 239, 283, 22, 132, 132, 42, -88, 22, -67, -8, 183, 77, -32, 145, -107, -113, -106, 104, 23, -37, 41, 79, -35, -134, 121, 249, 27, -69, -104, -243, -105, 134, 153, -211, 15, -110, 185, 94, 16, 72, -310, -9, -39, 143, 205, -57, 79, 315, -192, 219, -69, -240, -52, -69, 203, -48, 91, 27, 4, 264, 71, -77, 154, 46, 79, -88, 67, -97, 127, 51, -49, 187, -127, -127, 32, 78, -29, 82, 137, 89, -91, -75, 10, -38, 127, 109, -155, -104, -62, -223, -151, 139, 112, 165, 278, 89, 33, -244, -25, -21, -148, 272, 15, 253, -6, 8, -284, 93, 29, -282, -197, -56, 156, -128, -77, -254, -102, -99, 148, 38, 105]
4923A05Nr6o5l8K76k57j39J68J91n4J5n2om28K44J56l8R9n8j20J15j93L4mK11
4948G1J3k01K59j64M1J79k97k73K63Q0J82J61l12J57j18r9J10k24K75Rj21p0N0
4971b9k9M1Q5k01J38J43j61O3K76n60M0O0L49l01r2K39r7J7k6j7n2k7J96j88L40
4996B07k57J1J24j25Q8M0j17r1K33j13j28o9K02jJ08j81K47r6j40J31k08r3K47
5019A9j12N3J0N9N4j43J3J26j76r2m7J57K69j25o6qk18L13k01m2J84O6j86J89
5043I6k5j37r4K01O8L2Oj58j55J66J40k18L11m27L79l3q3j63J90k4j98m4K98k61
5067a33L71k34R4k15o0J96o3Rk9K86j1l43N3L17k92o8N9J4o4J01M2M3l13K08k51
5092b83K24M2J03l51K67j97k3J28o2j85J87K20l5J3q6J25k15K46r5J20r6k5j78
$$ y = [105, 110, 14, -51, -89, 187, -70, -209, -41, 150, 96, 111, 59, 53, -375, -131, 25, -13, 86, 28, -92, 23, -170, -136, -140, 71, 84, -117, 142, -22, 19, 198, -99, -372, -109, -29, 153, 314, 2, 159, 41, -58, 52, -172, 103, 112, -9, -79, -29, -58, -17, 68, -133, 5, 148, -13, 50, 326, -234, -194, -134, 215, -86, -178, 61, -36, -19, -45, -62, -114, -141, 55, -133, 207, -50, -39, 85, -40, 48, 88, -29, -120, 113, 0, -128, -197, 5, 4, 112, -69, 178, 82, -58, 73, -135, -228, 19, -93, -40, -30, 29, 83, -60, -47, 79, -97, -189, -236, -79, 190, 65, -1, -9, -227, 86, -115, -157, 27, 93, -93, 96, 71, -66, -160, 41, 109, 141, 147, -11, -166, 0, 140, -78, 233, -194, 185, 152, 69, -94, 96, 72, -126, -170, 128, -133, 238, 4, 98, -117, -177, 19, -44, -35, -64, 222, 211, -132, -79, 238, -54, -122, -63, -49, -113, -12, 30, 73, -240, -32, -283, -59, -17, 86, -265, 2, -195, -218, -90, -152, -337, -150, 70, 35, 48, -38, 87, -128, 118, 23, 143, 47, 22, -156]
5115a56J91j13R7l6p6K5K11j54n1N8l3oj5m3K69j23O6n4R2j44j13q0J58n9L81
5140B92o1k63J01k99J28j53J09J88K18j67l04J86nn7l6K32o4j6j14M3M4j40J48
5163A0L0n2K03J16j65L1k07j85K44j70K7m3K79J59o5m08J14L8L3j02n9K53LLo7
5188B0j12R4k8J45j47J23j18q0O2P0J73k07K6l14O15n15M15j09n0j76Q7l3K49
5211A90j82J92Lk74J92p4j30k1O0J04K06l04J6K27k34p7PJ62Ql2q7N3J40p0K0
5236I5l26J28k3L50k13j07oJ49j00k65L82k34L20n5m3j36R8j01N8j99K02K02l63
5259a87M61l75l1K44k30K95k67o7r5L21J17j05j12J89o3n6j54P1J1K68j10j26
5281ap3J95j65k0k22L52k07J50K2k60J27M2K7J50No9o4j87J36K42J2j35j08J35
$$ y = [-156, 35, -78, 19, -17, -93, -68, 143, -11, -62, -4, -37, -43, -58, -101, 168, 45, 111, 57, 149, 5, -108, -188, -30, -89, 292, 231, -32, 69, -230, -102, -255, -146, 42, 260, 93, -211, -25, -30, -87, -123, 109, 45, 29, -85, -42, 2, -138, 10, 40, -12, 191, 307, 142, 173, -34, -219, 25, -145, -118, -161, 118, 277, 212, -196, -82, -44, -11, -113, -172, 81, 84, 87, 20, -92, 2, -26, 119, -28, 95, -23, -103, -41, 29, 202, -5, 21, -293, 322, -193, 222, 113, 63, -113, -26, -59, 190, 8, 200, 203, -71, 121, 47, -83, -104, -44, 60, 266, -38, -22, 205, -29, -106, -99, 63, 71, 39, -48, 5, 145, 75, 95, -231, -103, -126, 224, 11, -96, -102, 47, -53, -318, 64, -170, 150, 95, 52, -84, 14, -87, -29, -228, -26, 176, -187, 274, -101, -132, 112, -118, 177, -90, -157, -252, 69, 186, 81, -31, 158, 95, 39, -115, -44, -33, 235, 125, -1, -74, 121, -44, -64, -286, 66, -141, 9, 31, -229, -102, -60, -33, 117, 122, 53, -11, -198, -62, 180, 192, 57, -51, 84]
5305H4lr6J67q0j22qJ00j45L79k90mq4P1K9Q8n3r2P8j14K22m4o6j00l5l3N2L00
5332B01k11K50j81q8nJ4K02q3J88l08L42l34J3j23J77j12J77l9o7K9j38J13L00
5355C17l62J15on3P4K4k26L7J61l42L11L9L8l6j93n8J8J43o0k60M34j53Q3j57
5379a12J62J08k63j01K31J77J7o9q6j02n4K17l06O8K91Kj90R8K3j14Q6l17K07
5402b7k33M45n3JO4k47J05k51K31K87p7m4n1j86oO2J7q9J63M8k1j75N7k65N68
5427C23k07j10J70l16K68k68O6J61%P2o0rk29K59J0j49j07k42K83J09m03N43j78
5450a4O8N9j17m5l4J63J9j00J50j49L5n1p0k1Q4m6j12K57J48l21J58j34k1N9J71
5475A36q2l7J77j02J6j58J31k37J65j6N0k28L06R4l54J66o0J09M2N3j21n2J48
$$ y = [84, 81, -15, 152, 72, -50, -58, 42, -103, 276, -14, -18, -102, -31, -2, 86, 33, -59, 19, -95, 127, 83, 17, -83, -118, -151, -99, 201, -10, 240, 59, -29, -34, -20, 182, 99, 287, -21, 321, -13, 0, -123, 54, -58, 119, 80, 13, 42, -96, 17, 317, -45, 70, 64, 11, 85, 109, -117, -80, 81, -261, 50, 89, 127, 91, -102, -160, -142, 1, -59, -319, 115, -38, 45, -112, 50, 158, -105, -206, 25, 202, 219, 150, 64, -38, -92, 125, -181, -113, 178, 180, -10, 88, 111, -3, 83, -234, -27, -260, 185, 132, 133, 197, -50, 55, -196, 35, 322, 245, 201, 150, -36, -42, 20, 37, -52, 111, 159, 138, -37, 20, -245, 323, 116, 6, 176, -140, 128, -140, -74, 87, 87, 159, 99, 90, -139, 120, 130, -19, -126, -368, -85, 24, -379, 164, -14, 54, 113, -4, -49, -83, 80, 99, -1, 149, 0, 35, -16, -86, -107, -23, -69, -181, 76, 224, -97, 61, -73, -94, -35, 136, 54, 17, 194, 92, 108, -50, 81, -156, 9, -7, 43, -185, 121, 215, -139, 27, -33, 76, 118, 171, 50, -2, 146]
5498A46j82J9K07l83J98Q4J03o9j61r5J24J7J85j76j8j62J60l6Qp5j64K68M0N8
5522I6j00j3n2j45J02L89j93m1j18J87j18j64Q5o9J51o4J72j00J0K28l07K35k97
5545a26O3J5j04J69j04k4R1kJ66j06j4oj91L50j49J48l42J13o0Q6qp0j8K00rQ1
5571A49m18L37m9j76J01j0J12L9m18K19K85k27j18K95j26j66L10k28J52j09J42
5592I6J75l32J22L8k6m6k47M37l66J74J82l14j61M53l80J25N8j61K9Q7K17l10
5614a50J40K03q7K1Qj64K48j13j07k52N17m89K53K28m23J89l19L18k28L87l6j81
5636c7P1j91K80J9j92n1J19Q8o6j36K9oJ24o0j3l84M63k21%J33J72k31J04O5J6
5661I5j12j84J27n2K11o5J77j00J18l42J00k21J31J4J12k58M80k82j42K62j54
$$ y = [146, -36, -17, 190, -193, 5, 89, 192, 123, -38, -133, -9, 8, 193, 17, -1, -163, -3, -39, -31, -106, -270, -2, 38, 96, -4, -17, -69, -214, -112, 277, 84, 43, -75, 112, -6, -170, -85, -154, -3, -67, 105, 5, 15, 243, -64, 171, -126, -63, -48, -152, 17, -87, -111, -20, -22, 144, 38, 24, 18, -173, 177, 28, 176, -166, -53, -113, -27, -35, -105, -123, 77, 68, 149, -269, 68, 19, -157, -56, -66, 46, 85, -333, -114, 171, -56, -174, 121, -5, -171, 139, -89, 63, -46, 96, 271, -61, 61, 99, 73, 27, -220, 217, -149, 25, 207, -107, -268, 185, -195, -70, -12, -173, -144, -57, 160, -150, -10, 193, 106, 127, 135, -29, 219, 106, -1, -253, 264, -225, 28, 256, -167, 22, -297, 21, -207, 180, 144, -37, 34, -157, 123, 142, -50, -101, 18, 106, 40, -96, -67, -73, 51, -9, -22, -406, 57, -164, -164, -31, 141, -90, 14, 79, 95, -17, -201, -74, -126, 85, 20, 197, 97, 215, -127, -27, -248, -117, -103, 9, -249, 231, -51, -193, 69, -85]
5682h5J20j38j48L12n8J44l4j90r3N9K60p7n7J2j32R3l1j0J54r0j63R1R2o0J00
5707G1j70l0J10Q1j15LK69k06Q2j40j28R8J95j31K1Q0p1P1k9j15J46j47J91J7
5731A53j05J70j02J40j99M3j21J61j52J96j73K31l42K0j81M63k44j15J31L1K1
5752B6j46n6N7O4j09K99k02O4J66k06j9n4Q4M5o3qJ53j03N1o0k17O0J7K09K2K5
5778I9K2l57J62P7k07J62L2m4O7j71K99k31j05L30J14k95J58k34N4L9J62K19l93
5801d1K44j85N0J68r3k22L6O0r7M6K68j58J97k77j87K41j63Q7R7j01Q9K12k93
5824b2o4j26K11J25q1J45j54J70k42k3r0P9Q9j20o2J81k53L98j21j31J91j38J78
5847A40l57K29Q1P2j61L3j59R5l3jL05j99j30l0J85j41j6R1k46L85k15J55n5p7
$$ y = [-85, 35, -103, -251, 61, 3, 147, 113, -77, -170, -111, 149, 72, 15, 27, -105, -12, -43, -53, 101, 11, -152, -61, 31, -29, 71, -99, -129, -19, 62, -53, -50, 219, 13, 95, -45, -173, -75, 120, -11, 10, 90, 19, 90, 61, -54, 92, -55, 136, 153, 48, 218, 116, 256, 57, 100, -21, 140, -12, 184, 11, 242, -100, -80, -261, 202, -42, -157, -26, 5, 26, -120, -176, -119, -55, -164, 135, -67, -3, 163, -43, -62, -116, -32, 13, -50, -58, 95, -8, 43, -17, -234, -174, -157, 52, 74, 99, 121, -236, -74, 3, -204, -42, -10, -54, 13, -158, 141, -90, -195, 135, 249, -46, 112, -122, -68, -29, 133, 352, -41, 203, 18, 68, 236, 143, -79, -43, 17, -80, -34, 234, 76, 273, -4, -191, 50, -113, -26, 71, -30, 59, 271, -22, -86, -212, -1, 124, 43, 188, 34, 204, -38, -61, -151, -72, 17, -103, -165, 16, -237, 161, 40, -91, 100, -38, 140, -217, 12, 93, 165, 4, 37, -122, -27, -60, -61, 244, 45, -85, -115, 70, -71, -87, 4, -242, 143, -72, 83, 28, -49]
5871d9o0O8q4J08K8j68R1J39N9k97Q7q8L26n0k2j87p8Q7N7P8O3k98L58j73K4j37
5897a18J45J28k09K14l70J56J41l4M9j27r0N8j25J69j23J7J17j9J79k09J77p8
5919D8l1p2J36l00P5M84m67J06J8M2K5p9J00k6o7j4k80j4L42j96N5M66m37N47
5943D61o11r9K83j82K35K16k89O0j18Q2N4K41j43j42l0J57j42m9q7OL42q9k03
5966d7K63j40J05k10R9%j14N2R3n1n5m0J57j58P7j1k8r3L3L8j2N5M7j40n6K26
5992I0r7J26p8q5K23m71K63j4K84k45J46p9j78M14k33p7l5r7J42l5K23j43O1j63
6016e8J16j3l7J78j64J4n9k9p9J28J86k96N2K25k72L12k26n2J13j8j00Q5l4j21
6040a49J84j15j20J58J77j37J6l4r8L60j21K85k76JM9J1k18k9M8O1J55o4k09j28
$$ y = [-49, -109, -41, -125, -17, 11, -157, -66, 73, 132, -165, -78, -166, 160, 110, 88, -99, -177, -90, -33, 45, 108, -190, 168, -5, 19, -118, 27, 155, -54, 160, -210, -54, 87, 53, 102, -25, -115, -57, -182, -13, -136, -119, -2, -21, 158, -51, 126, 48, 17, -55, 81, -219, -144, 340, -127, -21, -3, 39, 64, -15, 85, 59, -8, -22, -302, -316, 26, -170, -115, 351, -86, 461, -150, -249, 34, -148, 87, 303, 14, 74, -44, 38, 92, 333, 190, 48, 18, 175, 33, -16, -103, -97, 245, 156, -47, 216, 76, 181, -29, 70, 70, -44, 8, 101, 50, -5, -45, 112, -46, 31, 20, -8, -101, -68, -30, -42, 13, 60, -80, -136, 90, -7, 119, 41, -44, 179, -292, -29, -43, 241, -4, 142, 63, -115, 299, 66, -11, -46, -143, -1, -36, 187, 44, 105, -58, 58, 45, 8, 186, 22, 36, -23, -52, -131, -3, 183, -113, -61, 164, -108, 204, -22, -74, 39, 21, -79, 6, -28, -149, 35, -80, -200, -42, 135, -2, 14, -20, -118, 242, 121, 406, 130, 131, 180, 191, -27, -56, -8, 53, 208, 144, -65, -193]
6064a93J72J15j56RL47l68J87j76j47J73K23k14k88K65J0q9P0K56j74m8j1K69
6086B32j13l03J62k6j38J25J41O7j67k37K29K28k03J08k48K02k51L06k11l7J78
6107D4k17k1P3J1m0J62Q4k45N6j64J58PJ17J34k73J39m2R6j03J08q3K06l31P9
6131d5J16j30j8J22m4N9J13j85n8K03m3j22K58j79j25J5J77q6q0J13n1n0L4j21
6155a27K18j25j81P8J65J7j83J61JL9j2j50lL04l18mQ8m7j76O5K34M3j4k23K66
6180A16l11L15l91K64RJ34k30J47j10o7J17j11J51q1j06J54p2J68j2j48K23j05
6202E4j02J21J31k70j60R7J01J51Kj15o6J63j99P6J30k83J77M3j6N6n2L9r1J14
6226A01j4J75l46Q6J17k86J0K26j53J87j80Q2k92J73l2J45m7P0n3j15pL7J38n0
$$ y = [-193, -21, 94, -62, -53, 294, -74, 113, -63, -210, -37, 186, -28, -316, -51, -41, -130, -60, 196, 22, -26, -37, 232, 119, -184, -22, -48, -186, -61, 80, 147, -20, -257, -28, 200, -3, 105, -143, 59, -192, 114, -97, -134, 44, -173, -194, -121, -110, -150, 12, 96, -149, -93, -257, -99, -92, 25, 159, -114, 25, -17, 79, -24, 84, 1, 207, -124, -45, 71, -59, -77, 45, 1, 60, 173, -12, -70, 133, 90, -32, 226, 47, -78, -63, 114, 28, -52, 61, 10, -40, -6, -127, 91, -34, -215, -137, 28, 45, -138, 23, 24, 63, 51, -99, -102, 202, -116, -120, -32, -79, -255, -190, 44, 87, 73, -150, 116, -195, 120, -271, -7, 2, 136, -94, 53, -57, -124, -7, -118, 33, -48, -154, 0, -72, 96, 84, -64, 159, 54, -48, 73, 204, -66, -226, -129, -28, 123, 125, 10, -56, 107, -92, -16, 114, -169, 8, 51, 35, 91, 39, 78, -13, 101, 87, 262, -84, 2, 119, -167, -157, 69, -84, 103, -77, 5, -287, -114, -146, -1, -48, 22, -31, -146, -153, -116, 22, -28]
6250b8q6J21q8K12j42Q5j4m5NK06j27q0K41l48R5K18k85j2Q5l2oqJ07k50K05P3
6276A02m5%m4R0l30J32K0L22k95L3J02k33L33j6j67p0Q9K41l55R5Q1l00L89m14
6300b40J32K15k51J85j30J30K6j60L99m10J17R7q2J0J74k07P4RJ15j69O9Pj23
6323a3K1J41j98J26k19J03Q6j77M35k3k75r0k4L48k92L64j16k48J50M1m1k06O
6346a01R8J09J0k00L9K09k18J45k80J25J63K7pq6p9M7m9k5l6p7K40j21P5Q0J83
6371B71j60j48Q2N1o1J29k6l5J83k79j98L09k20K09k8O9k83R0J43k62J04J08j51
6394a03N0J74q4J00l83K34J42j27q5J40r1j30N8K01k85J52m4P3J18k18r7K28j5
6417Hn1l2J2L07l04L78m71J36o5n9M9K28M5m03L68l44L18K48m79R9Nj18j7J51
$$ y = [-28, -114, 7, -81, 131, -11, 74, 60, 15, 20, 226, 99, 19, 260, -88, 7, 225, -60, -72, 13, -19, -25, -33, 74, -176, 29, 102, 57, 57, 13, 103, -227, -95, -75, 247, -48, -15, 87, -146, 187, 171, 4, -66, 23, 264, -91, 4, 85, -215, 174, -240, -108, 107, -144, 41, -89, 41, 67, -93, 306, -104, 13, 110, 28, 38, 212, 5, 79, 88, 203, 34, 103, 110, -13, 8, 149, -49, 77, -142, -39, 47, -130, 305, 282, 7, -83, -107, 241, -51, 313, 197, -51, 99, 140, 99, -107, -101, -3, 106, 116, -84, -45, 164, -54, 91, -189, -64, 99, 126, 119, 33, -46, 1, -48, -73, -109, -186, 54, -67, 8, 88, 271, 111, -37, 45, 96, 35, 164, 138, 103, 286, 7, -191, 118, -102, 107, 79, 148, -135, -45, 98, -164, -60, 48, -103, -53, 121, 37, 137, -246, -12, 130, 3, -82, 58, -33, -163, -105, 96, -189, -37, -81, -8, 110, -108, -205, 23, 8, -43, -75, -63, 244, -60, 318, -153, -17, -82, -141, -92, 136, 181, -222, 146, -198, 120, 368, -111, -12, -7, -125, -142, 9]
6441IN1j5%N2J%k37J36J61k43L94P9l29j65K29qO9j65r9l7K05J53m00K97j35j55
6467a52O6K70j79k25L13j2j21R7K13j27l20J41L7J12J90j67j25J25p2m7K17l04
6489g0J46k4j40J34k02LL0K85j45K86k50O1j27P9N2m33M12k11J17L04j98j72P3
6512A0k7J43J83l50J62j04j08J65R1lo3m7j07K36j03j4j17j44L21j14n0J23L4
6535A17jm42L12L6j05M1Qj91N15m22J16L9O1O2l6j30rL6j03P1r1q5J0M47j41l51
6561b36Q2P9j11L25j9k34J30j4J97j64j29L6J11nP8j58L8J03K8o0m8k00J78q4
6585g7j97J76J1j33K58k8%K00m13L28m24L64P9k39J04j20J3Q9j9j1k3mQ0j06K75
6610A83j55j60q1Q1L6K23q2R2L43l97j46Q1Qj05K5K38l06K76k45q4L42p9J06N5
$$ y = [9, 60, 45, 45, 97, 98, 98, -139, -3, 158, -85, 309, 388, 59, -106, 123, 115, 184, 19, -80, -117, 88, 241, -159, 138, 3, -152, -86, 184, 5, -220, 93, 81, -40, 57, 270, 143, -177, -36, 1, 113, 303, 136, 11, 136, 64, 17, 234, -70, 76, 52, -88, 46, -156, -153, -123, 162, 17, 303, 53, 114, -13, 66, 118, -315, 97, -114, 3, 307, 109, -63, 10, -17, 126, 309, -41, 121, 17, -91, 74, 165, 162, 99, 52, -55, 181, 78, 64, -53, -197, 124, 10, -40, 83, 117, 116, -326, -14, 22, -83, -42, -34, -225, 290, -132, -16, 23, 84, 146, 110, -20, -29, 7, -96, -25, -116, -201, -191, 256, 115, -236, -154, -75, -186, 139, 120, -114, 16, 2, 199, 35, -94, -58, 53, 48, 126, -32, 6, 109, 137, 77, 29, -171, 7, -77, -274, -98, -87, -220, 38, 10, 10, 210, -203, 125, -299, 65, 144, -95, 9, -111, -98, -9, -28, -39, -62, -66, 14, -92, 183, 28, -132, -213, -132, -96, 127, 45, 137, 480, 83, -63, 18, 26, -79, -54, 184, -122, 154, -91, -175, 167, 88, 194, 249]
6634B49k28l34L9L70k80K63k59J3J30Q9j24k67M73k6j8o6j0M2k21L52k64O0p2
6657h9J33j61J22L9J47j31k67oL13l6R7j31L4l14j6M19j59K00j26O5l43M8L63
6680B01j54L24l62k5Rn4K5K32n5l42J16j34K52p8K62j78L4K9n1k26L71l31J13
6703b2o4R5lN7j33r1K02J59k47m7q1J79J2L03n28K40m4r1K12J59j42j34k9Q8P6
6728A26j1N2k07M3q4k14L80o7P5mj0l2r3R2j38k73J57K34p9P0j9P3j83L96k97
6753a3k15K28l35L39j95l8J80J62m8m6j35P4k7J74K9j74q8J11o5R1K42k20J03
6776A34j16Qj6J76k47Q7M0j33k6j0R1l05M28l2o0K1j59L13l02Rr8L88m39K27j31
6801a52M9K05J88l56K6k73J67L12j67K8j78K02j96K35k15J50R9j06k24J76OK01
$$ y = [249, 21, -313, -274, 96, -184, 79, -180, -167, -37, 52, -72, -339, 134, 108, 90, 24, 14, 56, -165, 187, -77, -17, -89, 44, -117, 5, 44, 191, 60, -207, -213, 100, 64, 161, 30, 64, -250, -266, 153, -6, 194, 68, 133, -210, -162, 201, 47, 371, 9, -16, -7, -61, -36, 196, 141, -201, -85, -219, 33, -45, 217, 39, 73, 102, 51, -175, 196, -135, -22, -86, 9, 6, 63, -70, -161, 41, 200, -47, -94, -175, 4, 16, 319, -209, 31, -13, -104, 108, 267, 125, -9, -38, 50, 126, 115, 167, -40, 3, -81, -295, 85, 18, 93, 89, 79, 47, -46, 46, -92, -365, -208, 26, -53, 17, -2, 71, -112, 284, -13, -228, 0, -335, 4, -191, -229, -49, 113, 65, 19, -116, -42, -69, 105, 134, -40, -128, -17, -82, 9, 251, 31, 134, 18, 26, 10, 186, -61, 26, 66, -67, -93, -103, -12, -317, 111, 79, 19, 40, -119, 194, -108, -99, -197, 191, -248, -21, -152, -103, 102, 290, -66, -40, -313, -146, 166, -1, 27, -151, 51, -145, 90, -125, 25, 124, 18, -206, -30, -24, 177]
6823A77rj40L3n5J51k91K33Q6m77L29K2k7l46J44J61J17J16n7l41K05P6j54K22
6846A75k97N9NJ48j06O3L04m40n7J50J86k97O6J47j92L83k58M2o6N2o1N3l9l38
6870c18K27N8J77n3j36l5rO7Qp3L74m9l57L28j97r2J13j41J90O4l44o1N63k30
6894G4j41K29q5o9P1p2Q2m4P4k8m0j42N3Q8L4Q5m75L11K19n6r8Q1j69oJ31l04
6920a97L39j20N7j41J36k43N6K19K15k05j29o0O3J23j58J85j59p2k8k3J26L5p0
6943e1k0J53k74J03Q1J23l69K04J91m01P0J96k0K02l87K14k97M90j55q4L4J7P4
6966I4j93J70m0J72K0j32j48j8J89j47r8j82K85K5m6L30k64j8n5K38j2j38K33
6989B65k46j9L8O3j2rk00L40k11j06j17J86L4j26J28k22K05M3O4j80J21K4O3k62
$$ y = [177, 168, 28, 61, 6, 157, -134, 99, 185, -292, 37, 59, 32, -314, -170, -9, 108, 224, 167, -174, 31, 107, -47, 175, -122, -63, -58, 90, -16, 47, 351, -89, -146, 4, 190, -107, -41, 106, -86, 297, 39, 81, 15, 67, 6, 59, 20, -318, -91, -33, 144, 91, -45, -80, -89, -22, -14, -87, 287, 238, -119, 209, 12, -80, 33, -108, 82, 146, -198, -259, 304, 74, -67, 162, 77, 8, 79, 7, 89, 45, 119, 91, 51, -91, -38, 50, 84, 169, -306, 5, 224, 168, 70, 151, -18, -24, 107, -197, 142, 22, 79, -62, 74, -169, -113, 106, 321, 116, -13, -73, -10, 113, -45, 140, -19, -91, -119, -142, -16, 19, -51, -71, 82, -192, -89, -8, 115, -254, -50, 141, -260, -190, 6, -14, 188, -199, 15, -282, 208, 53, -31, 3, 20, 94, -99, 71, 31, 203, 223, 91, -57, -75, 114, -33, -131, -313, -28, -3, -49, 281, 17, -1, -56, 182, 170, 32, 265, 19, 0, 38, 101, 89, 80, -120, 220, 9, -97, -214, -28, 6, -120, 8, -214, -9, 34, 98, -82, 39, 63, 126, -136]
7013a36L2P8R1m9J20j90j05J03K75m8j27j48K20l5p5j1m2q1J10M1l6k5p1j10J15
7038a04O4K9N7J54q0j38j05K41j56O2J73m04K72n5K2j28L18P9k68m6J13q2j70
7061a52K81j52K5J40J77k02J06q8kj99L17l60L89k53L9k9k2J95m49L53k83J01
7083f8J56o5k28L5K03j28L1J00j49J23q6L28k46k93L18kj50K58l11L06k11Q6J
7106Hmk76L93j10Q1j01J29N9k85K24R1k09j92J59R5j83K41k31J20m7j12K61j71
7129f0jj3K03p4k06K40j97J59j60J70L3q5j86J08J16j68K61JJ98k65L7l42L59
7152A28m45K55J08K35l37L43j49k27K04k29j6K58k02K11j45j29O1K7J2l5J42l00
7174b30K82j35Q3r8j0l0J10j00J02k03L97j62K4r4J54p7J1P9k16L9L14k13N1K0
$$ y = [-136, -104, -26, 65, 16, 136, -54, -159, -56, 219, 171, 44, -104, 116, 81, 6, -5, -47, -128, -18, 23, -13, -38, -109, -219, -104, -40, -11, 46, 200, 120, -18, -123, 118, -38, 24, 197, -207, 65, 10, 32, -96, 222, 301, 33, -13, 100, 18, -152, 129, -23, 2, 142, 319, 117, 223, 135, 133, -66, 251, -109, 280, 27, 66, 37, 15, 210, -239, 114, -169, -68, 88, 23, -205, -170, 33, -95, -64, 36, -113, 10, -76, 252, 6, -287, 31, 29, -121, 137, -174, 132, -79, 7, 8, 4, -272, 121, 11, 92, -9, 120, 179, -106, 118, 209, 0, -192, -33, 62, -121, 120, -111, 9, -38, -150, 111, -60, -61, -74, 129, 55, -151, 89, -108, 51, -109, 61, 94, 9, -177, -69, 47, -121, 140, 141, 339, 74, 111, -231, 128, -317, -62, 46, 281, -56, 287, 138, -89, 115, -114, -130, 128, -74, 137, -8, -137, -76, -49, -37, -72, 70, -230, 52, -83, 0, -98, -108, -138, -28, -128, -26, -229, 168, 6, 30, -64, 90, 13, 24, 103, -113, -74, 240, 27, 78, 98]
7198I8rm1j02j3k53J69J91K6k12J87m22M05k16K50l43M63jj89Pl5k80M17J3j59
7222d9K0O4K96l86L54k60o1j96J45J57j58L27k94M3p0K7J75k60J86R7p9o8J62
7245A72j73k15K26j58J51j6n1p9L19p1L4k82L85n0j00j65R3j56oJ37j0L78j94
7268A69k41J42q1Q0M2l85J91K82K6n02P4J25J02J58k33L34k34q5j14P8j0K4j59
7291b17K58M3j15j99J80K8O1o8j81J11k1L39m85J69J41k60J61J30l67J64L93l80
7313a15J42J73j10k20QK66j17J79l75M54k73R0o7q6M5M3j5J46j64K11j60j85L01
7336A71r6l4J67j50j20L9K19p5l52N7L30L4k64J21p9r2R0nj2k78M37j1j17J19
7360I9k62M00j85j08P4j44J61k37J07P9J30k34K22q7j3K65l52Q4J96k3j90j64
$$ y = [98, 89, 48, -54, -67, -320, -151, 40, 66, -146, 41, -381, 24, -192, 58, -285, 178, 177, -12, -5, -40, -320, 97, 110, -49, -29, 35, 331, -55, 299, 39, -22, -218, -73, 84, -74, 253, -41, 2, -68, -41, 134, -126, 60, 157, 78, 10, 172, -1, -216, 10, -148, 3, -13, -64, -143, 176, 105, 139, -143, 242, 192, 92, -73, 20, -136, -142, -5, -15, 363, 169, -72, 70, -11, 69, 111, -274, -83, 199, 225, -277, -203, -78, 24, 182, -51, 283, 49, -36, -150, -72, -82, -58, -217, 41, 84, -31, -230, -50, -22, 39, -29, -210, -99, -120, 219, -266, -97, 44, -216, -55, 75, -292, -128, 265, -115, 27, 200, 90, -130, -122, 144, 27, 206, -169, 285, 12, 102, 35, -51, -6, 37, 22, 168, 4, 215, 55, -130, 171, 75, 41, 208, 58, -62, -23, 196, 121, -231, -174, 156, 190, -74, 47, -32, -124, -34, -39, -51, -329, 108, 97, -20, 99, -163, 237, 52, -56, 18, -126, 35, -202, -95, -16, 114, -120, 102, 15, 2, 267, -85, -1, 195, 172, -18, -182]
7382a82K49M9k34K17k06N8M2j73O3J17n1J25K9%n2k42QL05mj18J17r5n8K34j72
7407B6r7k0j9J98K90m53J27j20J06k0L6j76R1O7qj23QJ26j20KJ87%j54J36M9l37
7433a98K20J26m9J76n07M32k36O5k63L36j03J03j21K4J51k10n7J56O8k37J05L4
7455A5N1j33K40n2m2O7j43o0M0O5m09N29l1j34l37K94j01P5L7J07K10k16J00l90
7479b18N09j76j00J8Q8n1k49N0NJ10J85k16P0k97K13K10m3j62k8P8j43J94k9J16
7503A34l5k20K85j94J55lq4KJ89m32K8J87k26K89K78l12P1o4J15j32j36L90m38
7526a53l8L19k13q9K61j66J44OL0j20P0r2J8l9L3r4J03N5o5j65Q6P4r2L5O7j6
7552d1K40p0p4q6J70J02j03k84J49J01j61O9nj84K39p8l0o2M7J96q9j8j58r3P3
$$ y = [-182, 67, 116, -118, 99, -107, -49, -7, -180, -117, 0, -51, 74, 103, 103, 51, -191, -183, 122, 118, 0, 117, 22, -36, 198, 26, -71, -91, -110, 88, 378, -75, 52, -68, 38, 18, 54, -122, -31, 36, 28, -95, -87, 39, -81, -79, 108, 108, -46, 90, 139, -198, 22, 148, 99, 275, -232, 200, -36, 29, -234, 102, -1, 102, -19, 5, 156, -54, -111, 45, 113, -124, -19, 15, 66, -67, 173, 121, 79, 146, 3, -57, -17, 48, -361, 168, 137, 3, -334, -40, -141, -66, -29, 78, 288, 72, 172, -218, 291, 115, 15, 33, 121, 70, -179, -129, -124, -14, 171, -45, 25, -272, -59, 151, 108, -54, -82, -4, -147, 47, 18, 134, 99, -121, 164, -30, 125, 122, 38, 40, 229, -203, -175, 12, -214, 75, 353, 41, 112, 48, 163, 31, -105, 285, -153, -191, 128, -85, -174, 87, -79, 65, 71, 101, -19, 51, -41, -23, -62, -29, -123, -20, 35, -30, -195, -109, -35, -127, -92, -25, -41, 199, 129, 55, -31, 139, 241, 138, -146, 3, 104, -57, 12, 7, -177, 62, -16, -46, -108, -61, 135, 46, 28, -130, -223, -150]
7577a50P2r7L83k51Q5k44J37J27l1M8k31j2j49K29L4K2rJ91L9k15N1J13kj43j73
7602a76K52r4P0k32J97n7L3k4roK1j61K9J22J5N7n2rk65J68K48k12l8R5r6L7o1
7629a48k2K12j74K16M6j37J04j17p9j2J44L8k48J74K7o8J78j41k30J69J13M0p3
7652A2q3K0jr6M27l25rO8J55k34Q3Jp5N8R5j14j08K48l09J73Q1K98m63J32o1j6
7678d3k5M5J44Q2k08J87k43j78L00mk04J62K07k75J24q5L7J97l38K19R9j9l2J1
7702A60m20J57M14m72K88j06pp0J98k58L9Q3J54l38K71k28K57j45L6j96J88K59
7724B64m25L64j80J0K98l06L3j16L15j79r5j54j22L06j63j37L68k15p8O2J48j91
7746a93L2K3J72J21j22k9k18J97J1J07j52M63k90j44N5K28k11k02K25m5j45J96
$$ y = [-150, -78, -175, 208, -43, 42, -202, -65, 62, 31, 79, -152, -164, -313, -84, -50, -28, -37, 154, 193, -22, 29, 142, 140, -3, -176, 76, -18, 52, -180, 17, -40, -7, -31, -40, -46, -25, -186, -157, -35, -20, 37, -15, -24, -289, -121, 127, -85, -123, -28, -124, -87, -148, -170, 42, -132, 84, 130, -7, 97, -20, -99, -111, 33, 71, -177, -3, 24, -44, 134, -7, -237, -68, 45, 85, 12, -71, -51, -52, -148, 279, -46, -55, 13, 168, -66, 17, 18, -57, 1, 96, -18, -126, 122, -187, -14, 67, 365, -98, 34, -27, -43, -68, -23, 121, 203, -5, 182, -61, -239, 61, 57, -147, 15, 222, -53, 71, -14, 23, 220, -118, 101, 200, 181, 149, 160, -260, -103, 311, -161, 127, 21, 14, -56, 142, -116, -77, 6, 160, -178, 93, -135, 122, -23, 13, -183, 5, 264, -161, 203, 23, 33, 331, 25, 58, -58, 257, 78, -17, -171, -293, 13, -150, -287, 81, -134, -212, -150, -2, -193, -161, -138, 34, 155, 33, 4, -214, -17, -6, 101, -51, 412, 122, -22, 33, 261, 50, -152, 73, 28, -117, 79]
7768G9r9q6L12l75K58j53l5R2N2M3j20rJ29J13m77M66l45K86m6k04R4l70L03P0
7792b2J20m3j56K37%Lj82m7Q3j3K8n4k56L75j40l5K04kk47J06j66J90Q4m4J08
7817A31j56j92M0P7o4M44j67p6p2j17K32Mr3J24n6l42L76j19j31J78r6R0p3O8
7841A0J67m1j60O1j94L69j91J03j00O6k15J47j1k27L7o4M92l48J31J93p1j14j77
7864a37K24k15J71k2J38j31m8J29j78mJ28Q6j83k45K78n4m8J31L6J90l46K48J06
7887B54j53j34mR4jj81K67o6j38J07l0Pj50J92o9J51j93K8L0P4j03P7j6P6m0k9
7913E0J78L7k37j75J60l5M1J35q3p4N5nJ2M1K33m03o9P1o9K11j17K24j91P0L6
7938I6k75K30k35L38l47K42k93K48j38J90J67n1J7j56r8J8J74lj66N3J1J21l67
$$ y = [79, -20, -106, 206, -169, 89, -64, -99, -7, 45, 88, -32, -41, 88, 201, -276, 190, -155, 131, 85, -119, -25, -395, -92, -22, 98, 55, -101, 136, 136, 139, -43, -90, -7, -20, 8, -46, -302, 73, -67, -102, 102, 100, -147, -41, -207, -17, 67, 23, 131, -25, -217, -177, -100, -164, 280, 113, 37, -35, -152, 80, 84, -9, 115, 59, -283, 93, -26, -157, 21, -75, 15, -58, 10, 177, 136, -24, 37, -157, 212, 21, 124, 24, 90, -125, 22, 11, -216, -179, -243, 249, -99, 32, 225, 154, 40, -137, 87, -128, 43, 21, 159, 28, -20, 109, -69, -73, 55, 141, -42, -287, -9, -63, -111, 20, 56, 246, -100, 148, 254, 101, -33, -37, 57, 56, -125, 142, 76, -62, 45, 15, 22, -128, 64, -5, 146, -47, -19, 11, 85, -18, 59, 43, 119, 79, 50, 228, 265, 28, -147, 13, -22, 19, 154, 71, -3, 52, 47, 59, 100, 333, -70, -139, -68, -137, 74, -43, 181, -10, 60, 96, -179, 51, -184, 154, -193, 49, -244, 4, -134, 56, 223, 172, 189, 33, -65, -47, 127, 124, -42, 11, 22, 143, -224]
7961b24M36j38j19J9%K17L8r4r6l2L1j58J84m2R1K20j37j16j11K44l46M0J33J
7985D1J57k27J52j37l8n4k5K94l41K13k20J75K14j90j31L57n1k03J25k05j0P1
8007c3p4J81Nn5l3r1Q1J31j37K78k89J40J37k60Q5j00q3J86p2J81k71j2K8J24
8031D7k13L54k34J66k34J71l82L39L6l2P3m28M43m55L26Q1l14J27L0pK89k3l1
8054A29k42K50j2j75j14J52K12j52P9k03K95k20m9M3K21k41o4J90j74m5j47J64
8076a03L56o11K56J28J00l10L76p5j34m6J00q1Jj56J35k0Kk4J12J18l70J87J45
8099H6Q2j68j37m3K04J35n5J42k93K78Lk79p2Q1J58n0o9pp8q4J82j33K20l3l2
8124C8j16J80o1J67l51K01M8r8o0j37K60k25r8K61L3l52K32L5O4K32k76L6k46
$$ y = [-224, 212, 74, -45, -26, -26, 191, 229, 135, 39, 7, 38, -120, 64, 22, 113, 333, 196, 80, -31, 213, -133, -93, 40, 41, 198, -29, 123, -14, -52, -106, -131, 163, -178, 35, -185, -10, 204, 14, -117, 240, 189, -14, 111, -94, -104, -33, -107, 74, 79, 24, -9, -100, -19, 112, -25, 253, -36, 104, 241, -19, 66, -34, -117, 69, -3, 178, -93, -105, -77, 47, -166, 188, -46, 120, -114, 57, -325, 14, 50, 18, 91, -337, 106, -349, -23, 58, -256, -129, -99, -106, 183, 160, 129, -113, 137, 125, -50, -164, -12, 200, 48, 127, -76, 219, -1, -50, -7, 214, -27, -91, 99, -75, -120, -267, -103, 253, -358, -102, 26, 126, -184, 192, 117, -17, -63, 37, -44, -43, -199, -64, -84, -82, -106, 6, 124, -246, -59, 86, 168, 0, -137, -180, 24, 159, 104, 246, -47, 231, 234, -45, -117, -36, 122, 72, 3, -4, -82, -166, 16, -117, 103, 70, 38, -78, 102, 41, 208, -143, 58, 106, 8, -52, -189, 71, -154, -252, 9, 42, -310, -78, -43, 21, 253, -23, 13, -233]
8147b33p6L91Kk9p6j6MJ18R5j46j54K38k56J2Q1l6J68J40j99%k8r9J04n9L6Q4
8173F6l4pK05j10k21JN9p4o6L4J31J30lQl06R3n4K89
$$ y = [-233, -309, 82, 84, 55, -21, -37, -33, 85, 180, 34, -120, 118, -138, -126, -45, -81, 87, 227, 28, 28, 0, -99, 5, -54, -18, 66, 32, 25, 230, 120, -101, -100, -41, -115, -181, -147, -16, 114, 111, 119, -187, -94, -148, 141]
8191A41
$$ Imaginary data points
##PAGE= N=2
##DATA TABLE= (X++(I..I)), XYDATA
0@%%%%%%%%%%%%Qj6J6j6J6k4L2l2M0n0N8p2Q5r5J11j31J50j72J96k22K52k84L22
35A72l64M08m56N10n70O33p02P80q64R54j054J163j282J412j557J716j889K083
53A093k300K540k812L123l478L893m385M973n697O611p804R438j1814J5608k2604
68a3615L9656j56983k34151K04177K1733R8984K55922k6330j68378P3419p0715
79B3719j69766Q5588M9603r0259J67137J55302j04074j7795q590k29287m2806
90a81228J68206K0428O2084J58888j09965j72915J8664o8372p8446J53024O9930
101D0298n6633J04899M7139j39427k3017k1895j64009K4358J75272L7232P0864
112I5081R5544j45476j51676K7398l6159j0242J58690M7088n2728P3828k338j28274
$$ y = [0, 0, 0, 0, 0, 0, 0, 0, 0, 0, 0, 0, 0, 8, -8, 8, -8, 8, -16, 16, -16, 24, -26, 32, -40, 45, -50, 61, -70, 80, -92, 104, -118, 134, -150, 172, -192, 216, -240, 270, -300, 333, -369, 411, -453, 501, -553, 610, -672, 740, -817, 899, -990, 1093, -1207, 1333, -1479, 1644, -1834, 2059, -2326, 2647, -3050, 3561, -4243, 5195, -6619, 8989, -13615, 26041, -130942, -365093, -160916, -139183, -40199, 215723, 189393, 21015, 94434, 23719, -146047, -60459, -10856, -101115, 66022, 221324, 117250, 99455, 90865, -138422, -181228, -13022, 7406, 69490, 228378, 118413, -54502, -35838, -104210, -182656, -29632, 40298, -16335, 88564, 135703, -3724, -26741, -48636, -212645, -188287, -13015, 24217, 95081, 190625, 45149, -106527, -79129, -115288, -125530, 33160, 80248, 27520, 101348, 99010, -29264]
124b9264j255M37q7208P5582J40522n478K1099K5684j48349j03234M2301q894
136g8057L4512J48114K2037o3127J3767n8004j09549K5478K6641l0827Q4656R2258
148A07899k5436K437j0232j29285o0056N5724K0427O0629J12403j7232p4749j1755
160C0774n8877o3486N1533L9489j343P4506M4379n5143k3836l0513r4596r198
172i6311P0814K7032N2006O7405m5476p5250k1144n1150k5828P2221M7932P851
184C0102M4070n171p0880k3634j7448m5500L2129P4860K7511L6713K3734o9205
196C7281p3666j8086k2416J8726Q6310M7221N799J6119l4206p2747k4457j3028
208d7150j4921M8169O3765J5194J2303p324o7273n0928k725k131K9403O3778K0370
$$ y = [-29264, -30519, -30082, -117290, -41708, 98814, 93336, 114435, 140119, -8230, -111464, -69163, -78057, -43545, 104569, 126606, 63479, 77246, 19242, -90307, -64829, -38188, -69015, 15641, 107899, 82463, 84900, 74668, -54617, -114673, -58949, -38522, 22107, 134510, 117278, 42529, 30774, -28103, -91589, -40056, -567, -1910, 72596, 116975, 61832, 37996, 7483, -87113, -96311, -25497, 1535, 53541, 120946, 75470, 220, -20924, -72074, -97902, -25681, 22251, 30102, 74172, 69001, -1879, -25513, -42961, -88461, -56332, 18528, 46039, 82752, 106486, 37281, -36385, -54471, -76887, -58161, 28149, 75370, 81169, 97288, 63082, -9665, -34122, -47150, -62071, -13902, 49863, 65057, 77360, 70036, 2763, -48165, -50890, -53021, -23618, 40160, 60530]
221F0530j5117j2600m4516n0421L666K0127K0116N0644L4980j5946k2189l3639
233d365n7537k1388K6609L2721M9850N3478J056l4670l7398n0820l4082J7051
245e9495L5199L6604M7051J8678k4702l1838l6978l8819q90L1825L2436L4279
257D3350K1816j9377l8518l1952k7289k874L3020L8223K6574J5734j5070m1893
269A744l5803k2110m130K8497M4927L3690J6130p975l7765m3924k7117n911K0326
282c9421M2304L8275J7354n000k9692m0987k8869p288J6159L5156L6904J8380
294E3275n120k5662l7406k9842o934J6486L3767L5671K0559m406k6211l7881l1076
307d4780r899J4522L2315L6289K2931j421k3835l5375l2265j2903J1080L0104
$$ y = [60530, 45413, 32813, -11703, -62124, -58458, -38331, -18215, 32429, 67409, 51463, 29274, -4365, -61902, -83290, -56681, -23960, 25890, 79368, 80424, 45754, 8356, -42464, -76546, -59495, -24296, 12308, 59359, 78037, 53335, 21497, -15481, -54300, -55190, -23365, 9071, 43350, 65166, 45789, 7271, -24681, -51970, -54844, -21824, 16399, 42973, 58707, 43637, 1744, -34059, -56169, -60299, -31802, 13125, 46815, 62945, 54970, 17205, -26719, -53836, -59747, -39421, 2883, 41158, 58512, 53512, 23820, -17167, -46036, -53324, -37165, -2009, 34895, 53275, 48155, 22493, -14913, -44755, -51689, -35203, -1436, 34235, 54794, 50388, 24177, -13704, -44780, -54679, -40157, -7842, 28447, 51378, 49957, 26122, -9253, -41518, -54421, -43341, -13237]
319a3237L5174K3996J544k0855l3411l1269j3980R897K7958L4080K4635L195k0095
332B7632l3056l1144j6602P330K7343L4344K5695O482j6300l1200l1321j7766
344d8563L895K4047L2110K5768R000j3740k8573k8970j7276J599K1876L0819K3056
357C5048O958j3009k9809l0024j6563J898K1526L3110K4662P928j0279k9537l3867
370c1958j9658j080J7559L4354L1158J1754o492k3291l4322k3186k754J2375K6597
383h944L0536J2470m852j6232k7676k2910j708J1796K0172K7788J4008r418j8590
396F440k4353k5066j576J9386K3057K5771J7048j1180k4560k3764k4981q871J8142
409c4507K3973K3443K5087J011k3799k4389k5050j8612J2199K9035K1750K1153
$$ y = [-13237, 21937, 45933, 47477, 26622, -6789, -38058, -52038, -42141, -14183, 19897, 44532, 47727, 27632, -5424, -36568, -53170, -45840, -18497, 15847, 41542, 48024, 31724, 524, -30797, -48563, -44668, -20621, 11489, 37257, 46257, 32517, 3944, -25026, -42302, -40703, -18827, 11992, 35048, 42006, 28997, -812, -30836, -47399, -45501, -23975, 9135, 33797, 41725, 31446, 1909, -31958, -51616, -52696, -35137, -783, 30375, 42129, 35637, 12346, -21976, -45162, -47916, -35541, -8944, 21592, 34062, 29210, 12978, -14698, -37608, -39316, -27520, -7348, 20440, 34448, 25030, 6440, -17913, -42979, -44555, -25169, -2112, 23659, 40707, 29527, 4967, -18797, -43778, -52649, -34507, -10534, 12909, 37996, 39007, 15208, -9181, -34231, -52843, -40644, -11609, 10141, 31294]
421C1294P317k1648k4520j4130j3814L998K6391J8149J0991R760j3939k9307j4605
434b4063j0129k968K6331K9330R760N117j1637l6546k4322k760J189K1213L3781
447A4296J0846j929k000k4425k8862n015j909N390L3468K7033R14k543j8195l6502
461b9433j1013J2449R521K4405K7639m759j2287o261k3692j7698J1970R728J0156
474G25K9759J0426j5861r767j9966l1225K248K2571J3734K4789J6985k1703k5126
487b411j0569j9907k705K5246J0772N586K0441k143k2391j0187j7935k1595J6968
500c0830L0918J4643J8383K904l3496k4278l636r735J0465L1494Q986K146J2456
513C0420j3263k5853l446q917j0304K4475K5057M337J0401m894l6205j8226M342
$$ y = [31294, 38611, 16963, -7557, -21687, -35501, -31503, -5112, 13037, 24028, 33788, 19849, -9458, -24063, -34192, -37160, -10829, 18501, 28261, 33378, 21741, -14805, -39127, -41887, -40698, -19485, 14296, 25142, 23213, 21213, -3212, -32074, -37089, -38998, -33608, -140, 26893, 27807, 25264, 7069, -29433, -40446, -27997, -18476, 5929, 33568, 28809, 16522, 10261, -13431, -31129, -19159, -9431, 725, 30484, 40910, 25049, 15282, -4684, -35909, -33661, -11090, 2644, 27433, 44418, 22715, -2411, -12980, -32887, -35592, -10346, 426, 6012, 26453, 24310, 1919, -8268, -26203, -47798, -30830, 88, 14731, 33114, 36018, 2522, -21756, -25392, -35127, -24662, 6832, 15818, 17964, 30420, 17157, -8696, -12142, -21059, -31363, -6888, 18169, 22506, 32907, 28013, -8192, -26418, -22076]
526b2076r5K0974L2122k875j3278k160k0517j7813R915P33j195K6481J8653m359
540B4510k24j7725l8739r243J5510J1320K7545K5314j2323j7259o038k1183j1556
553c0091J5078M888L843K3774P046j3175l003j4862k6494L872J8045Q630K2098
566A9649J3886k2624k1694q418j5064N524K8799Q939J038J2172q313j8570k040
579f716j2595j7641J4522K3400J1267J9300K166l1468k1154m042o814J3381K7889
592A1495M115k185O101j4204j8113J345n061m974J9983J6129J6O476p647k9440
606a5964j2716K499J642K0601K7457j200j0588p660k2391j3635J0594M734L312
619a3315J9991R440m346J899j1909k7198n923Q864Q210K3360J9610j0277j4156
$$ y = [-22076, -22171, -1197, 30925, 28050, 14772, 12612, -7905, -25718, -15803, -15070, -16265, 10216, 28869, 24510, 24286, 6561, -32178, -41421, -25911, -14591, 12954, 38268, 25945, 8686, 2648, -18535, -30091, -15013, -10125, -6282, 17492, 24538, 11363, 8360, -6502, -32996, -29124, -11079, -2449, 19649, 33535, 10911, -10783, -19201, -34265, -28741, 58, 8997, 10035, 22207, 13894, -4676, -6716, -19311, -36952, -22430, 970, 12237, 31537, 33703, 2235, -18919, -22961, -29775, -16394, 11495, 15610, 13425, 19526, 5322, -12791, -11446, -16507, -21481, -1498, 14631, 14647, 21123, 13476, -15964, -28680, -26181, -24539, -3938, 23519, 22319, 11731, 4071, -18320, -31955, -21361, -16627, -13315, 6676, 16116, 11770, 13669, 1760, -25438, -31361, -22497, -14287, 9073, 28683, 18406, 4250]
632D250q270j7076m439J5680P340N505J5395k73j2883m298j1249j5172O273J4103
646e114Q092J6374Q287j6727j6118r974j2647M863K1612J1266M435N514j1258
659H605j6563l753n584n630J2100J4041P282J0019j279k0667j5262n923k485J3272
673a1827K2002P937m19j617j4994j5205k121p34L019J5800J2183J724J185p912
687I021j8147q696N93K720J4050J6678K054n616q001j5130r534N606P651Q649
701A898J2702L311o456o369j0855j2662r25P714J0059J5224J0400n491j1763j2738
715e951j2704l186R664J1260J0630R358j038r493r677r824o806M774J0611R156
729F774Q808K161r224j1417q274n426L944J2220J0197N565N12q781j2512p987
$$ y = [4250, -4020, -21096, -25535, -9855, -2515, 2990, 18385, 18112, 5229, 931, -10318, -25490, -19217, -5114, 2978, 19352, 27639, 10912, -5206, -15180, -27827, -22964, -1352, 9914, 14349, 19863, 8605, -7958, -11711, -17295, -22925, -10825, 3216, 10498, 20517, 19238, -1429, -16691, -22614, -25099, -11827, 10175, 18112, 17693, 16076, 1082, -14123, -16244, -16978, -13959, 1841, 14024, 15748, 16933, 9021, -9126, -17822, -17229, -14509, -459, 16219, 18273, 12657, 4656, -10474, -20008, -14402, -6751, 1898, 14600, 17911, 11455, 5086, -5769, -18431, -19356, -11642, -1583, 13641, 24041, 18550, 6787, -5951, -18655, -21841, -12177, -917, 9713, 19071, 18033, 8540, -1137, -10961, -17767, -12993, -2382, 6774, 15582, 17743, 8519, -2898, -11172, -16598, -12654, -434, 9763, 15328, 15840, 7059, -5453, -13440]
743a3440l214L439J0929J1719O739J734o276j3054j1194n365J766R952J3658Q456
757A5849J907n346j1569j1094n297J716O798J1394Q320K083l902r547j0363n328
771a4379J413O910J0749R148J531m814r327j0858n991J845P430J0754R554K559
785A6524m601r322j0930p378J72O624J0198J0114M639l216q872j0058p953r69
799a5028N810R885R349M798k321q126r714p624j415N399R155R065N029k000p844
814D418r493p532k552N169R429Q993N468j018p462r439p622k622M096R021Q840
829G694N355l12o603j0119p422k647L329Q296R883N538m23n873r793q549k904
844a4550K907Q029R874O396Q71n397r050q943l990K194O697R658O826J235m745
$$ y = [-13440, -16654, -13215, -2286, 9433, 16172, 17906, 11630, -1424, -12618, -17983, -16217, -6265, 7393, 15849, 17756, 12410, 841, -10253, -15550, -13834, -7036, 4358, 12678, 14761, 10859, 1312, -9051, -14379, -12966, -6056, 4693, 13841, 15372, 10558, 1231, -9627, -15618, -13773, -6343, 4411, 13965, 16524, 11923, 2601, -8329, -15707, -15535, -8911, 1287, 11401, 16040, 12824, 3952, -6106, -14059, -15028, -9218, 667, 10016, 14814, 12493, 4367, -5347, -12971, -14386, -8987, 168, 9233, 14262, 12262, 4418, -5075, -12607, -15159, -9990, -561, 8432, 13900, 12882, 5420, -4019, -11641, -14263, -10167, -1146, 7694, 13049, 12737, 6134, -3985, -11407, -14054, -10725, -2429, 7454, 12992, 12569, 6696, -3097, -11646, -14550, -11643, -3614, 6260, 12656, 13527, 8130, -920, -9863, -13853, -11659, -4962, 4696, 11522, 12757, 8012]
859H012p826q340m636J995O197P979P035J516m660p560q160m552J907O912Q466
874D285O948J782n049q571p872n479R27P116Q884P150L177l438q193q672n878
889a2883j046N928Q647P469L267j793p302p960m607j232M543Q084O500K097j334
904H378o608p779m729k33M358P782P073K870j957p047r249n603k39M293Q589Q829
920H728K916j982n552q568o694j841L255O328Q375N253l04m596p702p761k379
935a2524L580N659P304M968j208n253o051o110k041L681N796N967M662j01m923
950C406o335o195l724K456O573P647O113R73o613q184o005l117K837O814O095
965B741M345J437l427o360n585m591m08O033P579N747K644l434q502o486l192
$$ y = [8012, 186, -8154, -12790, -10795, -4598, 3381, 10416, 11932, 7272, -288, -8448, -13000, -11093, -4181, 4285, 11233, 13015, 7966, -605, -8477, -13956, -13029, -5913, 2971, 10121, 13298, 9860, 1667, -7005, -12883, -13929, -8001, 646, 8115, 11382, 9589, 2287, -5673, -10280, -11512, -6969, 1115, 7615, 9712, 8378, 1770, -6009, -10738, -10971, -6613, 1169, 8242, 11112, 9155, 2108, -7141, -12744, -12983, -8690, -101, 8728, 11644, 9662, 4110, -4458, -11152, -12993, -9738, -3410, 4965, 10218, 9914, 5318, -2384, -10145, -12524, -8944, -3285, 4019, 8987, 7779, 2526, -3525, -9635, -11676, -7995, -2199, 3768, 8430, 8329, 3406, -2929, -9124, -12848, -10392, -3819, 3828, 9941, 10914, 4301, -3883, -9888, -13005, -10168, -3354, 2741, 7086, 8523, 5096, -1264, -6849, -11440, -11848, -5815, 1764, 7511, 10155, 6721, -1781, -8267, -11459]
980a1459P33N723P755M294M95k151o147o232k458k53K804O758N504K257r27m837
996A859q497m963M42M301Q018P063K03l862n699n905k833J509L210L971N804L200
1012G821j123l910o936p098j238M769O805P499M002l288o031n733n177n83M604
1027e617M922M214L539p08m334l873m355l480K212M910N289N119J342n809p977
1042d606m733j698M362P866N035R84j320l880m805k980k199k87M065O874M758
1057G436K427l145p886o709k327J834N555P338K912p77k824n146m766r47J820
1072e205K693M730L444K49p38l895o375l653O24M058P201O742J52n136o644n686
1088g439j708L184M543L538L627J379j228l305m382n705j527L540N446O448L455
$$ y = [-11459, -10726, -5003, 2752, 7046, 7541, 5390, -757, -6989, -9447, -9700, -6896, -138, 5366, 7623, 6696, 1859, -6638, -11601, -11159, -6858, 1160, 8223, 8426, 4564, -1135, -7040, -9873, -8364, -5154, -1183, 4621, 7821, 6698, 2788, -4148, -11246, -12484, -7715, -910, 6589, 10591, 7303, 1272, -4461, -9638, -10221, -5617, -695, 3519, 7058, 6350, 2016, -1857, -6212, -9692, -7480, -2570, 2719, 7838, 9180, 3371, -4606, -9339, -11037, -6675, 1191, 6226, 7210, 5890, 2010, -2795, -5775, -7974, -8261, -4196, 2678, 7436, 9863, 6718, -1168, -7877, -10204, -8370, -2815, 4523, 7435, 6658, 3834, -1312, -6078, -7025, -5205, -2512, 2218, 5662, 5911, 5173, 1278, -5097, -8750, -8126, -4068, 3133, 9875, 10027, 4891, -1753, -7439, -9147, -5963, -1420, 2118, 5745, 7124, 5896, 2591, -1791, -7496, -9023, -5483, -37, 6411, 9866]
1103I866k598o287m989l309L31M287M800L072J443j733m249l399k598p29K041
1118d051M495L802L190L51m367o716m348j116L653P105N261J120k173m915m567
1133c276k143Q6Q99L456M135K899J224k455n674n373j866K173N197O160K292j252
1149F482l757m477m056m35K057L255M459K998l76k496l389m909j982Q36L252M912
1165B374M680L18l190n235m467j863K655M529L506K710l53k705l142l305k782
1180f270M96L512M420L973J813k614n658m314k536N63M189M972K816J053j712
1195D703m073m119j658n91K763M295L026J412p32l636m340k352k63K510M526L996
1211E467N15j537m107m320k199R97K324M189L532J152q04l158m537l531l61J837
$$ y = [9866, 7268, 981, -4008, -7317, -6986, -2699, 2101, 5173, 6616, 4883, 634, -2765, -5363, -6092, -4051, 444, 4246, 7436, 7787, 3420, -3296, -7644, -8760, -5107, 1998, 7259, 8379, 6206, 1291, -3276, -5419, -5333, -4434, -978, 3157, 6056, 7280, 4825, -849, -6222, -8088, -5915, -718, 5442, 7734, 6482, 2725, -1752, -5808, -6243, -4186, -931, 3528, 6526, 6150, 3654, 265, -4644, -6626, -5790, -2538, 2374, 7054, 7372, 4182, -1053, -5520, -7383, -4728, -199, 3307, 6017, 5664, 2959, -183, -3488, -6270, -5774, -2262, 2158, 6131, 7944, 5330, -328, -4642, -7178, -6615, -2426, 2546, 5362, 6415, 4703, 630, -3489, -5147, -5738, -2975, 1320, 4346, 5758, 5026, 1390, -2950, -5302, -5565, -3055, 1471, 5467, 5982, 4445, 338, -3982, -6181, -5184, -2860, 1329, 4861, 6013, 5209, 2051, -2486, -6017, -6378, -4541]
1227d541M575M551K074j033l195m235l443p60K254L384L882K044o64k586l639
1242a332k968j039J979L098L273K434m50k926l539l150j017J781L857L769K245
1257F015n66l323l659l153j346J408L645L371L062M51k504m148l311j511P45L289
1273a535L879K680K36k026l569l047j664Q29K771L535K282N80j860l558k981j791
1289e239Q50K798L420K739P79j949l478l276j825N65K464L764K940L67j078l345
1305D96l280k056J3K301L497K868J151j346k849l574k059J52K088L108L245R37
1321D692q81k834l556k068j15K192K894L316J318r95k589l104k490n65J781K978
1337b6L003J522l04k846k994k402q12J580L113L017J663l22k787k988k564p94
$$ y = [-4541, 34, 4585, 6659, 5626, 2431, -1804, -5247, -6007, -3753, -369, 3513, 5557, 4893, 2307, -1332, -4300, -5339, -3360, -262, 3011, 5445, 4995, 2069, -1470, -4620, -5637, -3856, 1, 3770, 6015, 5449, 2126, -1533, -4686, -6032, -4624, -979, 2392, 5454, 5905, 3401, -747, -4058, -5569, -4824, -1535, 2344, 5024, 5260, 3234, -335, -3382, -5046, -4217, -1446, 2089, 4371, 4951, 3091, -467, -3448, -5239, -4389, -1591, 1829, 4568, 5347, 3398, -80, -3356, -5181, -4616, -2152, 1612, 4552, 4919, 3841, 496, -2784, -4840, -4827, -2526, 971, 3839, 4990, 3644, 795, -2779, -4838, -4686, -2598, 510, 3755, 4692, 3811, 977, -2579, -4647, -4762, -2570, 324, 3640, 4958, 3963, 1374, -1730, -4220, -4785, -3004, -26, 2977, 4499, 4195, 1349, -1645, -4047, -4859, -3279, -166, 2851, 4514, 4192, 1405, -1583, -4147, -4941]
1353d941J615K964L218J519R6k513l145k451r55Q12K743L309J665J69j590l211
1369f96k750r18R76K300L334J687J36j928k764k714q53J084K087L026J818M41
1385D266j914l049k943j397R44K555L091K429N76k037k906k561j844L42K337L001
1401H90K457J044j322k698k461j741k51J913K712K331J094j075k533k257j769
1416c666K7K076K852J767O94r56k536k132j545o33J805L240K393J152q51k792
1432H95l372j713n0J664K901K364J051l91k059k965k025m02R33K538L011J129
1448C509k92j559k934k452Q8J049K081L253J215j062j708k155k415j6J413J527
1464d58K413J782j83j750j923k668j390J266K337K357K344l50k543k117j846j214
$$ y = [-4941, -3326, -362, 2856, 4375, 4471, 1958, -1187, -3638, -4593, -3781, -1038, 2271, 3936, 4105, 2515, -696, -3446, -4364, -3388, -1088, 2246, 3933, 4069, 2141, -623, -3337, -4190, -3106, -1019, 2007, 3825, 4266, 2352, -697, -3640, -5037, -4093, -1538, 1553, 3982, 4558, 2521, -385, -2946, -4790, -4448, -2111, 890, 3347, 4391, 3069, 371, -2090, -3831, -4082, -2169, 543, 2874, 3968, 2893, 360, -1897, -3666, -3639, -1563, 1289, 3056, 3750, 2794, 258, -1874, -3419, -4052, -2247, 993, 3386, 4538, 3687, 895, -2477, -4190, -4240, -2576, 325, 2689, 3740, 3349, 1290, -1675, -3700, -4102, -3169, -631, 2380, 3509, 3217, 1658, -1276, -3728, -3640, -2591, -510, 2743, 3958, 2896, 1188, -967, -3382, -3398, -1985, -458, 1955, 3737, 3554, 1804, -119, -2787, -4177, -2911, -574, 1783, 4127, 3777, 1234, -883, -2729, -3943]
1480c943J467K258J430J734O35j894j877j921j755N23K646J752K240P44j543k898
1496d02k125q58J11K311K613J274O71j178k641j869n55m55J433K479J482N51M87
1513C329k902l227r83L86J434L053K367n63j130j618k332p86L81M48J966L046
1529B869P15p12j101k813k449M20J233J852K914R34j150j543k344k213Q18J648
1545i22J092K029J183j158j251j019k373j060J267J808K347K198r15k638k025
1560a437k173n78K371K341Q62J156L53j953j696j028j706N15K376J483J982R09
1576C777j373k996j161j377N06K637K047M61O23j186k996r92P1j46J713K020K81
1593A909O78K07k686k391o93n03K051L493J665q16j258k052k205k1R39L07J627
$$ y = [-3943, -2476, -218, 1212, 2946, 3581, 1687, -190, -2111, -3866, -3343, -697, 1055, 3295, 4039, 2496, -402, -2527, -3385, -3274, -963, 1650, 2924, 3595, 2417, -224, -2093, -2648, -3103, -1670, 809, 2291, 2842, 3329, 427, -2800, -3783, -3397, -1963, 1090, 3457, 2894, 1764, 146, -2186, -2972, -2591, -2143, -177, 2869, 3584, 2872, 1771, -1042, -3491, -3071, -1838, 14, 2928, 3862, 2712, 1169, -1175, -3388, -2570, -922, 170, 2199, 3382, 2224, 973, -46, -2419, -3479, -2212, -404, 1943, 4141, 3226, 588, -1437, -3610, -4188, -1817, 524, 1386, 2542, 2895, 942, -754, -1782, -3488, -2973, -597, 886, 2868, 3777, 2404, -592, -1753, -3130, -2624, 13, 2060, 2521, 3144, 1958, -1038, -2030, -1959, -2105, -392, 1628, 1909, 2587, 2794, 108, -2283, -2976, -3479, -1428, 2065, 3730, 2914, 1656, -396, -2601, -2622, -1683, -1376, 251]
1610B51J957J48j35j012k721j925Q29J223J450K718M88j576j029j739k232J018
1626b287J734J074J874R06k027j126p05j852k27J423J151J323K236o73k256j681
1642a113j722q36K196K392O99R56l24k064j290m82j134L75K247J289J038J024
1658C251k021k496p49o57M91K398J710L38L99j069k850r42J76J1J715J995M89
1675B189l41O5k115j789l25L0J426K186J329j80j003k072k158L2J271R10J557
1692A012J512n54n57j190j978j004O85J226J521K093L70j534j390j730j316P60
1708b074J286J350J672M62j387j248j183j199K01J352J312Q29J047q28j367j563
1724a338r03m68J714J865J125O77q42j908j167q05l49J225J746J221M54J84j699
$$ y = [251, 2208, 2356, 2221, 1209, -1512, -3437, -2608, -1385, 65, 2783, 3271, 1695, 666, -1073, -3305, -2287, -553, 521, 2395, 3301, 1274, 148, -557, -2409, -2636, -1213, -62, 1261, 3497, 2824, 568, -1113, -2835, -3671, -1475, 917, 1616, 2572, 2248, 184, -1106, -1588, -2722, -2347, -100, 1189, 2227, 3251, 1230, -1266, -2015, -2672, -2181, 217, 1927, 2265, 2664, 1595, -1255, -2197, -2021, -2010, -295, 1700, 2189, 1848, 1913, -202, -1991, -2316, -2286, -860, 1326, 2655, 2475, 1472, -600, -2758, -2726, -1455, -545, 1012, 2524, 1970, 1413, 223, -1755, -2759, -2074, -848, 673, 2766, 3136, 1602, 212, -1518, -2834, -2074, -788, 562, 2234, 2696, 1309, 61, -1122, -2321, -2120, -768, 544, 1373, 2420, 1592, 225, -1338, -2241, -2709, -995, 870, 1995, 2672, 1830, -78, -1245, -2050, -2399, -1174, 572, 1793, 2247, 2431, 732]
1741G32j800j117l58J006J783J519L29r3j189j675r86l33Q85J348J430N76m22
1758A635q66j576j403J82N42J151J665J024l68r88j708j418mM45J546J767N71
1775B197m0j033j621j367n04P25J148J202J506k66j026j137j591o40Q46J138J199
1792G36J049K14j033j260j203p71M81J132J605J298Q7j145j145j303q92M79J127
1809e44J271J280N20r69j546j339o48K42R93J333J200J11n92j319j310o29j89
1826b135J016J533J205J68o01j194j235q44j05J044J212J479K08m56r39j268j163
1843b075n1R84J287J215P22o67q64j324q22p0P94J115J321L70o3j204j307j087
1861a726N9Q02Q25J269R26l52q33j237j380m00M29J506J030Q34K33j193j293q97
$$ y = [732, -1068, -2185, -2543, -1537, 246, 1765, 2094, 2001, 812, -863, -1849, -2182, -1297, 51, 1481, 2057, 1635, 769, -807, -2210, -2028, -1486, -335, 1330, 2354, 1986, 998, -710, -2128, -2132, -1687, -141, 1626, 2197, 2157, 1124, -497, -1864, -2368, -1643, -495, 707, 2213, 1947, 921, -216, -1807, -2447, -1601, -463, 736, 1785, 1999, 966, -294, -1497, -2268, -1787, -655, 950, 2248, 2335, 1190, 45, -1258, -2150, -1671, -544, 727, 2007, 2527, 1558, 12, -1327, -1975, -1733, -740, 593, 1793, 1904, 1312, -7, -1317, -1946, -2135, -1119, 414, 1619, 1787, 1186, -8, -1243, -2087, -2192, -1148, 64, 1543, 1751, 1295, 356, -912, -2075, -2126, -1142, 145, 1360, 2082, 1415, 551, -773, -1595, -1665, -871, 244, 1565, 1935, 1872, 668, -639, -1726, -1667, -865, -40, 1229, 2155, 1803, 970, -267, -1647, -2047, -1618, -112, 918, 1752, 1985, 792, -501, -1398]
1879a398m62K75J084J261J020r4q12j161j124m87O61J206R52N70J84r00j011q60
1897a096m41j52J333J236N00N89q01j460j251j48j43J715R61Q02L03m69j293j086
1915i01q51J75R68J083J110Pj28j171j133n41J92L95J555J101r4l60r76j240p62
1934a571M86M48J069R97K02m88q70j120j005M1P66P80J318P85o19r92j194p00
1952a667j86Q28J073P54O16q0j288n94o55n31M51J522Q27N31j47q17j087q05k88
1971a543M42J477Q61P59j96j103j024n14k92J3J041Q97M37L72j63j714p10n02
1989a462O2J122J417L89l51n25r52j090J1K6M30J624L95q0p3q27j669l5K02M61
2009i25J105J257j71m07n54j483n77O57P65N45J185k33n83k28r48q40L37M05Q23
$$ y = [-1398, -1860, -1585, -501, 760, 1780, 1686, 874, -287, -1411, -1898, -1237, -31, 921, 1491, 1675, 775, -236, -1096, -1537, -1689, -356, 880, 1380, 1969, 1168, -292, -1543, -1691, -1834, -119, 842, 1644, 1947, 1478, 185, -901, -1752, -1577, -609, 474, 1584, 1591, 1463, 292, -841, -1382, -1190, -795, 760, 1861, 1767, 1407, 431, -809, -1571, -1085, -637, 432, 1429, 1631, 1143, 273, -847, -1852, -1811, -1045, -265, 1053, 1838, 1219, 227, -967, -1667, -1853, -1025, 48, 802, 1418, 1338, 50, -544, -1199, -1730, -1279, 243, 1070, 1601, 1454, 637, -450, -1255, -1543, -1101, 376, 1237, 1996, 1800, 697, -327, -841, -1133, -1120, -79, 818, 1255, 1627, 1464, -250, -960, -1462, -1400, -278, 1139, 1528, 1177, 652, -300, -1390, -1379, -1353, -923, 701, 1096, 1016, 943, 116, -1553, -1588, -1386, -925, 180, 1437, 1266, 859, 305, -1178, -1755, -1098, -333, 212, 1397, 1164, 581, 353, -595, -1435, -1098, -693, 130]
2028A30R10P28r09o15r67r84K43J184N69Q06N12o65j094o05n22k34P03J067N10
2047G67R20m81q27r70l78o13L45J495N67Q41k36j464j198N3l5N36J176M08j72
2066G34L80m46j015o19k46j24R86J601R8P1r23j331m43L48k21Q58J068K32k68
2085G40K23q04j293M3J13L26J021R92l81j51o45j226n53O62O19R46R11m35n80
2104E28n75p91k66M82J60M16J017Q38r19p81q30p66K7J133P72R62j87o92o09o08
2124f89l12m21R45M83Q15O44m35j142l74k91m85P10P16P15L11K24j323q69k09
2143i87j18M68J391J69j36P2n12p35m34k72M1R66R94J95K39j102j168m58N28L34
2163e25N63Q97k79L13k11j301n58K18O7N60J018M79l68j31p49q74j26L92K79R40
$$ y = [130, 1040, 1768, 859, 244, -723, -1707, -1464, -280, 289, 1095, 1607, 942, -152, -757, -1279, -1513, -810, 257, 767, 1687, 1206, 379, -591, -969, -1582, -1237, 258, 825, 1666, 1430, -34, -1232, -1179, -1214, -678, 498, 906, 734, 1114, 668, -347, -966, -1212, -1336, -350, 1251, 1349, 1420, 497, -834, -1277, -929, -1150, -292, 776, 1008, 740, 963, 159, -1134, -1091, -978, -652, 369, 1361, 980, 829, 184, -1042, -1595, -933, -314, 632, 1543, 1108, 528, -47, -838, -1104, -622, -462, -46, 971, 1809, 890, 109, -721, -1487, -1460, -327, 445, 1407, 1220, 528, -81, -689, -1001, -1422, -477, 6, 821, 1465, 1030, -112, -486, -777, -1262, -552, 164, 879, 1190, 1414, 91, -778, -987, -1105, -637, 754, 923, 787, 859, 347, -388, -822, -1094, -1053, -87, 907, 1102, 1341, 239, -929, -1387, -859, -525, 38, 935, 656, 969, 758, -543, -1101, -883, -816, -256, 762, 1241, 873, 742, -7, -881, -1007, -615, -336, 604]
2183F04Q76n28m10q15o70j24M52P94J55N95K46o23m66n08j192N04J075P31L69
2202A065L02r89o29l92m69K78P54O47J55N27k40j157o81j57j23O52R09M22L7O0
2222I71q12j048m5j75O60Q16Q13j50J7j063p92j0J08K87N49R57j06m6o89j148
2242i06j71Q7K89Q63O22J83m05l66o51m41j8L91O02O24M21k45n06n36o28k97M74
2263f14O94O43K49k51m64p39l18k11M44P36N77P6K47o64p76m90L9J12N22O92L05
2284H09M48q55p04o52k71N42N94M27O27j19m33m91l19l86J02N21P10L12k00k12
2304D50n61n61k14J41O34L92N66k53Mo95o16MR8M64N51M08N4k35n06o24j79j57
2326h35O08N78L65O7o9o08n12o87K53L02Q37J92M57m27n55n45m63N8N48M18O64
$$ y = [604, 1480, 952, 542, -273, -943, -1067, -615, 179, 334, 929, 1175, 552, 86, -422, -1614, -1110, -35, 696, 1065, 1367, 378, -251, -643, -1112, -834, -80, 567, 722, 1249, 1009, -148, -829, -986, -1109, -457, 452, 874, 911, 971, 159, -889, -934, -1109, -449, 367, 1180, 1030, 1047, -16, -808, -818, -710, -423, 126, 1083, 977, 931, 242, -906, -1077, -990, -701, 162, 784, 967, 562, 196, -455, -896, -914, -523, 79, 703, 1124, 879, 373, -163, -791, -1088, -614, 80, 723, 972, 721, 257, -482, -800, -1011, -567, 169, 746, 822, 1069, 405, -371, -861, -822, -710, -188, 504, 809, 1257, 402, -302, -954, -1225, -683, -89, 338, 965, 846, 413, -78, -397, -783, -681, -160, 550, 862, 662, 450, -111, -672, -886, -745, -111, 281, 847, 594, 598, -97, -713, -709, -611, -147, 404, 812, 866, 631, 125, -499, -678, -835, -227, 351, 716, 783, 714, 106, -406, -1093, -840, -538, 299, 491, 948, 521, -34, -579, -1042, -984, -436, -18, 646]
2347F46P7j53k73p83k11j42M99M93L13N67m44k31p56j04l79O56N62L07mJ45m20
2368C65o22p2l90K62O48L99N10m34l63n15o21J48o1O14P04Lm6k27o74l02k20J41
2390g53O20K43N14k12m93k73j19k58q9P63K89M91Jj70o98o18p0J31N72O55K28
2411G54Lj96n85n43l26J60K66O87O97j8j49o82p55R7nL27N62K28K90k13p61k72
2433d34k52p4N50M75M42J91l34m00n24m52K81K68K99M17K37l75l50k80n38K46
2453f07K95o9O71J67K06l43o89k17n7M6M94M49K02J78m46p04q9j57J94N66M96
2474E86J70Q3n73n39l31J77j07O22P17j63J0J5p71n18mJ96N84M36J99p8l87n47
2496b23m71J20K23L47J53M37J6j78l99o89j02J57K32P64J94L1k96k50o28l32L50
$$ y = [646, 723, 570, 297, -486, -697, -839, -340, 153, 466, 1033, 589, 358, -398, -502, -881, -225, 337, 644, 640, 785, 365, -257, -329, -719, -457, 191, 590, 1100, 666, 303, -212, -833, -685, -746, -132, 572, 575, 529, 302, -372, -674, -894, -753, -133, 110, 624, 412, -81, -354, -473, -731, -820, -57, 232, 723, 724, 554, -144, -762, -832, -701, -129, 526, 754, 757, 561, -24, -567, -893, -733, -467, 220, 917, 899, 750, 68, -687, -590, -595, -268, 294, 522, 812, 599, -162, -434, -686, -760, -210, 265, 707, 898, 564, 164, -360, -812, -531, -263, 36, 453, 690, 315, -35, -315, -853, -607, -312, -381, 290, 457, 663, 320, -369, -586, -643, -597, -103, 346, 548, 726, 280, -424, -513, -670, -476, 90, 586, 756, 839, 266, -273, -604, -427, -534, 88, 805, 642, 652, 667, -104, -622, -626, -430, 154, 590, 789, 711, 324, -223, -694, -574, -351, -4, 149, 586, 602, 424, 25, -664, -766, -609, -377, 387, 581, 612, 316, 66, -562, -894, -544]
2517e44O02R6L62J90l27k79j19n48j15K45N88L71L79n12n21l00j77l1N54N46k41
2538B19O47m61n62j32j71k47J75P78M35K76k89p20n20o1L83m6L81P96k03j01l63
$$ y = [-544, 58, 154, 516, 706, 379, 100, -19, -567, -682, -437, 151, 522, 901, 389, -132, -432, -609, -640, -86, 460, 219, 866, 405, -157, -289, -460, -707, -532, 246, 681, 957, 668, -52, -572, -633, -250, -296, 85, 881, 678, 577, 214]
$$ [...]
8191C28
##END NTUPLES=NMR FID
##END=
