##TITLE=1H_LR-738-B-B2-CR3
 D2O
 8 sc, 
 30.10.2021
##JCAMPDX= 6.0         $$ Bruker NMR JCAMP-DX V2.0
##DATA TYPE= NMR FID
##DATA CLASS= NTUPLES
##ORIGIN= UXNMR, Bruker Analytische Messtechnik GmbH
##OWNER= root
$$ XWIN-NMR		Version 3.5
$$ Sat Oct 30 13:26:55 2021 Russian Standard Time (UT+4h)  she@DPX200
##.OBSERVE FREQUENCY= 200.1313468511
##.OBSERVE NUCLEUS= ^1H
##.DELAY= (6, 6)
##.ACQUISITION MODE= SIMULTANEOUS
##.ACQUISITION SCHEME= undefined
##.AVERAGES= 8
##.DIGITISER RES= 18
##SPECTROMETER/DATA SYSTEM= spect
##.PULSE SEQUENCE= zg30
##.SOLVENT NAME= D2O
##.SHIFT REFERENCE= (INTERNAL, D2O, 0, 15.7039)
##AUDIT TRAIL= $$ (NUMBER, WHEN, WHO, WHERE, WHAT)
$$ ##TITLE= Audit trail, XWIN-NMR		Version 3.5
$$ ##JCAMPDX= 5.01
$$ ##ORIGIN= Bruker BioSpin GmbH
$$ ##OWNER= she
$$ F:/spectra/data/she/nmr/H-F/1/audita.txt
$$ ##AUDIT TRAIL=  $$ (NUMBER, WHEN, WHO, WHERE, WHAT)
(   1,<2021-10-30 13:25:49.62 +0400>,<she>,<DPX200>,
      <created by zg, POWCHK disabled, PULCHK disabled
       configuration hash MD5:
       00 E9 B6 7A A2 85 ED C7 34 08 36 98 17 FE 4E 26
       data hash MD5: 16K
       BD D7 2C F1 D9 18 22 E4 F8 3F 8D 1A 5B A6 38 7B>)
$$ ##END=
$$ 
$$ hash MD5
$$ 9B 5D F2 E1 32 98 44 4E ED F7 44 41 A4 FE 1E 3E
##$RELAX= 
##$RELAX= 
##$RELAX= 
##$RELAX= 
##$RELAX= 
##$RELAX= 
$$ Bruker specific parameters
$$ --------------------------
##$DU= <F:/spectra>
##$EXPNO= 1
##$NAME= <H-F>
##$PROCNO= 1
##$TYPE= <nmr>
##$USER= <she>
##$AMP= (0..31)
100 100 100 100 100 100 100 100 100 100 100 100 100 100 100 100 100 100 
100 100 100 100 100 100 100 100 100 100 100 100 100 100 
##$AQSEQ= 0
##$AQ_mod= 1
##$AUNM= <au_zg>
##$AUTOPOS= <>
##$BF1= 200.13
##$BF2= 200.13
##$BF3= 200.13
##$BF4= 200.13
##$BF5= 200.13
##$BF6= 200.13
##$BF7= 200.13
##$BF8= 200.13
##$BYTORDA= 1
##$CFDGTYP= 0
##$CFRGTYP= 5
##$CHEMSTR= <none>
##$CNST= (0..31)
1 1 145 1 1 1 1 1 1 1 1 1 1 1 1 1 1 1 1 1 1 1 1 1 1 1 1 1 1 1 1 1 
##$CPDPRG= <>
##$CPDPRG1= <>
##$CPDPRG2= <>
##$CPDPRG3= <>
##$CPDPRG4= <mlev>
##$CPDPRG5= <mlev>
##$CPDPRG6= <mlev>
##$CPDPRG7= <mlev>
##$CPDPRG8= <mlev>
##$CPDPRGB= <>
##$CPDPRGT= <>
##$D= (0..31)
0 1.2 0 0 0 0 0 0 0 0.06 0 0.03 0 0 0 0 0.0002 0 0 0 0 0 0 0 0 0 0 0 0 
0 0 0 
##$DATE= 1635585949
##$DBL= (0..7)
120 120 120 120 120 120 120 120 
##$DBP= (0..7)
150 150 150 150 150 150 150 150 
##$DBP07= 0
##$DBPNAM0= <>
##$DBPNAM1= <>
##$DBPNAM2= <>
##$DBPNAM3= <>
##$DBPNAM4= <>
##$DBPNAM5= <>
##$DBPNAM6= <>
##$DBPNAM7= <>
##$DBPOAL= (0..7)
0.5 0.5 0.5 0.5 0.5 0.5 0.5 0.5 
##$DBPOFFS= (0..7)
0 0 0 0 0 0 0 0 
##$DE= 6
##$DECBNUC= <off>
##$DECIM= 32
##$DECNUC= <off>
##$DECSTAT= 4
##$DIGMOD= 1
##$DIGTYP= 9
##$DL= (0..7)
0 120 120 120 120 120 120 120 
##$DP= (0..7)
150 150 150 150 150 150 150 150 
##$DP07= 0
##$DPNAME0= <>
##$DPNAME1= <>
##$DPNAME2= <>
##$DPNAME3= <>
##$DPNAME4= <>
##$DPNAME5= <>
##$DPNAME6= <>
##$DPNAME7= <>
##$DPOAL= (0..7)
0.5 0.5 0.5 0.5 0.5 0.5 0.5 0.5 
##$DPOFFS= (0..7)
0 0 0 0 0 0 0 0 
##$DQDMODE= 0
##$DR= 18
##$DS= 0
##$DSLIST= <SSSSSSSSSSSSSSS>
$$ [...]
##$SUBNAM2= <"">
##$SUBNAM3= <"">
##$SUBNAM4= <"">
##$SUBNAM5= <"">
##$SUBNAM6= <"">
##$SUBNAM7= <"">
##$SUBNAM8= <"">
##$SUBNAM9= <"">
##$SW= 18.0517286264689
##$SWIBOX= (0..15)
0 0 2 0 0 0 0 0 0 0 0 0 0 0 0 0 
##$SW_h= 3612.71676300578
##$TD= 16384
##$TD0= 1
##$TE= 0
##$TE2= 300
##$TE3= 300
##$TEG= 300
##$TL= (0..7)
0 120 120 120 120 120 120 120 
##$TP= (0..7)
150 150 150 150 150 150 150 150 
##$TP07= 0
##$TPNAME0= <>
##$TPNAME1= <>
##$TPNAME2= <>
##$TPNAME3= <>
##$TPNAME4= <>
##$TPNAME5= <>
##$TPNAME6= <>
##$TPNAME7= <>
##$TPOAL= (0..7)
0.5 0.5 0.5 0.5 0.5 0.5 0.5 0.5 
##$TPOFFS= (0..7)
0 0 0 0 0 0 0 0 
##$TUNHIN= 0
##$TUNHOUT= 0
##$TUNXOUT= 0
##$USERA1= <user>
##$USERA2= <user>
##$USERA3= <user>
##$USERA4= <user>
##$USERA5= <user>
##$V9= 5
##$VALIST= <valist>
##$VCLIST= <CCCCCCCCCCCCCCC>
##$VD= 0
##$VDLIST= <DDDDDDDDDDDDDDD>
##$VPLIST= <PPPPPPPPPPPPPPP>
##$VTLIST= <TTTTTTTTTTTTTTT>
##$WBST= 1024
##$WBSW= 4
##$XGAIN= (0..3)
0 0 0 0 
##$XL= 0
##$YL= 0
##$YMAX_a= 263295
##$YMIN_a= -372296
##$ZGOPTNS= <>
##$ZL1= 120
##$ZL2= 120
##$ZL3= 120
##$ZL4= 120
##$ABSF1= 10
##$ABSF2= 0
##$ABSG= 5
##$ABSL= 3
##$ALPHA= 0
##$AQORDER= 0
##$ASSFAC= 0
##$ASSFACI= 0
##$ASSFACX= 0
##$ASSWID= 0
##$AUNMP= <proc_1d>
##$AZFE= 0.1
##$AZFW= 0.1
##$BCFW= 1
##$BC_mod= 2
##$BYTORDP= 1
##$COROFFS= 0
##$CY= 11.3945322036743
##$DATMOD= 1
##$DC= 2
##$DFILT= <>
##$DTYPP= 0
##$F1P= 2.36226072786647
##$F2P= -0.459571619588291
##$FCOR= 0.5
##$FTSIZE= 0
##$FT_mod= 4
##$GAMMA= 1
##$GB= 0.15
##$INTBC= 1
##$INTSCL= 1
##$ISEN= 128
##$LB= 0.24
##$LEV0= 0
##$LPBIN= 0
##$MAXI= 10000
##$MC2= 0
##$MEAN= 0
##$ME_mod= 0
##$MI= 1.114404
##$NCOEF= 0
##$NC_proc= 0
##$NLEV= 6
##$NOISF1= 3.799351
##$NOISF2= 2.8
##$NSP= 1
##$NTH_PI= 0
##$NZP= 0
##$OFFSET= 15.70392
##$PC= 1
##$PHC0= -15159.81
##$PHC1= 12.40082
##$PH_mod= 1
##$PKNL= yes
##$PPARMOD= 0
##$PSCAL= 0
##$PSIGN= 0
##$REVERSE= no
##$SF= 200.130013532006
##$SI= 16384
##$SIGF1= 3
##$SIGF2= 2
##$SINO= 400
##$SIOLD= 16384
##$SREGLST= <1H.CDCl3>
##$SSB= 0
##$STSI= 0
##$STSR= 0
##$SW_p= 3612.71676300578
##$SYMM= 0
##$S_DEV= 0
##$TDeff= 0
##$TDoff= 0
##$TI= <>
##$TILT= no
##$TM1= 0
##$TM2= 0
##$TOPLEV= 0
##$USERP1= <user>
##$USERP2= <user>
##$USERP3= <user>
##$USERP4= <user>
##$USERP5= <user>
##$WDW= 1
##$XDIM= 8192
##$YMAX_p= 0
##$YMIN_p= 0
$$ End of Bruker specific parameters
$$ ---------------------------------
##NTUPLES= NMR FID
##VAR_NAME=  TIME,          FID/REAL,        FID/IMAG
##SYMBOL=    X,             R,               I
##VAR_TYPE=  INDEPENDENT,   DEPENDENT,       DEPENDENT
##VAR_FORM=  AFFN,          ASDF,            ASDF
##VAR_DIM=   8192,          8192,            8192
##UNITS=     SECONDS,       ARBITRARY UNITS, ARBITRARY UNITS
##FACTOR=    0.0002768,     1,               1
##FIRST=     0,             0,               0
##LAST=      2.2672688,     0,               0
##MIN=       0,             -372296,         0
##MAX=       2.2672688,     263295,          0
$$ Real data points
##PAGE= N=1
##DATA TABLE= (X++(R..R)), XYDATA
$$ [...]
1899b15o33j20L78P78N42l5J35m64p32m49RM35J91O68M22n12m81k87n44q1N36
$$ -215 -848 -968 -590 188 730 695 830 366 -366 -815 -806 -371 -180 488 910 398 -83 -370 -914 -995 -459
1920d59M07L59L06P2o47k24l61k75N5O84N61L40J81o41p39m48p8K32P25M05M21
$$ -459 -52 307 613 685 38 -186 -547 -822 -767 -83 478 818 999 358 -381 -829 -907 -675 50 455 876
1941H76k6l42p26o25j20K18M79R08J53K07l30o43p43J07j53O73Q05Q3K4k17o73
$$ 876 850 508 -218 -843 -963 -745 -266 642 795 1002 672 29 -714 -607 -760 -87 718 801 825 608 -65
1962f5p62L4p7N46M05M72K36l51m78j043L11K53L71N87L58J87l72o22o46m22L69
$$ -65 -827 -793 -870 -324 81 553 789 438 -40 -1083 -772 -519 -148 439 797 984 612 -10 -656 -1078 -709
1983g09L82N52O60j17k38n83o59j54j43Q28N73L70L02o76j97q57j49L18J80M52
$$ -709 -327 225 885 768 530 -53 -712 -866 -1009 -181 392 762 1064 388 191 -666 -815 -497 -317 135
2003A35M95L57j64p10m74l20j56L94O88N80J43m79l47o25n9m88O74N25M89K28
$$ 135 630 987 823 113 -361 -681 -837 -443 245 825 968 489 142 -483 -542 -1030 -356 169 658 886
2023H86L2o01o09o40K09M7P31R26j34Q3o00q53n03K16K30N30P33K12j76m27m34
$$ 886 918 317 -292 -932 -723 -676 55 981 847 930 330 -523 -1026 -810 -580 -50 683 895 719 292 -142
2044a42q16k57P98J14Q75L93k20j61p15o40M5K84N21J92N10j11k80n89l06m14
$$ -142 -958 -1215 -417 -303 572 965 745 584 -131 -771 -726 -442 79 271 781 670 390 -199 -505 -919
2064i19K30N82L89K71K14n04m89m19m02L12O77N94K87k9j80p78p02J7J13O7J022
$$ -919 -689 -107 282 553 767 263 -226 -645 -1047 -735 -58 536 823 794 614 -164 -866 -849 -736 -669 353
2085C53Q11l67k05o29n51j26O7K89P83L53J55m45m39o90j17k36O66L12R01j89
$$ 353 1164 797 592 -37 -588 -714 -647 -358 425 778 933 488 49 -641 -758 -994 -328 -16 885 696
2105F96l92k35m48m31M58J01L95P33m1k63m97o19r1n8N10K92N04L08m24l48p48
$$ 696 304 69 -379 -810 -352 -251 144 877 836 573 76 -543 -634 -692 -182 110 614 922 498 150 -598
2126e98j74k2P24L48K65J92j87o14m37J47n78L80Q44L08K60j13o83m16m16k04
$$ -598 -772 -794 -70 278 543 735 548 -66 -503 -356 -934 -554 290 598 858 745 62 -354 -770 -974
2146i74K43Q27M87n6K02m68m39p15K3K75O57N37K84j04l26o28p88L45j28Q25K96
$$ -974 -731 96 583 527 729 261 -178 -893 -870 -595 62 599 883 779 453 -175 -963 -618 -746 79 375
2167C75M31Rn70m79m93K95j68M99O72J21%l67n80n04k1J40N20N43M57N8m94p55
$$ 375 806 815 245 -234 -727 -432 -600 -101 571 692 692 325 -255 -759 -780 -640 -120 423 880 938 444 -311
2189c11j02o02L24M77N61J0M74m25n75o88P5J05M44P22K65O5k83o61l61m01N48
$$ -311 -413 -1015 -691 -214 347 357 831 406 -169 -857 -782 -677 -233 489 754 819 536 -125 -486 -887 -339
2210c39J29N85L26J0j34n76m25l86L09L1N83Q54p4l21m60n61l40R6N04L03N97
$$ -339 -210 375 701 711 577 1 -424 -810 -501 -470 113 967 893 572 112 -449 -789 -693 -189 114 711
2231G11L57o57k73o00l25J32J64Q51J18L70k09m90m93k23m13P49L21M07j1L06
$$ 711 1068 411 138 -462 -787 -655 -491 360 478 848 639 149 -344 -567 -980 -231 90 497 486 792
2251G92p69l69J14n04J93Q38J35K8j4j78p73j84J05J26L41O31J32l10k26l22l14
$$ 792 23 -346 -232 -736 -543 295 430 458 444 266 -507 -691 -586 -460 -119 512 644 334 108 -214 -528
2272e28k77L48K87O79K34m5m54m59o08j10M08L68P57L03j65n59l03m66l63K17
$$ -528 -805 -457 -170 509 743 698 244 -215 -823 -933 -525 -157 600 903 738 179 -124 -590 -953 -736
2292g36O83P11J32j19l44k60m60l33J95O01L45M8J59j99m52m81l19K27M73M80
$$ -736 -53 658 790 671 327 67 -393 -726 -531 70 415 463 622 423 -29 -510 -829 -602 -129 351
2312C51K26J12j76n47o25pK60K54O56K62k6k94n28l94k93K69J35N74N00j81p0
$$ 351 577 689 513 -34 -659 -666 -406 -152 504 766 740 446 -82 -476 -769 -500 -365 209 709 528 458
2333D58m88m29k62j66O42N99K60J53m91m31j41l73R2M25K94L76J33J2o71m08j69
$$ 458 -30 -459 -721 -887 -245 354 614 767 276 -155 -296 -669 -577 -152 142 518 651 663 -8 -416 -585
2354e85m6N17K95M42J38r9n56l82j17j33K52L71K27M66mn19l94m52PR3M24L13
$$ -585 -631 -114 181 623 761 662 106 -276 -393 -526 -274 97 324 790 786 267 -127 -579 -572 -479 -55 258
2376B58J16r4r8k19o54L4L45J72M49K87k53j11k75q27K70N55k1K97M37r9m88m13
$$ 258 374 280 182 -37 -691 -657 -312 -140 309 596 343 232 -43 -870 -600 -45 -66 231 668 569 81 -332
2398c32l62k41N12L67L27K58L75p43l78j64l25L43J97O03L9J40j04n77l90N9J36
$$ -332 -694 -935 -423 -56 271 529 904 161 -217 -381 -706 -363 -166 437 476 616 512 -65 -455 -396 -260
2419b60L1P08Q1j64k16n18j41M4K10J26M80lK12k94k72o67K0m6K24N78M07k87
$$ -260 -229 479 560 396 180 -338 -479 -435 -225 -99 381 378 590 296 24 -643 -623 -669 -445 133 540 253
2441B53J62n64k00J37l77M97J18L46qr8o2o31l27J02O23L20M3K28j07l57m39l54
$$ 253 415 -149 -349 -212 -589 -92 26 372 364 266 204 -427 -754 -652 -29 291 334 562 455 98 -341 -695
2463f95O4M94J93L11M45n52o0n76m6j37L95J10N15O5m5j76n41J01m64K93O04m1
$$ -695 -631 -137 56 367 812 260 200 -376 -422 -559 -164 -54 461 526 481 305 -236 -135 -599 -306 298 257
2485B57l0K08l84k53l24J40K37J91L64k0k7j22m93k71j58J25M06N06J55j65j35
$$ 257 227 435 51 -202 -526 -386 -149 42 406 386 359 237 -256 -527 -685 -560 -154 352 507 342 207
2506B07n05l16M2M13l8L94M47n07j08r7m45p9L44L90l4M61k0n48j44m15q8L16
$$ 207 -298 -614 -572 -159 -197 197 644 137 29 -68 -513 -592 -248 142 108 569 549 1 -143 -558 -646 -330
2528c30K52M32J09O4l65l67k89m8P6M34J85K63K40l36m13l97J13j82L25K33L15
$$ -330 -78 354 463 527 162 -205 -494 -542 -466 -32 153 416 656 320 -93 -490 -377 -559 -234 -1 314
2549C14K19l02l90r2j34J45q0L36M80O7k70k05j75k60J82j19K17M65k27J67k54
$$ 314 533 231 -159 -251 -385 -240 -320 16 496 563 293 88 -87 -347 -165 -284 -67 398 171 338 84
2570H4j47n14J05L91L07K73j99P5l69l30J1j29J69M06K03O1n7j64n47j62M7L46
$$ 84 -63 -577 -472 -81 226 499 300 375 6 -324 -313 -442 -273 133 336 397 340 176 -371 -533 -486 -140
2592a40K64J89L16j04m62j97j60Q4j81M61K68K87k18k47m80P9q8R2N10K77n8j68
$$ -140 124 313 629 525 63 -134 -294 -210 -391 70 338 625 407 160 -320 -241 -329 -237 273 550 492 324
2614C24k4j57q37N01J1P8J62M90q5o23L19o79J69L5N57l3P2J18l38l24N2k88M10
$$ 324 300 143 -694 -193 -182 -104 58 548 463 -160 159 -520 -351 -316 241 208 280 398 60 -264 -212 -500 -90
2637i0J43l0M02kl24k8k99q5k48N64L16O2J42k70m16k2j31m5K94J04J07J59L0
$$ -90 53 23 425 423 99 71 -228 -313 -561 3 319 381 523 253 -163 -185 -316 -361 -67 37 144 303 333
2660C33m06k02l6OO6N76M9J64k40j63n39j6R4m6M20K04r1j6j18l10j63J99r9O67
$$ 333 -73 -275 -311 -305 -239 337 386 550 310 147 -392 -408 -314 -360 60 264 173 157 39 -271 -434 -235 -334 333
2684C33M2L7o4q7n32j53N1K33L99L4J80p5q3n68j58rJ00L87Q1K15j38j52k05j41
$$ 333 375 412 348 261 -271 -424 -373 -140 259 293 473 398 315 -253 -411 -420 -320 67 148 363 225 73 -132 -273
2708b73k11J43L18K90J11j39j99l55j16K18PL22J22J86k27j97j48j30j80K46J79
$$ -273 -484 -341 -23 267 378 239 40 -315 -431 -213 -206 116 238 424 197 0 -148 -278 -458 -212 -33
2729c3M31R0k60q6k85j7k00P9P9N12K01p5m04n4j70k61P2K60L30J41pj26j96n35
$$ -33 398 488 228 142 -143 -160 -360 -281 -202 310 511 436 32 -22 -192 -453 -381 -121 209 350 343 217 21 -514
2753e14J93J7L31k1K05r8q3K9k84j36q2L01J84J36q0K25m15k17O4J47m4M66r7
$$ -514 -321 -304 27 6 211 113 30 59 -225 -361 -443 -142 42 178 98 323 -92 -309 -245 -98 -142 324 227
2776B27j87L34l75j82N9o0O3N3N33l8j45k10l24P0j59j1L44L73R6o10Q0l00O6
$$ 227 40 374 -1 -183 -124 -184 -121 -68 465 427 282 72 -252 -182 -341 -352 -8 365 461 -149 -69 -369 -303
2799c03L0J41O9M52j83j7K3m95r7M9J27J18K45K58j23m41N1j93K74l9M1J65J88
$$ -303 -273 -132 -63 389 206 189 212 -283 -380 -331 -204 -86 159 417 294 -147 -96 -289 -15 -54 -13 152 340
2822C40K04n87j33p2K60k61K11J31Q0K6qk22j17n46N62K79l5L4Q2o1k74l12K08
$$ 340 544 -43 -176 -248 12 -249 -38 93 173 199 191 -31 -148 -694 -132 147 112 146 228 167 -107 -419 -211
2845b11j73M10J42Q0K54k46k07k95n1J56p4M87K03j13k86m54J81pk7K81M6j0M
$$ -211 -384 26 168 248 502 256 49 -246 -297 -141 -215 272 475 362 76 -378 -197 -204 -231 50 96 86 90
2868I0N6Nk56k69L20Q4RL82j6j01l18j20l03K25K57K5L2J4J47q7m33k12M03P7
$$ 90 146 151 -105 -374 -54 30 39 421 405 304 -14 -134 -437 -212 45 70 102 116 263 176 -257 -469 -66 11
2892A1O8K55j48j78j31j45J8J4K51l3K47Pk67J23k87j70k5J95K68J02J04o7qk74
$$ 11 79 334 186 8 -123 -268 -250 -236 15 -18 229 236 -31 92 -195 -365 -390 -195 73 175 279 212 204 -70
2916g0l1r0J47J18NR4J06k84l8k29j92M25p9K43j8R5J00m71r1q9J89K20O2L02
$$ -70 -101 -191 -44 74 79 173 279 -5 -43 -272 -464 -39 -118 125 107 202 302 -169 -260 -349 -160 60 122 424
2940D24j65j57j91p5j21J27K93r9K58O4j07k88k00qL1J88R6L9N8j03l12J56p1
$$ 424 259 102 -89 -164 -285 -158 135 36 294 358 251 -37 -237 -245 -214 -26 70 109 167 64 -248 -92 -163
2963a63J67J93l74M51j56j13j35k80K28NK00p4M43j2l21j38k0J6Pj85M51L60m07
$$ -163 4 197 -177 274 118 5 -130 -410 -182 -177 23 -51 392 380 59 -79 -99 -83 -76 -261 190 550 143
2986A43N8k35j48o5K33j99M90J51j55l02m4j28q6k16O58r6LR7J58k66l47K87k96
$$ 143 201 -34 -182 -247 -14 -213 277 428 273 -29 -73 -201 -287 -503 155 59 62 159 317 51 -296 -9 -305
3009c05K36J47J25k19K71j66k28K53l40L9J84o3K16O9n5j60Pj88Q2J57L00j39
$$ -305 -69 78 203 -16 255 89 -139 114 -226 -187 -3 -66 150 219 164 4 11 -177 -95 62 362 223
3031B23j73j29J07k92Q5J65k2n7M55q5j96m4n48J52Q4K56J51K9J25J3l09j4m76
$$ 223 50 -79 28 -264 -179 -14 -36 -93 362 277 81 37 -511 -359 -275 -19 132 161 286 299 -10 -24 -500
3054e00M95J93N1j3J38k42k48m5o4K57j05R9K79k81Jk67k0K33m43L36J72Q3K20
$$ -500 -5 188 239 226 364 122 -126 -171 -235 22 -83 16 295 14 15 -252 -272 -39 -482 -146 26 109 329
3077C29r8j62l17K1J32k7K72K32L8j0n57o6J82l42L53j52N51L5k73n8k50M2j3
$$ 329 231 69 -248 -227 -95 -122 150 382 420 410 -147 -213 -31 -373 -20 -172 379 414 141 83 -167 -125 -138
3100a38J44j6K94j41L07l17j50m06L22j40K78J02j01j3j97j42J95j95L90K61m6
$$ -138 6 -10 284 143 450 133 -17 -423 -101 -241 37 139 38 25 -172 -314 -119 -314 76 337 291
3121B91j5k19M5m28J03J1O8J83J81j31L9Q1k41k5l96M27n7J65r7P1l4j34m0o3
$$ 291 276 57 102 -326 -223 -212 -144 39 220 89 128 209 -32 -57 -453 -26 -83 82 -15 56 22 -112 -152 -215
3145b15J9K01O6J31Q1k95r7Kj0n9K59k28M98j26m8k36J20l5m35L64J85J7O7j11
$$ -215 -196 5 71 202 283 -12 -109 -107 -117 -176 83 -145 353 227 179 -57 63 28 -407 -43 142 159 226 115
3169A15j51q8m9J73j51L00J08j14m1l37K27r1l78N26Q0j3L08n97K22k36kj55L09
$$ 115 -36 -124 -173 0 -151 149 257 143 102 -235 -8 -99 -477 49 129 116 424 -173 49 -187 -189 -344 -35
3192c5k11j6L98J55q7j71j19j42R6K35J07K42l09j33l86N06k77j91K85J61J23
$$ -35 -246 -262 136 291 204 33 -86 -228 -132 103 210 452 143 10 -376 130 -147 -338 -53 108 231
3213B31j84j03J25l78Q0K97ML0L9K7J08k02l73O2K91M4l8J24M9r6o5r5k60m5L15
$$ 231 47 -56 69 -309 -229 68 72 102 141 168 276 74 -299 -237 54 98 60 184 233 137 72 -23 -283 -328 -13
3238a3J62j%Q2k94j49J83m7K9q1J60K65k67j63q3J40P5O9Lo7K59j64j75j40J34
$$ -13 149 148 148 230 -64 -213 -30 -77 -48 -129 31 296 29 -134 -217 -77 -2 67 70 3 262 98 -77 -217 -83
3263h3qn6L45j33J51j11p8r8j01m2l9M08j44K04j85Lk63J32J28j07J52J14j08
$$ -83 -91 -147 198 65 216 105 27 -71 -172 -214 -253 155 11 215 30 33 -230 -98 30 -77 75 189 81
3286H1R3l05j56J62O5K7m5L60k28J84j92j65J21K21n7K1l8j74J27Oj18q3%M7J91
$$ 81 174 -131 -287 -125 -60 -33 -78 282 54 238 46 -119 2 223 166 187 149 -25 102 108 -10 -93 -93 -46 145
3311A45p4J32j61J41k22%l77K29L78J62k84k59M17k58K3m67K04L10k20J36L19
$$ 145 71 203 42 183 -39 -39 -416 -187 191 353 69 -190 227 -31 -8 -475 -271 39 -181 -45 274
3332B74P4k44m34J70j71L07M54k52J02k24k44R5j06k3K18J7K91p4j48P2l14r7
$$ 274 348 104 -330 -160 -331 -24 430 178 280 56 -188 -93 -199 -222 -4 13 304 230 82 154 -160 -257
3354b57L44j80O6K25j45j37J05j27j98Q2J39P3M07k41N9k90j2m9J47n1j2L0J78
$$ -257 87 -93 -27 198 53 -84 21 -106 -304 -222 -83 -10 397 156 215 -75 -87 -136 11 -40 -52 -22 156
3377A56K0k25M0J52k23m0K99k40M33r2j02m35J80k64K62Q6K9K12j77Q4p0l25O
$$ 156 176 -49 -9 143 -80 -120 179 -61 372 280 178 -257 -77 -341 -79 7 36 248 71 155 85 -240 -234
3400b34P4K31K1N5Nj08J74l85R6K03m10N11k44K65k03J04l61q6L56Jj03J04K90
$$ -234 -160 71 92 147 152 44 218 -167 -71 132 -278 233 -11 254 51 155 -206 -292 64 65 -38 66 356
3423C56k74l73J66r0M1J30K66j15J75n61L61j78LL6P9P7M3J50k48kj20n4K31j53
$$ 356 82 -291 -125 -215 -174 -44 222 107 282 -279 82 -96 -93 -57 22 99 142 292 44 42 -78 -132 99 -54
3447e4P5J80l73K26J5K6j02Rm59M03K41Q8o6k73r5L52l98K78j02j62L60J1l40
$$ -54 21 201 -172 54 69 95 -7 2 -457 -54 187 275 209 -64 -159 193 -205 73 -29 -191 169 180 -160
3470a60J46q2k3o1K40L8L0K55k97k11P1l06K72K1J76O9J05j20j85N3l0N4j04J29
$$ -160 -14 -96 -119 -180 60 98 128 383 86 -125 -54 -360 -88 -67 109 178 283 163 -22 31 1 55 -49 80
3494H0L32m43J83l40J69j74m5K72Q3oj02J28k52J38k79R5J05k98J47K39O4L4j91
$$ 80 412 -31 152 -188 -19 -193 -238 34 117 111 9 137 -115 23 -256 -161 -56 -354 -207 32 96 130 -61
3517f1j25j45L65Q9K64k20K2j41k52p2K62m2L7J81J75k4j45q6l11J60J18P4M1
$$ -61 -186 -331 34 123 387 167 189 48 -204 -276 -14 -56 -19 162 337 313 168 82 -229 -69 49 123 164
3540A64N2k29O0k54m7J11J96K69j79M7j29k65p0r3K62l5K93J2P7j85M2m57K81
$$ 164 216 -13 47 -207 -254 -143 53 322 143 190 61 -204 -274 -367 -105 -140 153 165 242 57 99 -358 -77
3563g7qj30J31L27k9j93j58K30j92r4M30r0j60J11L92n33j22r5J69j21M35j19
$$ -77 -85 -215 -84 243 214 21 -137 93 -99 -193 237 147 -13 98 490 -43 -165 -260 -91 -212 223 104
3585A04Mj29J94j60k24K58k56NJ18J05R2K5k16J2k12Q3N3oM76k31L5j22k27K3
$$ 104 108 -21 173 13 -211 47 -209 -204 -86 19 111 136 -80 -68 -280 -197 -144 -150 326 95 130 8 -219 -196
3609a96O5J40k9J64J3k46Jk70Q4J83J7J70m8N5K82l57k27r8L74m11M64Q3r7K8
$$ -196 -131 9 -20 144 157 -89 -88 -358 -274 -91 -74 96 48 103 385 28 -199 -297 77 -334 130 213 116 144
3633A44j56o2j24L4R7K1J24r6L84m09j14j1k5J95M8M4j2o0J63j59j82l19J43J90
$$ 144 -12 -74 -198 -164 -67 -46 78 -18 366 -43 -157 -168 -193 2 50 94 82 22 185 26 -156 -475 -332 -142
3657a42M48j94Qr9J35j83n4j31k2N35kk65Q4j14m7j67J12L60j99J68k11J30m9
$$ -142 306 112 120 21 156 -27 -81 -212 -234 301 299 34 118 4 -43 -210 -98 262 63 231 20 150 101
3680A01k33j6R0j55L29J63j21k1j11k06j9K41j80L11J25n9J03k02l17K49j17j0
$$ 101 -132 -148 -58 -213 116 279 158 137 26 -180 -199 42 -138 173 298 239 342 140 -177 72 -45 -55
3702e5L14M5K0m83r0J95l53K70N6K39j17J18j76r8m0J08j17o0M31q0o8q3L6j98
$$ -55 259 304 324 -159 -249 -54 -407 -137 -81 158 41 159 -17 -115 -155 -47 -164 -224 207 127 59 -24 12 -186
3726a86j94M33q3K26N4p4j01j22n0j9j16J7L07J85j09r6k1p4q8k08J02K58l18
$$ -186 -380 53 -30 196 250 176 75 -47 -97 -116 -232 -215 92 277 168 72 51 -23 -111 -319 -217 41 -277
3749b77L86j00J04k38j67J41K06k2J87r3j32K47j46j28o3p6L71j42K9J38j50q1
$$ -277 109 9 113 -125 -292 -151 55 33 220 127 -5 242 96 -32 -95 -171 200 58 87 225 75 -6
3771fj03N6RQ0N3Q5j45l3J41l69J31K37k21K58j35j21L40j50j57j29K99m1j87
$$ -6 -109 -53 -44 36 89 174 29 -4 137 -232 -101 136 -85 173 38 -83 257 107 -50 -179 120 79 -108
3794a08J82K09M4l73l23K65K6J34j62J90M0l72J95K8k62j68M79K80j03n0k29j4
$$ -108 74 283 327 -46 -369 -104 -78 56 -106 84 124 -248 -53 -25 -287 -455 24 304 201 151 -78 -92
3816i2j14j01N18k21K7K01Q4k41M7k82N2K39n3M7R5Rl3k99lP2k27K26M22k48M6
$$ -92 -206 -307 211 -10 17 218 302 61 108 -174 -122 117 64 111 206 215 182 -117 -120 -48 -275 -49 373 125 171
3841A71K18m69J24k10q8n1N80j06r1N5k19L16l56J39o4Q2m2J84r5Q6p8m10K50
$$ 171 389 -80 44 -166 -254 -305 275 169 78 133 -86 230 -126 13 -51 31 -11 173 78 164 86 -324 -74
3864g4j10J51QK52Nj59j99l5j92L70J14j44K65j28q8k61l1J52q5L00j35P7Q0k03
$$ -74 -184 -33 -25 227 232 73 -126 -161 -353 17 131 -13 252 124 36 -225 -256 -104 -189 111 -24 53 133 -70
3888g0K31l24j63J22J57p9R3J80l2l01J55j76P6Q3J42j12L13K7j15n66K51R9O4
$$ -70 161 -163 -326 -204 -47 -126 -33 147 115 -186 -31 -207 -131 -48 94 -18 295 322 207 -359 -108 -9 55
3911E5J25M7j82J11m8k03J64l01L10j4K16j46q7k3q1j41J97p8j22L31J8n5k73
$$ 55 180 227 45 156 108 -95 69 -232 78 64 280 134 47 24 -57 -198 -1 -79 -201 130 148 93 -180
3934a80J78k58N4J46J53J00J2j84J43l27k18j3K16M61k34N4jn8n6ok84M18o2J33
$$ -180 -2 -260 -206 -60 93 193 205 21 164 -163 -381 -394 -178 283 49 103 102 44 -12 -18 -302 116 54 187
3958A87L6r7n6j67P0j32j4K29j2J63k60J73k7k12P7R4O7J23k34k9M7K05j89q3
$$ 187 223 126 70 -97 -27 -159 -173 56 44 207 -53 120 93 -119 -42 52 119 242 8 -21 26 231 42 -41
3982d1O1ro4J63p0P6j68k61J25J05K3J41J75j83j04J08j46Lr2L65j70o6K2Q0l1
$$ -41 20 11 -53 110 40 116 -52 -313 -188 -83 -60 81 256 73 -31 77 -69 -66 -158 207 37 -29 -7 73 42
4007D2q2Q8l78J71K29P1M7p2l30J87j15R4K90k30J36j62K04j59l0j51n7q6L35
$$ 42 -40 48 -330 -159 70 141 188 116 -214 -27 -142 -48 242 12 148 -14 190 31 1 -150 -207 -293 42
4030D2J72j15R8j38j05q5P0pJ25K56j55N4k12q7J18lj93J89J11O7lk96L8k44N2
$$ 42 214 99 197 59 -46 -131 -61 -68 57 313 158 212 0 -87 31 28 -165 24 135 202 199 -97 -59 -303 -251
4055b51%K56J84m6K5l70J44n1J18j49O1L61k33p6M4J7l16j59L86K52Lj24J9J02
$$ -251 -251 5 189 143 168 -202 -58 -109 9 -140 -79 282 49 -27 17 34 -282 -441 -55 197 200 76 95 197
4079A97q6l07P6N8j9J82J96K9l54k60L68j88L5L23j38P2k15M3k1J48j61k13L52
$$ 197 111 -196 -120 -62 -81 101 297 326 -28 -288 80 -108 -73 250 112 184 -31 12 -9 139 -22 -235 117
4102A17r0P6m6q7Jpl13L86MJ89j12j7k25J45k65m7L03PJ80j65J64k58K3j65j27
$$ 117 27 103 57 -30 -29 -36 -349 37 41 230 118 101 -124 21 -244 -291 12 19 199 34 198 -60 -37 -202 -329
4127c29K0J70K78Op9R6j03J8k17J63m2L31k07j08R0k33R8l24Q3J60K00m1J92k73
$$ -329 -309 -139 139 145 66 162 59 77 -140 23 -19 312 105 -3 87 -146 -48 -372 -289 -129 71 30 222 -51
4151e1J53k49o1J76J93N5j30qL8o6k05NPK27j54M43j34m13J72o7o6j8J06L07K0
$$ -51 102 -147 -208 -32 161 216 86 78 116 50 -155 -150 -143 84 -70 373 239 -174 -2 -69 -135 -153 -47 260 280
4176B80Jk17L9k14J75k29R7K78j80K21j54j73J22k46L06l5l2K13l01K4j65J59
$$ 280 281 64 103 -111 64 -165 -68 210 30 251 97 -76 46 -200 106 71 39 252 -49 -25 -190 -31
4198c1j73J93l33K37J34J2O2k01j98N0K4L20MJ19l16L66l41j40j54K77n7J45K02
$$ -31 -204 -11 -344 -107 27 39 101 -100 -298 -248 -224 96 100 219 -97 269 -72 -212 -366 -89 -146 -1 201
4221B01O0j15k13o1J39mM1j23J56J06J3k07O6k72J59j85L10k6n0q7o3K17k15K90
$$ 201 261 146 -67 -128 11 7 48 -75 81 187 200 -7 59 -213 -54 -239 71 45 -5 -92 -155 62 -153 137
4245A37l25J43J25J62k2n3l28Nj76K36Q8qJ52J99j20r6j12l50M14p3n9PK64k78
$$ 137 -188 -45 80 242 220 167 -161 -156 -332 -96 -8 -16 136 335 215 119 7 -343 71 -2 -61 -54 210 -68
4269f8j2j20l4k2k20L94K83j17P0l3j72R4l34M67j45K62k48L1k84k1nK32K5J45
$$ -68 -80 -200 -234 -256 -476 -82 201 84 154 121 -51 43 -291 176 31 293 45 76 -208 -229 -234 -2 23 168
4293A68j09Lk2j63O7j2Lj71L21O9M8o8kr6J4j92L32jj50j18Q0l8K87l25m9J99
$$ 168 59 62 40 -123 -56 -68 -65 -236 85 154 202 134 132 36 50 -142 190 189 39 -79 1 -37 250 -75 -124 75
4319G5n9J2N0j02L3o0n2P6j27J99jJ71k31K55l03j91J47K16QJ72j50k25L03p4
$$ 75 16 28 78 -24 9 -51 -103 -27 -154 45 44 215 -16 239 -64 -255 -108 108 116 288 138 -87 216 142
4343A42k06J5O6r0J8q7LM1K63l81R4M66l39K85o5j42k57rL1j03L09k02J69j09
$$ 142 -64 -49 17 -73 -55 -142 -139 -98 165 -216 -122 344 5 290 225 83 -174 -183 -152 -255 54 -148 21 -88
4367h8J37L0k51J63j18Mm0K65P9m1j74J9l4k9K06j19K51m33P6P6j92L6k5L54j3
$$ -88 49 79 -172 -9 -127 -123 -163 102 181 140 -34 -15 -49 -78 128 9 260 -173 -97 -21 -213 -177 -202 152 139
4392A39K02j16k82M3j73J5r2J09L57p8j54L4j68K86k99K25j29j93L05O3O2j22
$$ 139 341 225 -57 -14 -187 -172 -264 -155 202 124 -30 4 -164 122 -177 48 -81 -274 31 94 156 34
4414C4L13l13Q5J01k52J30J17r6j19j08l5P9j35L45j3K04q8k96J34p6j31J13m8
$$ 34 347 34 119 220 -32 98 215 119 0 -108 -143 -64 -199 146 133 337 249 -47 87 11 -120 -7 -55
4437e5j54J26L0J86j33p1j81J78k6K98k33L82l00k03K46j34M9k58L72m9p7m0K69
$$ -55 -209 -83 -53 133 0 -71 -252 -74 -100 198 -35 347 47 -156 90 -44 5 -253 119 70 -7 -47 222
4460B22j18k26J5j4J17J11j19n2O3K7l3j22J92k28L83k08J35j48P9j37K66j00
$$ 222 104 -122 -107 -121 -4 107 -12 -64 -1 26 -7 -129 63 -165 218 10 145 -3 76 -61 205 105
4482A05p1K43l07J36Q8j57j63K71j5j25j30K35j26L4j14J3r6J0K55N8k0j0k00
$$ 105 34 277 -30 106 194 37 -126 145 130 5 -125 110 -16 18 -96 -83 -179 -169 86 144 124 114 -86
4505h6K16m03ML52n6k34M09k17L6o2J22j99q8R4L91m01R5J56K4k05RQ0k14K88
$$ -86 130 -273 -269 83 27 -207 202 -15 21 -41 81 -118 -206 -112 279 -122 -27 129 153 -52 -43 37 -177 111
4529A11j7K1m7k55L60j55k05J59J53J27k35j30K01j97J2L24l85J45m9J78k11K54
$$ 111 94 115 68 -187 173 18 -187 -28 125 252 17 -113 88 -109 -97 227 -158 -13 -62 116 -95 159
4551A59m36Q7K6P6J66J59q6j13l08p5M27k55K25j09K29J46m07j25L0K06j81m2
$$ 159 -277 -190 -164 -88 78 237 151 38 -270 -345 82 -173 52 -57 172 318 -89 -214 -184 22 -159 -201
4573b01K32j68J69Q2k45K30l21r8M96l59K35K02j07Kl10J73M4p8N7j83K85n27
$$ -201 31 -137 32 114 -131 99 -222 -320 176 -183 52 254 147 149 -161 12 56 -22 35 -148 137 -390
4595c90L70j6j5j66N7K51j21Q4n1M3o4q9K2K13k68K74q0Q9j43J08Q2k39J31k94
$$ -390 -20 -36 -51 -217 -160 91 -30 54 3 46 -18 -107 -85 128 -140 134 54 143 0 108 190 -49 82 -212
4619b12l6M55k31J11n9K0j35J36k83P3K68p7l93N63k18n6J53j01J79p1j7o9j14
$$ -212 -248 207 -24 87 28 48 -87 49 -234 -161 107 30 -363 200 -18 -74 79 -22 157 86 69 0 -114
4642a14J28j23j86L73M6k40L17k7k47K91k93k6L8J07lk53J44Q8mJ50RO9j77O8
$$ -114 14 -109 -295 78 124 -116 201 174 -73 218 -75 -101 -63 44 41 -212 -68 20 16 166 175 244 67 135
4666A35j51j77L88q0k29P1o6N3K4j17K71J3M2k12J85M7K0j40J23k33j8M2j91K78
$$ 135 -16 -193 195 115 -114 -43 -109 -56 -32 -149 122 135 177 -35 150 197 217 77 200 -33 -51 -9 -200 78
4690G8j18O8No3L3K39k92L43k79J29l83J98J65J92o26M16j74n2J69l4K13o5j78
$$ 78 -40 28 33 -30 3 242 -50 293 14 143 -240 -42 123 315 -311 105 -69 -121 48 14 227 162 -16
4713a6R7k09J5o1J97m8q7J85J96j80q6r0N5N3j52M08l08r4K74n4p0Q2k13P2J57
$$ -16 81 -128 -113 -174 23 -25 -112 73 269 89 3 -87 -32 21 -131 277 -31 -125 149 95 25 107 -106 -34 123
4738A23o9n6j91K53k97L13j44J52j01P6p6J42q3p8M3lo1j14L85l08l6L92k51k04
$$ 123 54 -2 -193 60 -237 76 -68 84 -17 59 -17 125 42 -36 7 4 -57 -171 214 -94 -130 262 11 -193
4762a93K18J75j08L08p27K55m5j7K96j38R3k27J89j36L3k10L85j42p7J52m4mJ34
$$ -193 25 200 92 400 -327 -72 -117 -134 162 24 117 -110 79 -57 -24 -234 151 9 -68 84 40 36 170
4785A70j84N1l32J88k3L80k96L22p7o4j90N1L1O1j02j21K05n5j5j29J39j73Q8
$$ 170 -14 37 -295 -107 -130 250 -46 276 199 135 -55 -4 27 88 -14 -135 70 15 0 -129 10 -163 -75
4808g5J36J43k01q6j0M0J8J47j79J7J38r1P9P8j67O1j32j56m5M80k54L4o7k1J59
$$ -75 61 204 3 -83 -93 -53 -35 112 -67 -50 88 -3 76 154 -13 48 -84 -240 -285 195 -59 -25 -92 -113 46
4833D6j82J77k17J45J91p6q6j0k6K8q5K3mj77K84j78M39r4k17n3k2L32n2k21r3
$$ 46 -136 41 -176 -31 160 84 -2 -12 -38 -10 -95 -72 -76 -253 31 -147 292 198 -19 -72 -94 238 186 -35 -128
4858a28J68J15l19K83k40L06j04J16k71m6k08K38q2J34L2J13m5q8k9j43J05O6
$$ -128 40 155 -164 119 -121 185 81 197 -74 -120 -328 -90 -172 -38 -6 107 62 -26 -55 -198 -93 -27
4880b7j06K32k11L89k92J69k49j2r2K66M4k52JK52j10j83L33j64J45N2j84r2K20
$$ -27 -133 99 -112 277 -15 154 -95 -107 -199 67 111 -141 -140 112 2 -181 152 -12 133 185 1 -91 129
4903A29j45j97J57j23K78q1M6m3K77l26q2K23q6J60l05M6P9j41J42R9N9j63k10
$$ 129 -16 -213 -56 -179 99 18 64 21 298 -28 -110 113 27 187 -118 -72 7 -134 8 107 166 3 -207
4926b07J11K13j76j0Q6j75m8J10L7N3o1j09M28l37Pr8J53j62J15K42j27j10Kj1
$$ -207 -96 117 -59 -69 17 -158 -206 -96 -59 -6 -67 -176 252 -85 -78 -176 -23 -185 -70 172 45 -65 -63 -74
4950g4J35kO7j2m4J59j57m2k37J5M4J97k11K15O9J67q0m13J82j19R4J52oj45K40
$$ -74 61 59 126 114 70 229 72 30 -207 -192 -148 49 -162 53 122 289 209 -204 -22 -141 -47 105 99 -46 194
4975A94n0l23j26K70K47k84j46L55r2n4O4J91l74J37p3K94j94k06L54o9q1P7r9
$$ 194 144 -179 -305 -35 212 -72 -218 137 45 -9 55 246 -128 9 -64 230 36 -170 184 115 34 111 12
4998A2NL5j01L4Pn7jj76K19J21j4o3P4J56k53o4P9k16K05j68o8L50j74P4L07m59
$$ 12 17 52 -49 -15 -8 -65 -66 -242 -23 98 84 21 95 251 -2 -66 13 -203 2 -166 -234 116 -58 16 323 -136
5024a36K45k84P9l0J65J29n4k8j52K00qn6M5n8j00O6j32O3k8J82o2p2r2K36j01
$$ -136 109 -175 -96 -126 39 168 114 86 -66 134 126 70 115 57 -43 23 -109 -46 -74 108 46 -26 -118 118 17
5049A7k09R7J53m4j31j6J76N7J4K30m03N2j4M5k63K13J17p2j15j0J70k89J53j5
$$ 17 -192 -95 58 14 -117 -133 43 100 114 344 -59 -7 -21 24 -239 -26 91 19 -96 -106 64 -225 -72 -87
5073h7N7K76l8k71R0m8J19o8n0o2L0QJ54q6J00k78L2q7M88j5j63m5k79L04j19
$$ -87 -30 246 208 -63 27 -21 98 30 -20 -82 -52 -44 110 24 124 -154 -122 -209 279 264 101 56 -223 81 -38
5098c8j72L11j29K42J25m86OK7j51K71o0rJ57l2j27L56l32k4J88k25j7J69lo2
$$ -38 -210 101 -28 214 339 -147 -141 -114 -265 6 -54 -63 94 62 -65 291 -41 -65 123 -102 -119 50 47 -15
5122a5N8k27J72J13oM0KK13l43n2R4k49K29p5R6q5k0K0ln7P1p8j60L20J80k75
$$ -15 43 -184 -12 101 95 135 137 350 7 -45 49 -200 29 -46 50 -35 -55 -35 -38 -95 -24 -102 -262 58 238 -37
5148c7L5L11m09K16k7k9j65R6K5j7J74j29j0k9J94m24M85j66M9j47L8Ml7N7M3
$$ -37 -2 309 -100 116 89 60 -105 -9 16 -1 173 44 34 5 199 -225 260 94 143 -4 34 38 1 58 101
5173A01L1k32oKq8K37r3J8N3p9N0p3M9j24K20p1q5J06O6k05J62k31L03j54K60
$$ 101 132 -100 -106 -104 -192 45 -48 -30 23 -56 -6 -79 -30 -154 66 -5 -90 16 82 -123 39 -192 111 -43 217
5198B17l12K17j19M8J96q8m13K99M3j54J47k12O6Q1J32J8n6pj59N9j58M08j89
$$ 217 -95 122 3 51 247 159 -254 45 88 -66 81 -131 -65 16 148 166 110 103 -56 3 -155 253 64
5221F4N4k48J31j70Q4K03m1q3J32q6l8j34K81l62L31l29M22k32O5mk14K59q9l17
$$ 64 118 -130 1 -169 -85 118 77 -6 126 40 2 -132 149 -213 118 -211 211 -21 44 40 -174 85 -4 -321
5245c21M80j71R8j6j91M29k70N3k05J01O6J7j0p2O2K4j09N4P2j38J62j15N8M8
$$ -321 159 -12 86 70 -121 308 38 91 -114 -13 53 70 60 -12 50 74 -35 19 91 -47 115 0 58 106
5269A06l76L10J14j6j67l03N25M6j13q9j32k3J0Q5jK5q2K5J59p9j7O8l16J29J87
$$ 106 -270 40 154 138 -29 -332 193 239 126 37 -95 -118 -108 -23 -24 1 -81 -56 103 24 7 75 -241 -112 75
5294G5Mj96J77j24m7j3J81j46J47j60j0J64p4K13k88L56o7k17J40l0l77K80J65
$$ 75 79 -117 60 -64 -111 -124 57 -89 58 -102 -112 52 -22 191 -97 259 192 -25 115 85 -292 -12 153
5317A53l87Q1K82j64n2k5R2q6P7O9qQ5j02l7k9m9j61N46m92L85k86k00M14j35
$$ 153 -234 -153 129 -35 -87 -112 -20 -106 -29 40 32 117 15 -22 -51 -100 -261 285 -207 178 -108 -308 106 -29
5341b9Q0k05lj65L29k7q6K29qk01K1K00m46M45k49K21j28rL6k56J64m5n8J01K83
$$ -29 51 -154 -157 -322 7 -20 -106 123 115 -86 -65 135 -311 134 -115 106 -22 -31 5 -251 -87 -132 -190 -89 194
5366A94j90k38J93M2J45j73Oj90K07l3M8q6q9J38R5L7j83Nk8j10K76J50k41j07
$$ 194 4 -234 -41 1 146 -27 -21 -211 -4 -37 11 -75 -164 -26 69 106 -77 -72 -100 -210 66 216 -25 -132
5390a32lK71k06j40L05k77L84j80J1M4j32nM49k21j09n2J8j47K7J34j35R4j63
$$ -132 -135 136 -70 -210 95 -182 202 22 33 77 -55 -60 389 168 59 7 25 -122 -95 39 -96 -2 -165
5413a65K45qJ52j94q0L2k3J7J29J9j1l20J12J47j33p7K19j26OK24j20J28k50J02
$$ -165 80 72 224 30 -50 -18 -41 -24 105 124 113 -207 -95 52 -81 -158 61 -65 -59 165 45 173 -77 25
5437B5O3R9l03N0K09p1k54J71N6J35j4l33L44j82J9k02K64l02R7J97K0l76K15
$$ 25 88 187 -116 -66 143 72 -182 -11 45 180 166 -167 177 -5 14 -188 76 -226 -129 68 88 -288 -73
5460g3N8Q4m5q2P8P3q7j91K42j59m2J58q6O9Q0J14j20j05l4L46k36J18m20K07
$$ -73 -15 69 24 -58 20 93 6 -185 57 -102 -144 14 -72 -3 77 191 71 -34 -68 278 42 160 -260 -53
5484e3L30j88M3m35J9K06J29K93r8j79k58KO8Q7p1Q5K4j18J67m9r1N6M8k2m2o3
$$ -53 277 89 132 -303 -284 -78 51 344 246 67 -191 -189 -121 -34 -105 -20 4 -114 53 4 -87 -31 17 -5 -47 -110
5510a10J97j43q7n9J14j57K43mN9j6J5M7l16J56L4K5k6l6nk25J93J27j74N3m0
$$ -110 87 -56 -143 -202 -88 -245 -2 -6 53 37 52 99 -217 -61 -27 -2 -28 -64 -69 -294 -101 26 -148 -95 -135
5535a35L39j11o3Q5P3j50j35L0Rj10J29m2n3J11J15o6O9j96K8M3K20k07n2J56
$$ -135 204 93 30 115 188 38 -97 -67 -58 -168 -39 -81 -134 -23 92 26 95 -101 -73 -30 190 -17 -69 87
5559H7k58L19r9j13P4P3M5j56J05j51jJ14j38kM3K48j91l37L90N2r2q0o8o5L23
$$ 87 -171 148 49 -64 10 83 128 -28 77 -74 -75 39 -99 -101 -58 190 -1 -338 52 104 12 -68 -136 -201 122
5584A22j21o3LL5j68J14O2L66k27j8J7m1l7l59K91l56M27j42K50j93J71k3j53
$$ 122 1 -62 -59 -24 -192 -78 -16 350 123 105 122 81 44 -315 -24 -380 47 -95 155 -38 133 110 -43
5607d3n7J56q5L10q2k93p1L77l0l98M42l75N9j33L34q8R1k07J07J4J30J17k89
$$ -43 -100 56 -29 281 199 -94 -165 212 182 -216 226 -149 -90 -223 111 23 114 -93 14 28 158 275 -14
5630a4R9M5l8j87o3O10m31P5O0j48ln4J19J03j22p9J4q2K26j16Q7J27j8m27J62
$$ -14 85 130 92 -95 -158 452 21 96 156 8 5 -49 70 173 51 -28 -14 -96 130 14 101 228 210 -217 -55
5655e5j6Q4K11k65P9k95J63oJ36N5M1j04r2P9Jp4ko9L1K45l27l1RK37k83M20k
$$ -55 -71 13 224 -41 38 -257 -94 -100 36 91 132 28 -64 15 16 -58 -60 -129 -98 147 -180 -211 -202 35 -248 172 170
5682A70Nj04J32o8l64L87L7j78j19Q8K4m4K24r1r9k39J70J23j59n5K72j82O7M8
$$ 170 175 71 203 135 -229 158 195 17 -102 -14 10 -34 190 99 0 -239 -69 54 -105 -160 112 -70 -3 45
5706D5n7J8k57J90J05j34m0L81m05L19n7j50J26K3j57j10K6J33k64J21K1O1M3
$$ 45 -12 6 -251 -61 44 -90 -130 251 -154 165 108 -42 84 107 -50 -160 -134 -1 -265 -144 -123 -62 -19
5729a9J84j10m20K36M7l7P1M9K57k38m1L00m04j29Ol1J53L04j68j83K49j47O4
$$ -19 165 55 -365 -129 -82 -119 -48 1 258 20 -21 279 -125 -254 -248 -279 -126 178 10 -173 76 -71 -7
5752gO3J42k55P3l2L3n6m3N0J63k05l4J74p7J07oo5N3j96K87n0j10J74k37qO1
$$ -7 56 198 -57 16 -16 17 -39 -82 -32 131 -74 -108 66 -11 96 90 25 78 -118 169 119 9 183 -54 -62 -1
5778aK6o5Q7r2k3K32o7m5j38LJ08j76K1R9j14J21j57L16k68K20k45k12M28J33
$$ -1 25 -40 47 -45 -68 164 97 52 -86 -83 25 -151 -130 -31 -145 -24 -181 135 -133 87 -158 -370 58 191
5802A91l87M62m62M2J90o1J12o4m7n1R0m2P6l65K61J49k8J65n11M41k83K78l13
$$ 191 -196 266 -196 -154 36 -25 87 23 -24 -75 15 -27 49 -316 -55 94 66 231 -280 161 -122 156 -157
5825a57P2J85l24K09q0J08N8j63qN6J86l9k51M09l83J99k21K7K09l03J33k1K10
$$ -157 -85 100 -224 -15 -95 13 71 -92 -100 -44 142 103 -148 261 -122 77 -144 -117 92 -211 -78 -99 111
5848A11k7JQ6j00j80L8N5J3k1J0K23p9k10J03r5Q8p5M2j62L68o2j51p6K28j61
$$ 111 84 85 171 71 -109 -71 -16 -3 -24 -14 209 130 -80 23 -72 16 -59 -17 -179 189 127 -24 -100 128 -33
5873c3j80L70p6N9l91K27p3J26k24J53K30j60J47l51P1J21j8J66k49j0K64j65
$$ -33 -213 157 81 140 -251 -24 -97 29 -195 -42 188 28 175 -176 -105 16 -2 164 -85 -95 169 4
5895Dj10K29l61J00O4R3o5K14j87p7m8P8N8J85l54L02r8j43P4J02j07j06J12J63
$$ 4 -106 123 -238 -138 -74 19 -46 168 -19 -96 -144 -66 -8 177 -177 125 27 -116 -42 60 -47 -153 -41 122
5919A22K9k92K13j83K16k2r1j85J88L6j14J68r5k45L43l1O4j86J87J09j41j64
$$ 122 151 -141 72 -111 105 83 -8 -193 -5 31 -83 85 -10 -255 88 57 121 -65 122 231 90 -74
5941g4j14M80l33M4l9R7p1J93j2k85j8J98K53l23M7no6M3j40N9K04l56K58l26
$$ -74 -188 292 -41 3 -36 61 -10 183 171 -114 -132 66 319 -4 43 38 -28 15 -125 -66 138 -218 40 -286
5965b86K34J55k25O8k26K19RL1j94M35l30J01j7J41Kk41n6J14j9J06n0j28J27
$$ -286 -52 103 -122 -54 -280 -61 -52 -21 -215 220 -110 -9 -26 115 117 -124 -180 -66 -85 21 -29 -157 -30
5988c0J02j61L75J23l84M4j12K24l6j35J8k3j74N1P4k5Nk7J62M0q9J69L5k58K5
$$ -30 72 -89 286 409 25 69 -43 181 145 10 28 5 -169 -118 -44 -69 -64 -91 71 111 22 191 226 -32 -7
6013gj2q1O9p7M7j7K37l11K99j4k9k7j10K26j49j77K29l4n7q4j85J80J55j82J1
$$ -7 -19 -100 -31 -108 -61 -78 159 -152 147 133 104 77 -33 193 44 -133 96 62 5 -79 -264 -84 71 -111 -100
6038a00K88m81K85K3kj05J36K3J38r1p3q6j64J17M0J84l09L25J35l01L37k58O4
$$ -100 188 -293 -8 15 13 -92 44 67 205 114 41 -45 -209 -92 -52 132 -177 148 283 -18 319 61 125
6061A25j44J23j6J17o5j49j69J34M6j02K52J8p2j24mL9O3j51J79N8J68l59J34
$$ 125 -19 104 88 205 140 -9 -178 -44 2 -100 152 170 98 -26 -30 9 72 -79 100 158 326 -33 101
6084A01J54m54K09n0Qk48L15J22J16k31p2J71j99j74L5K46l09J81k90M42P1m65
$$ 101 255 -199 10 -40 -32 -280 35 157 273 42 -30 141 -58 -232 -197 49 -260 -79 -369 73 144 -321
6106c21L70p9j04L64m40K54k48K68n0j97k2J15K06J9j0k26P1J97m03N3J6J37R0
$$ -321 49 -30 -134 230 -210 44 -204 64 14 -183 -205 -90 116 135 125 -101 -30 167 -236 -183 -167 -30 60
6129F0j61K76l39K14m87M98j61K70j26j49r8N83o00J67J54j84M3J01P7q4o7J02
$$ 60 -101 175 -164 50 -437 61 -100 170 44 -105 -203 380 -220 -53 101 -83 -40 61 138 54 -13 89
6151H9m8j40N8j04L05l11L85l57L05p4j88kj8j1K04j03j4j69K79l06J50j95K66
$$ 89 41 -99 -41 -145 160 -151 234 -123 182 108 -80 -82 -100 -111 93 -10 -24 -193 86 -220 -70 -265 1
6174AJ9j12P3J37k01k40K63Q8on3p2JJ69K1k44k4L46j11Oj78K48L8j25K16k35
$$ 1 20 -92 -19 118 -83 -323 -60 28 22 -31 -103 -102 67 88 -156 -180 166 55 61 -117 131 169 44 260 25
6199B5K3m8R7l6n6M9j73J26mO8K3l31K78k3m9j7P6P9l3j21J51Mk17N3J6k5K05
$$ 25 48 0 97 61 5 54 -119 7 3 71 94 -237 41 18 -31 -48 28 107 74 -47 104 108 -109 -56 -40 -65 140
6226A40p4kJ00kr5P5k97Q9M5k29L45j71L09M0l42Q3q9N6n7q5Q2L64l91K02k69
$$ 140 66 64 164 162 67 142 -155 -66 -21 -250 95 -76 233 273 -69 14 -75 -19 -76 -161 -79 285 -106 96 -173
6251a73J30J11n7J17j45k4K74j63m4K72l50M5j12L28k82pj83M40l66K53P2m3j88
$$ -173 -43 68 11 128 -17 -41 233 70 26 298 -52 -7 -119 209 -73 -80 -263 177 -189 64 136 93 -95
6274i5J33Q0O4l28K44J3j1q1L2J66k35m0L05j75j54M7Q2p0J65J46m32K4J44Q4
$$ -95 38 118 182 -146 98 111 100 19 51 217 -18 -58 247 72 -82 -35 47 -23 142 288 -144 -120 24 108
6298A08J56l04L6K81j83j82O1J34Lj57p7K03J88q4j36r0k20M17k47M02J4j57j50
$$ 108 264 -40 -4 277 94 -88 -27 107 110 -47 -124 79 267 183 47 -43 -263 154 -93 309 323 166 16
6321A6j12M3K0J52k78n2L54k11j35K17j31j03M77l02K19j75K43l57j51L62k05
$$ 16 -96 -53 -33 119 -159 -211 143 -68 -203 14 -117 -220 257 -45 174 -1 242 -115 -266 96 -109
6342a09q1J23K53k01N9N3k17K44m4k09m2L46n7l20J93k2j46R3p4J60O0j81K49
$$ -109 -190 -67 186 -15 44 97 -120 124 80 -129 -171 175 118 -202 -9 -31 -177 -84 -158 2 62 -119 130
6365A30N6j43J54o2p6l26K42m8J58j14o1JM28k58m95M53q6j13K01%k14K0Q0n1
$$ 130 186 43 197 135 59 -267 -25 -73 85 -29 -90 -89 339 81 -414 39 -47 -160 41 41 -173 -153 -73 -124
6389a24K40k18K53R6j70k4k68K07r9J43J80j91j87L67p1R2j61J34l10J35J38k60
$$ -124 116 -102 151 247 77 53 -215 -8 -107 36 216 25 -162 205 134 226 65 199 -111 24 162 -98
6411i8Q9K21k69N8K3K52k09P6l27J95M7j37j1J71m6rR9p7m6r3K03k0j93k7j2R7
$$ -98 -9 212 -57 1 24 276 67 143 -184 11 58 -79 -90 81 35 26 125 48 2 -91 112 92 -101 -128 -140 -43
6437d3q5J85P7M8k40j7L9L60j93Lrj54J29l6J8j91k3K39j86oM2m4J66N4j83R9
$$ -43 -128 57 134 182 -58 -75 -36 324 131 134 125 -29 100 64 82 -109 -132 107 -79 -85 -43 -87 79 133 -50 49
6463D9j8N2l6K7n50M61n5P7R4r7J8l4RP4n7ok08J75k0O1pJ4J4j28J35o7Q1m4j49
$$ 49 31 83 47 74 -476 -15 -70 7 101 4 22 -12 -3 71 14 8 -200 -25 -45 16 9 23 37 -91 44 -23 58 14 -135
6492a35J56J9k2M1j95K14k6j51j15K55j48Q8n4J27Q8j24o8j24L09j17K49k64k69
$$ -135 21 40 18 59 -136 78 52 -99 -214 41 -107 -19 -73 54 142 18 -50 -174 135 18 267 3 -266
6515b66K66J74k20j9K4J81l2j56J80j09k43J19k1P0r8J45r6L40k52O3o4J34J82
$$ -266 0 174 -46 -65 -41 140 108 -48 132 23 -220 -101 -122 -52 -150 -5 -101 239 -13 50 -14 120 302
6538C02k51L0j24P9p4M8L9o1j66LJ10L9N8n7o8l1Q1l1K2Q8j13j31K06p5K7J76
$$ 302 51 81 -43 36 -38 10 49 -12 -178 -175 -65 -26 32 -25 -93 -124 -43 -74 -52 36 -77 -208 -2 -77 -50 126
6564A26j68M5J13M7j31M8j20Q9N6J49l42o3P8J93r0j51J76Q4k24K2J34j75K78
$$ 126 -42 3 116 163 32 80 -40 49 105 254 -88 -151 -73 120 30 -121 55 139 -85 -63 71 -104 174
6587A74j16l28L20j68K02P6o2k43J53r5K11k98Q3O1p9l1K73j64l0J5K98k20J3
$$ 174 58 -270 50 -118 84 160 98 -145 8 -87 124 -174 -91 -30 -109 -140 133 -31 -61 -46 252 32 45
6610D5J30j47k34J12J02M3j04O2R7r1R9m8l36L08K19j61M3r6j53p8J51Q0J54m74
$$ 45 175 28 -206 -94 8 51 -53 9 106 15 114 66 -270 38 257 96 139 43 -110 -188 -37 43 197 -277
6634b77M36j17L8Q0k45K5p9J12O7j18N5N5j42K58j38M9r3j73OJ65qJ25n6O5k03
$$ -277 159 42 80 160 -85 -60 -139 -27 40 -78 -23 32 -110 148 10 59 -34 -207 -201 -36 -44 81 25 90 -113
6659a13N8P1o1J28L2j21N8j97R3m7n8L67j97r0J13k98M68r1j29N8l42L14J67m15
$$ -113 -55 16 -45 83 115 -6 52 -145 -52 -99 -157 210 13 -77 36 -262 206 115 -14 44 -298 16 183 -232
6683b32J07N6l4K26j08m2J2J12l6k79J76Kr1L54j34j49l2Q0k06K53n7L1Q7j13
$$ -232 -125 -69 -103 123 15 -27 -15 97 61 -218 -42 -40 -131 223 89 -60 -92 -12 -218 35 -22 9 96 -17
6707a7M8j33K32k28J87k50O02m26j42L75P2k03j25K54j11q4o6L8P6j24M1r6l2
$$ -17 31 -102 130 -98 89 -161 441 15 -127 248 320 117 -8 246 135 51 -15 23 99 -25 16 -80 -112
6730a12K9K17l30K66k24K31m5n5k1LJ90l65R0j14K13K39k53J60j87J53m5j40m9
$$ -112 -83 134 -196 70 -154 77 32 -23 -44 -41 149 -216 -126 -240 -27 212 -41 119 -68 85 40 -100 -149
6753a49J5J9K83q9l75M02k11O9r0J30K32j86J63k18J26j84K34p1j00j9J8R7O2
$$ -149 -134 -115 168 79 -296 106 -105 -36 -126 4 236 50 213 -5 121 -63 171 100 0 -19 -1 96 158
6776A58J12m20K69P8j40j66Q4j02N6jK91k48q3M1o4R2j56L84m5n2J67l86J14k03
$$ 158 270 -150 119 197 57 -109 -25 -127 -71 -72 219 -29 -112 -71 -135 -43 -199 185 140 88 255 -131 -17 -220
6800b20N5P3K51m8k38jJ66L5q1j8l4QJ39j00Q7j07k30L27R4j65j13J71J4Rk85
$$ -220 -165 -92 159 111 -127 -128 38 73 -8 -26 -60 -52 87 -13 74 -33 -263 64 158 -7 -120 51 65 74 -211
6825b11J87K24m03Q3k93J40J49L42J6k22k19K29k9jK8k0klj71N3J95J2M9j37k95
$$ -211 -24 200 -203 -120 -413 -273 -124 218 234 12 -207 22 -7 -8 20 0 -2 -5 -176 -123 72 84 133 -4 -299
6850b99K90j2j11K13j82L0r0K48N7k94j13L37l09J71R8M2k10j15J85J09q7J83
$$ -299 -9 -21 -132 81 -101 -71 -161 87 144 -150 -263 74 -235 -64 34 76 -134 -249 -64 45 -42 141
6872A41j71l4P8P9j12R7l0p7K44o4k80K40Q9j97J67k17K46o9j62q5J93K2q9J95
$$ 141 -30 -64 14 93 -19 78 48 -29 215 151 -129 111 200 3 170 -47 199 130 -32 -117 76 98 9 204
6896B04j44L9J69j12j33L21k72j89l9M69j00k20N5J05l86k4K15N8MM1R7j71j60
$$ 204 60 99 268 156 23 344 72 -117 -156 313 213 -7 48 153 -233 -257 -42 16 20 61 158 -13 -173
6919a73J91J12pk67J68%K4nK11p4k08l6J72l04M2K77m3J39k67j76J52O5l81M55
$$ -173 18 130 123 -144 24 24 48 43 254 180 -28 -64 108 -196 -154 123 80 219 -48 -224 -72 -7 -388 67
6943F7j20J40k38J72J4j37J87j96K50k14J57kKj10J06P4j44J12j43l1L39r0j83
$$ 67 -53 87 -151 21 35 -102 85 -111 139 -75 82 80 82 -28 78 152 8 120 -23 -54 285 195 12
6966A2r8J23k59N69k92p5P0K6l68L69N5j35k1l8J35J9j53L2Q1j37J09J8K7k46
$$ 12 -86 37 -222 347 55 -20 50 76 -292 77 132 -3 -24 -62 73 92 -61 -29 52 -85 24 42 69 -177
6990a77K66m7J24k69KJ26l0J8k48L05n2m8n8J09L8j47R5r2J5m3O2l1jJ25j83J08
$$ -177 89 42 166 -103 -101 25 -5 13 -235 70 18 -30 -88 21 59 -88 7 -85 -70 -113 -51 -82 -83 42 -141 -33
7016c3J44P8p1j51K69j90l7j00n3J62J19k67Q4P6o1L07k39R0J3j70K9j30J26j21
$$ -33 111 189 118 -33 236 46 9 -91 -144 18 137 -130 -46 30 -31 276 37 127 140 -30 -1 -131 -5 -126
7040a26J74Q4j57Q0j25J61l15R3K30j12K0j84M0K24Q7l63L39k52K54j77K37j93
$$ -126 48 132 -25 55 -70 91 -224 -131 99 -13 7 -177 -137 87 174 -189 150 -102 152 -25 212 19
7062A9k16J76mQ5Lq1R3j77K9p4K6J87k38O2K2K35qo0m3m4r2n9K21j28J72j59J7
$$ 19 -197 -21 -25 60 63 -18 75 -102 -73 -147 -121 66 -172 -110 -88 147 139 79 36 -8 -100 -159 62 -66 106 -53 -36
7089c6K54Q8l15L2m1N2R5nj06J51j26j6j75NK52o6n1j91J18J78l47J64N0J03M9
$$ -36 218 306 -9 23 -18 34 129 124 18 169 43 27 -148 -143 109 43 -8 -199 -81 97 -250 -86 -36 67 116
7114A16k6j19J71k90J31M5o2R3j05L5L42j65m7j36j01o5K14p7j15K1k76L75L9
$$ 116 90 -29 142 -148 -17 28 -34 59 -46 -11 331 166 119 -17 -118 -183 31 -46 -161 -140 -416 -41 -2
7137br1j25J9J92J05q7Q0j44P1j40R8M4j95Q5J44k54J50Q5J23l78J77J31J03k59
$$ -2 -93 -218 -199 -7 98 11 91 -53 18 -122 -24 20 -175 -90 54 -200 -50 35 158 -220 -43 88 191 -68
7161f8J64j42n3J64JqQ8j83K39l36J19P0mJ24j71J58k6l32K11J02k44j18P8J48
$$ -68 96 -46 -99 65 66 58 146 -37 202 -134 -15 55 51 175 4 162 136 -196 15 117 -127 -245 -167 -19
7185a9j50L33j87K72k65J20l45RL76k58Q8k66K70J24j62Q2j48K6M7M6q0K79k73
$$ -19 -169 164 -23 249 -16 104 -241 -232 144 -114 -26 -292 -22 102 -60 22 -126 -100 -53 -7 -87 192 -81
7208h1J22p0k13L15n3R7j23Q9n3j7R8o9k1j00J74N5j90Q1l80L64K10l20J21J8
$$ -81 41 -29 -242 73 20 117 -6 83 30 13 111 42 21 -79 95 150 -40 41 -339 25 235 -85 36 54
7232E4j1J06j26N7l23L06O3k04l3J23r6J53j80L8K75j69k57J90J13K5r0Q7j33
$$ 54 43 149 23 80 -243 63 126 -78 -111 12 -84 69 -111 -73 202 33 -224 -34 79 104 14 101 -32
7255c2j41Q8P8K51l43K93k66L09j49j70m3M9o6L6L46k04R2k92j5J83k47K84q5
$$ -32 -173 -85 -7 244 -99 194 -72 237 88 -82 -125 -76 -142 -106 240 36 128 -164 -179 4 -243 41 -44
7278d4M7N5O4O2k14J50j14Mn3M1MJ80k29prJ24k21j05K97j14N3k55K61J34j86
$$ -44 3 58 122 184 -30 120 6 10 -43 -2 2 182 -47 -54 -63 61 -160 -265 32 -82 -29 -284 -23 111 -75
7303g5JJ98l58K82j03o0j17K07j07K7J22j84K88j83LnJ3J73l30K62M3k48K74M1
$$ -75 -74 124 -234 48 -55 -115 -232 -25 -132 -105 17 -167 121 -62 -59 -64 -51 122 -208 54 97 -151 123 164
7327A64k13j18J53M6r2J73j87J83j19J95r0l05J99l8m1o2J01j41J0J27j40J40
$$ 164 -49 -167 -14 32 -60 113 -74 109 -10 185 95 -210 -11 -49 -90 -152 -51 -192 -182 -55 -195 -55
7349e5j3J65j41j0N3J12kL1k29k4J67j12l4j50M38j31k56J18N9j07L51p8m18L94
$$ -55 -68 97 -44 -54 -1 111 109 140 -89 -113 54 -58 -92 -242 196 65 -191 -73 -14 -121 230 152 -266 128
7373A28k48l7M39k90k13K29k58J45n2J14L6j17J2j15L12M3j9j68k49N30k27L0
$$ 128 -120 -157 282 -8 -221 8 -250 -105 -157 -43 -7 -124 -112 -227 85 128 109 -59 -308 222 -5 25
7395B5j79R0Q6J31l2q8k4n0qj06P5L0rQL22k52J24p7K06q5j81R1k48m0K00Q1j45
$$ 25 -154 -64 22 153 121 33 9 -41 -49 -155 -80 -50 -59 -51 271 19 143 66 272 187 6 97 -151 -191 9 90 -55
7422e5J11j03k8r3K93j92j20L85p1n3K8R8l22R6P4k98L03P7p2m2k33M32k49J9
$$ -55 56 -47 -75 -168 125 -67 -187 198 127 74 102 200 -122 -26 48 -250 53 130 58 16 -217 215 -34 -15
7446a5J17l57L62j26M6l0QJ18l14J86J62po5j53K60k93N8J4J34l13J49J84J16
$$ -15 102 -255 107 -19 27 -3 5 123 -191 -5 157 150 85 -68 192 -101 -43 -29 105 -208 -59 125 241
7469B41p1l42K79k42J39q1L5m8O1J9M1k72R4J26jKJ5j12K25l04K44ql45L55j19
$$ 241 170 -172 107 -135 4 -77 -42 -90 -29 -10 31 -241 -147 -21 -22 -20 -5 -117 108 -196 48 40 -305 50 -69
7494f9K25k42m3J4J01J67j48L61m20M6L5j2k5j79J88J1K08j85r5J83N3l60K50
$$ -69 156 -86 -129 -115 -14 153 5 366 -54 -8 27 15 -10 -189 -1 10 218 33 -62 121 174 -186 64
7517F4l9R1J32k95N2k99L94j80RPj45M46l46J35l7k6p1j13J93J97k62K13o0j47
$$ 64 25 116 248 -47 5 -294 100 -80 -71 -64 -209 237 -109 26 -11 -37 -108 -221 -28 169 -93 120 60 -87
7541h7Q4r1Nl6J96Q7j73q9K65l21K25k4k24l4K74L1j27k38J09K51J12j1Lk10R6
$$ -87 -3 -94 -89 -125 71 158 -15 -104 161 -160 65 41 -183 -217 57 88 -39 -277 -168 83 195 184 187 -23 73
7566G3r7l42K40J88l49M22j23J23Rl69N32m15J33J16j95MK78k38l35K55R0O2L4
$$ 73 -24 -366 -126 62 -287 135 12 135 144 -225 307 -108 25 141 -54 -50 228 -10 -345 -90 0 62 96
7589I6M0r2j48p8L40j27L3J31m47K39J03N2Ro9j39j39J42j22K00l0J4j05J44J4
$$ 96 136 44 -104 -182 158 31 64 195 -252 -13 90 142 151 82 -57 -196 -54 -176 24 -6 8 -97 47 61
7613F1P0l12K45L2k0K8k42J61j34J38M15m45k63N2J19jM4j50K61o5J50k01J36
$$ 61 131 -181 64 96 76 104 -138 23 -111 27 442 -3 -266 -214 -95 -96 -52 -202 59 -6 144 -57 79
7636G9j65J93l7j53J36j58k4J15jK33O3l57L61k98qK74l95L2K71j27o1Q8r4J49
$$ 79 -86 107 70 -83 53 -105 -129 -14 -15 218 281 -76 285 -13 -21 253 -142 -110 161 34 -27 61 -33 116
7660A16k12K12L2l40J17kK18m65K00o1K06K7K9k05R9J65j34k60K14L49k05k42
$$ 116 -96 116 148 -192 -75 -77 141 -324 -124 -185 21 48 77 -128 -29 136 2 -258 -44 305 100 -142
7682a42J48j52k5Q4Q7k8j0J1N7o8p0J44J18K08m43j54J53K76l23j8K97k57N7J79
$$ -142 6 -146 -171 -87 0 -28 -38 -27 30 -38 -108 36 154 362 -81 -235 -82 194 -129 -147 150 -107 -50 129
7706A29j78M5Q2j18k3M2j41Q5j2K46j62j01R9Q4q3j11K53l24J60K2J07m05M02
$$ 129 -49 -4 78 -40 -63 -21 -162 -77 -89 157 -5 -106 -7 77 -6 -117 136 -188 -28 -6 101 -304 98
7729I8l15L31j78M5l5J2P5j60L09k43M1kJ01j06jJ60j42k16K70K90l28j21J89
$$ 98 -217 114 -64 -19 -54 -42 33 -127 182 -61 -20 -22 79 -27 -28 132 -10 -226 44 334 6 -115 74
7752G4j09j20J54k4K5K03j36L3N7k76o7J73J43j17J60j92K3L59j03l33J68l28
$$ 74 -35 -155 -1 -25 0 203 67 100 157 -119 -186 -13 130 13 173 -19 4 363 260 -73 95 -233
7774b33K09J1M5k28nJ56j58K46l7l45M87l22m7K69L8k87K81p0P3k32J78J64k28
$$ -233 -24 -13 32 -196 -201 -45 -203 43 6 -339 148 -174 -221 48 86 -201 80 10 83 -149 29 193 -35
7797c5R3m3j54L24oj65J01K7j96j55J23J41o1j13J10j51M27k6l04O9K15k22j9
$$ -35 58 15 -139 185 179 14 115 142 -54 -209 -86 55 -6 -119 -9 -160 267 241 -63 6 221 -1 -20
7820b0RQ6j59K20j48kK2o7j59K76r3q5L30n6j55l2J21j43J7J36j97L94k74j17
$$ -20 -11 75 -84 136 -12 -14 8 -59 -218 58 -35 -120 210 154 -1 -33 88 -55 -38 98 -99 295 21 -96
7844i6J44r9Nk78L05K55p5j09j86n2J71n3J46j22L2J5J30p9J4ol98M75k91k5L9
$$ -96 48 -51 -46 -324 -19 236 161 52 -134 -186 -15 -68 78 -44 -12 3 133 54 68 62 -336 139 -152 -177 -138
7869a38K18j32j15J25l6j6J0J15j61J56p7r6N1O1q9o5K21l5j38J23M12m38J07
$$ -138 80 -52 -167 -42 -78 -94 -84 31 -130 26 -51 -147 -96 -35 -124 -189 32 -3 -141 -18 394 -44 63
7892F3k24J63J68j10R1l16K45J39l62J24P2R5k90N3L0J9R9P1j71l6j0J54r1k58
$$ 63 -161 2 170 60 151 -165 80 219 -143 -19 53 148 -142 -89 -59 -40 59 130 -41 -77 -87 67 -24 -282
7916b82M31J6km3l4j19pJ45J9j39j56p3K35k87L86J18k13O5k96L74l65O4J71J7
$$ -282 149 165 163 120 86 -33 -40 105 124 -15 -171 -244 -9 -296 90 208 -5 60 -236 138 -227 -163 8 25
7940B5K05j26J05j65p9l46L65o8j16K53J4K9l1j39L1OJ16j53J79k47K48Jm3j14
$$ 25 230 104 209 44 -35 -381 -16 -84 -200 53 67 96 65 -74 -43 -37 79 -74 105 -142 106 107 64 -50
7964e0J05jj30J00j91L73m38J82qJ24j18k8K02j69J87j00j12J22l00K19K09k48
$$ -50 55 54 -76 24 -167 206 -232 -50 -58 66 -52 -80 122 -47 140 40 -72 50 -250 -31 178 -70
7986g0Q5Po0J27m7l4k56M28j09j62J00k39K16K9j46K6K75k32J44j91L7j77K64
$$ -70 15 22 -38 89 42 8 -248 180 71 -91 9 -230 -14 15 -131 -105 170 -62 82 -109 -72 -249 15
8009A5%O9Mj90j03L54j99Q4q9l8o3K5K74l50J94J72k04j3q0K46j18R3J08k84j13
$$ 15 15 84 88 -102 -205 149 -50 34 -55 -93 -156 -131 143 -207 -13 159 -45 -58 -138 108 -10 83 191 -93 -206
8034b06K86l3J16k64Q5j77J6J86m0j58J02J50M7j34k76J95m9O6j44M6K56j18q7
$$ -206 80 47 163 -101 -16 -193 -177 9 -31 -189 -87 63 110 -24 -300 -105 -154 -88 -232 -186 70 -48 -135
8057a35K38j0l68L14j04j71K69r8j0j57K88L4NPq6J13j08p6J9J37j47J19k21P
$$ -135 103 93 -275 39 -65 -236 33 -65 -75 -232 56 90 95 102 16 129 21 -55 -36 101 -46 73 -148 -141
8081a41Q0P9J9k81L50L8k90J10j20J7Q2k4R7pj88K89j57R4o3M2p8L13p4k61J72
$$ -141 -61 18 37 -244 106 144 -146 -36 -156 -139 -57 -81 16 9 -179 110 -47 47 -16 26 -52 261 187 -74 98
8106I8Rj13j75K64l22L06J27j31J12q8q8J03j19j58P5L29j3l07j4K7J58K3n4o4
$$ 98 107 -6 -181 83 -239 67 194 63 175 87 -1 102 -17 -175 -100 229 216 -91 -105 -78 80 103 49 -15
8130a5j93J44j40JL19k91J0L42j31J24l3J08k41o2q3J03J2O2j61Q2J66j69O7J4
$$ -15 -208 -64 -204 -203 116 -175 -165 177 46 170 137 245 4 -58 -141 -38 -26 36 -125 -43 123 -46 21 35
8154C5N3j46M0J12j76N4J74K6j11m2j02K33q7j52K06j0n6j02NN3O1j77L03k31
$$ 35 88 -58 -18 94 -82 -28 146 172 61 19 -83 150 63 -89 117 107 51 -51 -46 7 68 -109 194 -37
8178c7K47k98J81l30M03n9k90L05j12k19N88m31K29
$$ -37 210 -88 93 -237 166 107 -183 122 10 -209 379 -52 177
8191A77
$$ Imaginary data points
##PAGE= N=2
##DATA TABLE= (X++(I..I)), XYDATA
0@%%%%%%%%%%%qJ6j6J6j6K2l0L2m0M8n6O7p5Q8j04J22j44J66j90K17k47K82l20
$$ 0 0 0 0 0 0 0 0 0 0 0 0 -8 8 -8 8 -8 14 -16 16 -24 24 -32 35 -40 48 -56 66 -78 88 -102 115 -132 150 -170
34a70L60m04M55n11N70o37P09p86Q73r66J068j179J300j435J582j743J923k119
$$ -170 190 -214 241 -270 300 -337 372 -414 459 -507 561 -618 682 -753 829 -914 1009 -1110
52a110K334k573K843l151L498l894M356m903N561o367P383q709J0516j3141J7317
$$ -1110 1224 -1349 1494 -1657 1841 -2053 2303 -2600 2961 -3406 3977 -4732 5784 -7357 9960
67I960k4985M3553j71317k29507K27264J3272J04235K65219l8441j82300P1285
$$ 9960 -15025 28528 -142789 -372296 -145032 -131760 -27525 237694 199253 16953 88238
78H8238q8426j84561R2807O2577q1324J85448J65034j16741l5362j6532k36678
$$ 88238 -188 -184749 -91942 -29365 -110689 74759 239793 123052 87690 71158 -165520
89a65520m4061J80598K9421N3873J58441r4925j59679K6981o0839r7188J20788
$$ -165520 -209581 -28983 438 54311 212752 117827 -41852 -14871 -75710 -172898 -52110
100e2110O8160m1468J13600O5928j33081m9769k9501j41467K6397J70958M2481
$$ -52110 16050 -25418 88182 154110 21029 -28740 -58241 -199708 -173311 -2353 40128
111D0128M2626O8496j20581j33174K0392k5107j8964J23958N9764k3410O0677
$$ 40128 82754 151250 30669 -102505 -82113 -107220 -126184 -2226 57538 34128 94805
122I4805l182j20409l7328q626m7964P5735J29417J5990M629l844j17416q6539
$$ 94805 91623 -28786 -66114 -74740 -122704 -46969 82448 98438 103067 99223 -18193 -104732
134a04732K0342M492L4688J06703L5088k5350M08n4253q9715j4242P666Q960Q2102
$$ -104732 -84390 -79898 -45210 61493 96581 71231 71639 17386 -72329 -86571 -78905 -69945 12157
147A2157P7034J163j1850m2594r4516m1394K5916L0139O0933O8453j229l1553
$$ 12157 89191 90354 78504 35910 -58606 -100000 -74084 -43945 16988 85441 84212 52659
159E2659k9839n9531l9326J6177K2608L8792O3546J9659k6045l0596n6491n4010
$$ 52659 22820 -36711 -76037 -59860 -37252 1540 65086 84745 58700 28104 -28387 -82397
171h2397R182L7366M0907N9556K4800l4647l9339m4163m8990M532M1753L1516
$$ -82397 -73215 -35849 5058 64614 89414 54767 15428 -28735 -77725 -73193 -31440 76
183G6M2471L2877k4086l9510l2926m8940j7007M0076M1504M0613M4690j1202n5632
$$ 76 42547 75424 51338 11828 -21098 -70038 -87045 -46969 -5465 35148 79838 68636 13004
196A3004l8455l6490k2701L8248N3476K9891L3106O555m6162m0765k6286l1354
$$ 13004 -25451 -61941 -84642 -46394 7082 36973 70079 76634 30472 -10293 -36579 -67933
208f7933J1541N3535L4731K5733J9587l2925n4538k4749j7825p45M6375M1642
$$ -67933 -56392 -2857 31874 57607 77194 44269 -10269 -35018 -52843 -53588 -7213 34429
220C4429J0680P697j7597m9249k6013k280j379L0258M7573J3885l764j0708m4799
$$ 34429 45109 52806 35209 -14040 -40053 -42333 -43712 -13454 34119 48004 44240 33532 -11267
233a1267m3148k579J1281K5881M9922K7920r547j7913l4577m6358j2726J5756
$$ -11267 -54415 -56994 -45713 -19832 30090 58010 48463 30550 -4027 -50385 -63111 -47355
245d7355K1962L9981L9103J287j9004k5676m0636k5748J0704K4449L0068L6207
$$ -47355 -25393 14588 53691 54978 35974 10298 -30338 -56086 -45382 -20933 9135 45342
257D5342R940k1550k6236k9325k5764N099K7111K6518K5641J2797j7638l1238
$$ 45342 55282 33732 7496 -21829 -47593 -42494 -15383 11135 36776 49573 31935 697
269F97k6987k0851k07K7472L2708K4470J3326j1719l4041l2064j8696l378K1214
$$ 697 -26290 -47141 -47348 -19876 12832 37302 50628 38909 4868 -27196 -45892 -49270 -28056
282b8056L6274K8146J2146o653k7340l4342k1867m483J4903L1122K9650J2840
$$ -28056 8218 36364 48510 41857 14517 -19825 -41692 -46175 -31272 -150 29500 42340
294D2340m513k0757l1403k2699k967J3704K5069K7961J4557o139k0153k6302k1841
$$ 42340 37827 17070 -14333 -37032 -39999 -26295 -1226 26735 41292 35153 15000 -11302 -33143
307c3143m466J4618K4733K5023J3954n592k1515k5699k1556o033J4281K5725K4429
$$ -33143 -37609 -22991 1742 26765 40719 35127 13612 -12087 -33643 -39676 -25395 330 24759
320B4759J5113l288k1132k7292k1152p123J2605K5673K6688J5571j114j9194k7965
$$ 24759 39872 36584 15452 -11840 -32992 -40115 -27510 -1837 24851 40422 39308 20114 -7851
333g851k3109q781R115K3790K7454J7247J400j6050k6550k4213j1673N975K0934
$$ -7851 -30960 -39741 -30626 -6836 20618 37865 39265 23215 -3335 -27548 -39221 -33246 -12312
346a2312K5837J8853M134j2017k2427k2698j1952M366J7388K2760J7902M116j1126
$$ -12312 13525 32378 36512 24495 2068 -20630 -32582 -28216 -10828 11932 29834 33950 22824
359B2824j9585j9972j0242L746J6183K1050J5328L299j1558k1324j9229j0587
$$ 22824 3239 -16733 -26975 -23229 -7046 14004 29332 32631 21073 -251 -19480 -30067
371c0067M023J8495K3006J5722L587j0929k2230k1691j1610K719J6013K3501J8540
$$ -30067 -26044 -7549 15457 31179 34766 23837 1607 -20084 -31694 -28975 -12962 10539 29079
384B9079O644p858k0538k3103j4044m68J2402K2678J9547P419n875j6940k1607
$$ 29079 35723 27865 7327 -15776 -29820 -30288 -17886 4792 24339 31758 25883 8943 -12664
397a2664j3247m17J0535J9254J7876P462l983j3847k0353j4078j340R766J8109
$$ -12664 -25911 -26328 -15793 3461 21337 28799 24816 10969 -9384 -23462 -24802 -15036 3073
410C073J9509P726n577j4248k0196j4855n62R458J5073J8045R486m505j1806j6308
$$ 3073 22582 30308 24731 10483 -9713 -24568 -25130 -15672 -599 17446 26932 22427 10621 -5687
424e687j6936l620Q680J4098J8003J2542l856j2738j4767j5674n101J1745J4235
$$ -5687 -22623 -26243 -17563 -3465 14538 27080 23224 10486 -4281 -19955 -25056 -13311 924
437I24J3883J1788k751j4548j3011j2243p749Q515J5426J2711J2709K735j5187
$$ 924 14807 26595 23844 9296 -3715 -15958 -23707 -15192 234 12945 25654 28389 13202
450A3202j7183j1527j0073N190K0361J3854P998N006j2198j9298r590o805j061
$$ 13202 -3981 -15508 -25581 -20391 -30 13824 21822 26828 14630 -4668 -14258 -21063 -22124
463b2124J5960J6228N525N739n081k0181j3329l287k858J1398K1212Q027M72k148
$$ -22124 -6164 10064 15589 21328 16247 -3934 -17263 -20550 -23408 -12010 9202 17229 17701 15553
477A5553j7125j7938o12K850O581J9158J1597l386j833q570j8784o091M543L142
$$ 15553 -1572 -19510 -20122 -17272 -10691 8467 20064 16678 14845 6275 -12509 -18600 -14057 -10915
491a0915J4428J8470N69p572p662j7843j1719Q058Q860Q606J5606K985j1356p036
$$ -10915 3513 21983 22552 14980 7318 -10525 -22244 -14186 -5326 3280 18886 21871 10515 3479
505C479q703j3560K461J0888N665J2145J0655p693j2348q626j4567m209J5362
$$ 3479 -5224 -18784 -16323 -5435 230 12375 23030 15337 2989 -5637 -20204 -24413 -9051
518i051J2602Q299R156o392j6098p796n232m837Q539J1728N112Q398M030j1474
$$ -9051 3551 11850 21006 14614 -1484 -9280 -14512 -19349 -10810 918 6030 14428 18458 6984
532F984j2236p626p772M957J8382J1549L892o90j2183j5289l928N16K954J1380
$$ 6984 -5252 -12878 -20650 -15693 2689 14238 18130 17440 5257 -10032 -13960 -13444 -10490 890
546H90R260K467K155m184j3049r848l830O1J0910J5815P365o03p035j4460j0386
$$ 890 10150 12617 14772 10588 -2461 -12309 -16139 -16078 -5168 10647 18012 17409 10374 -4086 -14472
561a4472N60M851Q666R643L552k128l287o401q835l541J19N251J2618R810m5o655
$$ -14472 -13912 -9061 -395 9248 12800 10672 7385 984 -7851 -11392 -11273 -6022 6596 16406 16361 9706
577I706j2377j2522j693P347R315J0752N893l490n997o738r850m816K735M570
$$ 9706 -2671 -15193 -16886 -9539 -224 10528 16421 12931 6934 196 -9654 -14470 -11735 -7165
591g165J0125J2254K457n756q319j3454q813L930Q439R153J0146K044p344o155
$$ -7165 2960 15214 17671 11915 3596 -9858 -18671 -14741 -6302 2851 12997 15041 7697 1542
605A542o407p014J432O504L713P579P505l727p116o229r030k209R777Q764N718
$$ 1542 -4865 -11879 -10447 -3943 -230 7349 14854 11127 4011 -2218 -11248 -13457 -3680 5084 10802
620A0802M862n055j1778m665k887k358P309R266K618L780Q67r735q672k878m086
$$ 10802 15664 10609 -1169 -5834 -8721 -11079 -3770 5496 8114 11894 12761 3026 -5646 -8524 -12610
635a2610L734J2791O753J550J413q664j2617l034M44J455J0336R157r32l89k859
$$ -12610 -8876 3915 10668 12218 13631 4967 -7650 -10684 -10240 -8785 1551 10708 9776 9387 6528
650F528j0993n912J546k63N660J1748L764j855k472r532r475R33M567M003R807
$$ 6528 -4465 -10377 -8831 -9094 -3434 8314 12078 10223 7751 -1781 -11256 -10323 -5756 -1753 8054
665H054N127m570l885m352q673j801N241L093O013P809j386o619m001p553n558
$$ 8054 13181 8611 4726 374 -8299 -10100 -4859 -1766 4247 12056 10670 4051 50 -7503 -13061
680a3061N601P046N021O840Q58p638o644m171m792K536Q141M621L996L453m426
$$ -13061 -7460 -414 4607 11447 12305 4667 -1977 -6148 -10940 -8404 -263 4358 8354 11807 7381
695G381q085m091m499j328P061P904L233K500k479q400n393j256o39M738P461
$$ 7381 -704 -4795 -9294 -10622 -3561 4343 7576 10076 7597 -803 -6196 -7452 -8091 -3353 4108
710D108L367L11o61n814p372j976Q41K995P351O177l02k503m891p898m026K127
$$ 4108 7475 7786 7125 1311 -6061 -8037 -7196 -4201 3150 9327 9025 6522 1631 -6267 -10293 -8166
726h166L671N963O832J286l150m410n939n049M6M262M578O265L285k234m722m963
$$ -8166 -4495 1468 8300 9586 6436 2026 -3913 -8962 -8916 -4654 -76 6189 9474 7240 2518 -2445
742b445m907j394M251N501L827L165j141n345m684l098j596K942N775M031K399
$$ -2445 -7352 -8746 -4495 1006 4833 7998 6857 1512 -3172 -6270 -7866 -4924 851 4882 7281
757G281j58m846n837k980j077K146N880N409J660p12l301o200m323k4J851M228
$$ 7281 7123 2277 -3560 -6540 -7617 -5471 409 5818 7478 6766 3465 -2735 -7058 -7082 -5231 -1003
773a003N887K568j061l101n065n149j052K465L684N531M176j321l280m424n100
$$ -1003 4884 7452 6391 3290 -1775 -6924 -7976 -5511 -1827 3704 7880 6559 3279 -1145 -6245
788f245k070K863M063M437M263L9l545m295m626k693J539M222M066L858J098k942
$$ -6245 -8315 -5452 -1389 3048 7311 7350 3805 -490 -5116 -7809 -6270 -2048 2018 5876 6974 4032
804D032m461l785k686L30M273M214K978J422j871m796l447j963NL324N043K467
$$ 4032 -429 -4214 -6900 -6570 -2297 1917 4895 6317 4446 -350 -3797 -5760 -5755 -2431 2612 5079
820E079N27j457m132m205j859M03K952M801L124K67j409l704m796k184R79K358
$$ 5079 5606 4149 17 -4188 -6047 -5644 -2692 2109 5233 5500 4091 387 -4409 -6593 -5614 -3256
836c256M523L921J048j811l142m547l157R80K222L767M124J739j687l605l810
$$ -3256 1267 5188 6236 4425 1283 -3264 -6421 -5441 -3219 548 4672 6411 4724 1119 -2691
851b691l264k92K624L888L404K296r96l240l999l056o63J974L809L501K219k96
$$ -2691 -5955 -6247 -3623 265 3669 5965 4969 1729 -2270 -5326 -5989 -4015 -206 3295 5514 5218
867E218l297l628k659j092J271L605L521J589J08k655l841k328r46J201L275L715
$$ 5218 1921 -1707 -4366 -5458 -4187 -582 2939 4528 4636 1981 -1860 -4188 -5134 -3933 -658 3057
883C057J401k93k149l960k676o54J740K719L948J842n20k011l628l430j043J598
$$ 3057 4458 4165 2016 -1944 -4620 -5274 -3534 -815 3133 4975 4455 2444 -1184 -4614 -5657 -4059
899d059K793L468L077m81k049l092l492j599J073K615L166K581P33j892k705l072
$$ -4059 -1266 2202 5279 4798 2749 -343 -3835 -5434 -4361 -1746 1420 4001 4734 2842 137 -2935
915b935k093P07K749K958K278Q92j758l347k308j480L77K519K903J713R86j407
$$ -2935 -5028 -4321 -1572 1386 3664 4556 2798 -549 -2857 -4337 -3960 -1441 1462 3175 4161 2754
931B754l005k857j708K0K230L850K368N83r00l078l229j264l34J980L353K530
$$ 2754 -251 -3108 -4816 -4796 -2566 1284 3652 4235 3335 257 -2972 -4236 -4570 -2590 763 3293
947C293O57n04k552l062j590l56J508K568K776R28p97k463k764j697L6J513K704
$$ 3293 3950 3446 894 -2168 -3758 -4114 -2606 -38 2738 3666 2869 406 -2358 -4055 -4019 -2506 198
964A98K725P38p80k060k780j601k45J342K682K524Q53m35j999k778k261l75J207
$$ 198 2923 3661 2881 821 -1959 -3560 -3805 -2463 219 2743 3596 3161 1162 -1616 -3877 -4252 -3045
981c045K652K982J225l95j963l057k283n20J634K455K368J356j74j490j998k740
$$ -3045 -393 2589 3814 3419 1456 -1601 -3884 -4404 -2770 -315 2053 3409 3235 1745 -253 -2993
997b993j191Q98K033K728J939J76k038k169k263j158J122J817K082J914O1j736
$$ -2993 -4184 -3286 -1253 1475 3414 3590 1552 -617 -2880 -4038 -2916 -1099 983 2897 2958 1222
1013A222j597j599j467N66K093J382J724J230j850k317k020r67M56K434K465J004
$$ 1222 -375 -1974 -3441 -2875 -782 600 2324 3554 1704 -613 -2633 -3600 -3144 -710 1755 2759
1029B759K92j322k541j594q82O7J981J824J384J462l96k656k889p70l46J662L027
$$ 2759 3051 1729 -812 -2406 -3288 -3221 -1240 584 1968 3430 3034 378 -2511 -3281 -3627 -1965 1062
1046A062J804J63o57j750k428p78m5Q45J930J867L47k91j069k195j709j4J242
$$ 1062 2866 3029 2372 622 -1806 -2584 -2629 -1784 146 2013 2360 2069 1000 -1195 -2904 -2918 -1676
1063a676J336K450R98j060j670j934j535M31J371J428J754O93p85r91j413j864
$$ -1676 -340 2110 3108 2048 378 -1556 -3091 -2660 -1289 139 1893 2586 1801 810 -603 -2467
1079b467n38J094J581J939J414l90j982j816j717k00J466J803J418R10k95j302
$$ -2467 -3005 -1911 -330 1609 3023 2633 651 -1165 -2882 -3082 -1616 187 1605 2515 2220 918
1095I18j757j046r50P66J654J743J381o5j513j850j613p39P08J933J798J190M7
$$ 918 -839 -1885 -2835 -2069 -415 1328 2709 2644 1131 -719 -2332 -3071 -2363 -430 1368 2558 2605
1112B605j342j863j618j36J42J522J758Q46P14p46j909j633q31r5J706K000J130
$$ 2605 1263 -600 -2218 -2354 -2212 -690 1068 1914 2628 1882 -27 -1660 -2491 -2586 -880 1120 2250
1129B250J30j275j308j526k74J08R26J769R29L58l45j398j859o68J92O09J668
$$ 2250 2380 1105 -203 -1729 -2003 -1895 -969 800 1729 2087 1742 344 -1515 -2183 -1991 -1382 286
1146B86J763M31n83j378k138p69M03J141J271J282K23p29o45j364j338K09N39
$$ 286 2049 2480 1897 519 -1619 -2388 -1985 -844 427 1709 1932 1203 558 -806 -2144 -1935 -1396
1163a396J424J624Q25o71j286j748j227R9J332J426J058P09m21j251j101j286
$$ -1396 28 1652 2477 1806 520 -1228 -2455 -2356 -1024 402 1460 2169 1748 497 -604 -1890
1179a890r3N95R74J558O98L68j375j375j363k50M48J551J392O51J2j115j186j052
$$ -1890 -1983 -1388 -414 1144 1842 2210 835 -540 -1903 -2153 -1705 -154 1238 1889 1901 786 -400 -1452
1197a452m17K77J594Q86J049Qn07j576j618j94J63J272J534Q35k84o18j034j246
$$ -1452 -1869 -1592 2 888 1937 1945 1438 -138 -1756 -1950 -1787 -515 1019 1854 1570 952 -82 -1328
1215a328n10N20P30Q71J221L73n79j291r26p80j0R04J411R59K45o07j240r51p00
$$ -1328 -1838 -1318 -588 283 1504 1877 1298 7 -919 -1699 -1709 -805 606 1565 1810 1203 -37 -988 -1688
1234a688k46J252J264R80N60q44j214j278n30J39O24J740N27Q71m01j050j362
$$ -1688 -1934 -682 582 1562 2122 1278 64 -1214 -1744 -1605 -981 759 1286 2157 1756 706 -656
1251f56r83qQ03J041J121M63p9j150j228o37k41M53J070J234o0L77r33r52r82
$$ -656 -1639 -1647 -844 197 1318 1781 1702 552 -676 -1313 -1554 -1101 -31 1203 1143 1520 587 -365 -1347
1270a347j8M77O97J092N27l50p94p84j011k1N25Q92J000O08j36q58j082p87o75
$$ -1347 -1365 -888 -191 901 1428 1078 284 -500 -1511 -1532 -1007 -115 885 1493 1357 499 -583 -1370 -2045
1289b045Q81R14R49J062j35r03j121o61m32J83R75J100M35L78l06j375p82o45
$$ -2045 -1164 -250 699 1761 1626 723 -398 -1059 -1491 -1308 -333 767 1202 1580 1274 -101 -883 -1528
1307a528J66R04J022Q21P9k65j106j095n77NQ30J074R26J26m23p25r36p50K70
$$ -1528 -1362 -458 564 1385 1464 1199 93 -1002 -1579 -1574 -744 330 1256 1382 959 234 -702 -1452 -1182
1326a182N00Q11J018K52n62m02j152o76J58Q81M38J057M95p35o59p25q60k45R44
$$ -1182 -682 129 1147 1399 837 435 -717 -1393 -1235 -354 84 1141 1636 901 242 -483 -1343 -1588 -644
1345f44R31R32L82j43j142p65n37n97P59J196N26O15n6q09j250n28j48J17J123
$$ -644 287 1219 1601 1458 316 -449 -986 -1583 -824 372 898 1513 1457 648 -602 -1130 -1278 -1161 -38
1364c8N85N51L64q78j097l36j73J3P58J181L12Q2m97j169p78j71K95O50J114M00
$$ -38 547 1098 1462 584 -513 -849 -1022 -1009 -251 930 1242 1324 827 -342 -1120 -1291 -996 -346 768 1168
1384A168J45l99j031p66n44K44N56O98J131K81p21m96j026n75M36L52P24J167
$$ 1168 1313 914 -117 -883 -1427 -1183 -627 71 1202 1483 762 266 -760 -1335 -899 -547 177 1344
1402A344Lm25r18p03n51j09R01R84P35Km34p54o86o55K48M93P73L09M27m7q51
$$ 1344 1347 922 4 -699 -1250 -1359 -458 526 1261 1263 829 75 -611 -1266 -1018 -525 248 557 984 937 86
1423H6p09o26n3N22O80J211K25j75o62p90q87j42M63P80P21Q77m86o18o59r32
$$ 86 -623 -1249 -1302 -780 -100 1111 1336 1161 499 -291 -1178 -1320 -857 -77 644 1521 1035 417 -242 -1174
1443a174o6M20N79R32N34N6p57p39o77l30K05R75N99P16J01q34p12m81m11j73
$$ -1174 -1240 -820 -241 691 1225 1281 524 -215 -892 -1222 -1017 -42 557 1273 1374 540 -172 -653 -1064 -1237
1463a237J065N23L94O61q37j014n23j99L60M81P87L37L08k17r83o57k24j4O08
$$ -1237 -172 351 745 1406 569 -445 -968 -1167 -807 -326 461 798 1106 889 -94 -751 -975 -989 -381
1482c81O28R00j82rq65j029l17L25L94R70O86J99n18p41q76m21J58O23O11O85
$$ -381 247 1147 965 956 91 -938 -1255 -930 -536 434 1120 1319 801 60 -816 -1237 -1079 -456 155 840
1502H40L80k81o31q30p63J34L98P09J168L65o41m31o92q15j54M49N56Q62M11P2
$$ 840 1220 939 308 -522 -1285 -1151 -753 -44 1124 1489 848 417 -275 -1090 -1244 -795 -239 623 1034 1106
1522A106r20n99o04k2M22M73N12O52m1o38m14q83j85N07N34M68M65n9m85q98m15
$$ 1106 186 -413 -1017 -1039 -617 -144 368 1020 979 341 -73 -956 -1141 -634 -100 368 833 774 289 -609 -1024
1543a024J69J04N61N81N60J16m80j075m54j62M27P05O65L42K31o49p54n60o07
$$ -1024 -855 -751 -190 391 951 1067 587 -488 -942 -1104 -677 28 693 1035 1266 617 -137 -697 -1304
1562a304J5R18R05M50K40l45q59o22n43j35O61J152K72L25m25q14n78k37L0M31
$$ -1304 -1289 -371 534 984 1224 879 20 -602 -1145 -1280 -619 533 805 1130 705 -109 -687 -924 -894 -463
1582d63Q84N86j92k94m32q22j62j37L04J031P35n0m84m89n98q18M32M05P53R40
$$ -463 421 1007 815 521 89 -733 -895 -1032 -728 303 1038 988 504 15 -583 -1401 -969 -564 189 1129
1602A129p0n09m51l56o20j51O99M14L06Q39k36q20m30p36l38P15R11K66O88l60
$$ 1129 1059 550 99 -257 -877 -1028 -329 85 391 1230 994 174 -256 -992 -1330 -615 296 562 1250 890
1622H90o43n80n28k06J72R56M98L77K26n72j029n92k57K41R06Q79K8O19r86r11
$$ 890 247 -333 -861 -1067 -895 61 559 936 1162 590 -439 -1031 -1288 -1047 -141 738 766 1385 399 -512
1642e12n0k25r3O77O82K14L17j77j032o81l55M23L79J299M20J7o84o99o95k45
$$ -512 -562 -787 -880 -203 479 693 1010 833 -199 -880 -1235 -812 -433 866 1286 1303 619 -80 -775 -1020
1662a020K92O97L61L60J44k68n96m42n03J21N64N72N40M74p18p65m91l14K05N99
$$ -1020 -728 -31 330 690 834 566 -30 -472 -975 -854 -290 282 822 1296 578 -187 -678 -992 -787 -188
1682a88O57R2N52o46l54o00k97q4N11O36L46M24k93p32p20l39L0K58J107N22r4
$$ -188 469 561 1113 467 113 -487 -784 -868 -357 279 625 1049 756 24 -696 -1035 -1005 -747 360 882 788
1703G88o8m88o69n64K59J63P40O18M38j57n69p50o01p8M36K90J005K68m26n25
$$ 788 720 232 -437 -1001 -742 -579 161 779 1217 1060 491 -259 -860 -938 -502 -212 793 1061 635 110
1723A10l57n29l27M48Q14L30N41N4p44n63n45l31L98O01N24N71j97l85p57n06
$$ 110 -247 -776 -1103 -655 159 489 1030 1084 340 -223 -768 -1099 -701 -100 424 995 798 413 -344 -850
1743h50j15K26M34R43J84m6o1p65r08kJ63O15Q44J61j89j27m89q89j94L33J60
$$ -850 -965 -739 -305 638 822 776 715 -50 -958 -960 -797 -182 662 823 634 507 18 -871 -1065 -732 -572
1764e72J253M60j18l01o77p50l27J61M64Q07O29Q7l24o01p13m34l6P83M55N44
$$ -572 681 1141 1023 722 45 -705 -1032 -871 -407 400 1029 1116 792 191 -522 -956 -992 -209 246 790
1784G90O5k80o01k68m46m9M67P18L68J63r7q68n07k18j53L91R82p1Q41m91o68
$$ 790 855 575 -26 -294 -740 -789 -322 396 764 927 830 -38 -545 -763 -916 -525 457 386 1227 736 68
1805F8m67o53J79L0J007N15K86l82r3j106l75m5J59J015K56L73K5o23o71k82r8
$$ 68 -399 -1052 -873 -843 164 679 965 583 490 -616 -991 -1036 -877 138 394 767 792 169 -502 -784 -882
1826h82M16N07N47M45m51l02o15m64j77M41N31M43O21l23o53l18l77m58M65N58
$$ -882 -466 41 588 1033 582 280 -335 -799 -976 -535 -4 439 1060 737 84 -234 -611 -1069 -604 -46
1846d6O13K85J97p42n59l93P6k18R21L93K19J98n25p21k71k78J95L95Q85L38j67
$$ -46 567 852 1049 307 -252 -645 -569 -787 134 527 746 944 419 -302 -573 -851 -656 -261 624 962 795
1867G95l84m71o83k31J55L82Q42L56K55o83l10m59n74J61M35N70Q79j47k77n80
$$ 795 411 -60 -743 -974 -819 -437 405 761 1016 333 23 -436 -1010 -849 -414 156 1035 888 611 31
1887C1n71n18L21P20K14N63L18n37q63j37m74O3M18R71K63K75k54j044l49l23
$$ 31 -540 -1058 -737 -17 197 760 1078 541 -322 -459 -933 -870 -452 519 782 1057 803 -241 -590 -913
1907i13j37O17O49M45L27j6p10p20l17OK14N96N61J76l16k96m70n09J86J68M48
$$ -913 -1050 -433 216 661 988 972 262 -458 -775 -769 -555 41 602 778 462 166 -304 -813 -627 -459 -11
1928a1O46J61Kl51j083m73Q0O12P15M17J39l31n66l93n78K39L22K20P94M39j02
$$ -11 635 796 798 447 -636 -1109 -1029 -417 298 715 854 523 -43 -436 -1014 -775 -453 -233 561 1000 898
1949H98q75j54q43k81O27O94O37K23P5o63n84m72j89L92O38K50N49p2j15q38m07
$$ 898 23 -131 -974 -1255 -628 66 703 926 1001 338 -246 -718 -907 -515 123 373 922 850 735 -103 -510
1970e10o53M80L11Q48K90k7k06r13k72m28L22O57O17L94J50m88o38o70p4L60J15
$$ -510 -1163 -683 -372 476 766 739 533 -380 -652 -1080 -758 -101 516 910 1060 572 -66 -736 -810 -450 -335
1991c35P92K47K44m68r05k76k66J84N73N75O08l01j02n38q83j92K75N11L08O95
$$ -335 457 704 948 480 -425 -701 -967 -783 -210 365 973 672 570 32 -851 -1043 -768 -257 51 746
2011G46N16n88n57j125N0J95N76N28N41o3n35L4p55m44lM40N79N59K20j09p84
$$ 746 1262 674 117 -1008 -958 -763 -187 341 882 819 284 318 -437 -881 -884 -444 135 694 914 805 21
2032B1m86l10j01O94L20L15N69l80p49m20l32P0K17O08O19J28m8n46p44k47j64
$$ 21 -465 -775 -876 -182 138 453 1022 642 -107 -527 -859 -789 -572 36 655 783 735 189 -555 -802 -966
2053i66L52O84M54K07J58o79p05l12K81K18J86R19K29l31l62o70n02J71K09K06
$$ -966 -614 70 524 731 889 210 -495 -807 -526 -308 -122 797 1026 695 333 -337 -839 -668 -459 -253
2073b53Q08K79o0m10o56l10l73M25N94O00L96j76o60n98k19k84L15O70J23O17
$$ -253 555 834 774 364 -292 -602 -975 -550 44 644 1040 864 204 -394 -613 -897 -582 88 211 828
2093H28j42j02o38o25n9M9M93M77O42j10j05j044j76n26L05R73L01J15J86m45
$$ 828 686 584 -54 -679 -738 -689 -196 281 923 813 708 -336 -512 -1038 -733 240 541 656 842 397
2113C97m95m37q4p4N03P52K09m3l13n19o15k91K03M75O78N24l94q6l57m81m50
$$ 397 -98 -535 -619 -693 -190 562 771 728 415 -104 -719 -1010 -807 -332 346 870 476 390 33 -448 -898
2134h98K84M25L56N51m9j35n06p11k42K23M80N14N19q6j40o04l87o01J11O34L09
$$ -898 -614 -189 167 718 669 534 28 -683 -925 -702 -222 292 811 725 585 -19 -406 -1007 -896 -262 47
2155D7M83J74Q1m89q10l27j16L49R62L91O8j12m30o21m05n7K81N59M99L36l69
$$ 47 530 704 785 296 -514 -841 -957 -608 354 745 813 701 271 -350 -755 -812 -531 28 527 863 494
2176D94p1p08k59k04K64N15N32K92k08j05o05n36j56J81N75O48j40J77o10l18
$$ 494 423 -285 -544 -748 -484 31 563 855 647 542 -63 -599 -755 -574 1 649 509 686 76 -242
2196b42l40k66J73N15O26L80j9n52m33o20o6M10L63N70K00P7o31k55m51j64j35
$$ -242 -582 -848 -675 -160 466 846 827 275 -158 -778 -844 -434 -71 499 699 776 145 -110 -561 -725 -860
2217h60N73O88M5M34k50p56j47o36J68O22M14M36l0j35n50o22Q5M7Q6P70M97l31
$$ -860 -287 401 446 880 630 -126 -273 -909 -741 -119 295 731 701 566 16 -606 -521 -474 -388 382 879 548
2239E48j44j80p22j51M44J58L12P01l40k77k01m72o58L27K47N41M90J65k67o45
$$ 548 404 224 -498 -649 -205 -47 265 966 626 349 148 -324 -982 -655 -408 133 623 788 521 -124
2259a24k40k67j82P66L21L52L20m07m12n50j18l31O58K88O12K43l22k59o05n65
$$ -124 -364 -631 -813 -47 274 626 946 539 127 -423 -541 -872 -214 74 686 929 607 348 -257 -822
2279h22K61K85M33N56j9j27l76m36m06j60M06M83N77J09j10m87l09n18k7L02M16
$$ -822 -561 -276 157 713 694 567 191 -245 -651 -811 -405 78 655 764 654 167 -142 -660 -687 -385 31
2300C1M82K91j74l95n28j76q4J66L18M53M14j61k24p25m96J02L10O12L38R9q5
$$ 31 513 804 630 235 -293 -469 -553 -387 -69 384 798 637 413 -312 -808 -706 -396 216 554 653 568
2321E68j48o21l35j6k5N97K58J66K74j21o99m01j86l6P47M35L45j21j00o16n68
$$ 568 420 -201 -536 -552 -577 20 278 444 718 597 -102 -503 -689 -725 22 457 802 681 581 -35 -603
2342f03q3L56L01N44q0N1j65m15m56m75M39L33O36K88J0k13l28o13l77J10N04
$$ -603 -686 -330 -29 515 435 486 321 -94 -550 -1025 -586 -253 383 671 681 468 140 -473 -850 -740 -236
2363b36L54L56J35j29m53l51r1J60l7O23L77j3k32m67k66l21OL8O80L75J05j86
$$ -236 118 474 609 480 27 -324 -415 -255 -292 331 708 695 463 -4 -270 -591 -585 -547 133 508 613 427
2385D27l33k13m39j52L60N68K09K74j35m93m53q6J57k64O21N87M1n8l92m25m21
$$ 427 94 -119 -558 -710 -350 218 427 701 566 73 -380 -466 -309 -573 48 635 676 618 226 -199 -620
2406f20p4K29L63Q02n0j19l59k29n57jK18M87L52L82j51n42l71k40k4J58M58K59
$$ -620 -694 -465 -102 700 650 531 172 -57 -614 -615 -397 90 442 824 673 131 -240 -480 -504 -346 112 371
2428C71K88m0k31k60o03r4P5O94J37J72L73o06m06j36l50K71M85K62l8R5k11l99
$$ 371 659 619 388 128 -475 -569 -494 200 337 509 882 276 -130 -266 -616 -345 140 402 364 459 248 -151
2450a51l40R8q2K81N05P5L5k80m21m85L96o1L48M35K87L1m33k36m62j48R5L20
$$ -151 -491 -393 -475 -194 311 386 421 141 -280 -765 -369 -430 -82 353 640 671 238 2 -460 -608 -513 -193
2472a93M57K83J16l73k00l32n28L70K14J67L71M14m33m59M3m61o2P25O3K46L86
$$ -193 264 547 663 290 90 -242 -770 -400 -186 -19 352 766 333 -126 -83 -544 -606 119 182 428 814
2493H14n25m07M5m34J9K91L78K40J58q7l11l19l07l93O69M33K96j47k02j54k80
$$ 814 289 -118 -73 -507 -488 -197 181 421 579 492 181 -138 -445 -838 -169 264 560 413 211 57 -223
2514b23k23J37M9M16Q3L78j28k20m51l10o0Q1N12K38K75r7j67n91l40k3L51N58
$$ -223 -446 -309 -260 156 239 617 489 269 -182 -492 -552 -471 41 279 554 457 290 -301 -641 -664 -313 245
2536B45O4J34K1l89o9m04j89M33j07M85J08J55k68m95Q7l35J07L14N36J23q4p3
$$ 245 309 443 464 75 6 -398 -587 -154 -261 224 332 487 219 -276 -189 -524 -417 -103 433 556 472 399
2558C99n82k53j57J26N52K81J99m7l52l77j80k94K62K80M36L8K80J6o66n00j47
$$ 399 -183 -436 -593 -467 85 366 565 518 166 -211 -391 -685 -423 -143 293 331 611 627 -39 -539 -686
2579f86M41J63K50K84j82P6j45o41p6n7J84O12O5J36l0l86l28l58O78k3K15K12
$$ -686 -245 -82 168 452 270 346 201 -440 -516 -573 -389 223 288 424 394 8 -320 -678 0 -23 192 404
2601D04r3j68j01j68l81l6J51N43O0N16j12o57l54M3j33K97K42Q1M96j69l52m33
$$ 404 311 143 42 -126 -507 -543 -392 151 211 727 615 -42 -396 -353 -486 -189 53 134 630 461 109 -324
2623c24K7k09K47L87K62o0Q0l95k35j75J13m23Q58L95l56J05j41k69m39L25r1
$$ -324 -297 -506 -259 128 390 330 410 15 -220 -395 -282 -705 153 548 192 297 156 -113 -552 -227 -318
2644c18L97K14Lj6l12j09k60j14K52L83K69P5r0q6l96j69jk6L71j6K18J47j95
$$ -318 79 293 296 280 -32 -141 -401 -515 -263 120 389 464 374 288 -108 -277 -278 -304 67 51 269 416 221
2667B21k99l85j46L84J03R9N04O0l21k16Q2l52L2j10O64j56K31l8m32R4m13J67
$$ 221 -78 -463 -609 -225 -122 -23 481 541 220 4 86 -266 -234 -344 320 164 395 357 -75 19 -394 -227
2689b27K8K51L66N0o6l54k35r7j26N19K38j41J70j28j24m32p8k9J85L15K45l8
$$ -227 -199 52 418 468 402 48 -187 -284 -410 109 347 206 376 248 124 -308 -386 -415 -230 85 330 292
2711B92L4k79k25k32p7K63J97J12L60j31M7o06j6P9P6Q5L60q0K36l48k78j76m0
$$ 292 326 47 -178 -410 -487 -224 -27 85 445 314 361 -245 -261 -182 -106 -21 339 259 495 147 -131 -307 -347
2734c47L32K44q4K39j91r5m98J34J12k02K70lM67k07k87J77m50m1O9K94M82j81
$$ -347 -15 229 145 384 193 98 -400 -266 -154 -356 -86 -89 378 171 -116 61 -389 -430 -361 -67 415 234
2756B34J43k03l59K13k42j19M47P0m7L06k43l00l5k58J56K39J28L73k58r9l81
$$ 234 377 174 -185 28 -214 -333 114 184 137 443 200 -100 -135 -393 -237 2 130 503 245 146 -235
2777b35j24L5J46L64m5R9J46k20l01j30m0J46K45M2K19P5k53j95n7k78%K91J39
$$ -235 -359 -324 -178 186 141 240 386 166 -135 -265 -305 -159 86 128 347 422 169 -26 -83 -361 -361 -70 69
2800F9J75K59k15l75n1k32L34J16j49L53Q8Rm79j57K6k68L33K10L20l13K71k39
$$ 69 244 503 288 -87 -138 -370 -36 80 -69 284 372 381 -98 -255 -229 -497 -164 46 366 53 324 85
2822H5l95m2j02M78N6K7L26j73P4m77M8k36J18M24M5K40j79l07j52j88J62m2M1
$$ 85 -310 -352 -454 24 80 107 433 260 334 -143 -95 -331 -213 211 256 496 317 10 -142 -330 -168 -210 -169
2845a69L25L54k96j89j76j79MK3K90K64Q6k68L6nl66j11L62R1J3L00j94M2m84
$$ -169 156 510 214 25 -151 -330 -326 -303 -13 251 337 69 105 100 -266 -377 -15 76 89 389 195 237 -247
2868b47J5l6O7J92K17J00J42m13r0j11N5j00ML4L01O8j13j63l75J86qK00J90J09
$$ -247 -232 -268 -201 -9 208 308 450 37 -53 -164 -109 -209 -205 -171 130 198 85 -78 -453 -267 -275 -75 115 224
2892B24l6J06m86J13j65j49L23N6K02p4m0k05p1q4J39L28k97N16R6l91j18k13
$$ 224 188 294 -192 -79 -244 -393 -70 -14 188 114 74 -131 -202 -286 -147 181 -116 400 496 105 -13 -226
2914b26J72l69K24P0L27K64k62J33l08l43o4L29r2M64k1rk99Q1k61j71L61M1N7
$$ -226 -54 -423 -199 -129 198 462 200 333 25 -318 -382 -53 -145 319 298 289 -10 71 -190 -361 0 41 98
2937I8l3J49k27K2k83P6m3L91K51o7j35k0j54j28j89N5O33k26K01k29k69j29k0
$$ 98 65 214 -13 9 -274 -198 -241 150 401 334 199 179 25 -103 -292 -237 396 170 371 142 -127 -256 -276
2960b76j4K69j75L08K93o2l94j36q5j13L65J90k33N15j83p4k59k56OJ37K40J52
$$ -276 -290 -21 -196 112 405 343 -51 -187 -272 -385 -20 170 -63 452 269 195 -64 -320 -314 -177 63 215
2982B15J88o3j41R6l12j41Q2N5K10R2p2k6k86j06j85P5L55L03j89J12K4k92k80
$$ 215 403 340 199 295 -17 -158 -76 -21 189 281 209 183 -103 -209 -394 -319 36 339 150 262 286 -6 -286
3005b86Q3p1K62J35K68r5n5r3n33R6N9J14J22P2K95m06j4p2R9k96L80k5K07K50
$$ -286 -203 -274 -12 123 391 296 241 148 -385 -289 -230 -116 6 78 373 -33 -47 -119 -20 -316 64 39 246 496
3029D96k79q9k86j01qMN40k22J01J0j92J24j75j42J07J71n8J53j5M5k60l64K05
$$ 496 217 128 -158 -259 -267 -263 277 55 156 166 -26 98 -77 -219 -112 59 1 154 139 184 -76 -440 -235
3052b35J93K9K68j80q7J88k93r8k41K58K52K39j09K52k13j55l05n2J93K99r7m6
$$ -235 -42 -13 255 75 -12 176 -117 -215 -456 -198 54 293 184 436 223 68 -237 -289 -96 203 106 60
3074F0K5j29Q8k7k96J63J96m1K05O1j60j00n6j63J33R5J04K34j35p2j37J5k62
$$ 60 85 -44 44 17 -279 -116 80 39 244 305 145 45 -11 -174 -41 54 158 392 257 185 48 63 -199
3097a99O4J61J19K34r9j80K5k03r5j58L44K51J40l38K15l33j15j71J24K00j12
$$ -199 -135 26 145 379 280 100 125 -78 -173 -331 13 264 404 66 281 -52 -167 -338 -214 -14 -126
3118a26N17k17K82m65o4lj91J07L28K7mo7l18J12l9q6l5K02K57p7J18k34M8k50
$$ -126 391 174 456 -9 -73 -76 -267 -160 168 195 191 124 -194 -82 -121 -207 -242 -40 217 140 258 24 72 -178
3142a78r5N5J01J28P0k4J78j53l77J69m1J66J24J36k08k4K6p1Q1k10J96K28OR6
$$ -178 -273 -218 -117 11 81 57 235 82 -295 -126 -167 -1 123 259 51 27 53 -18 63 -147 49 277 283 379
3166C79m47p5L54k56m00J65M55o9Q2N2j01k33R6k93K05J96J09q5k46J77k68j29
$$ 379 -68 -143 211 -45 -445 -280 175 106 188 240 139 -94 2 -291 -86 110 219 134 -112 65 -203 -332
3188c32J62J68k68N09o5J02j15m37J05K22m4p4K93j23r0J28l88L32l03J40K10
$$ -332 -170 -2 -270 239 174 276 161 -276 -171 51 7 -67 226 103 13 141 -247 85 -218 -78 132
3209A32q7L9n3k4lk19j00qJ35J04j07M06k82p6j7k2L7K50k28L35Qk50j55O1J54
$$ 132 45 84 31 7 4 -215 -315 -323 -188 -84 -191 215 -67 -143 -160 -182 -145 105 -123 212 220 -30 -185 -124 30
3234C0P4J8J70j63O8n6K6m67R0J91J71P4J59j84k76j25J4p9J8K78K25K11j72k83
$$ 30 104 122 292 129 197 141 167 -300 -210 -19 152 226 385 201 -75 -200 -186 -265 -247 31 256 467 295 12
3258A2R2j50r2N5O7J04P8K5j10j05k46J4J52K2N8J24K91k72k15Q0j2j06N5M53
$$ 12 104 -46 -138 -83 -16 88 166 191 81 -24 -270 -256 -104 -82 -24 100 391 119 -96 -16 -28 -134 -79 374
3282C74n6q3k69J82l61L17k92K10J28pn1j5M6l02o9M0P8K49o3kK84k17k76O5l0
$$ 374 318 235 -34 148 -213 104 -188 22 150 143 92 77 123 -179 -248 -208 -130 119 56 54 338 121 -155 -90 -120
3307a20L4J30K05j35p5J5n2k09L9n7K70J17k0J67m14J87k65K28k61L12J7J85j17
$$ -120 -86 44 249 114 39 54 2 -207 -168 -225 45 162 142 309 -105 82 -183 45 -216 96 113 298 181
3330A81j37k59J22j21K36J8N4O4%j81mj57P6Q2k1K8J92J75m39o5Q4k89K24R4R0
$$ 181 44 -215 -93 -214 22 40 94 158 158 -23 -27 -184 -108 -26 -47 -19 173 348 -91 -156 -72 -361 -137 -43 47
3355D7l5J4J50k05Lj46l3P9K53k1j0j97j69o3J72M4J58l6P8j7K24j97k99J66k95
$$ 47 12 26 176 -29 -26 -172 -205 -126 127 106 96 -101 -270 -333 -161 -117 41 5 83 66 290 93 -206 -40 -335
3380c35K45L00p0J17J27j37j38k61p9J86MJ21j25P6L1q7j27J27mN1J88k29J33
$$ -335 -90 210 140 257 384 247 109 -152 -231 -45 -41 80 -45 31 62 -25 -152 -25 -29 22 210 -19 114
3403A14k8j01po0j30K32J9L58l90O5r9j21L0l1L59M9l76J38O5j40J24k18k92M58
$$ 114 86 -15 -22 -82 -212 20 39 397 7 72 -27 -148 -118 -149 210 259 -117 21 86 -54 70 -148 -440 18
3427A8K1K34l89L94l24Q6k32n7K61J3J55j66K3kk8k99J35O8J66j6J50k58M9N9
$$ 18 39 273 -116 278 -46 40 -192 -249 12 25 180 14 37 35 7 -292 -157 -89 77 61 211 -47 2 61
3451F1j42L8k5R7L37j08l04O0p3N3k2J10J30Ol8k14%q9j41J05m9J88j6M34j40
$$ 61 -81 -43 -68 29 366 258 -46 14 -59 -6 -28 82 212 218 180 -34 -34 -123 -264 -159 -208 -20 -36 398 258
3476B58k0l24O2k18K9L08L0J96o4l43Q2m4j27J91j8pJ52K83l89p6P0j36N0M7J34
$$ 258 238 -86 -24 -242 -213 95 125 321 257 -86 -4 -48 -175 16 -2 -9 143 426 37 -39 31 -105 -55 -8 126
3501A26n1jN9j70L6k96K39J05ql3K94k96J87l73J35o2M8K25j49K4q9l7%k01M6
$$ 126 75 74 133 -37 -1 -297 -58 47 39 6 300 4 191 -182 -47 -109 -61 164 15 39 -50 -87 -87 -288 -242
3526b42K52KJ21J8l8k99M5k63L53k21M53J55l34K4j17Q2l39K11j95L74L53j92
$$ -242 10 12 133 151 113 -186 -141 -404 -51 -272 181 336 2 26 -91 -9 -348 -137 -332 42 395 203
3548B03K70k56l14L09l41LK00K81l52R2j65k36j10K25LK47P3K04l65K01j96j08
$$ 203 473 217 -97 212 -129 -126 74 355 3 95 -70 -306 -416 -191 -188 59 132 336 -29 172 -24 -132
3570a32Q6k82L17N6M56m25k51nJ55l1q6J66J53Q6p0j86N6k93K26PR9N9j07j02
$$ -132 -46 -328 -11 45 501 76 -175 -180 -25 -56 -142 24 177 263 193 7 63 -230 -4 3 102 161 54 -48
3594d8K40l33K1n0Q9q8N00j3n0q4j18k82j03p7K89j2K00N2j47P8l28J66j39L47
$$ -48 192 -141 -120 -170 -81 -169 331 318 268 184 66 -216 -319 -396 -107 -119 81 133 -14 64 -264 -98 -237 110
3618A10k48J58J16j3m3j04k79K93J89j12M3K26j99k04j21j18K19K52k14oK56r1
$$ 110 -138 20 136 123 80 -24 -303 -10 179 67 110 336 137 -67 -188 -306 -87 165 -49 -55 201 110
3640A10l43j61K22K57j23J98Q3l6J7k70K3j21lmL45j89J5o0k8j10MJ56p8J6J76
$$ 110 -233 -394 -172 85 -38 160 243 207 224 -46 -23 -144 -147 -151 194 5 20 -40 -68 -178 -174 -18 -96 -80 96
3665I6P9l24J43j41j03l5L74r8oK44Lj78m13J68L6K38j54K83J07k77K41l66J18
$$ 96 175 -149 -6 -147 -250 -285 89 -9 -15 229 232 54 -359 -191 -155 83 -71 212 319 42 283 -83 35
3688C5k20K86j16L83m71L17j56j12j59K55j76R1qN3J42l33P5Mj95K65m6J84J10
$$ 35 -185 101 -15 368 -103 214 58 -54 -213 42 -134 -43 -51 2 144 -189 -114 -110 -305 -40 -86 98 208
3711B08k5R9m09J67k96J81j56M23j06L17o05j06K27r4J5j32M42L14j19n85J56
$$ 208 183 282 -127 40 -256 -75 -231 192 86 403 -202 -308 -81 -175 -160 -292 150 464 345 -240 -84
3732h4p0J80j99N8Q8J72q1K6q8J02m37K01q9L39L33j95j61j81M0j65J74J06r4
$$ -84 -154 26 -173 -115 -27 145 64 90 2 104 -333 -132 -221 118 451 256 95 -86 -46 -211 -37 69 -25
3755b5J21K61l05k35R8j68J26P8L4K07j15J58j91k01J68j47J66J80J08k3l92Q3
$$ -25 96 357 52 -183 -85 -253 -127 -49 -15 192 77 235 44 -157 11 -136 30 210 318 295 -97 -14
3777a4j34M8o1J12N8K25o9j73m6r4k82L20J96j75n3J96J99l2l52O4K7K60k18J70
$$ -14 -148 -100 -161 -49 9 234 165 -8 -54 -148 -430 -110 86 -89 -142 54 253 221 -131 -67 -40 220 2 172
3801A72r4P8P9m95K37l06L29p0K9K36j1m2l48K04j21M3O8L37k88J52j31k4j07
$$ 172 78 156 235 -260 -23 -329 0 -70 -41 195 184 142 -206 -2 -123 -80 -12 325 37 189 58 34 -73
3824g3k38J53Q4K55q4j59m2R8J15l08J87P3J2R9j67M6o0K7k72J05J08l7J34J70
$$ -73 -311 -158 -74 181 97 -62 -104 -6 109 -199 -12 61 73 172 5 51 -9 18 -254 -149 -41 -78 56 226
3848B26l15p7J41j23M5N0k24L39J94k31J27k35J36k1q3nJ78K4l8j17Q1o0j20Q5
$$ 226 -89 -166 -25 -148 -103 -53 -277 62 256 25 152 -83 53 32 -51 -56 122 146 108 -9 72 12 -108 -23
3872b3q6L25j61j1K8j89q5L4%L58r8J89o4k43j66J66n4m1J8M03j83j12k53L1Q4
$$ -23 -109 216 55 44 72 -117 -202 -168 -168 190 92 281 217 -26 -192 -26 -80 -121 -103 300 117 5 -248 -217 -133
3897a33k96L76K69K74m62K14j94M0m23Q4L47j31O5J19K19l82n5n0n9J04J54J23
$$ -133 -429 -53 216 490 28 242 48 88 -335 -251 96 -35 30 149 368 -14 -69 -119 -178 -74 80 203
3919B03m0J60l11m5l1l7P1N3J25J8J04n10K03j60J6j86K58L46l9l04r3K54n8k5
$$ 203 163 323 12 -33 -64 -101 -30 23 148 166 270 -240 -37 -197 -181 -367 -109 237 198 -106 -199 55 -3 -28
3943b8m1nJ87L9K59l61N4m09J19R6n1L29j89J72j07k09J65o1K0J58j21K4p3J37
$$ -28 -69 -74 113 152 411 50 104 -305 -186 -90 -141 188 -1 171 64 -145 20 -41 -21 137 16 40 -33 104
3967A04j72k65N48m86L64j24J57J72j17k42m4o1J5J3J76j44L91j73k6k26kK37
$$ 104 -68 -333 215 -271 93 -31 126 298 181 -61 -105 -166 -151 -138 38 -106 285 112 86 -140 -142 95
3989I5k89J06J02L88o6j70m9j76R0o4j30J43K73l79o0J44k62K04n1J77P9L9k7
$$ 95 -194 -88 14 402 336 166 117 -59 31 -33 -163 -20 253 -126 -186 -42 -304 -100 -151 26 105 144 117
4012A17j06K36m19j15K14J45K1M5k00j19J40j0j53L35L3J09o7j62j23p5L8J13
$$ 117 11 247 -172 -287 -73 72 93 138 -62 -181 -41 -51 -204 131 164 273 206 44 -79 -154 -116 -3
4034cq7K63j17Q3j17O0m9j56l1j06K86L03o6Qj19m64nn4L99J35j36O2J05l3j01
$$ -3 -90 173 56 139 22 82 33 -123 -154 -260 26 329 263 271 152 -312 -317 -371 28 163 27 89 194 161 60
4059F0j55j3MO8r4J35J74J59m80K9l8N8K21n4J14r4J42k90K35l94n6L51M0K6M3
$$ 60 -95 -108 -104 -36 -130 5 179 338 -142 -113 -151 -93 128 74 188 94 236 -54 181 -213 -269 82 122 148 191
4084A91k2k24l9P7m02N12j77L85k33l0J65k54R3k29p8N08k60K29L3l27jl9Lj21
$$ 191 169 -55 -94 -17 -419 93 -84 301 68 38 203 -51 42 -187 -265 243 -17 212 245 -82 -83 -122 -119 -240
4108b40J66Q7K90r6p5j34J04O8k19j36J61q4J04J16l1r2r2L8L24k44J77Q4l33
$$ -240 -74 13 303 207 132 -2 102 170 -49 -185 -24 -108 -4 112 81 -11 -103 -65 259 15 192 276 -57
4131e7K72j91M6k5J5q1K29q0j73j22K3J55J9l2J4J53j95J44j04j50J38KmnK37
$$ -57 215 24 70 45 60 -21 208 128 -45 -167 -144 11 30 -2 12 165 -30 114 10 -140 -2 0 -4 -9 228
4156B28J05k84Pj38%j53K82q1K95p5k95L4r0J54q7k5J07k2J34l26Q1J33j21O4
$$ 228 333 49 56 -82 -82 -235 47 -34 261 186 -109 -75 -165 -11 -98 -123 -16 -38 96 -230 -149 -16 -137 -73
4180g3J49nK5J22k65k7j22n8O5J41J59J06p2o5J43m34L8N9J61p8L4r9K98j87M2
$$ -73 76 71 96 218 -47 -74 -196 -254 -189 -48 111 217 145 80 223 -211 -173 -114 47 -31 3 -96 202 15 57
4205E7n8N1j4K08r7j63P0J31k07nn5J73j89L35j97q2M6M3k05J04K0J31J03j26
$$ 57 -1 50 36 244 147 -16 54 185 -22 -27 -82 91 -98 237 40 -42 4 47 -158 -54 -34 97 200 74
4229G4J3p7j3k18K22jJ68J8r3L0j31J63k68K13j13KL0J19K49j98l43R0p4p1K48
$$ 74 87 10 -3 -221 1 0 168 186 93 123 -8 155 -113 100 -13 -11 19 138 387 189 -154 -64 -138 -209 39
4254C9m6q1J62k17j54J67j58J96K5K10q9j22Q5o5j0O0M9K33p6j16K6l02M71l13
$$ 39 -7 -88 74 -143 -297 -130 -288 -92 -67 143 54 -68 17 -48 -58 2 51 284 208 92 118 -184 287 -26
4278b6k01N34k90J33j49J42j79j88L12j69L3N7KJ82k7n3o1K9K5l2j7j54J06O7
$$ -26 -227 307 17 150 1 143 -36 -224 88 -81 -48 9 11 193 166 113 52 81 106 74 57 -97 9 76
4302G6P4k21j29L52l88J39R4J5O8j06j31K0J44j91K40j11J48M8k89K02r3j24K97
$$ 76 150 -71 -200 152 -236 -97 -3 12 80 -26 -157 -137 7 -184 56 -55 93 141 -148 54 -39 -163 134
4325A34%k48R4J15l3J94j75l21L03j92L06k88M37l34k0m4k86K62NK12o1Q6J8p0
$$ 134 134 -114 -20 95 62 256 81 -240 63 -129 177 -111 326 -8 -28 -72 -358 -96 -91 121 60 146 164 94
4349I4j7m18N7QJ34L54L7l76N2q3k29J22N20k56K72j00m0j37J37J15k49j2N6J53
$$ 94 77 -341 -284 -276 -142 212 249 -127 -75 -158 -387 -265 255 -1 271 171 131 -6 131 246 -3 -15 41 194
4373A94k15N0j6l53K40k1J3Q7J40J6o2j85j87M79j73J60l52L59k80K58j78kp2
$$ 194 -21 29 13 -340 -100 -121 -108 -21 119 135 73 -112 -299 180 7 167 -185 174 -106 152 -26 -28 -100
4396a00N7k14J93K33j24J69k20j50K70k79N5J78j16L20k11P3k48J75q5k50K28
$$ -100 -43 -257 -64 169 45 214 -6 -156 114 -165 -110 68 -48 272 61 134 -114 61 -24 -274 -46
4417d6Q9R8L4k15j08L00k45K02K7Lk58M4M33n26K21Rj61L0J31J6M9j08K11q1r0
$$ -46 43 141 175 -40 -148 152 -93 109 136 139 -119 -75 358 -168 53 62 -99 -69 62 78 127 19 230 149 59
4442E9j5n4k17K52R3R6l38pJ59LJ75k35N4J55r7j09o0O6k32K36j00K14k3O3j35
$$ 59 44 -10 -227 25 118 214 -124 -131 28 31 206 -29 25 180 83 -26 -86 -20 -252 -16 -116 98 75 138 3
4467Cj32J8j80L16o6R3J71J9k03J30l47J70j87K43Qj25j20K55j22J31L9L4k3o3
$$ 3 -129 -111 -291 25 -41 52 223 242 39 169 -178 -8 -195 48 56 -69 -189 66 -56 75 114 148 125 62
4491F2j95L46j91k4J9p7P9P8k18K02K29m47J58p5P8j51J09O6l6J05j91R7O4l27
$$ 62 -133 213 22 -2 17 -60 19 97 -121 81 310 -137 21 -54 24 -127 -18 48 12 117 -74 23 87 -240
4515b40N3K8M95k01o0o4J83j86l0m9j28M36k5p9R9l21m2J45Q8j39J75J1o4J2q
$$ -240 -187 -159 336 135 75 11 194 8 -22 -71 -199 237 212 133 232 -89 -131 14 102 -37 138 149 85 97 89
4540H9R4j12l43K58j4J44l5o7kLo5j68K47J0j28P9K05K4k03k35L09j08j5J19k12
$$ 89 183 71 -272 -14 -28 116 81 14 12 15 -50 -218 29 39 -89 -10 195 219 16 -219 90 -18 -33 86 -126
4565a26K51j29j55O6j74K81J67k67j51J94K8j6Q1j99L26k09J0J41Rn1j86j68M56
$$ -126 125 -4 -159 -93 -267 14 181 -86 -237 -43 -15 -31 50 -149 177 -32 -22 119 128 77 -109 -277 179
4588A79r9k18Q2L5J05o2j10J38m2k1j01K12n4n4l1P3n7n9J71j6j38J76j0k18K38
$$ 179 80 -138 -56 -21 84 22 -88 50 8 -13 -114 98 44 -10 -41 32 -25 -84 87 71 -67 109 99 -119 119
4613A19j32rk28K87J69j19q0r6J29j43J69J1k17J73k15L69q6k38n1K76j08q5M69
$$ 119 -13 -22 -250 37 206 87 7 -89 40 -103 66 77 -140 33 -182 187 101 -137 -188 88 -20 -105 364
4636C64k80k2J28k71R7j91R0J27L23k28j74j0J7r8J15q7O0J9K7k05K34j57K10
$$ 364 84 62 190 -81 16 -175 -85 42 365 137 -37 -47 -30 -128 -13 -100 -40 -21 6 -199 35 -122 88
4659H8l85L22K5k43M55j99j34K4P4j06o4J68j28M8J07J49k40R5q6J45j58K54l04
$$ 88 -297 25 50 -193 262 63 -71 -47 27 -79 -143 25 -103 -55 52 201 -39 56 -30 115 -43 211 -93
4682i3L5J38k75L63k20j99K80k58Q8L42K32n11J68j23j57R3J26Rk38K81j42k39
$$ -93 -58 80 -195 168 -52 -251 29 -229 -141 201 433 -78 90 -33 -190 -97 29 38 -200 81 -61 -300
4704c00K14j66K57l2J76j70q0O4q7p9J56l1k4K29M3k35j76K21J25j76Q9J75k38
$$ -300 -86 -252 5 -27 149 -21 -101 -37 -124 -203 -47 -78 -102 127 170 -65 -241 -20 105 -71 18 193 -45
4727d5n3P1m9J41j09j74M73n00L29L0m3J57k80r7K38J2j26L65l87J53p3q0n7J3
$$ -45 -98 -27 -76 65 -44 -218 255 -245 84 114 71 228 -52 -149 89 101 -25 340 -47 106 33 -47 -104 -91
4751i1K27J7l0r9r0K92l23P9KJ01j67L44j71j59L21k78N8j26J69o7P3p9J39j82
$$ -91 136 153 123 24 -66 226 -97 -18 -16 85 -82 262 91 -68 253 -25 33 -93 76 9 82 3 142 -40
4775d0J72j54j9m4kJ86O9k77J99m8J20r5J19k5l51K40M6k09j4L7J65PJ38m1l61
$$ -40 132 -22 -41 -85 -87 99 168 -109 90 42 162 67 186 161 -190 50 96 -113 -127 -90 75 82 220 179 -182
4800a82M92j97K32k77k23Q2NK42l23K10l8k12Q4J76J19o8q3r5J84l21L24r5J61
$$ -182 310 113 345 68 -155 -73 -68 174 -149 61 23 -189 -105 71 190 122 39 -56 128 -193 131 36 197
4823A97l49Q2L11j47m1L6j52J07j76K08j73J90j78NP9m7P5J32l47p2N12K5k46
$$ 197 -152 -70 241 94 53 89 -63 44 -132 76 -97 93 -85 -80 -1 -48 27 159 -188 -260 252 277 31
4846C1j83N6j9n8J24j81K61J34R4k75j86J51J1j43K48j59L05M8k18j97J11M7l7
$$ 31 -152 -96 -115 -173 -49 -230 31 165 259 -16 -202 -51 -40 -183 65 -94 211 259 41 -156 -45 2 -35
4869c5o8j08J87N4pn5J44j55J42q2Q9k22J80j5j17J67J96l08n7O9O9o2l3J31k86
$$ -35 -103 -211 -24 30 23 -32 112 -43 99 17 106 -116 64 49 -68 99 295 -13 -70 -1 68 6 -27 104 -182
4894a82q0N5K28j39Q9J89o3k56nO2k33M49j24o5L1L7K71j19M3j64j20K95j66j36
$$ -182 -262 -207 21 -118 -29 160 97 -159 -164 -102 -335 114 -10 -75 -44 -7 264 145 188 24 -96 199 33 -103
4918a03l4K38jj04QM9j76P6o0J14j96J51J9o2M2q2K02p5k51L75k25m0J99O5l9
$$ -103 -137 101 100 -4 4 53 -123 -47 -107 7 -189 -38 -19 -81 -39 -121 81 6 -245 130 -95 -135 64 129 90
4943I0k50J88LP6J87j04q1k89K17J3j89K11j17K16j47j01P4j93kM0NR4M4k02J85
$$ 90 -160 28 31 107 294 190 109 -180 37 50 -139 72 -45 171 24 -77 -3 -196 -198 -158 -153 -59 -15 -217 -32
4968c2J77k07n2N1K20k50K77q4j38M2j03qj05L87l19q1J05L4NQ6K45k47j54J50
$$ -32 145 -62 -114 -63 157 -93 184 100 -38 4 -99 -107 -212 175 -144 -225 -120 -86 -81 5 250 3 -151 -1
4992ap1K61j95K38l88J19J39o4L1p3m1k1K31j78m7Q1k28p8L81K43k41l71K96j96
$$ -1 -72 189 -6 232 -156 -37 102 38 69 -4 -45 -66 165 -13 -60 21 -207 -285 96 339 98 -273 23 -173
5016a73J28j19K67r7L8j92Q1O7j36LN7m5J30j88N2lJ47K20k71j00L09l53K00p7
$$ -173 -45 -164 103 6 44 -148 -67 0 -136 -133 -76 -121 9 -179 -127 -130 17 237 -34 -134 175 -178 22 -55
5040e5j8j02O2K49K14k67j17Q6n2j61J59N8L5QM1K48m57N7k51K69J57o3j41M4
$$ -55 -73 -175 -113 136 350 83 -34 52 0 -161 -2 56 91 99 140 388 -69 -12 -263 6 163 100 -41 3
5064Cm4K15q2O3j39k50J06K3j58L40p8N9P1q7L1j52j24K48l8j14K17k57L59n61
$$ 3 -41 174 92 155 16 -234 -128 -105 -263 77 -1 58 129 42 73 -79 -203 45 7 -107 110 -147 212 -349
5088c49L47JJ21j39J56q7j18om0k29K43R9j90L23k17J21J6J40k51q2K55j09M8
$$ -349 -2 -1 120 -19 137 50 -68 -74 -114 -343 -100 -1 -191 132 -85 36 52 192 -59 -141 114 5 53
5111E3J40Ml31j36M12k38J63p1m3K46j90k9J71k77J5P1J9J5K3n0J53j47J58l46
$$ 53 193 197 -134 -270 142 -96 67 -4 -47 199 9 -20 151 -126 -111 -40 -21 -6 17 -33 120 -27 131 -215
5135b15P1K07j91J2j49L11j49J38J12k33J1J57p0J1j3L0kj04k4O8Q6n6J24l61
$$ -215 -144 63 -128 -116 -265 46 -103 35 147 -86 -75 82 12 23 10 40 38 -66 -90 -22 64 8 132 -229
5159b29K20j31J37J20j47K40j16j87K1J26n9J08j12NJ50J43j25j53j22K81j84
$$ -229 -9 -140 -3 117 -30 210 94 -93 -72 54 -5 103 -9 -4 146 289 164 11 -111 170 -14
5180a4j20K1K94m51L77j16l6j90K61j68M28k67N3j96j12M99m02J58L9k1P5l3j78
$$ -14 -134 -113 181 -270 107 -9 -45 -235 26 -142 286 19 72 -124 -236 263 -139 19 58 37 112 79 -99
5203i9l6K98m22PL44r1K15k3k58K9l7J46m21L80J01l1n6j00J39j74K55k98K92
$$ -99 -135 163 -259 -252 92 1 216 193 -65 -36 -73 73 -348 32 133 102 46 -54 85 -89 166 -132 160
5226A60k45pq6M86k86k19L60l28J6K55k4p4p9K77k18n9J31k25J30J1J56J41m04
$$ 160 -85 -92 -178 308 22 -197 163 -165 -149 106 82 8 -71 206 -12 -71 60 -165 -35 -24 132 273 -131
5249a31J29m3O7l9K94k51L24m04J03l30J80J98O6Oj08J29j48n7J30j22J00R1j28
$$ -131 -2 -45 22 -17 277 26 350 -54 49 -281 -101 97 163 169 61 190 42 -15 115 -7 93 184 56
5272E6k09K22o3k21K03j57M7J36L8J08k2j98J36k09j25L62J4l4q0j1KL3o2Jj07
$$ 56 -153 69 6 -215 -12 -169 -122 14 52 160 138 -60 76 -133 -258 104 118 84 4 -7 -5 28 -34 -33 -140
5297a40K03j41k70L47j39r3J19l3r5J03L4q2J52K17j96L06l27Q3j50jnJ18j59
$$ -140 63 -78 -348 -1 -140 -233 -114 -147 -242 -139 -105 -187 -35 182 -14 292 -35 48 -102 -103 -108 10 -149
5320a49N9P2J9j78mJ30L8J21j39q7J83j1OJ71j46j44Q6k4NJ74k31o9K03k60L36
$$ -149 -90 -18 1 -177 -181 -51 -13 108 -31 -118 65 54 60 231 85 -59 27 3 8 182 -49 -118 85 -175 161
5345A61o1r2j33K82n3j18L01k95J33k66J24j65K99j73o7K98j97j72J14J27J37
$$ 161 100 8 -125 157 104 -14 287 -8 125 -141 -17 -182 117 -56 -123 175 -22 -194 -80 47 184
5366A84m12J37L1K1m1R9K55n1j70j57J10O5n7j6k41K54N5J5J11mm0p0j61k32M72
$$ 184 -228 -91 -60 -39 -80 19 274 223 53 -104 6 71 14 -2 -243 11 66 81 192 188 148 78 -83 -315 157
5391A57o4p0j15k7N2J85j95o1J25J87j72J33j78mR5j73J85j98P6j5l7K56l01Q3
$$ 157 93 23 -92 -119 -67 118 -77 -138 -13 174 2 135 -43 -47 48 -125 60 -138 -62 -77 -114 142 -159 -76
5415g6j73J97j29K39N8j49K14j57N7j31Rn0N8r6J65L5j04K8q9j98J90Q2L4M7J53
$$ -76 -249 -52 -181 58 116 -33 181 24 81 -50 -41 -91 -33 -129 36 71 -33 -5 -94 -292 -102 -20 14 61 214
5440B14p7N4j62R8N1m08J72K17l9n9k03j58L08JK15k08l03L4L17j30J38k0k23
$$ 214 137 191 29 127 178 -230 -58 159 120 61 -142 -300 8 9 224 16 -287 -253 64 -66 72 52 -171
5463a71M15n06L23K4k26J26r6J25J21j90Q6n9n6O1O4j18l1O6K7p7L24j12Q8j95
$$ -171 244 -262 61 85 -141 -15 -111 14 135 -55 31 -28 -84 -23 41 -77 -108 -42 -15 -92 232 120 208 13
5487A3k24N43m40n7J35M8K3k83M0J15K9M9l7j16J54m7j79J39Q4J51j52K03k13
$$ 13 -211 332 -108 -165 -30 18 41 -242 -202 -87 -58 -9 -46 -162 -8 -55 -234 -95 -11 140 -12 191 -22
5510b2K0K04k23j53K6J07M4K8K13j08j70j88L30n1l45J11N35k54k17L09k24Ll24
$$ -22 -2 202 -21 -174 -148 -41 3 31 244 136 -34 -222 108 57 -288 -177 358 104 -113 196 -28 -25 -349
5533c49K88JK8M7J23j8k02J57j42l4K30l23J36K94k97LJ89K7k59p1K12J36j16
$$ -349 -61 -60 -32 15 138 120 -82 75 -67 -101 129 -194 -58 236 -61 -58 131 158 -101 -172 40 176 60
5556F0j4N4k67J70j28m6K98j09J71l53Pl47L63J37k20K23j4pK9n8j5j7M1J27p4
$$ 60 46 100 -167 3 -125 -171 127 18 189 -164 -157 -504 -141 -4 -224 -1 -15 -22 7 -51 -66 -83 -42 85 11
5581A1j13K52j05p5J14l21%K81k7L8K1j35%q8J28J86j39Q7O1l9j84M2j49J93l5
$$ 11 -102 150 45 -30 84 -237 -237 44 17 55 76 -59 -59 -147 -19 167 28 115 176 137 -47 -5 -154 39 4
5606Dk48P2M84j75j59J5L0l12J93j28J16L43k58J30Pj25J65o1oj42K29j65J39
$$ 4 -244 -172 312 137 -22 -7 23 -289 -96 -224 -108 235 -23 107 114 -11 154 93 87 -55 174 9 148
5629A48j13j17J47j76q1L01j02K39k68p4n0j06L11k16J5K15j3j50P9k39J76j56
$$ 148 35 -82 65 -111 -192 109 7 246 -22 -96 -146 -252 59 -157 -142 73 60 -90 -11 -250 -74 -230
5651b30M14j87J28j06j22J16L4L7j11j58K29J93k36J36k92J18j8K29j23m5n4K02
$$ -230 184 -3 125 19 -103 13 47 84 -27 -185 44 237 1 137 -155 -37 -55 174 51 6 -48 154
5673A54j55j44K33j02l0j17M4J05O6J71j45ll08M31m54L69K9l66J91j64L89j82
$$ 154 -1 -145 88 -14 -44 -161 -117 -12 54 225 80 77 -231 200 -254 115 144 -222 -31 -195 194 12
5695A2j44J04O7j71L14l10J04M9o5q6J51R3k68P8L09j55j59J50q5j86K35j16R3
$$ 12 -132 -28 39 -132 182 -128 -24 25 -40 -126 25 118 -150 -72 237 82 -77 73 -12 -198 37 -79 14
5718A4J34l39J44R8j72J59M3l2J19j62J62m86L70k4LLJ11J2k08O1N8k78J19R9
$$ 14 148 -191 -47 51 -121 38 81 49 168 6 168 -318 52 28 31 34 145 157 -51 10 68 -210 -91 8
5742Hj04j00K05J32j79K04k69L44k77L08r2p1l87L81k32n9j1K56j61K2Q5j08J10
$$ 8 -96 -196 9 141 -38 166 -103 241 -36 272 180 109 -278 103 -129 -188 -199 57 -104 -82 3 -105 5
$$ [...]
8191c11
##END NTUPLES=NMR FID
##END=
