##TITLE=1H_LR-738-B-B2-CR2
 D2O
 8 sc, 
 30.10.2021
##JCAMPDX= 6.0         $$ Bruker NMR JCAMP-DX V2.0
##DATA TYPE= NMR FID
##DATA CLASS= NTUPLES
##ORIGIN= UXNMR, Bruker Analytische Messtechnik GmbH
##OWNER= root
$$ XWIN-NMR		Version 3.5
$$ Sat Oct 30 13:12:35 2021 Russian Standard Time (UT+4h)  she@DPX200
##.OBSERVE FREQUENCY= 200.1313468511
##.OBSERVE NUCLEUS= ^1H
##.DELAY= (6, 6)
##.ACQUISITION MODE= SIMULTANEOUS
##.ACQUISITION SCHEME= undefined
##.AVERAGES= 8
##.DIGITISER RES= 18
##SPECTROMETER/DATA SYSTEM= spect
##.PULSE SEQUENCE= zg30
##.SOLVENT NAME= D2O
##.SHIFT REFERENCE= (INTERNAL, D2O, 0, 15.7039)
##AUDIT TRAIL= $$ (NUMBER, WHEN, WHO, WHERE, WHAT)
$$ ##TITLE= Audit trail, XWIN-NMR		Version 3.5
$$ ##JCAMPDX= 5.01
$$ ##ORIGIN= Bruker BioSpin GmbH
$$ ##OWNER= she
$$ F:/spectra/data/she/nmr/H-F/1/audita.txt
$$ ##AUDIT TRAIL=  $$ (NUMBER, WHEN, WHO, WHERE, WHAT)
(   1,<2021-10-30 13:11:16.62 +0400>,<she>,<DPX200>,
      <created by zg, POWCHK disabled, PULCHK disabled
       configuration hash MD5:
       00 E9 B6 7A A2 85 ED C7 34 08 36 98 17 FE 4E 26
       data hash MD5: 16K
       CB 12 80 47 D5 BA 5C 9C 04 42 87 7F 15 B0 C0 E3>)
$$ ##END=
$$ 
$$ hash MD5
$$ E9 22 EC 11 E8 0F 0F B7 BA E6 90 56 01 EB 4F 0D
##$RELAX= 
##$RELAX= 
##$RELAX= 
##$RELAX= 
##$RELAX= 
##$RELAX= 
$$ Bruker specific parameters
$$ --------------------------
##$DU= <F:/spectra>
##$EXPNO= 1
##$NAME= <H-F>
##$PROCNO= 1
##$TYPE= <nmr>
##$USER= <she>
##$AMP= (0..31)
100 100 100 100 100 100 100 100 100 100 100 100 100 100 100 100 100 100 
100 100 100 100 100 100 100 100 100 100 100 100 100 100 
##$AQSEQ= 0
##$AQ_mod= 1
##$AUNM= <au_zg>
##$AUTOPOS= <>
##$BF1= 200.13
##$BF2= 200.13
##$BF3= 200.13
##$BF4= 200.13
##$BF5= 200.13
##$BF6= 200.13
##$BF7= 200.13
##$BF8= 200.13
##$BYTORDA= 1
##$CFDGTYP= 0
##$CFRGTYP= 5
##$CHEMSTR= <none>
##$CNST= (0..31)
1 1 145 1 1 1 1 1 1 1 1 1 1 1 1 1 1 1 1 1 1 1 1 1 1 1 1 1 1 1 1 1 
##$CPDPRG= <>
##$CPDPRG1= <>
##$CPDPRG2= <>
##$CPDPRG3= <>
##$CPDPRG4= <mlev>
##$CPDPRG5= <mlev>
##$CPDPRG6= <mlev>
##$CPDPRG7= <mlev>
##$CPDPRG8= <mlev>
##$CPDPRGB= <>
##$CPDPRGT= <>
##$D= (0..31)
0 1.2 0 0 0 0 0 0 0 0.06 0 0.03 0 0 0 0 0.0002 0 0 0 0 0 0 0 0 0 0 0 0 
0 0 0 
##$DATE= 1635585075
##$DBL= (0..7)
120 120 120 120 120 120 120 120 
##$DBP= (0..7)
150 150 150 150 150 150 150 150 
##$DBP07= 0
##$DBPNAM0= <>
##$DBPNAM1= <>
##$DBPNAM2= <>
##$DBPNAM3= <>
##$DBPNAM4= <>
##$DBPNAM5= <>
##$DBPNAM6= <>
##$DBPNAM7= <>
##$DBPOAL= (0..7)
0.5 0.5 0.5 0.5 0.5 0.5 0.5 0.5 
##$DBPOFFS= (0..7)
0 0 0 0 0 0 0 0 
##$DE= 6
##$DECBNUC= <off>
##$DECIM= 32
##$DECNUC= <off>
##$DECSTAT= 4
##$DIGMOD= 1
##$DIGTYP= 9
##$DL= (0..7)
0 120 120 120 120 120 120 120 
##$DP= (0..7)
150 150 150 150 150 150 150 150 
##$DP07= 0
##$DPNAME0= <>
##$DPNAME1= <>
##$DPNAME2= <>
##$DPNAME3= <>
##$DPNAME4= <>
##$DPNAME5= <>
##$DPNAME6= <>
##$DPNAME7= <>
##$DPOAL= (0..7)
0.5 0.5 0.5 0.5 0.5 0.5 0.5 0.5 
##$DPOFFS= (0..7)
0 0 0 0 0 0 0 0 
##$DQDMODE= 0
##$DR= 18
##$DS= 0
##$DSLIST= <SSSSSSSSSSSSSSS>
$$ [...]
##$SUBNAM2= <"">
##$SUBNAM3= <"">
##$SUBNAM4= <"">
##$SUBNAM5= <"">
##$SUBNAM6= <"">
##$SUBNAM7= <"">
##$SUBNAM8= <"">
##$SUBNAM9= <"">
##$SW= 18.0517286264689
##$SWIBOX= (0..15)
0 0 2 0 0 0 0 0 0 0 0 0 0 0 0 0 
##$SW_h= 3612.71676300578
##$TD= 16384
##$TD0= 1
##$TE= 0
##$TE2= 300
##$TE3= 300
##$TEG= 300
##$TL= (0..7)
0 120 120 120 120 120 120 120 
##$TP= (0..7)
150 150 150 150 150 150 150 150 
##$TP07= 0
##$TPNAME0= <>
##$TPNAME1= <>
##$TPNAME2= <>
##$TPNAME3= <>
##$TPNAME4= <>
##$TPNAME5= <>
##$TPNAME6= <>
##$TPNAME7= <>
##$TPOAL= (0..7)
0.5 0.5 0.5 0.5 0.5 0.5 0.5 0.5 
##$TPOFFS= (0..7)
0 0 0 0 0 0 0 0 
##$TUNHIN= 0
##$TUNHOUT= 0
##$TUNXOUT= 0
##$USERA1= <user>
##$USERA2= <user>
##$USERA3= <user>
##$USERA4= <user>
##$USERA5= <user>
##$V9= 5
##$VALIST= <valist>
##$VCLIST= <CCCCCCCCCCCCCCC>
##$VD= 0
##$VDLIST= <DDDDDDDDDDDDDDD>
##$VPLIST= <PPPPPPPPPPPPPPP>
##$VTLIST= <TTTTTTTTTTTTTTT>
##$WBST= 1024
##$WBSW= 4
##$XGAIN= (0..3)
0 0 0 0 
##$XL= 0
##$YL= 0
##$YMAX_a= 252666
##$YMIN_a= -347676
##$ZGOPTNS= <>
##$ZL1= 120
##$ZL2= 120
##$ZL3= 120
##$ZL4= 120
##$ABSF1= 10
##$ABSF2= 0
##$ABSG= 5
##$ABSL= 3
##$ALPHA= 0
##$AQORDER= 0
##$ASSFAC= 0
##$ASSFACI= 0
##$ASSFACX= 0
##$ASSWID= 0
##$AUNMP= <proc_1d>
##$AZFE= 0.1
##$AZFW= 0.1
##$BCFW= 1
##$BC_mod= 2
##$BYTORDP= 1
##$COROFFS= 0
##$CY= 11.3945322036743
##$DATMOD= 1
##$DC= 2
##$DFILT= <>
##$DTYPP= 0
##$F1P= 2.36226072786647
##$F2P= -0.459571619588291
##$FCOR= 0.5
##$FTSIZE= 0
##$FT_mod= 4
##$GAMMA= 1
##$GB= 0.15
##$INTBC= 1
##$INTSCL= 1
##$ISEN= 128
##$LB= 0.24
##$LEV0= 0
##$LPBIN= 0
##$MAXI= 10000
##$MC2= 0
##$MEAN= 0
##$ME_mod= 0
##$MI= 1.114404
##$NCOEF= 0
##$NC_proc= 0
##$NLEV= 6
##$NOISF1= 3.799351
##$NOISF2= 2.8
##$NSP= 1
##$NTH_PI= 0
##$NZP= 0
##$OFFSET= 15.70392
##$PC= 1
##$PHC0= -15160.76
##$PHC1= 13.00082
##$PH_mod= 1
##$PKNL= yes
##$PPARMOD= 0
##$PSCAL= 0
##$PSIGN= 0
##$REVERSE= no
##$SF= 200.130013532006
##$SI= 16384
##$SIGF1= 3
##$SIGF2= 2
##$SINO= 400
##$SIOLD= 16384
##$SREGLST= <1H.CDCl3>
##$SSB= 0
##$STSI= 0
##$STSR= 0
##$SW_p= 3612.71676300578
##$SYMM= 0
##$S_DEV= 0
##$TDeff= 0
##$TDoff= 0
##$TI= <>
##$TILT= no
##$TM1= 0
##$TM2= 0
##$TOPLEV= 0
##$USERP1= <user>
##$USERP2= <user>
##$USERP3= <user>
##$USERP4= <user>
##$USERP5= <user>
##$WDW= 1
##$XDIM= 8192
##$YMAX_p= 0
##$YMIN_p= 0
$$ End of Bruker specific parameters
$$ ---------------------------------
##NTUPLES= NMR FID
##VAR_NAME=  TIME,          FID/REAL,        FID/IMAG
##SYMBOL=    X,             R,               I
##VAR_TYPE=  INDEPENDENT,   DEPENDENT,       DEPENDENT
##VAR_FORM=  AFFN,          ASDF,            ASDF
##VAR_DIM=   8192,          8192,            8192
##UNITS=     SECONDS,       ARBITRARY UNITS, ARBITRARY UNITS
##FACTOR=    0.0002768,     1,               1
##FIRST=     0,             0,               0
##LAST=      2.2672688,     0,               0
##MIN=       0,             -347676,         0
##MAX=       2.2672688,     252666,          0
$$ Real data points
##PAGE= N=1
##DATA TABLE= (X++(R..R)), XYDATA
0 0 0 0 0 0 0 0 0 0 0 0 0 8 -8 8 -8 16 -16 24 -24 32 -40 48 -56 64 -74 88 -103 119 -136 156 -178 202 -231
33 -231 262 -295 333 -374 418 -468 522 -583 646 -717 795 -879 972 -1071 1181 -1302 1434
50 1434 -1582 1742 -1921 2120 -2342 2590 -2875 3199 -3579 4022 -4558 5207 -6027 7091 -8534
65 -8534 10623 -13923 19955 -34688 154374 120925 -65459 -7633 -173446 -71645 171396
76 171396 160477 118602 252666 127837 -18798 36404 -43487 -172284 9499 117972 75951
87 75951 185345 180951 -82089 -133541 -67749 -127473 -16821 194327 130526 54449 88145 -46721
99 -46721 -156807 -52901 -50543 -74615 93732 163509 93433 135489 75478 -138629 -152135 -59423
111 -59423 -52268 86222 247682 162727 64084 56198 -60349 -118513 -5497 24906 29865 149034
123 149034 160104 68819 64730 -1233 -131692 -88371 8545 25498 118007 188044 76317 -18188
135 -18188 -37620 -112579 -109545 14283 64805 81253 135571 88533 -5550 -19862 -59216 -104944
147 -104944 -28934 50958 69289 126593 130797 14468 -60718 -75675 -102585 -48027 66558 99396
159 99396 95884 89911 10315 -66000 -68990 -77906 -60328 30456 83026 82376 95156 48757 -55378
172 -55378 -90710 -81600 -72303 3485 89606 92935 71695 35751 -47052 -89887 -65849 -43332 5350
185 5350 79109 87054 57976 43204 -14545 -79045 -66658 -32110 225 74963 120469 84004
197 84004 36145 -17377 -84723 -89719 -38560 3807 57265 101862 74873 24952 -8842 -65968
209 -65968 -98873 -57473 -11754 21404 73931 82688 27298 -18733 -54628 -87254 -62521 -2020
221 -2020 35312 65228 72055 21181 -31575 -53116 -74341 -61226 3346 48300 62938 76276
233 76276 46701 -22713 -61914 -72086 -66219 -14901 51105 79907 82671 58022 -4178 -54069
245 -54069 -65331 -61541 -26906 35282 66808 63778 50545 7064 -49935 -68791 -55100 -29180
257 -29180 17588 60144 61961 36353 -2226 -48230 -71167 -55558 -21900 23309 64742 69252
269 69252 40910 3483 -40236 -72025 -62645 -23088 17962 55315 73816 52601 7240 -34833
281 -34833 -62369 -63251 -33057 11058 48306 63606 47418 10217 -28486 -54828 -56886 -28228 14693
294 14693 46356 57558 45817 9350 -34889 -59441 -55250 -29899 9090 47355 62168 44138
306 44138 7021 -32830 -61679 -64102 -37734 5307 44354 61299 50189 18141 -23858 -56516
318 -56516 -61040 -36915 71 36518 58827 51805 18309 -20831 -49294 -58630 -41282 -4115 33220
331 33220 52591 46812 20012 -17166 -47912 -56613 -38277 -3851 29936 50699 49640 23540 -13745
344 -13745 -41788 -49478 -36477 -6202 28504 48389 42670 17664 -14772 -43733 -54524 -38704
356 -38704 -5417 26280 45003 42719 17626 -19210 -48728 -57138 -41304 -8935 26429 51594
368 51594 52175 26173 -10682 -40914 -57081 -49907 -17037 21212 45406 51015 35297 360 -33450
381 -33450 -49192 -44276 -20286 12835 36266 43215 31450 1491 -25806 -37165 -34456 -15287 16349
394 16349 38017 37921 24185 -1402 -32201 -45911 -35594 -11952 18466 42235 42900 24910 -3725
407 -3725 -35219 -49499 -39825 -17999 12479 43163 50680 33939 9213 -21243 -45780 -43019 -18427
420 -18427 9837 37397 49562 35107 9197 -18516 -40686 -38969 -18086 5000 28162 42668
432 42668 29431 3274 -18010 -37777 -44251 -22905 6134 27637 42905 36102 6300 -20996
444 -20996 -38984 -44246 -22123 9940 27855 39319 36998 9184 -17107 -26939 -34707 -26776 5427
457 5427 29486 37964 40705 20789 -14122 -29762 -31291 -22734 9674 38675 40984 36036 19887
470 19887 -16318 -34670 -27210 -21072 -2918 29954 37824 27098 19130 -7508 -40155 -42617 -30967
483 -30967 -14912 20670 43333 30179 12615 -9199 -40913 -42831 -18506 -5580 12429 36405
495 36405 29676 9343 1189 -20296 -41463 -27486 -5655 10419 37884 45113 16840 -6378 -22771
508 -22771 -42323 -28263 6232 19402 29712 40087 17347 -10238 -13605 -23703 -30291 -5749
520 -5749 15382 21300 35051 29645 -5352 -26497 -34403 -39653 -12920 25009 31114 26250 19372 -12754
534 -12754 -35746 -27906 -24159 -18737 10289 27073 24933 26792 11246 -24232 -38050 -33657 -24879
547 -24879 5981 36126 32968 19626 5143 -24401 -37865 -22384 -11706 -321 21476 24744
559 24744 10948 4774 -9086 -29213 -27569 -13983 -1132 22899 37663 21807 1004 -17793
571 -17793 -38117 -33236 -5207 12588 23213 32293 18978 -2307 -11729 -22950 -31590 -18626 459
584 459 15317 32519 32554 10076 -10905 -25867 -34655 -19315 7425 19968 26380 24654 3934 -16473
598 -16473 -21716 -24064 -17729 1603 14849 19213 20449 7949 -13296 -24648 -30074 -25635 -1447
611 -1447 22508 28656 26247 12068 -15531 -29189 -24440 -16341 318 20000 25155 21822 15623 -2469
625 -2469 -19794 -22525 -20378 -9081 15722 29165 24293 16297 -848 -23570 -25764 -13455 -2643
638 -2643 14887 28675 22074 9173 -1469 -17156 -23573 -13050 -3829 7416 24445 24619 10360
651 10360 -439 -16222 -31323 -22048 -1683 10965 24208 27858 9798 -8057 -15841 -23143 -18275
664 -18275 -72 11767 19698 27320 17857 -1732 -12458 -21587 -25350 -7229 14328 21671 26194
677 26194 21460 -406 -17875 -20715 -20478 -10033 10317 19844 20137 18060 4341 -12474 -16535 -16028
691 -16028 -12207 5316 20827 20507 15964 6258 -13342 -23354 -16502 -6605 6460 21170 22064 11686
705 11686 1412 -11986 -22453 -18087 -7847 3636 18718 26381 17442 4398 -8311 -21688 -23398
718 -23398 -9892 4681 16085 24028 19529 4436 -9146 -18169 -20875 -11938 1989 12612 19163
731 19163 17427 4883 -8134 -16458 -19883 -13397 2171 15038 19574 17774 7734 -8648 -19163
744 -19163 -18815 -11895 160 13649 20071 17108 6918 -6273 -17212 -19810 -14019 -2438 10946
757 10946 18902 16405 6856 -4225 -15415 -19447 -11347 577 10414 17645 17284 6215 -6708 -14744
771 -14744 -18404 -13506 -279 11176 17680 17332 7360 -6554 -16497 -20465 -16805 -2856 11130 17320
785 17320 17914 11223 -3562 -15697 -18274 -15343 -6308 7816 16956 16923 10931 -355 -12778 -17518
799 -17518 -14377 -6712 5709 15060 14037 8405 -634 -12817 -18273 -12486 -4454 4706 14737 16241
813 16241 7844 -1749 -10574 -17059 -13375 -3794 6392 14412 16568 8661 -1936 -11169 -17853 -15950
827 -15950 -4884 5898 12621 16239 11092 -1820 -12240 -16298 -15885 -7366 5307 14205 16247 12232
841 12232 1661 -9790 -16010 -16227 -8868 3312 12413 15043 12241 3224 -9160 -15911 -14807 -9319
855 -9319 9 10338 14281 10119 2221 -6842 -13734 -13777 -7531 2043 10240 13530 9399 1638 -7350
870 -7350 -14375 -14476 -7106 2127 10021 14641 11249 774 -9225 -15241 -16273 -10455 1050 10611 14143
885 14143 12499 4665 -6287 -14128 -15686 -10777 -612 8756 12966 12913 5861 -5263 -12389 -13547 -10503
900 -10503 -2480 7888 12534 9746 3620 -4677 -12887 -14175 -8979 -870 7650 12670 10705 4718 -3987
915 -3987 -12787 -14719 -9355 -2036 6717 14003 12353 4230 -4050 -11215 -15419 -11710 -2770 5503 11020
930 11020 11134 5262 -3181 -10045 -13759 -10453 -2636 4651 10579 12435 6659 -3280 -9614 -12814 -11147
945 -11147 -3047 6743 11479 10885 5694 -3367 -10573 -13328 -11231 -3792 4697 9858 11777 8524 -608
960 -608 -9649 -12520 -11254 -5307 4777 11993 11890 7071 -460 -8523 -12085 -10374 -4004 3640 9557
975 9557 10203 7201 854 -7862 -12380 -10637 -6064 1568 10407 12768 8263 779 -7083 -12366 -10532
990 -10532 -3837 3647 9708 10689 6730 1509 -4733 -10547 -10305 -4911 411 7376 12152 9022 629
1005 629 -6553 -11318 -11751 -4755 3669 9703 11656 8573 1036 -5195 -9412 -10573 -5505 2365 7164
1020 7164 10570 10783 3817 -4631 -9319 -11277 -8213 498 8379 11057 9280 2706 -5456 -9403 -8915
1035 -8915 -5569 1443 7357 8844 8250 5536 -2356 -8703 -9411 -7050 -1374 7758 12748 9405 3687
1050 3687 -3650 -9922 -10583 -6253 -227 6542 9964 8200 3898 -1171 -7328 -9667 -6148 -1054 3899
1065 3899 9720 10625 4941 -1633 -6938 -10250 -7304 166 6740 10229 8533 2731 -3480 -7541 -8919
1080 -8919 -6383 -338 4676 8030 10613 7094 -757 -7380 -10161 -8943 -2606 5861 10864 10591 6081
1095 6081 -943 -6510 -8826 -7711 -2684 3397 6726 7721 5720 673 -5244 -7636 -6961 -3609 2314
1110 2314 7959 9326 5724 -472 -6107 -8706 -6756 -1011 5386 8350 7439 4409 -122 -5740 -8377
1125 -8377 -7251 -3474 1920 7643 10079 6983 797 -6264 -9756 -8639 -3539 3042 8725 9037 5942
1140 5942 1629 -4180 -8444 -7766 -3694 897 5704 8774 7045 2295 -3803 -8063 -8786 -5450 478
1155 478 6375 9156 6479 883 -3423 -7095 -7802 -3442 2241 5143 6681 6404 2168 -3405 -6274 -7148
1171 -7148 -5158 624 5733 8155 6495 1194 -4774 -7422 -7460 -4972 874 6485 7492 6481 2953
1186 2953 -2892 -7537 -7683 -4755 -789 5114 8578 7544 3703 -1879 -6855 -8440 -5860 -1146 4338
1201 4338 7984 6009 2390 -1580 -6138 -7799 -4599 -432 3153 6668 7307 3411 -1479 -5212 -7233
1216 -7233 -5487 -477 4058 7076 7177 3273 -1925 -5462 -7428 -6210 -1135 3929 5793 6179 4287
1231 4287 -1140 -5713 -6460 -5440 -2194 3312 6899 6705 4369 -568 -5265 -6712 -5412 -2133 3434
1246 3434 7015 6059 3550 -182 -5366 -7912 -5640 -2213 1907 6146 7505 4210 -138 -3886 -6982
1261 -6982 -6191 -2555 1759 5839 7024 4447 544 -2831 -6175 -6273 -2578 1486 4083 6043 4704 112
1277 112 -3798 -5663 -5671 -3212 1843 5065 6096 4453 773 -3816 -5780 -5379 -2769 1836 5615 6187
1293 6187 4847 1458 -3755 -6703 -5678 -3179 343 4874 6258 4540 1234 -2833 -5864 -6477 -3573
1308 -3573 548 4269 6132 4938 1893 -2034 -5329 -6120 -3405 423 3574 5817 5319 1573 -2643
1323 -2643 -4927 -5901 -4243 133 3776 5492 4572 2112 -2189 -4827 -5359 -4020 -35 3831 5446 5130
1339 5130 2656 -1792 -4816 -5202 -3765 -924 3214 5758 4756 2141 -1066 -4838 -6186 -3922 -1169
1354 -1169 2562 5272 5021 2362 -759 -4173 -5967 -3581 -913 2205 5203 5761 2304 -863 -3286
1369 -3286 -5517 -4626 -967 2230 4331 4859 2722 -1116 -4113 -5185 -4728 -1174 2622 4408 5061 3744
1385 3744 -591 -4061 -4747 -4747 -2207 2371 4751 4979 3954 448 -3781 -5506 -4868 -2621 1373 4155
1401 4155 4888 3542 719 -3056 -4938 -3798 -2213 902 4561 5013 3044 960 -2176 -4542 -4148 -1771
1417 -1771 1619 3791 4793 3251 537 -2787 -5223 -4473 -1900 703 3740 5011 3394 251 -2527
1432 -2527 -4635 -4955 -2728 886 3408 5142 3898 1450 -1871 -4523 -5141 -2688 253 3128 4854
1447 4854 4073 1045 -2050 -3897 -4655 -2692 261 2721 4179 4211 1448 -1152 -3420 -4550 -3031 592
1463 592 3108 4217 4358 1843 -1812 -3766 -3847 -3226 -136 2865 3765 3348 1776 -1722 -4118 -4202 -3128
1480 -3128 -624 2634 3905 3515 2497 -1102 -4336 -4328 -2678 -791 2887 5006 4178 1701 -808 -3720
1496 -3720 -4492 -3054 -1161 1422 4038 4031 2167 226 -2798 -4972 -3420 -839 1535 3995 4610 2097
1512 2097 -581 -2333 -3834 -3063 -728 1554 2995 3982 2191 -554 -2267 -3837 -4054 -1386 1594 2951
1528 2951 4130 3002 -477 -2887 -3465 -3397 -1252 2173 3416 3127 2459 -6 -2270 -3244 -3332 -2066 1240
1545 1240 3193 3490 3062 343 -3405 -4284 -3435 -1753 1110 3374 3671 2476 374 -1976 -3566 -3604 -2338
1562 -2338 516 3274 3768 2980 1451 -1355 -3876 -3335 -2008 111 2749 3875 2739 724 -1504 -3259
1578 -3259 -2933 -1446 121 2299 3302 2346 1101 -492 -3179 -3866 -1744 323 2414 4086 3036 286
1594 286 -2024 -3338 -3794 -2132 295 1753 3202 3322 947 -1236 -2353 -4015 -3212 -75 2248 3140
1610 3140 3767 2044 -1134 -2737 -3182 -2825 -105 2215 2752 3128 1820 -1271 -2551 -2379 -2736 -1160 1788
1627 1788 2742 2457 2222 -128 -2978 -3174 -2267 -758 1916 3765 2477 1636 -264 -2786 -3023 -1938 -935
1644 -935 1117 3251 3021 1216 12 -2361 -3673 -2556 -809 827 2814 3678 1899 -137 -1977 -3409
1660 -3409 -2838 -454 999 2506 3631 2005 -427 -1432 -2474 -3332 -1527 957 2127 2904 2650 40
1676 40 -2127 -2852 -3042 -1537 1034 2691 2366 2175 64 -1769 -2529 -2367 -1512 828 2645 2651 2049 893
1694 893 -1374 -3116 -2690 -1758 57 2319 2919 2091 485 -1326 -3134 -2862 -1262 95 2051 2899 2310
1711 2310 864 -621 -2367 -3029 -1516 534 1627 2721 2682 700 -1318 -2549 -2663 -1827 2 1765
1727 1765 2438 2431 932 -1091 -2184 -2437 -1989 -124 1863 2385 2510 1577 -554 -2341 -2831 -2053 -572 1465
1745 1465 2519 2244 1204 -541 -2107 -2400 -1822 -402 1304 2802 2280 1358 -285 -2034 -2953 -1929
1761 -1929 -394 1231 2417 2594 1335 -504 -2027 -2423 -2204 -942 1094 2279 2321 1582 -318 -2029
1777 -2029 -2551 -2098 -684 978 2412 2482 1913 336 -1711 -2443 -1680 -999 774 2175 2288 1426 -14
1794 -14 -1443 -2539 -2235 -1078 583 2055 2522 1688 270 -1314 -2668 -2270 -524 259 1944 2760 2116
1811 2116 134 -1061 -2022 -2639 -1368 512 1344 2206 1904 270 -1202 -2404 -2659 -1868 581 1285 1846
1828 1846 2161 552 -1351 -1931 -1984 -1625 199 2107 2172 2010 646 -825 -2240 -2109 -1692 116 1920
1845 1920 2097 1872 928 -1247 -2220 -2265 -1317 -215 1481 2574 1937 838 -293 -1942 -2575 -1526 47
1862 47 1045 2347 2055 825 -246 -1847 -2804 -1605 -317 673 2003 2048 1014 -449 -1172 -2156 -1771 -426
1880 -426 1037 1677 1928 1235 -133 -1498 -1884 -1562 -315 1051 1885 1880 1312 -567 -1707 -2167 -1614 -540
1898 -540 1103 2113 1952 1289 -150 -1280 -2189 -1990 -476 1146 1934 2340 1728 264 -1416 -2264 -1778
1915 -1778 -974 238 1650 2210 1337 94 -1137 -2057 -2227 -802 630 1719 1836 1593 501 -1000 -2047
1932 -2047 -1675 -915 319 1530 1643 1721 190 -1021 -1813 -1700 -1102 345 1812 1957 1147 530 -1019 -2294
1950 -2294 -1801 -721 105 1461 2187 1496 511 -740 -1544 -1826 -931 -116 1408 2396 1644 545 -371 -1756
1968 -1756 -2472 -1199 202 1094 1946 1989 396 -420 -1538 -2012 -1561 4 793 1709 2031 815 -700 -1186
1986 -1186 -1861 -1777 -49 1224 1348 1360 859 -762 -1739 -1670 -1392 -285 844 1356 1596 1122 -531 -1285 -1767
2005 -1767 -1444 -373 1420 2124 1676 1053 -109 -1322 -1544 -1236 -435 758 1689 1743 903 21 -1319 -1855
2023 -1855 -1608 -957 495 2078 1935 929 -2 -1035 -2053 -1475 -469 842 1566 1730 948 -2 -1176
2040 -1176 -1738 -1744 -812 -47 1159 1791 1179 102 -536 -1728 -1810 -549 854 1399 1500 1070 -41 -854 -958
2059 -958 -1673 -697 378 974 1778 1494 298 -1039 -1438 -1827 -1168 450 1660 1442 1383 529 -1206 -1708
2077 -1708 -1683 -641 337 1336 1695 1382 510 -653 -1340 -1563 -1248 -146 1383 1797 1344 553 -457 -1511
2095 -1511 -1824 -1005 103 1041 1477 1196 748 -520 -1585 -1534 -984 -165 1029 1712 1482 749 -448 -1194
2113 -1194 -1812 -1270 -237 1068 1564 1452 750 -667 -1517 -1752 -1156 -337 670 1516 1554 780 82 -1255
2131 -1255 -1504 -1156 -384 896 1680 1564 708 -233 -1316 -1691 -1310 -413 537 1404 1646 1036 -115 -1161
2149 -1161 -1464 -1311 -551 574 1280 1875 664 78 -910 -1456 -1377 -460 612 1089 1330 1101 -171 -1139 -1412
2168 -1412 -1515 -847 178 1308 1531 1073 115 -962 -1544 -1545 -1014 420 1338 1540 1016 320 -821 -1550 -1223
2187 -1223 -617 152 902 1473 1130 215 -732 -1402 -1606 -647 -14 1200 1542 1032 513 -626 -1601 -1641 -589
2206 -589 248 1037 1635 1310 381 -752 -1188 -1444 -1176 -77 976 1533 1412 477 -456 -1222 -1762 -1044 84
2225 84 1076 1413 1134 834 -677 -1321 -1211 -1005 -211 954 1444 1150 899 -399 -1317 -1677 -1128 -201 820
2244 820 1177 1196 609 -344 -1241 -1623 -709 -207 502 1334 1527 658 -272 -815 -1471 -1300 19 748 1198 1183
2264 1183 751 -158 -1099 -1519 -1371 -248 809 836 1618 965 -141 -962 -1076 -1272 -729 783 1379 1304 971
2283 971 283 -1005 -1025 -956 -565 534 1178 1147 805 229 -987 -1340 -1059 -817 291 1184 1559 843 250 -482
2303 -482 -1285 -1248 -436 425 1205 1217 884 160 -817 -1437 -1275 -734 231 639 1574 985 66 -835 -1465 -1590 -911
2324 -911 341 1061 1240 1211 508 -541 -1428 -1580 -546 194 909 1246 1331 490 -755 -1133 -1335 -874 -96
2343 -96 807 1433 1000 404 -384 -1059 -1431 -790 -108 942 1144 1090 711 -546 -992 -1247 -848 -120 842 1245
2363 1245 1308 100 -502 -1011 -1554 -1326 256 727 1005 1112 561 -409 -1071 -1236 -1223 -368 788 1240 1422
2382 1422 921 -139 -1337 -1293 -1109 -324 765 1237 1426 722 89 -878 -1619 -888 -269 438 1478 1127 745
2401 745 221 -664 -1195 -934 -430 410 1368 1546 455 57 -829 -1442 -1383 -255 515 841 1519 678 -260 -895
2421 -895 -1430 -1239 -499 378 1028 1413 996 -138 -830 -1227 -1404 -722 613 877 1340 1041 46 -933 -1200
2440 -1200 -1271 -894 468 1117 1370 1080 552 -471 -1315 -992 -840 164 794 1285 927 561 -293 -1334 -1060
2459 -1060 -585 -101 693 1361 922 250 -220 -1123 -1301 -734 -23 767 1294 1163 308 -319 -1010 -1612 -729 252
2479 252 930 1163 1294 850 -780 -1007 -896 -933 31 679 1000 955 298 -320 -950 -1157 -941 -24 719 1124
2499 1124 1120 456 128 -1022 -1231 -991 -337 813 1277 1050 298 -236 -776 -1520 -1073 -322 348 1169 1081 693
2519 693 -20 -784 -1214 -1221 -84 537 1121 1600 608 -108 -983 -1086 -1408 -455 435 994 1386 951 -91 -994
2539 -994 -1259 -1329 -582 516 573 1298 914 50 -1143 -1156 -988 -720 432 1196 1293 781 283 -855 -1172 -1139
2559 -1139 -904 258 846 1032 657 160 -654 -1324 -995 -335 257 1011 1089 889 207 -446 -1118 -970 -511 275
2579 275 821 1289 1083 222 -563 -1213 -865 -902 85 378 1239 1178 488 -470 -952 -1118 -871 369 794 893 728
2600 728 450 -582 -990 -1232 -490 129 881 971 841 615 -417 -1362 -1030 -647 -130 662 1238 992 277 -367
2620 -367 -989 -1018 -817 -25 879 934 1042 531 -98 -791 -1067 -909 -314 662 1090 1225 648 -58 -959 -1163 -962
2641 -962 -271 588 898 681 562 3 -764 -1034 -755 -447 476 1170 917 530 13 -711 -952 -820 -565 405
2661 405 1155 1058 550 -87 -685 -1083 -1076 -235 279 1081 871 582 24 -661 -1207 -1048 -370 503 1145 1151 593 -95
2683 -95 -586 -1211 -1103 -401 593 893 1093 934 126 -451 -847 -1087 -363 203 1000 1069 1001 164 -401 -1070 -773
2704 -773 -827 514 1043 943 797 69 -677 -874 -957 -680 72 507 639 723 165 -723 -1150 -961 -646 95 913
2725 913 1020 827 382 -435 -948 -1026 -737 111 732 1125 948 250 -530 -1107 -1193 -814 -238 585 1311 913 453
2746 453 -355 -1221 -933 -976 66 871 1298 947 747 -202 -822 -1439 -673 23 368 879 1039 257 -491 -620
2766 -620 -1032 -663 -89 771 1197 830 383 -215 -815 -918 -802 -169 570 1172 967 674 -293 -834 -943 -676
2786 -676 -260 485 1073 881 693 -275 -744 -1026 -927 -264 675 806 1093 706 40 -884 -1065 -681 -339 151
2806 151 947 1143 501 13 -728 -886 -1072 -533 418 696 946 931 72 -520 -965 -954 -419 396 836 1131 1004
2827 1004 344 -415 -821 -810 -479 216 744 690 461 200 -1007 -982 -838 -602 174 739 719 701 331 -371 -756
2848 -756 -969 -512 57 834 1416 955 412 -352 -1043 -1170 -631 -79 554 1101 754 193 -263 -1049 -1148 -676
2868 -676 347 703 742 1101 300 -389 -754 -843 -846 53 794 638 820 347 -282 -868 -1123 -785 -254 697 986
2889 986 1072 605 -502 -893 -760 -1129 -215 495 1040 711 373 19 -698 -913 -670 -167 480 949 824 625
2909 625 -115 -665 -1181 -630 -563 206 999 896 378 -130 -699 -1069 -967 -100 202 756 1216 550 -3 -683
2929 -683 -759 -779 -135 513 928 896 553 -252 -829 -894 -974 -571 320 910 908 524 67 -416 -1143 -796 -346 215
2951 215 1042 1019 612 -6 -526 -929 -1059 -525 154 732 990 439 90 -536 -1008 -964 -361 259 505 1048 893
2972 893 50 -434 -982 -765 -601 370 853 955 711 38 -577 -682 -1074 -630 218 782 760 782 292 -501 -900
2993 -900 -869 -383 24 825 1110 667 231 -161 -790 -715 -608 -128 587 1073 593 78 -384 -1047 -815 -526 -169
3014 -169 324 738 845 83 -400 -787 -625 -749 160 515 803 910 406 -227 -732 -912 -551 7 600 737
3034 737 1041 470 -384 -647 -683 -666 -148 621 841 732 334 -86 -496 -1019 -404 10 651 1107 939 453 -176
3055 -176 -693 -991 -479 -116 240 1046 1055 119 -276 -573 -826 -760 -386 421 731 981 488 -179 -391 -765 -511
3076 -511 7 516 611 839 357 -414 -582 -808 -816 -156 665 845 731 585 392 -875 -885 -829 -265 344 701
3097 701 915 688 114 -413 -687 -654 -226 -7 906 809 330 324 -339 -938 -1200 -469 178 731 1014 652 195
3118 195 -171 -617 -646 -179 123 567 903 639 138 -558 -836 -999 -467 233 545 732 667 138 -385 -921 -657
3139 -657 -576 40 686 764 631 97 -524 -575 -666 -701 171 837 1122 881 344 -330 -887 -907 -485 141 488 867
3161 867 804 252 -466 -799 -905 -549 89 500 859 484 274 -93 -527 -877 -592 -159 455 875 901 518 -439
3182 -439 -891 -782 -622 -91 506 791 470 160 -228 -676 -526 -509 -27 682 845 607 307 26 -842 -784 -259
3203 -259 99 406 902 737 390 -140 -518 -822 -987 -520 269 814 613 548 -4 -507 -796 -732 -85 363 605
3224 605 1020 717 128 -461 -820 -542 -354 225 695 914 504 -93 -585 -720 -691 -281 225 898 890 482 -5
3245 -5 -647 -801 -548 14 146 539 982 591 -205 -231 -930 -622 -332 130 685 755 389 -39 -375 -750 -749 -395
3267 -395 139 579 886 562 -31 -361 -663 -687 -432 87 879 867 878 -3 -112 -584 -697 -237 -84 424 967
3288 967 384 235 -443 -504 -632 -488 -77 581 857 538 306 -168 -556 -718 -335 -135 394 839 652 560 -183
3309 -183 -761 -753 -390 -219 314 729 592 148 -498 -676 -902 -428 183 521 616 570 524 125 -487 -671 -283 -21
3331 -21 624 638 624 217 -275 -566 -747 -607 -292 160 657 673 382 30 -567 -768 -661 -121 274 648 823
3352 823 438 110 -570 -910 -647 -212 269 695 704 432 -192 -185 -775 -600 -218 374 403 575 588 285 -490 -779
3374 -779 -625 4 235 370 894 268 16 -531 -682 -947 -401 119 563 555 374 106 -242 -1027 -536 -553 136
3395 136 611 1050 609 63 -401 -637 -598 -250 12 696 866 559 65 -465 -686 -855 -181 88 414 626
3415 626 507 167 -325 -578 -596 -441 292 496 440 614 198 -274 -633 -719 -619 -12 462 584 594 246 -166
3436 -166 -780 -385 -326 30 246 762 654 88 -94 -582 -615 -246 168 548 644 668 451 -58 -449 -840 -455
3457 -455 -61 293 440 515 219 -68 -422 -872 -498 -279 178 697 815 392 -101 -512 -777 -564 -6 554
3477 554 375 509 485 -107 -778 -596 -673 -131 358 801 556 57 -240 -493 -741 -480 -101 391 771 596 566
3498 566 -62 -323 -646 -536 -67 309 808 874 289 -70 -423 -819 -455 -267 207 562 588 397 164 -361 -537
3519 -537 -464 -14 229 330 962 510 19 -219 -547 -822 -269 -166 479 538 324 -58 -212 -644 -706 -345 443
3540 443 324 490 623 279 -119 -350 -260 -265 -5 518 579 492 181 -322 -483 -908 -410 207 441 641 313 121
3562 121 -487 -613 -688 -346 -269 326 837 533 431 -126 -378 -706 -268 153 123 668 624 381 -120 -560 -685
3583 -685 -496 -57 402 421 607 232 -161 -318 -376 -658 175 193 875 524 241 -71 -465 -623 -663 114 217
3604 217 739 655 238 -371 -155 -633 -52 -46 13 627 763 101 -150 -439 -507 -326 -49 427 693 802 395 44
3626 44 -447 -549 -569 -224 153 340 635 261 204 -717 -560 -458 -180 434 614 616 138 -52 -519 -401 -598 -198
3648 -198 114 432 530 484 -24 -423 -519 -588 -33 58 779 701 353 113 -439 -605 -560 -15 564 308 642 553 113
3671 113 -217 -558 -673 -178 -24 464 704 457 -38 -283 -524 -951 -101 141 472 542 257 153 -247 -599
3691 -599 -555 -131 57 556 544 363 352 -320 -376 -357 -347 -122 370 329 608 177 -205 -610 -633 -211 -51 163 596
3714 596 646 -128 -362 -342 -647 -20 -90 406 597 456 229 -113 -319 -688 -251 78 274 271 436 409 -122 -417
3736 -417 -505 -562 -103 157 706 524 265 -45 -361 -658 -220 54 136 524 448 371 -2 -482 -479 -291 -123 263
3758 263 481 506 313 96 -503 -625 -455 -22 234 688 553 453 -71 -337 -511 44 -48 245 623 811 351
3779 351 244 -356 -602 -574 -186 -8 456 311 283 -362 -236 -393 -389 -99 184 533 490 486 -98 -425 -469 -393 -309
3802 -309 -78 398 824 511 -102 -153 -435 -617 -427 42 521 414 322 -47 -192 -776 -256 -187 198 486 647
3823 647 599 69 -259 -486 -468 -164 232 348 559 371 -6 -346 -527 -302 -462 332 430 376 480 70 -87
3844 -87 -326 -335 -140 91 218 553 374 157 -197 -370 -514 -463 -224 662 383 500 253 -208 -540 -398 -307 17
3866 17 112 543 506 265 -19 -460 -664 -418 -207 296 514 505 261 -240 -137 -764 -43 -103 33 397 651 350
3888 350 -168 -623 -437 -68 -126 166 445 127 106 -243 -444 -468 -582 179 284 376 365 291 -292 -453 -456 -548 -146
3911 -146 198 496 538 379 39 -231 -437 -452 44 338 443 219 162 -121 -366 -261 -408 -273 227 547 331
3932 331 413 77 -145 -454 -530 -244 58 486 197 160 241 -295 -331 -329 -91 84 375 242 342 7 -75 -244 -342
3955 -342 -223 275 315 405 310 -30 -35 -284 -503 -117 219 261 351 393 -2 -6 -214 -246 -48 -73 316 627 345 270
3979 270 -40 -480 -393 -330 -92 -40 458 410 219 -144 -423 -253 -282 129 344 322 409 42 26 -144 -578 -277 -98
4002 -98 251 358 168 193 -22 -490 -461 -256 55 261 345 417 2 -238 -227 -342 -225 88 334 396 585 321
4024 321 -191 -231 -317 -2 -258 212 461 288 452 79 -330 -504 -299 49 -57 703 359 61 88 -292 -265
4045 -265 -232 -270 51 399 220 359 -36 -77 -563 -223 -59 -208 113 499 32 -50 -93 -255 -252 -300 107 290 510
4068 510 233 253 -209 -537 -336 -13 209 230 193 313 104 -232 -198 -361 -370 52 379 206 394 160 -260 -205
4090 -205 -377 -200 -94 465 475 128 91 -189 -452 -384 -273 -89 142 172 313 58 55 -495 -433 -234 -37 289
4112 289 481 301 32 81 -213 -457 75 -155 155 638 198 -50 164 -498 -351 -347 106 15 295 337 140 -110
4134 -110 -103 -171 -424 -1 69 283 271 291 -205 -166 -194 -252 -64 38 33 416 245 -39 -180 -532 -143 -226 137 448
4158 448 91 33 -127 -244 -307 -385 -172 18 473 409 53 6 -197 -406 -595 -54 307 82 397 276 -34 -277
4180 -277 -326 -298 -125 245 154 530 -84 -154 -183 -601 -405 -111 229 434 378 404 -30 -297 -357 -358 30 -102 261
4203 261 274 152 35 -174 -398 -390 56 -62 199 568 251 -172 -211 -407 -623 -66 -63 346 728 273 -41 -164
4225 -164 -366 -363 51 118 239 283 332 -101 -173 -102 -370 -181 -120 232 373 252 75 -299 -208 -58 -313 110 78
4248 78 456 23 252 -44 -235 -354 -91 137 323 103 281 56 -25 -361 -469 -332 -122 125 529 312 239
4269 239 -90 -150 -287 -542 -59 56 348 189 180 -109 -94 -573 -121 -74 66 171 257 195 213 -225 -316 -207 16
4292 16 236 377 316 212 3 -266 -390 -226 -33 111 263 44 -96 -57 -93 -323 -282 -115 -217 78 344 375
4314 375 -116 -327 -362 -161 -301 -41 396 325 167 111 -74 -329 -381 18 58 482 291 94 68 -122 -476 -197
4336 -197 -165 60 178 315 222 18 -181 -254 -229 -230 -45 386 210 6 137 -64 -318 -363 -81 -131 64 69 318
4359 318 0 -71 -242 -326 117 204 107 371 576 292 -412 -274 -150 -166 -136 47 344 20 314 -144 -71 -260
4381 -260 -478 -99 -70 264 266 163 -67 -427 -182 -99 42 57 275 367 91 -257 -300 -470 -86 -121 92 197 344
4404 344 251 -101 -232 -197 -118 -209 203 256 391 14 -228 -217 -290 -171 -103 127 145 285 363 -107 -135 -210 -73 37
4428 37 -24 36 195 164 -242 -228 -139 -143 -10 99 343 272 323 117 -236 -412 -497 -262 -97 65 16 281 35 -286
4452 -286 -399 -141 35 -98 185 410 127 123 22 -312 -100 -69 96 33 371 321 178 -37 -539 -352 7 -11
4474 -11 227 276 277 78 30 -387 61 -345 -105 356 250 9 -119 44 -163 -223 -207 301 265 261 144 28 -121
4497 -121 -79 -355 -96 -66 169 387 387 174 -252 -171 -30 -215 -178 102 120 255 217 -125 -193 -523 -36 88 130
4520 130 92 384 76 -194 -161 -161 -259 17 309 112 390 270 92 -157 -333 -322 30 276 190 276 244 13 -249
4543 -249 -171 -339 -49 191 114 323 98 -79 -168 -351 -231 -208 137 17 303 312 190 76 -175 -378 57 74
4565 74 208 476 224 13 -85 -40 -154 -106 -54 366 271 38 -248 81 -309 -153 -57 46 274 204 168 65 -229
4588 -229 -193 -148 -74 -68 210 380 35 142 -142 -302 -297 -74 77 244 187 -77 9 -90 -4 -151 -374 56 169 255
4612 255 287 46 39 -61 -145 -114 113 68 22 192 50 -147 -203 -199 -69 15 117 245 174 -92 12 -335 -84 -63
4636 -63 -130 241 268 210 196 40 -125 -53 -71 55 229 282 288 265 79 -385 -17 -226 -142 -46 311 263 -16 -34 -9
4661 -9 -380 -518 -177 206 277 340 34 -108 -81 -123 -172 181 45 184 181 144 -221 -70 -370 -28 -204 -46 232
4684 232 269 235 72 5 -580 -140 58 169 269 209 173 88 -88 -355 -102 -74 85 82 118 266 121 20 -310
4707 -310 -275 112 90 157 309 395 -18 -28 -380 -176 -89 -34 178 284 60 177 3 -421 -218 -285 -140 56 22
4730 22 -61 122 39 -5 -26 -44 -29 121 410 143 179 81 -199 -262 -295 11 95 201 129 -30 144 -172 -146 -199 -220
4755 -220 -62 213 34 -222 -138 -170 -131 76 -14 63 299 212 248 81 -462 -121 -96 183 -266 211 431 307 7
4778 7 -170 -69 -205 -47 244 267 369 72 -51 90 -203 -193 187 233 153 231 218 -188 61 -393 -329 -38 252
4801 252 78 343 184 98 -10 -51 -39 137 297 152 305 243 28 -17 -142 -193 -71 35 79 95 159 1 -174
4824 -174 -237 -201 -53 -114 219 361 168 148 -311 -352 -274 -82 43 87 225 374 80 -225 -105 -354 -153 -147 163
4847 163 296 79 -8 10 -107 -231 -192 159 343 199 190 -146 -130 107 -265 -200 238 179 235 197 -41 -21 -299 -428
4871 -428 -153 -2 235 195 263 286 -145 -119 -193 -243 -110 6 360 108 233 16 -131 42 -60 -99 14 191
4893 191 45 -42 -56 -51 -161 -126 13 -82 289 509 244 51 -73 -250 -39 -164 -60 206 418 194 -58 -235
4915 -235 -254 -138 -60 47 144 147 140 -163 56 -243 -113 64 139 252 303 272 -8 -186 -214 1 -37 158 95 53 62
4940 62 -30 -38 -32 -453 -77 -76 68 255 -30 -17 -129 -253 -86 -248 74 -13 221 139 399 -153 -349 -190 -6 -170
4964 -170 381 178 7 221 15 -38 -288 -150 -43 187 74 -77 -32 -100 -283 -72 -70 144 273 133 137 87 128
4987 128 -48 -23 -99 -145 118 231 213 45 74 -242 -220 -328 -202 98 3 201 -98 -68 -103 -312 14 32 121 357
5011 357 127 144 -40 -33 58 -172 120 251 217 50 72 149 -413 -230 -390 144 189 192 333 267 -17 119 -89 60
5035 60 -24 152 226 79 127 141 -69 -99 -154 -32 109 205 332 218 -17 -85 -119 -254 -21 -8 -40 372 218 -161
5059 -161 -72 17 -203 -82 -69 60 161 74 46 -128 20 -129 -2 -54 236 93 345 20 -306 27 -233 -79
5081 -79 232 78 237 -61 -17 -47 -178 -132 155 -15 91 15 71 -99 -197 -104 -161 -69 114 84 110 28 166 11
5105 11 -24 -192 -42 56 128 207 126 75 -46 94 -279 164 -24 327 336 -18 -235 -12 -155 16 -2 117 -145
5128 -145 166 140 177 131 -108 -140 -203 -125 -4 105 375 128 -19 -81 -157 -270 -134 104 122 85 32 -53 -182 -220
5152 -220 -282 -37 -119 18 45 -9 -44 -135 19 -162 -33 340 -24 -126 220 25 -186 -104 -38 -14 69 -85 47
5175 47 319 32 -62 40 -160 -247 41 146 414 222 -103 -156 -51 35 76 -35 282 402 204 112 -157 -27
5197 -27 -172 -58 -234 222 360 187 14 -112 -378 -265 288 -67 -148 169 222 69 -163 171 -85 -8 -48 -40
5219 -40 147 216 37 -216 -135 -277 -14 53 108 169 221 -11 -58 -176 -78 -177 -7 94 131 298 7 12 -198 -36
5243 -36 -503 94 -73 216 101 -120 225 148 -377 -53 116 27 50 122 228 -52 -102 -87 -144 303 -16 402 249
5266 249 -25 129 -32 -130 43 46 -39 408 83 161 -83 -352 -90 -252 -9 -28 -100 116 -149 -48 68 155 -20
5289 -20 109 103 121 7 164 -136 22 -488 -130 -37 -129 -34 254 28 -80 -107 -210 -195 -178 105 106 64 -6 -89 -85 -307
5315 -307 -278 -25 -91 165 266 -86 131 -246 -125 -70 -61 -59 143 159 213 -17 90 3 -177 -8 22 4 229 -207
5339 -207 22 9 -293 56 -260 152 -56 -87 223 -154 -134 -25 -50 -85 82 82 75 271 5 140 -163 -72 -14 81
5363 81 177 127 197 187 -37 -84 58 37 16 127 -56 -110 5 -135 -212 -175 -34 243 130 66 225 75 39 53 -34
5388 -34 -61 120 -110 152 94 -83 19 -127 -151 -142 -83 190 106 292 231 8 -44 -240 68 259 8 335 58
5411 58 -74 -25 -4 -314 -182 -49 71 124 8 -65 -76 -149 -423 -243 41 71 144 187 41 50 -168 -198 10 -26 -70
5436 -70 34 282 190 137 -18 -65 -181 -48 218 293 39 354 115 -128 -21 -193 -38 -6 244 15 228 163
5458 163 -148 -314 -84 -191 114 98 3 -230 43 -14 -26 0 -263 82 -16 -13 31 134 3 -205 -165 39 -6 7
5482 7 419 303 254 50 -96 -85 -91 -2 -56 133 -44 91 -169 -258 -277 -150 35 36 21 -24 -186 54 228 -224 -149
5507 -149 123 176 372 -113 210 -2 -20 192 -44 -115 -148 142 123 55 95 -91 -312 -60 -1 254 461 -114 63
5530 63 115 -106 -148 -188 26 175 83 253 -79 -49 -162 -144 -94 -66 -15 76 -47 116 297 12 -185 94 -89 94
5554 94 11 30 -16 -67 -82 55 -274 -179 59 391 109 298 103 -197 -92 -135 94 158 202 196 16 -42 -93 -119 -84
5579 -84 -12 -72 162 198 -177 114 -19 -198 -155 47 1 198 83 135 163 -166 -256 82 -67 41 52 66 15 168
5603 168 22 -96 -175 -128 119 402 245 88 117 -35 -273 -458 -20 -276 -25 207 -5 -19 51 -6 -66 -201
5625 -201 -121 81 -39 128 156 -60 -131 104 -230 267 255 -93 -122 -100 -36 -78 -116 -46 -79 -83 -71 -8 346 -119 -48
5650 -48 -186 -137 -101 87 269 189 117 -42 -120 -226 -37 23 111 403 -67 182 -72 -206 -266 -3 -8 329 142 284
5674 284 11 22 158 -167 -282 317 13 -13 157 89 111 86 -99 -93 -251 72 62 -74 62 -117 -166 -155 -272
5697 -272 -181 65 163 209 73 125 -283 -54 -156 -42 197 291 -20 139 167 -25 -176 -207 11 103 413 58 -152
5720 -152 122 185 -170 -46 -211 156 219 268 126 42 173 -169 -64 -99 -147 -104 34 -79 69 60 -135 -498 -366
5743 -366 -12 -69 -187 19 107 -140 -81 -179 -59 83 142 -17 174 291 -29 -150 -212 -203 163 -107 327 246 -35
5766 -35 -106 76 30 -94 161 183 365 215 -48 -230 -191 -33 -54 205 39 155 155 95 -38 -267 2 -144 75
5789 75 -10 134 165 129 -96 -108 -35 -72 22 -43 275 -44 -101 14 -382 -234 -210 -156 83 107 131 -6 91 -94 -14
5814 -14 -177 53 15 19 204 -70 133 -114 -88 -307 -110 16 116 121 345 -5 -180 -62 -53 166 288 -81 174
5837 174 224 -215 -175 -34 -290 -59 151 45 328 81 247 -194 -158 170 32 278 30 43 136 108 141 -159
5859 -159 -86 -50 120 256 53 -44 181 -225 -190 53 6 -60 -99 166 322 194 76 -117 44 -62 168 120 141
5882 141 -113 -41 -70 -227 169 -15 93 241 244 9 -223 -369 -32 -134 -18 -85 80 292 -278 59 -82 -34
5904 -34 -164 -64 -14 131 285 350 62 22 -19 -140 60 115 82 228 161 11 -59 -224 -62 -120 -8 -80 -64 75
5928 75 34 -91 -124 -179 67 82 248 182 157 180 -130 -381 -169 -331 -92 -36 -94 -4 -93 -112 -95 177 -42 83 125
5953 125 218 195 8 163 -232 -249 194 -238 -16 136 229 125 20 -119 -428 -180 -89 -143 265 -175 -225 -32
5975 -32 21 -174 -123 118 20 261 247 200 41 8 -103 -171 8 -133 385 79 -5 176 53 -166 -94 -116 -143 325
5999 325 123 193 75 6 12 130 -175 232 94 -93 558 9 -95 -50 25 -83 86 -4 156 32 39 -177 -289
6022 -289 -71 -23 -175 200 88 220 44 167 -53 -62 -170 -57 72 -132 -170 -105 -241 -158 -133 -60 17 186 172
6045 172 266 109 17 -245 -151 -104 174 96 183 320 143 18 24 -96 68 93 309 28 180 106 -318 -94 -268
6068 -268 22 14 77 -63 231 102 -138 48 -273 -392 -56 26 53 -131 -10 -61 -183 -125 -54 -88 -11 81 232 266
6092 266 -22 -411 -22 -58 73 246 127 206 57 -202 -32 -78 -45 29 147 8 296 202 -131 -325 28 -107
6114 -107 120 41 184 163 116 217 35 -255 -97 103 220 -19 55 297 71 -151 -510 10 -344 208 48
6135 48 179 54 447 -125 -137 55 -36 -17 233 170 3 -109 -90 -109 -213 1 132 73 128 12 -23 -163 -32
6158 -32 -118 -256 -38 281 11 90 -170 -88 -85 -158 138 107 146 162 74 -235 -196 -175 25 -313 130 235 152 93 -113
6183 -113 78 64 -235 -29 -123 106 84 68 91 -124 -390 -168 138 88 123 184 163 128 30 -123 -173 -100 -97 81 35
6208 35 -3 28 20 -147 -116 -89 -94 134 179 65 -48 109 -223 -37 -100 -85 -123 263 202 166 -53 -1 -57 -96 24 239
6234 239 126 149 -41 -159 -110 -60 -33 -83 78 190 -51 138 108 -114 -185 -243 -63 152 249 151 -102 115 -269
6257 -269 -94 -3 -266 -16 -34 188 -42 -1 -80 -62 -104 122 -189 -120 277 111 148 95 -105 -193 0 -114 299
6280 299 270 126 169 -97 -134 -71 -99 307 128 -83 109 181 -10 -221 -83 -170 35 140 155 148 100 145 -72 -127
6304 -127 -99 -30 -129 74 228 80 16 -40 -329 -169 89 73 322 -122 146 -132 -145 -212 -89 -117 96 254 134
6327 134 -116 -145 -43 -245 -81 -147 7 11 -73 153 -170 -91 -277 15 10 -155 40 248 283 5 24 -219 -67
6350 -67 -50 57 288 -123 -8 105 -41 -25 57 67 35 239 25 -4 -86 -191 -69 -341 -38 193 312 138 -115
6373 -115 -373 45 99 -107 -2 2 45 146 101 -7 -63 -135 -55 51 27 -6 -97 18 -21 -102 -113 -105 171 476 -22
6398 -22 -224 199 200 -36 -138 -146 13 164 -111 75 -26 215 162 -315 106 42 -22 346 -145 -240 -234 -310 -192 -110
6422 -110 -46 133 118 51 92 -146 -37 -3 -175 -56 33 71 -18 -27 54 157 -174 -115 -72 49 -63 29 44 -204 -114
6447 -114 -234 -192 -148 243 -125 46 126 39 20 -167 -225 2 72 -86 143 -3 -62 -227 -134 45 -38 58 100 207
6471 207 9 -65 90 -131 33 0 178 33 78 175 -56 205 -161 -83 -59 -68 260 66 75 37 -105 -217 -127 -119 98
6496 98 317 344 94 54 220 -274 -118 -81 -335 -14 176 145 154 -3 -72 -211 -123 20 58 -9 -231 -84 48 -11
6520 -11 77 -279 -27 266 121 -27 -13 59 -118 51 -113 -32 4 32 68 104 -103 -70 -66 -267 -325 1 186 -116
6544 -116 84 7 57 -128 -55 67 263 106 49 163 415 77 -148 -15 -93 -37 25 259 -16 -111 100 22 -126
6567 -126 180 51 131 51 127 123 -52 -177 91 -166 -13 107 402 50 -28 -57 -5 -264 51 121 -84 -30 35 0
6591 0 -113 -35 -192 -181 53 6 176 217 -155 -142 43 4 -77 -155 146 181 249 -112 71 -75 8 -180 -36 14 -181
6616 -181 93 65 -312 -86 30 47 154 151 28 51 -12 163 -29 54 -220 -36 126 19 96 34 -20 -122 -74 -316
6640 -316 33 180 433 277 280 -255 107 -288 -124 170 102 418 26 103 -53 -148 8 2 -153 -31 93 55 22
6663 22 -238 -209 -125 -442 -126 59 189 184 186 56 -14 -166 -66 -59 -95 115 320 205 -290 113 -236 -179 -206 -22
6687 -22 276 314 140 -108 -88 -151 -126 30 177 176 357 210 -65 -93 -36 120 -162 20 -18 182 68 27 -88 -158
6711 -158 147 -323 76 74 120 -191 208 41 -220 13 -135 36 158 146 147 -11 -319 -194 0 -100 104 15
6733 15 210 -66 102 62 -189 -154 -70 87 224 82 86 340 -34 -10 -32 113 -147 210 148 226 -226 -154 -233 -138
6757 -138 -172 -24 -4 173 124 -26 -88 -201 -118 -239 108 -83 106 -24 -179 -157 156 -268 -14 265 191 191 206
6780 206 234 113 -5 -92 -89 258 11 171 0 247 -42 -81 5 159 154 -77 39 149 31 -106 -8 -35 112
6803 112 29 69 -87 56 92 122 -296 -72 -59 -66 112 -29 220 146 154 122 166 -175 -8 25 43 231 -4 -71 -19
6828 -19 -105 -103 -132 -268 47 -52 2 170 109 -6 -147 -291 -6 111 69 152 -36 -187 -156 -142 30 58 93 193 184
6853 184 111 -101 151 -72 -63 30 273 205 -23 -30 33 -170 -160 -66 -127 -12 65 48 -159 40 -89 -50 26 171 110
6878 110 96 92 100 -50 -60 -4 63 -128 33 117 -22 -38 80 158 -66 85 -40 188 87 -28 73 -59 -93 82
6902 82 1 -75 165 -145 -163 240 11 -197 -253 -143 133 472 70 -110 -66 -60 -195 -129 231 -66 49 418 238
6925 238 267 81 -267 -256 -3 91 -30 270 157 209 -95 -217 -283 -285 -117 -12 52 153 4 117 -162 -180 -294
6948 -294 58 -32 59 95 262 25 -280 24 -195 -118 228 42 39 -92 -90 -67 23 155 72 84 -116 -57 118 -49
6972 -49 109 -208 -84 131 85 133 -458 191 -11 -93 -47 -152 62 -34 78 104 -100 -68 -196 -107 -57 -109 104 216
6996 216 13 162 139 -174 -32 -168 -197 -35 46 123 42 -85 4 -26 3 -73 250 377 -144 93 -51 -13 -104 -28
7020 -28 -59 37 -165 345 -79 61 7 56 -172 -165 21 51 249 185 0 -38 -2 16 -129 106 190 169 165 -22 54 -241
7046 -241 10 99 -263 131 -55 14 5 -90 -148 -88 -172 -137 32 149 87 58 -244 -184 -65 -109 91 154 -11 85 73
7071 73 -232 269 -8 -104 52 10 -96 -312 22 -253 -132 -176 -211 -13 12 35 -95 -218 68 -135 -54 -276 -64
7094 -64 38 58 -39 29 57 86 10 -44 253 -63 41 21 -39 115 -64 -263 -151 -19 21 150 136 -38 298 -100
7118 -100 -243 -269 150 40 175 -42 129 -111 -89 -72 -135 -126 65 -143 78 56 -78 -139 -143 -234 -83 27 -17 98
7142 98 191 -111 -123 13 -80 -105 156 146 84 -59 94 67 -119 -83 -221 61 96 143 -24 140 123 -108 -74 -34 53
7167 53 36 292 61 19 -56 -43 -120 -107 133 -158 231 -33 -209 -25 82 -305 33 81 -212 13 -61 178 41
7190 41 -42 -259 -93 41 10 180 25 169 -127 -40 278 -17 75 142 67 -84 -6 64 -249 -66 -382 -200 -1
7213 -1 182 -29 -98 -81 216 -140 -173 12 -160 206 171 -21 120 -246 -153 -287 -214 36 235 -72 135 -14 -273
7236 -273 108 -69 -96 -97 5 239 -139 -47 22 -66 -16 233 247 94 105 78 -6 -150 76 -71 -77 -11 288 158 -8
7261 -8 -76 -272 -155 31 56 107 59 -55 83 -3 20 -65 -143 -19 -134 11 208 48 53 -168 -239 -27 -22 63 -27 -56
7287 -56 -30 -76 11 95 -236 -202 225 186 55 -49 27 -111 -242 40 -86 143 -35 4 358 -73 -157 8 -45 -50
7311 -50 177 161 -24 90 -96 1 -26 -8 -24 45 0 77 273 -105 -218 -227 -212 -76 -146 151 151 -19 -4 -145 -16
7336 -16 -79 -65 -145 58 132 91 138 253 -335 -213 25 56 219 -50 -6 -69 210 -141 62 165 -241 -96 35
7359 35 217 -49 -40 -75 -175 91 53 -3 124 11 -41 -70 -12 -218 -198 52 150 -138 -49 -145 37 -198 -145 146 -86
7384 -86 115 -38 354 -66 118 60 -301 -359 -114 -1 8 179 -124 128 -81 41 -222 -4 207 -135 209 82
7406 82 -16 13 -217 -92 78 73 -142 -36 74 89 -120 -69 -211 -213 105 258 165 26 160 -100 -97 16 96 -88
7430 -88 30 -83 150 -13 78 -12 -198 -197 26 -31 74 -2 -305 224 -81 104 20 146 152 293 120 -68 -106 -49
7454 -49 -139 72 -38 -53 209 -16 115 -3 -109 -189 -272 -116 44 -20 126 6 -151 -60 35 -154 181 -66 132
7477 132 154 106 134 -75 -163 -1 111 150 256 200 -217 14 -29 -91 -32 48 -44 -30 108 -12 178 -222 248 -138
7501 -138 35 209 141 149 -75 26 -179 -33 -74 55 -22 388 256 52 -80 -197 206 -142 -143 113 194 96 332
7524 332 -58 79 -5 -137 76 -101 -293 170 -83 36 148 -103 -44 62 26 -62 19 -28 81 -77 -240 76
7546 76 -11 56 173 78 159 -50 70 26 -58 103 -253 138 270 99 -21 -128 -134 -181 261 354 132 -44 -35 166
7570 166 -41 19 -47 97 -215 76 89 101 -126 -296 21 -90 -272 -108 -206 -88 53 123 -196 57 23 149
7592 149 100 5 -11 225 9 5 -133 -1 -9 -195 38 244 -77 118 -62 -80 -74 -270 -8 75 294 112 100 -75
7616 -75 -59 -198 -47 76 -101 146 96 -20 -162 -304 35 -41 12 3 114 2 -78 144 -22 -197 -71 -82 38
7639 38 265 61 147 -278 22 -16 -137 -68 114 -4 -130 -10 208 64 -54 -103 15 -55 -134 -198 -248 -3 -275
7662 -275 -33 152 15 -79 70 -141 -133 188 -282 -94 -99 -87 156 146 -117 29 95 -124 -99 -29 -63 -154 227 -98
7686 -98 -143 12 -164 7 -173 -7 -173 -40 171 39 51 168 -9 -34 -36 35 -117 -112 -87 -34 -28 -138 -207 -246 306
7711 306 86 368 -25 47 158 -186 -119 -149 56 -24 160 297 6 -80 29 166 60 -220 24 35 147 -25
7733 -25 161 -25 -172 86 -85 250 23 -144 -125 -112 -122 -231 -27 84 12 -125 119 -212 -141 -82 -47 104 178
7756 178 58 37 248 89 10 38 236 -92 115 -29 -102 270 54 96 -56 -258 70 180 7 80 298 -19
7778 -19 -292 -227 90 -230 151 23 36 -42 -230 -101 23 216 -60 104 -110 280 169 -81 151 81 -215 -120
7800 -120 -22 -11 13 141 77 101 -36 -82 -51 -27 55 205 130 -64 24 278 -87 62 8 -33 152 -25 144 92 -76
7825 -76 -221 -159 153 -124 92 -199 -84 -98 52 -262 -149 -3 31 28 85 -233 28 161 -38 -128 -97 -98 216 268
7849 268 98 144 278 -98 -170 269 296 -65 289 -40 -55 -90 52 -48 -264 256 -128 199 176 13 73 -168
7871 -168 -93 98 -344 32 103 50 150 -89 -215 -143 259 2 127 -60 -22 43 4 -19 -310 19 119 264 -20
7894 -20 172 -209 120 -104 60 -117 -80 -7 -61 75 -94 105 76 54 -206 -171 168 45 323 67 -49 76
7916 76 40 -60 15 -172 43 71 105 31 -61 73 -115 288 99 234 190 143 217 29 -173 178 190 80 154 -20
7940 -20 242 34 -1 -124 -38 1 230 277 -246 207 102 -186 87 113 -252 192 41 63 25 29 93 -41 241 56
7964 56 185 -61 249 178 -5 -169 -63 -273 -57 -156 6 350 -59 -38 -238 -97 -162 131 -171 -23 60 71
7986 71 116 -78 11 -185 66 77 -74 -185 281 -53 -59 68 -186 244 145 208 -36 72 -67 -73 -235 -156 24 -82
8010 -82 298 -2 124 142 19 74 171 238 -84 74 -6 75 181 -209 88 -94 -30 -94 -48 7 155 55 45 2
8034 2 99 -65 113 -231 22 -17 5 -26 -9 -197 43 143 -217 126 -76 186 -10 -71 282 -65 210 74 19
8057 19 -45 -82 -100 210 20 -134 243 125 59 0 26 202 97 419 -100 -37 8 186 385 133 -153 130 -167
8080 -167 -157 -167 -5 1 90 59 88 -68 -23 -58 -80 183 -102 30 -71 49 -17 -214 8 25 58 194 233 195 -26
8105 -26 -143 -63 132 183 -110 -89 26 32 -233 120 143 -237 22 87 210 165 12 -91 69 -108 -59 -1 -20 38
8129 38 178 150 22 -116 -5 -346 146 -56 108 132 69 -170 -335 116 119 -97 141 72 -27 292 -42 -82 -132
8152 -132 -9 -118 6 -89 25 267 -22 -6 -97 -154 123 385 -32 -130 49 -389 236 -176 92 -73 -202 -183
8174 -183 -96 -38 -37 -35 129 -193 87 77 -11 245 21 125 110 16 -156 281 -82
8191h2
$$ Imaginary data points
##PAGE= N=2
##DATA TABLE= (X++(I..I)), XYDATA
0 0 0 0 0 0 0 0 0 0 0 0 0 -6 8 -8 8 -8 8 -16 16 -22 24 -32 32 -40 48 -55 64 -72 83 -96 109 -125 141 -158
34 -158 181 -201 226 -254 281 -316 350 -389 433 -476 529 -583 643 -709 781 -861 948 -1044
52 -1044 1154 -1272 1406 -1559 1731 -1935 2169 -2449 2789 -3205 3741 -4451 5441 -6920 9364
67 9364 -14118 26797 -134770 -347676 -134647 -122451 -27089 220971 187492 15177 77647
78 77647 -4738 -171063 -77994 -18846 -92867 85721 230520 107397 80849 67626 -167911
89 -167911 -201365 -11884 12656 64009 225573 118549 -62168 -39867 -95003 -180284 -37881
100 -37881 43174 -4765 98497 147172 -2602 -44633 -63476 -213733 -179240 12834 51040
111 51040 94544 177308 36964 -128341 -103282 -115081 -125603 26193 99035 53806 102060
122 102060 91096 -44009 -68095 -58289 -116411 -33159 115424 116364 111321 119665 -20929 -134691
134 -134691 -93380 -73997 -37631 97187 138188 78332 64989 5273 -98256 -90619 -56174 -54821
146 -54821 32878 121679 97501 77147 49207 -67344 -123651 -66181 -24766 34730 128823 120121
158 120121 46002 7035 -52551 -100517 -55321 -5275 22961 89945 111818 52795 13939 -27907
170 -27907 -100782 -90916 -15414 26980 77665 120807 69249 -9281 -49491 -93381 -93602 -19460 35225
183 35225 62240 92577 59553 -15376 -46686 -72513 -96970 -42608 33317 63408 94060 95395
195 95395 17810 -52970 -75199 -86612 -46686 38955 83754 94687 92962 34928 -35393 -53690
207 -53690 -62599 -56331 10590 67044 70893 72980 48571 -24904 -66042 -58787 -45675 -1074 60614
220 60614 71576 49877 20952 -36407 -76819 -59234 -31793 2244 60620 81248 46571 13677
232 13677 -27801 -84171 -89437 -45777 -2446 49643 92253 77093 28209 -19570 -70272 -88963
244 -88963 -53122 -6714 37561 82314 82788 38753 -1662 -39170 -70681 -55414 -6191 31531
256 31531 59368 70168 38113 -11787 -45374 -62926 -51756 -8588 33294 56815 60838 30997
268 30997 -19173 -51715 -63135 -54309 -13267 38476 63524 61915 40491 -5473 -51729 -67310
280 -67310 -52990 -18151 27234 61163 65708 40628 -2668 -44570 -62866 -53539 -21496 22853
292 22853 58402 62778 38696 2154 -37252 -62239 -53862 -17597 23634 54109 64510 45472
304 45472 3137 -38334 -59500 -55615 -26971 14742 49861 60386 42185 4893 -33389 -57250
316 -57250 -57077 -29474 12606 44497 54852 42671 10100 -30632 -54407 -50729 -26207 9385 43424
329 43424 56940 41513 7373 -29654 -54035 -55663 -32216 6132 40690 53506 41866 12401
341 12401 -25122 -53048 -54261 -30757 3606 36124 53943 45757 15343 -20509 -44143 -48242 -31168
354 -31168 2766 36438 50167 40453 12958 -21994 -49485 -54304 -34170 -432 31948 47976
366 47976 41847 15444 -22248 -51045 -55888 -39809 -9817 26895 49488 44087 19386 -12566 -42830
379 -42830 -55736 -41052 -11820 18976 39773 38583 17739 -10891 -37899 -48649 -34131 -8674
391 -8674 17024 38435 39586 15326 -13935 -35812 -47944 -36735 -4947 25430 42605 42286 18981
404 18981 -14698 -40624 -52538 -43056 -12809 16894 35764 42648 25618 -8856 -35573 -48118
416 -48118 -46559 -21826 13978 35042 39463 27520 -2436 -29485 -40122 -35627 -13469 17496 33861
429 33861 34696 25059 -2746 -32156 -39676 -33895 -18795 12440 37996 37822 24396 -434 -34953
442 -34953 -50774 -42536 -22829 9214 37880 38117 22755 2773 -27949 -47598 -38473 -22881 -4879
455 -4879 25339 38477 23339 5348 -17612 -43485 -42134 -19072 1995 28083 43049 25074
467 25074 972 -15180 -35350 -35940 -7053 13682 25762 42468 34335 4443 -11750 -25291 -38897
480 -38897 -21252 9767 26019 41032 40949 6234 -24472 -34903 -42653 -26944 11514 26705 25985
493 25985 28999 8642 -23560 -29901 -31997 -34521 -7467 24263 30514 32737 21960 -17116 -40755
506 -40755 -36847 -31518 -7257 30426 35325 22239 15998 -8530 -34255 -25545 -14100 -10402 15162
519 15162 34547 25066 18199 6661 -24972 -35655 -18290 -4334 19929 46314 32784 3845
531 3845 -10294 -30121 -39636 -14226 6662 11598 27773 33073 10349 -5277 -18681 -41492 -37761
544 -37761 -8591 11995 32810 45409 21645 -10008 -23866 -36352 -34024 -4239 15965 18850
556 18850 26184 19051 -6431 -17536 -21521 -29708 -17276 6916 17697 25564 24385 -2330 -26992
569 -26992 -31613 -30301 -12676 19549 30859 21595 13622 -5160 -26231 -26747 -19854 -15003 3735 22659
583 22659 24966 21053 7442 -19827 -34626 -29221 -17454 5680 30306 30269 16124 2264 -18088
596 -18088 -31528 -21752 -7087 5310 21674 26644 15745 3447 -12420 -29672 -29683 -17705 -2904
609 -2904 18939 32667 20730 788 -17093 -35380 -35978 -15003 2643 14405 24108 17094 831
622 831 -9466 -21105 -28511 -18054 -2895 8868 23797 24382 4325 -11904 -21900 -29991 -18667
635 -18667 5400 16658 21399 20749 3278 -16054 -20987 -22275 -16268 3822 16975 19777 22335 12034
649 12034 -10741 -21899 -24145 -23666 -4793 19905 25274 20318 10731 -12006 -28712 -24612 -16901 -5367
663 -5367 13768 21083 15578 10538 -3145 -22464 -24939 -17119 -9240 10148 27296 22232 10339 -1220
677 -1220 -19941 -28191 -16725 -3251 8178 21708 21299 7529 -3095 -14139 -23565 -16765 -3414
690 -3414 4905 17291 23791 11246 -3641 -13113 -22412 -20492 -2071 13570 19889 22363 12071 -6587
704 -6587 -17095 -21136 -19546 -5966 10565 18645 21684 16885 -982 -16947 -21864 -21927 -12108 7788
718 7788 21302 21925 17150 4373 -12296 -19966 -17138 -8814 4349 16581 18829 13608 3578 -9754
732 -9754 -18498 -16294 -8145 2876 15971 20049 12275 586 -10955 -20308 -19326 -6783 7111 16976
746 16976 21180 15983 2529 -10928 -19029 -19164 -10821 3349 14887 20727 17585 4684 -9369 -17553
760 -17553 -19450 -13181 1693 14572 17668 14813 6407 -7486 -17099 -16052 -8941 1396 13925 19027
774 19027 14828 5328 -7022 -17135 -17171 -10075 360 12994 20116 14679 4502 -5955 -16938 -20664
788 -20664 -11582 466 10468 18559 17619 6703 -5498 -14362 -17965 -12562 -616 9990 17286 17530
802 17530 6884 -5046 -12884 -17376 -14131 -1145 9969 14331 15281 8517 -5253 -14403 -15803 -12593
816 -12593 -2924 9312 15999 15211 8875 -2912 -12922 -14850 -11970 -3391 9451 16040 13777 7880
830 7880 -1637 -13528 -17298 -11495 -3076 6620 15495 15725 7778 -2557 -12369 -17246 -13030 -3789 7019
845 7019 15875 17281 9604 -489 -9971 -16829 -14449 -4641 5704 12821 16280 10910 -166 -10037
859 -10037 -14652 -13657 -6597 4401 12184 14150 9451 167 -8417 -13364 -12340 -5319 5359 13060 13756
874 13756 10068 1294 -9700 -15088 -12515 -5866 3302 12383 14790 9410 614 -8517 -14770 -14398 -7406
889 -7406 2468 11172 14473 10446 2753 -6294 -13688 -13611 -6258 2499 9714 14546 11256 1280 -7625 -12708
905 -12708 -13552 -7801 2304 10136 13295 10291 1902 -7186 -13302 -14926 -9290 1294 9496 13262 12883
920 12883 5385 -6093 -12515 -12850 -9452 -735 8676 12376 10528 4132 -4363 -10961 -12412 -8897 -1616
935 -1616 7201 10246 8565 3957 -4454 -12063 -12581 -7421 -499 7842 13175 10124 2166 -5547 -11770
950 -11770 -13488 -8437 -594 7319 11987 10721 4525 -3373 -11516 -15796 -11478 -2986 5325 12115 13063
965 13063 5703 -3604 -10124 -13136 -10665 -2928 4905 10602 10809 5542 -1376 -7745 -12100 -11029 -3712
980 -3712 3383 7819 10832 6681 -2724 -10142 -12697 -10662 -3539 5359 9682 8971 4294 -2742 -8122
995 -8122 -9921 -9179 -4006 4306 9020 9615 7446 -596 -10133 -13579 -10800 -4718 4343 10865 10515 5604
1011 5604 -1684 -9251 -12400 -10087 -5320 2284 9548 10054 7250 2719 -5780 -11933 -10911 -6072 120
1026 120 7832 11775 7467 454 -6642 -11682 -10321 -4224 1944 6508 8253 4859 -50 -3873 -9023
1041 -9023 -10717 -5180 1539 6742 10714 9605 940 -6935 -10603 -10571 -5266 2880 8250 9760 7491
1056 7491 863 -5669 -8998 -10253 -7326 534 6544 8196 8944 4575 -4126 -9477 -9824 -7162 -115
1071 -115 7616 10877 8430 2345 -5110 -9413 -8613 -5210 46 5864 8315 6767 3949 -1696 -8873
1086 -8873 -10880 -7591 -1443 5576 10614 9718 3792 -3071 -8175 -9106 -5983 -264 5223 8630 7561
1101 7561 3595 -1216 -6261 -8933 -6584 -1371 3751 7552 8732 4687 -2020 -8002 -9693 -7148 -555
1116 -555 6056 9751 8157 2850 -2224 -6146 -7829 -6397 -1573 3817 7433 8663 6075 -300 -6769
1131 -6769 -10006 -8067 -2094 3837 8263 8869 4583 -1453 -5990 -7361 -7035 -2380 3745 7463 7825 5908
1147 5908 565 -5014 -8117 -7138 -3276 2846 7415 8606 6140 -264 -6448 -8697 -6883 -3200 2637
1162 2637 7410 7361 4254 1233 -3860 -7668 -6853 -3182 1553 6614 8888 6428 1207 -4632 -8368 -7332
1178 -7332 -3125 1543 6455 8681 5092 67 -3821 -7333 -8125 -3816 1786 5388 7627 7042 1890
1193 1890 -3466 -6756 -7718 -4250 1367 5947 7635 6707 1308 -4234 -6322 -6581 -4517 878 5674 6607
1209 6607 5253 2719 -3052 -7411 -6930 -4587 5 5513 8084 6591 2947 -2567 -6976 -7173 -4473
1224 -4473 -835 4575 8022 6056 2761 -1425 -5894 -7764 -4620 -776 2833 6412 6505 2912 -1680
1239 -1680 -5414 -6707 -4209 239 4008 6853 6827 2433 -2136 -4935 -6502 -5194 196 4525 6011
1254 6011 6403 3746 -2212 -6361 -7069 -5792 -1773 3898 6511 6522 4116 -995 -4999 -6226 -5499 -2372
1270 -2372 2971 6512 6055 4076 1016 -4310 -6651 -5094 -1911 1671 5472 6335 3314 -331 -3995
1285 -3995 -6358 -4975 -1565 2022 5653 6263 3406 -252 -3303 -5870 -5320 -1344 2748 5044 6314
1300 6314 4526 -234 -4305 -5696 -5495 -2459 2094 5238 6124 4179 53 -3952 -5816 -5922 -3095 2023
1316 2023 5354 6058 4797 1374 -3256 -6315 -5306 -2926 740 4740 6282 4739 1174 -2541 -5475
1331 -5475 -6059 -3472 2 3475 5510 4223 1530 -2029 -4616 -5407 -2392 870 3768 5376 4840 990
1347 990 -2787 -4288 -5222 -3545 663 4076 5267 4483 1340 -2793 -5178 -5611 -4047 47 3833 4795
1363 4795 5022 2632 -2234 -4908 -4980 -3467 -464 3766 5615 4573 2431 -998 -4838 -5420 -3780 -729
1379 -729 3037 5412 4285 2120 -879 -4573 -5439 -3598 -816 2001 5215 5467 2132 -818 -3253 -5274
1395 -5274 -4358 -891 2026 4319 5146 2309 -1024 -3574 -5390 -4395 -1063 2064 3498 4458 2389 -1469
1411 -1469 -3664 -4179 -3901 -1112 2784 4379 4605 3049 -497 -3441 -4768 -4580 -1249 2478 4724 4910
1427 4910 3463 -82 -3636 -5029 -4287 -2486 1156 4142 4791 3484 562 -2831 -4724 -4229 -2596 1010
1443 1010 4048 4444 3365 868 -2774 -4456 -3807 -1820 739 3405 4304 2650 341 -2455 -4400 -4066
1459 -4066 -2057 658 3801 4852 3335 923 -2006 -4717 -3966 -1477 637 3486 5003 3536 1006
1474 1006 -1739 -4047 -4632 -2244 166 2534 4680 3564 682 -1624 -3689 -5165 -2979 710 2719
1489 2719 3944 4541 1279 -1976 -3301 -3755 -2688 253 2215 3658 4000 1815 -1354 -3232 -4149 -3494
1505 -3494 -365 3025 3456 3433 1998 -1564 -3826 -3580 -2173 -346 2921 3877 3407 1944 -634 -3371
1521 -3371 -3587 -3034 -1223 2175 4243 3495 2040 -308 -3691 -4682 -2922 -674 1624 3938 3424 1674
1537 1674 -393 -2646 -3438 -2150 -768 1091 3557 4353 2406 256 -2265 -4391 -3407 -352 1796 3625
1553 3625 3965 1704 -890 -2683 -3649 -3234 -1072 1243 2798 3705 2556 77 -1822 -3716 -4047 -1739
1569 -1739 1321 2906 4024 2937 44 -2579 -3503 -3192 -982 1178 2307 2794 2643 305 -1758 -2590
1585 -2590 -3171 -2226 949 3379 3852 3172 877 -2478 -3460 -2782 -1558 1046 3135 3044 2574 803 -1963
1602 -1963 -3479 -2778 -2415 -539 2564 3514 2283 703 -1200 -3840 -3398 -1827 166 2478 3986 2648
1618 2648 740 -1149 -3199 -3516 -1155 263 1418 3620 3123 733 -718 -2586 -4046 -2616 332
1633 332 1926 3458 3420 1022 -1176 -2145 -3180 -2431 654 1538 2487 3386 1710 -1137 -2079 -2649 -2859 -421
1651 -421 2173 2493 2560 1735 -1334 -2979 -2857 -2492 -659 2352 3190 2375 1520 -516 -2985 -2660 -1932 -833
1669 -833 1552 3447 3015 1504 351 -2127 -3825 -2488 -712 1091 2972 2991 1234 -29 -2046 -3487
1685 -3487 -2360 -701 830 2309 3341 1798 -204 -1318 -2515 -3042 -1008 1350 2104 2979 2410 -256
1701 -256 -2072 -2588 -2580 -1201 796 1826 2390 2019 -56 -1802 -2192 -2198 -1493 888 2552 2627 2216 431 -1928
1720 -1928 -2851 -2519 -1095 653 2621 2866 1785 303 -1622 -3140 -2784 -1691 113 2114 3299 2276
1736 2276 801 -563 -2551 -2954 -1684 311 1917 2726 2629 691 -1006 -2311 -2437 -1443 -94 1236
1752 1236 2143 2303 646 -990 -2019 -2726 -1759 -329 1652 2452 2115 829 -737 -2120 -2511 -1138 32
1769 32 1768 2756 2248 707 -826 -2074 -2609 -1925 -376 1217 2739 2320 852 -185 -2028 -2879 -1990
1786 -1990 -253 1075 2227 2955 1741 -143 -1785 -2326 -2063 -612 855 2130 2668 1424 -263 -1561
1802 -1561 -2469 -2191 -865 1132 1976 2094 1734 -37 -1661 -2037 -1508 -837 838 2298 2237 1513 182 -1723
1820 -1723 -2474 -1834 -982 522 2338 2206 1236 -29 -1542 -2880 -2244 -1005 249 1871 2523 1469 56
1837 56 -1367 -2077 -2438 -949 558 1667 2431 2100 210 -1167 -2005 -2389 -973 429 1688 1962 2191
1854 2191 337 -1218 -1895 -2221 -1465 172 1807 2262 1912 960 -938 -1687 -1962 -1609 241 1729 2167
1871 2167 1876 1012 -1055 -2267 -2235 -1472 -511 1397 2144 1437 457 -895 -2314 -2369 -1520 18 1477 2581
1889 2581 2083 924 -521 -1844 -2242 -1488 -77 1221 2119 2054 1038 -531 -1556 -2098 -1707 -407 829
1906 829 2061 2080 1311 -89 -1369 -2101 -1583 -348 898 1948 1948 1494 -298 -1489 -1729 -1426 -549 478
1924 478 1897 2050 944 -215 -1294 -2377 -1730 -589 664 1727 2138 1367 -118 -1267 -2248 -1493 -660
1941 -660 687 1575 2288 1478 7 -977 -1728 -1983 -829 577 1278 1644 1417 -119 -1203 -2011 -1761 -865
1959 -865 502 1593 1867 1836 442 -1105 -1681 -1581 -1083 708 1584 1791 1499 608 -908 -1843 -1691 -954
1977 -954 98 1446 1723 1480 850 -1031 -1949 -1553 -1234 -207 1247 2252 1532 682 -530 -1938 -1829
1994 -1829 -1102 -89 893 1607 1410 588 -396 -1756 -2231 -1460 -408 663 2140 1861 342 -556 -1399 -2027
2012 -2027 -1241 -52 1109 1772 1700 853 -275 -1077 -1994 -1316 100 1242 1698 1900 876 -756 -1433 -1667
2030 -1667 -1478 -377 1248 1763 1581 1080 -343 -1375 -1665 -1380 -291 798 1497 1817 1376 88 -1447
2047 -1447 -1702 -1741 -911 677 1596 1426 737 -153 -1187 -1590 -1325 -475 486 1387 1759 964 26 -1013 -1820
2066 -1820 -1465 -471 403 1590 1894 1044 -327 -980 -1621 -1749 -804 625 1386 1441 1086 101 -1137 -1565 -1794
2085 -1794 -890 231 1183 1953 1475 282 -768 -1451 -1450 -949 381 1563 1463 947 408 -633 -1600 -1686 -988
2104 -988 247 1179 1695 1819 630 -899 -1574 -1385 -984 237 1211 1688 1346 431 -569 -1440 -1640 -851
2122 -851 116 996 1434 1137 366 -769 -1427 -1541 -1121 -163 1158 1856 1657 441 -609 -1559 -1687 -1100 124
2141 124 1195 1310 1648 842 -459 -1386 -1521 -1377 -219 582 1470 1872 916 -268 -1161 -1517 -1284 -424 824
2160 824 1925 1692 832 138 -1176 -1472 -1102 -334 368 1309 1593 825 32 -862 -1622 -1572 -509 502 1421
2179 1421 1415 841 -343 -837 -1558 -1163 -305 737 1161 1606 1107 21 -1396 -1301 -1287 -351 558 1529 1516 1129
2199 1129 82 -1029 -1723 -1881 -821 450 1388 1579 1135 359 -927 -1435 -1248 -761 217 1083 1714 1238
2217 1238 445 -559 -1493 -1559 -659 159 826 1207 803 197 -379 -1498 -1353 -564 551 777 1381 1313 350
2236 350 -782 -1303 -1276 -716 83 1004 1300 1132 377 -586 -1237 -1335 -1121 157 1035 1177 1205 719 -604 -1199
2256 -1199 -1234 -804 -123 1184 1573 1153 662 -428 -1348 -1205 -782 -217 794 1476 875 580 -87 -1306 -1497
2275 -1497 -959 -553 429 1289 1510 573 -79 -934 -1339 -997 -121 683 1280 1551 703 273 -734 -1521 -1168
2294 -1168 45 602 1326 1342 963 -135 -1212 -1239 -1056 -527 925 1267 1223 919 -145 -847 -1377 -1298 -586
2313 -586 686 1183 1239 1110 294 -1115 -1477 -1460 -602 247 1097 1184 807 41 -681 -1209 -1403 -657 307 1011
2333 1011 1251 951 388 -650 -1372 -1150 -733 192 732 1395 1246 34 -741 -1181 -1271 -838 263 846 1044
2352 1044 996 451 -666 -1191 -1408 -810 42 997 1369 1319 553 -401 -1215 -1293 -879 -133 1058 1492 749 323
2372 323 -339 -1194 -1546 -943 -78 676 1245 874 458 -363 -1047 -1386 -915 53 748 1395 1243 628 -339 -797
2392 -797 -1497 -1122 -77 621 1040 1245 688 -396 -1142 -1035 -988 22 943 974 1403 874 -373 -830 -1259
2411 -1259 -851 -324 965 1168 1237 833 190 -1090 -1202 -973 -408 416 1127 1351 588 -187 -1126 -1409 -1000
2430 -1000 -609 432 1054 1096 605 47 -823 -1581 -964 -53 458 1045 1524 535 -160 -908 -1511 -998 -313 464
2450 464 814 1518 1264 -81 -510 -1021 -1319 -489 561 912 1552 1155 199 -832 -1119 -1336 -849 137 1034
2469 1034 1315 788 163 -890 -906 -1189 -741 64 942 1219 878 457 -634 -1214 -1226 -522 106 954 1472 1134
2489 1134 357 -472 -1302 -1257 -581 134 655 1318 1060 227 -513 -1101 -1485 -973 293 826 976 1383 408 -461
2509 -461 -951 -1123 -909 104 913 1185 1057 536 -292 -732 -1001 -1065 -495 791 1038 810 571 -322 -1301 -1095
2529 -1095 -546 -88 626 1381 1031 358 -75 -995 -1026 -655 -137 475 1167 1074 589 -301 -696 -1368 -1147 -32
2549 -32 466 1187 1374 455 -465 -819 -1318 -724 73 595 1119 1397 812 47 -520 -1646 -1316 -556 473 955
2569 955 1150 943 -100 -932 -962 -1128 -430 391 985 1148 731 -91 -861 -900 -980 -450 373 1067 822 523 267
2590 267 -433 -1305 -1225 -581 140 885 1153 567 -364 -798 -1172 -889 -599 255 731 1442 808 304 -456 -1296
2610 -1296 -1144 -660 374 987 1399 932 394 -722 -1297 -1163 -604 102 910 1072 904 360 -279 -905 -998
2629 -998 -800 -191 544 859 1039 717 -174 -896 -969 -495 125 556 1148 612 240 -329 -801 -1238 -863 -161
2649 -161 614 1147 903 356 -91 -820 -1226 -609 254 560 1034 1277 366 -299 -793 -1078 -893 74 1029 934
2669 934 873 644 -172 -955 -1338 -1088 -205 486 913 897 754 -360 -878 -1126 -808 -325 284 1047 788 644
2689 644 64 -798 -1147 -867 -708 325 875 880 436 136 -673 -1052 -764 -524 235 1100 1390 579 144 -674
2709 -674 -956 -679 -238 424 921 1044 644 -163 -797 -1205 -948 -239 442 848 1275 832 -169 -584 -1099 -829
2729 -829 -527 278 769 998 733 -47 -452 -1117 -1146 -533 125 737 1045 879 144 -1009 -1105 -1245 -747 -4
2749 -4 787 830 555 228 -440 -900 -921 -346 267 725 1149 974 293 -475 -1079 -849 -571 291 610 1247 866
2770 866 449 -428 -802 -888 -782 -60 461 1234 1038 314 -63 -968 -1117 -533 -43 533 899 851 393 -426 -818
2791 -818 -910 -728 -154 816 975 872 164 -183 -763 -877 -981 154 791 1000 1091 478 79 -1076 -706 -592
2811 -592 -299 617 1159 979 411 -82 -595 -947 -882 -113 650 826 1031 738 -230 -705 -1118 -707 -162 331
2831 331 612 1055 600 -243 -673 -911 -634 -148 165 979 1007 559 -42 -629 -1033 -891 -301 424 760 965
2851 965 590 119 -742 -819 -664 -695 310 1128 884 589 418 -481 -972 -995 -544 418 863 925 618 230 -711
2872 -711 -1256 -558 -624 -125 865 935 631 248 -259 -992 -898 -490 -19 418 978 808 165 -369 -700 -1080 -541
2893 -541 2 530 843 662 -41 -284 -850 -993 -690 61 810 752 681 475 -435 -899 -1141 -503 293 526 818
2914 818 829 383 -398 -770 -968 -911 -106 676 888 748 370 -281 -781 -972 -872 -228 643 1047 814 647 -140
2935 -140 -836 -709 -758 -123 592 839 671 223 -398 -797 -854 -647 -55 423 553 1015 455 -279 -707 -568 -500
2956 -500 -99 526 790 782 341 -197 -639 -840 -531 -274 372 925 792 274 8 -807 -1053 -818 -72 204 1105
2977 1105 1175 730 118 -529 -802 -800 -224 427 870 707 359 99 -476 -923 -875 -471 284 540 814 508 -233
2998 -233 -520 -1075 -628 -582 467 706 905 604 99 -414 -780 -921 -361 540 664 666 447 -20 -897 -927 -947
3019 -947 -387 299 786 942 784 43 -421 -871 -660 -446 186 700 1115 772 169 -167 -795 -912 -214 48
3039 48 534 981 935 135 -341 -922 -1039 -476 -106 287 1004 802 72 -471 -758 -959 -556 373 719 668 867
3060 867 479 -457 -547 -855 -446 34 570 869 515 257 -298 -955 -979 -717 -222 477 1095 667 413 44 -848
3081 -848 -1043 -417 10 447 988 1045 32 -43 -549 -1100 -827 -191 779 828 829 431 -349 -482 -823 -941 239
3102 239 306 610 942 353 44 -252 -909 -418 -536 462 841 855 326 -154 -902 -729 -1127 -428 372 546 750
3123 750 581 108 -607 -666 -333 -375 203 826 742 688 -82 -375 -688 -930 -226 279 676 771 389 -71 -528 -670
3145 -670 -727 -325 121 666 742 513 35 -326 -840 -681 -365 384 608 966 1031 212 -448 -911 -705 -418 2
3166 2 549 896 565 98 -603 -765 -544 -504 -103 559 914 638 183 -151 -590 -762 -323 188 573 680 371
3187 371 379 -239 -732 -768 -403 -352 651 540 906 159 -79 -541 -953 -477 106 486 690 564 399 -219 -519
3208 -519 -845 -559 29 463 771 660 303 -456 -675 -941 -350 -313 523 865 654 507 -18 -741 -884 -203
3228 -203 10 614 721 849 481 -6 -577 -696 -485 -273 263 844 598 417 -50 -382 -698 -792 -162 547
3248 547 669 731 410 -141 -644 -613 -468 -383 384 590 848 261 62 -349 -723 -789 -223 192 500 595 700 7
3270 7 -748 -748 -801 -340 278 525 917 501 236 -382 -676 -719 -308 204 659 743 381 130 -355 -783 -901 -443
3292 -443 153 546 531 680 71 -264 -718 -541 -432 173 812 755 355 340 -269 -737 -754 -571 214 524 779
3313 779 602 145 -506 -832 -712 -547 -6 726 851 510 119 -261 -510 -827 -391 51 678 676 757 196 -447
3334 -447 -602 -624 -440 -56 384 840 798 -35 -398 -553 -923 -494 143 507 591 573 526 -44 -717 -600 -363 84
3356 84 448 853 760 438 92 -692 -633 -639 -244 194 702 588 261 -221 -549 -723 -572 -1 395 713 762 690
3378 690 -4 -696 -702 -684 70 347 618 743 401 -393 -351 -573 -681 -314 258 560 848 599 95 -412 -776
3399 -776 -324 -222 289 626 983 441 257 -560 -331 -418 -450 291 595 767 232 -175 -610 -782 -759 -98 57
3420 57 230 628 527 27 -272 -668 -337 -146 217 553 814 662 35 -365 -721 -824 -251 97 337 858
3440 858 835 231 -496 -741 -588 -384 158 273 564 997 33 -226 -727 -588 -611 -18 765 589 603 217 -288
3461 -288 -698 -462 -557 92 682 615 316 117 -327 -651 -698 -341 -64 482 624 374 390 -75 -616 -730 -187
3482 -187 72 283 737 882 23 34 -544 -647 -369 157 362 667 616 199 -136 -510 -668 -536 73 409 459
3503 459 706 284 -133 -656 -417 -602 -309 325 586 607 503 -368 -384 -646 -698 -174 426 751 367 720 89
3524 89 -400 -611 -272 -83 359 697 657 190 -97 -531 -625 -721 -262 258 602 638 202 64 -387 -716 -587 -274
3546 -274 278 516 767 575 -94 -358 -404 -574 -208 77 471 766 292 -76 -302 -714 -730 -269 193 584 387
3567 387 467 171 -501 -598 -532 -269 172 858 779 643 89 -333 -612 -663 -529 75 447 374 410 79 -75 -680
3589 -680 -725 -277 -130 296 609 468 156 -468 -535 -585 -490 59 498 658 450 107 -150 -416 -573 -103 44
3610 44 635 311 481 140 -464 -623 -431 -423 -203 407 806 356 245 -97 -521 -526 -393 -50 409 398 540 15
3632 15 -104 -472 -760 -426 18 177 437 544 66 -47 -688 -579 -410 215 129 541 601 325 274 -210 -652
3653 -652 -565 -86 498 574 397 363 -448 -373 -361 -752 -34 194 443 491 273 227 -293 -576 -481 -171 405 400 716
3676 716 285 -237 -471 -982 -514 -129 295 509 573 378 -102 -349 -714 -429 -235 112 301 526 394 119
3696 119 -319 -744 -624 -194 54 438 867 352 -183 63 -226 -452 -329 131 296 256 367 21 -238 -459
3716 -459 -506 -213 38 275 657 441 250 -594 -504 -411 -460 -43 397 582 341 91 -143 -407 -733 -196 -19
3737 -19 395 623 267 111 -504 -550 -624 -430 91 563 592 542 320 -13 -514 -377 -387 124 492 517 430 374 -201
3760 -201 -257 -585 -255 -77 254 508 501 241 -95 -491 -474 -388 96 329 450 587 172 130 -553 -466 -414 -49 289
3783 289 460 546 177 -325 -442 -380 -264 -288 170 356 428 256 120 -489 -516 -363 -14 183 634 725 435 36
3805 36 -478 -105 -558 -80 115 382 510 289 13 -374 -251 -544 56 269 457 487 534 -26 -498 -477 -361
3826 -361 -83 29 455 485 458 -27 -343 -191 -556 -431 2 634 194 44 91 -452 -313 -627 -28 -98 450
3847 450 469 616 29 -282 -544 -412 -68 96 494 462 473 156 -136 -621 -502 -279 24 376 232 301 134
3868 134 -228 -626 -497 -404 -61 70 394 393 274 35 -338 -702 -180 75 326 348 488 327 -73 -377 -487
3889 -487 -377 -270 30 342 509 146 -132 -332 -591 -160 -105 239 413 426 201 -181 -472 -523 -447 -20 269
3910 269 606 453 163 134 -502 -538 -560 52 431 666 338 341 -104 -474 -569 -362 -55 135 460 651 44 -165
3932 -165 -329 -566 -463 -119 131 384 525 252 80 -202 -335 -189 -280 235 388 705 332 -160 -192 -393 -260
3953 -260 -211 -5 143 525 192 -141 -203 -397 -270 -312 202 165 362 248 57 -417 -373 -273 -100 251 49 569
3975 569 519 -10 -369 -229 -304 77 98 470 502 557 120 -164 -379 -510 -186 -63 330 361 528 -111 -322 -345
3997 -345 -173 -237 9 319 406 550 -24 -179 -593 -592 -457 35 174 342 309 438 -64 -395 -444 -257 141 257
4019 257 341 261 180 -141 -309 -431 -173 199 426 544 218 57 -130 -334 -308 -312 -24 212 446 204 260 -74
4041 -74 -238 -381 -498 -130 312 397 411 328 -136 -163 -134 -270 -17 438 178 379 129 95 -147 -280 -73 -361
4063 -361 220 368 348 372 123 -263 -441 -429 -166 135 550 530 231 277 -557 -311 -348 -236 -63 342 276 47
4085 47 240 -185 -580 -641 -191 49 263 309 319 3 -312 -484 -484 -119 101 121 772 278 -151 -181 -185 -399 -240
4108 -240 215 92 531 431 10 -266 -320 -368 -276 31 259 355 293 60 13 -139 -201 -291 -128 225 339 24 -22
4131 -22 -346 -660 77 37 -30 98 153 397 64 -134 -318 -521 -13 -30 400 481 394 41 -136 -49 -209 -447 5
4154 5 235 180 481 -40 -98 -297 -365 -378 140 392 342 440 124 -49 -422 -176 -159 -61 405 176 425 164 28
4177 28 -240 -481 -321 92 243 392 260 163 -119 -205 -282 -337 121 189 120 249 203 -83 14 -591 -74 88 197
4200 197 248 431 411 -23 -99 -240 -175 -238 201 482 264 106 -169 -389 -254 -105 -97 57 516 276 175 160 -115
4223 -115 -462 -483 -142 227 46 409 114 -47 -140 -352 -239 -260 -234 215 159 162 72 4 -264 -535 -165 -107 437
4246 437 529 268 55 10 -301 -279 -340 -161 47 434 94 75 68 -425 -233 -76 92 178 195 144 171 -189 -65 -407
4270 -407 -382 162 64 346 342 19 -190 -95 -326 -207 17 203 143 122 98 -113 -200 -443 -251 120 213 553 101
4293 101 129 -95 -199 -349 -283 -202 308 283 348 69 63 -423 -63 -373 53 136 58 148 -46 210 -368 -219 -166 -160
4317 -160 273 367 316 137 44 -10 -439 -168 -67 94 404 292 72 -104 107 -239 -226 -58 -114 441 347 171
4339 171 -167 -245 -218 -254 7 114 -19 157 111 -150 -125 -225 -394 -96 -2 322 290 200 -93 -474 -381 -150 -210
4362 -210 -52 126 168 262 159 -263 -86 -110 -91 218 205 254 345 -18 -97 -293 -169 -206 -4 253 303 256 51 -106
4386 -106 -200 -482 -134 -27 459 424 516 -30 -328 -212 -377 -129 9 114 367 435 -103 -50 -293 -385 -64 -90
4408 -90 273 409 45 147 -88 -88 -318 -299 -49 64 113 82 100 -412 -37 -148 -413 63 74 -44 389 132 218
4431 218 -378 -160 -168 72 38 83 221 -81 119 -198 -113 -383 -158 -6 232 323 85 -17 -263 -210 -64 -156 192
4454 192 21 208 93 -40 -296 -73 -64 -225 180 272 324 299 -22 -151 -100 -169 -48 -54 268 394 257 11 -92
4477 -92 -101 -322 -15 -53 147 314 157 166 90 -205 -29 -79 244 22 200 241 123 -125 -292 -211 -104 119 30 172
4501 172 165 -1 -130 -298 -378 -192 -127 189 -2 112 182 -160 -230 -324 -169 -34 309 332 -150 16 -414 -199 -263
4524 -263 -100 -128 310 416 297 141 -202 -85 -188 -176 -194 148 405 227 259 111 -396 -174 -92 1 199 107
4546 107 381 158 -388 -302 -50 -197 -171 -113 77 214 64 -158 -156 -291 -221 174 144 147 254 117 -59 -206 -52
4569 -52 -228 -253 79 68 284 260 -197 -190 -212 -457 154 170 77 4 213 11 -167 -202 -212 -168 56 334 62 33 -106
4594 -106 -424 14 -88 -213 129 90 318 295 120 -322 -428 -340 -73 128 104 211 272 42 -123 -374 -203 -155
4616 -155 245 188 380 306 138 69 -557 -382 -149 40 121 115 187 -117 -243 -220 -235 -53 -143 55 437 322 -46
4639 -46 115 -97 -131 -202 22 339 498 98 125 -76 -98 -100 -369 133 -4 206 185 72 -348 -303 -339 -217 66
4662 66 201 252 293 -62 -20 17 -206 -287 -11 139 255 136 218 17 -150 -288 -138 -162 248 250 211 195 -64 -148
4686 -148 -289 -40 -88 173 235 156 175 -101 -188 -175 -258 161 -17 324 292 -1 66 -384 -284 -340 -119 -52 -73 72
4710 72 117 221 24 -320 -201 -43 14 136 128 333 158 -116 -165 -439 -189 95 261 212 198 77 -26 -43 -176
4733 -176 -16 62 -269 173 182 19 -109 -300 -182 -217 146 320 8 236 197 -330 -245 -136 -122 36 233 3
4755 3 151 63 -255 -266 -121 -147 60 344 110 106 252 -170 -143 -180 72 103 267 267 261 68 -47 -309 -331 -31 -267
4780 -267 171 392 71 160 -150 -76 -178 -228 -99 74 218 154 130 234 -122 -229 -133 21 142 171 260 26 -79
4803 -79 15 -364 -322 3 56 228 117 290 -207 -100 -30 -186 -129 11 118 180 276 -210 -284 -386 -203 -43 61
4826 61 152 367 -144 206 -192 -121 -111 -151 76 347 71 33 27 -218 -173 -95 -192 -80 216 369 434 56 1 -294
4850 -294 -44 -127 -27 398 28 69 -54 -98 -116 -38 97 38 313 237 330 0 29 -111 -219 -168 59 2 -3 38 63
4875 63 -71 -63 -342 -123 72 237 -23 242 121 -96 -256 -127 57 -21 -10 349 430 9 -13 -2 -311 -83 -15
4898 -15 86 237 170 102 -91 -9 -250 -144 134 43 18 184 121 -182 -58 -188 -49 -67 -51 123 296 134 61
4921 61 -181 -272 -6 -177 204 222 231 118 -30 -159 -204 -128 -37 125 399 135 -56 -55 26 -41 72 2 39 115 326
4946 326 199 71 34 -102 -213 -155 -8 -6 82 97 143 -174 -193 -502 -325 -60 100 38 152 17 179 -395 -264
4969 -264 -137 -33 117 9 214 -201 -32 -300 -435 -346 -36 331 205 82 7 -241 -219 -128 -161 -53 -21 17
4991 17 296 105 -53 52 -194 -390 -58 222 271 181 99 216 -264 -197 141 57 27 166 202 -221 -256 42 90
5014 90 -303 -116 156 270 6 180 -48 -58 -239 -103 -44 23 226 184 40 -32 -113 -115 -187 30 53 -110 522 169
5038 169 -157 -169 -114 -53 51 -132 -22 115 243 52 -257 -172 -276 -24 151 253 227 120 -94 -124 -295 -25
5060 -25 -21 -26 327 21 43 330 -157 -170 -63 -142 182 -201 145 196 -9 -257 -26 -167 -156 42 135 179 37 134
5084 134 -65 215 22 -142 -127 121 242 95 77 -46 110 -332 -125 70 87 109 342 -85 -208 -248 -181 -299
5106 -299 67 228 142 174 -93 -38 -134 -211 -106 81 160 45 131 273 -90 -244 -238 -66 130 60 41 251 32 9
5130 9 -159 -170 14 -17 387 26 370 27 -36 -193 -77 -67 -247 522 172 87 164 -271 36 -128 -231 -95 2
5153 2 74 158 -19 -71 -36 -43 13 237 -110 92 298 -77 -49 -8 -250 -122 112 -98 72 351 21 116 136 -334
5177 -334 -89 49 -36 313 110 270 -252 -147 -309 -212 32 -46 74 408 129 -12 19 -122 -337 91 82 -78
5199 -78 153 -79 -54 -393 -68 -42 -80 -13 150 -17 431 -114 31 -233 -177 -244 265 229 47 362 295 -64 -84
5222 -84 -85 -21 -146 -66 214 147 -66 -302 -57 -11 -343 103 246 -66 70 -41 162 -202 -101 -158 35 48 310
5245 310 84 34 -283 -32 -231 -261 -134 98 430 39 75 -282 -310 45 -192 -11 79 150 59 -134 -30 -161
5267 -161 70 -133 -118 130 18 -7 -93 -179 -215 -199 -221 8 55 149 447 80 -37 -285 -247 34 -51 350 85 140
5291 140 122 -53 -18 -72 -142 3 136 95 9 37 -38 -132 -205 -57 192 100 178 290 36 -23 -182 -205 -45 -99 -45
5316 -45 204 354 333 -45 -84 -240 28 -109 4 61 298 117 89 -100 -247 -282 -175 189 79 60 63 15 -35 54
5340 54 -110 113 259 -28 230 355 37 92 -173 -184 -208 78 283 276 147 -233 -163 -48 -35 -158 214 295 243
5363 243 33 79 -148 -31 -111 -288 -98 244 300 259 59 -230 -47 -174 -229 -96 202 120 216 177 -40 -122 -10
5386 -10 0 64 85 -45 24 192 82 -158 105 -54 -111 125 229 224 -25 -96 -70 -386 -282 113 127 354 118 58
5410 58 -153 -378 -296 -33 -4 71 135 111 20 -34 0 -30 -117 3 29 187 10 163 132 -372 -42 -329 77 39 -43
5435 -43 18 206 120 25 -19 -53 27 154 2 45 67 -43 -98 -260 -52 -284 49 338 124 250 57 -292 -153
5458 -153 78 -169 121 57 124 139 42 85 183 -116 -164 99 149 227 1 154 17 -217 -237 -500 248 124 187 199
5482 199 163 206 -6 -281 -159 -112 237 44 36 -26 -50 -353 -176 7 90 75 191 214 -259 -143 -277 -50 18 -75
5506 -75 272 294 242 41 27 -66 -197 -109 -141 223 -23 386 -136 -137 -139 -50 -96 32 32 219 -44 -146 -129 35 -100
5531 -100 -258 90 -57 286 98 -173 -44 90 -66 -63 190 208 172 202 -97 -267 -267 102 3 -49 -16 76 -127 101
5555 101 -32 -96 -84 -114 75 -279 258 203 -141 26 62 86 -30 -169 72 140 364 -103 40 -94 -124 119 122
5578 122 81 -18 245 232 -132 135 -189 -25 -112 71 108 -76 186 173 -130 -264 -113 -248 -20 23 168 -14
5600 -14 47 -158 -140 -45 -40 -10 142 8 153 12 -218 -140 101 -84 -18 258 103 129 32 -180 -354 -199 -141 9
5624 9 108 140 6 111 -107 -164 -107 -50 183 112 233 151 -117 208 126 -77 154 -56 201 -222 141 -169 -94 -48
5648 -48 37 -109 76 167 27 262 72 -85 -400 -259 -161 185 117 171 268 -35 -232 -184 -41 -329 17 55 131
5671 131 -72 8 -2 -83 -181 -242 -206 11 162 21 9 43 -54 -288 -221 162 21 390 381 3 133 -256 -194 -43
5695 -43 -182 267 206 54 -156 -95 -209 -128 -324 -287 157 99 74 178 -148 -100 128 -1 129 94 -15 264 158
5718 158 -273 -27 -211 -324 -184 -312 11 272 38 255 26 -43 -17 -83 163 73 79 212 -45 72 -148 -170
5740 -170 -195 -43 -1 112 120 264 -62 -424 -88 -69 334 233 198 273 -70 -294 84 -150 -65 -157 156 257 105
5763 105 -84 -146 -129 -87 -2 -165 60 131 130 147 94 -91 -364 14 321 231 171 92 -161 -53 -195 -119 -176 -78 372
5788 372 -111 231 151 -94 -284 -243 -123 -184 58 -13 2 -36 -60 -122 -170 -275 -122 116 137 161 88 -65 -37 -151
5812 -151 -269 -116 140 -32 102 352 -231 63 -203 -174 -70 125 333 104 156 17 -48 -213 -44 -265 20
5833 20 224 248 163 96 -193 -58 209 -233 182 141 129 -23 -46 32 34 -301 -23 46 142 -4 -62 -70 -135 -128 -112 -115 257
5860 257 162 243 197 79 -54 -136 -126 -238 -95 -28 129 -91 150 -152 -229 -93 -90 98 150 -9 300 104 -55
5883 -55 -130 154 -118 -161 94 228 -42 -35 -142 -60 25 -173 148 265 64 363 126 -38 -332 -86 -47 98 148
5906 148 40 129 -42 -81 -173 116 -175 203 155 74 -13 -46 12 -169 -20 121 229 -101 257 96 -34 -253 -30
5929 -30 47 -116 -65 321 26 80 -190 -86 -226 -2 18 -44 -37 -59 209 111 -117 47 -51 -263 -5 66 11 198
5953 198 56 -75 155 -7 -72 245 52 99 45 -33 -66 -216 -13 -369 176 -24 75 177 57 -205 179 -180
5975 -180 -329 166 -11 -58 168 348 -146 -300 -40 -61 -28 -145 361 184 64 58 -87 -199 -57 56 -143 -126
5997 -126 350 7 -207 18 -252 -130 -155 -31 245 201 -3 -16 -53 144 7 -78 -50 48 -60 -8 -44 19 -164
6020 -164 119 -43 111 134 122 -18 90 29 -197 -180 -51 36 -78 99 140 -144 -172 -355 -84 21 59 111 112 196
6044 196 88 65 -73 -244 107 -88 7 -59 53 -121 -125 -12 -182 18 105 355 72 86 244 194 -21 -252 25
6067 25 -18 67 211 -37 184 13 -79 -223 146 -227 172 11 -182 284 238 104 -14 -37 -50 81 25 -115 -2
6090 -2 -74 -183 -365 -145 -160 -112 203 162 73 -259 107 -365 -180 182 77 87 169 201 -30 -119 40 -263 105 -45
6114 -45 96 234 120 -159 -86 -213 16 34 -29 134 -18 219 122 16 -279 -61 -25 34 -178 160 223 -44 -240
6137 -240 -72 111 -37 70 139 129 36 111 329 -190 -284 -38 -153 101 185 200 -35 -276 -146 64 -171 132
6159 132 129 221 -168 -300 -211 -219 -150 44 -62 21 -90 50 125 74 -366 110 -105 50 114 183 181 137 253 -137 -39
6184 -39 -221 148 58 72 96 131 9 131 -79 129 91 20 175 -72 -50 40 -144 -126 -136 -184 217 53 57 108 -110
6209 -110 -100 -25 -257 -66 -95 37 117 -58 159 -292 -271 -54 -135 196 376 341 72 -112 13 -56 -17 -84 379
6232 379 131 -26 46 113 47 -272 -45 163 209 -111 70 99 14 -82 118 -170 72 -97 122 104 29 -60 -17 -52
6256 -52 -39 23 -172 283 62 138 75 -471 -145 -40 -21 -156 203 86 27 -99 -188 -116 -110 127 233 119 -27 96
6280 96 118 61 -207 40 11 259 93 149 101 124 -300 -51 -183 -121 43 27 73 -95 -49 -21 19 -226 156 51
6304 51 65 50 -82 136 -51 -109 106 4 82 283 322 122 334 -310 -227 -328 -247 195 145 84 -95 237 -91
6327 -91 74 7 162 -42 88 107 -2 105 86 56 -274 8 237 60 37 110 -90 -360 -36 -304 -37 12 192
6350 192 200 39 17 -75 -104 -131 -13 217 153 -44 90 19 -145 -116 -77 -65 -1 185 178 -88 -13 -243 -79 -54 -168
6375 -168 -169 247 442 93 -34 83 36 47 2 160 200 -107 162 84 -160 132 -98 -272 75 103 182 158 -132
6398 -132 28 -17 9 -160 -33 51 160 99 -75 18 -101 117 29 143 -39 -94 -47 -165 -167 1 -94 -188 -62 102
6422 102 139 25 -87 -200 -56 -112 -152 -48 1 -23 -179 44 178 -93 -139 154 -156 -72 258 105 104 -58 -57 -110
6446 -110 -5 -172 -50 166 80 16 450 -41 -284 -59 47 29 74 232 174 -50 -201 78 -239 -55 -171 19
6468 19 26 29 81 3 -186 -270 -167 -228 14 315 27 -15 140 -188 -329 -172 -17 137 161 30 -38 25 -238 -78
6492 -78 -206 -76 89 0 60 -269 -237 22 -55 -154 165 -153 -172 230 158 70 -133 -196 -132 96 92 188 -57 92 119
6517 119 -294 14 87 -133 19 67 179 152 -96 -102 -96 65 83 203 110 -41 97 -44 -294 -314 -154 -26 57 4
6541 4 140 -46 112 241 -236 -343 39 -24 -1 109 171 13 -9 -224 -104 -33 157 83 264 157 64 -99 -77
6564 -77 68 91 26 89 19 -35 -90 61 115 -142 146 -59 -96 107 39 36 -376 -201 86 -262 100 138 126 98 130
6589 130 -16 -382 119 -155 133 187 243 22 155 196 -294 -186 22 156 31 61 -56 -272 -149 -109 -198 65
6611 65 2 -52 -37 65 -40 -87 -202 -324 -39 -141 -41 258 -36 -98 -92 70 60 63 178 203 193 111 -30 38 -181
6636 -181 10 -259 42 -31 359 -24 -3 -229 -200 -185 134 54 325 296 -103 -27 -56 102 -215 -21 275 46 30
6659 30 71 107 144 -129 -14 -30 170 -324 -112 41 -99 65 -193 -99 -93 -154 -18 196 -18 189 228 -463 112
6682 112 -24 222 93 25 -120 40 158 -70 172 -82 -137 -62 187 206 -111 -93 -80 -81 79 -120 -24 183 99
6705 99 140 82 -116 -205 101 44 -40 156 -201 100 165 -83 95 -232 -116 180 413 133 -64 151 -235 -83
6727 -83 88 272 35 119 149 176 136 -75 -111 -170 -182 -55 175 -111 155 -155 -8 -42 -383 -25 39 26 166 53
6751 53 30 -195 -315 -201 -75 21 96 262 126 21 -76 -313 -258 -136 -376 197 195 143 -80 7 -327 -92 -90 121
6775 121 348 226 178 -62 -75 -14 249 18 -88 40 49 315 -201 -144 -182 -42 46 217 -14 62 82 42 140 120
6799 120 -105 -331 -15 43 385 136 69 47 -125 -83 -177 -82 -71 1 -27 246 -34 -62 -117 -147 -34 -138 264 -7
6823 -7 106 -15 -154 -300 56 69 289 126 170 220 8 -112 -43 -148 -43 184 -132 -80 145 -165 -201 -47 -357
6846 -357 61 13 159 121 -18 118 -279 -202 -330 -119 62 283 276 -206 32 -150 -224 -301 -2 192 -120 -112 467
6869 467 52 118 -366 72 130 237 -130 7 160 18 -7 -264 103 -57 242 190 -217 -211 -31 0 -286 -303 -41
6892 -41 -161 44 145 311 169 -259 -166 42 -127 -123 -51 393 26 -249 237 233 -186 -37 -185 -71 139 156 222
6915 222 19 -56 -183 -127 -121 -66 -17 179 82 -114 -73 -12 -63 21 5 306 95 -126 9 38 -93 -105 15 29 -122
6940 -122 175 88 63 -345 62 66 -55 360 271 117 -98 38 -103 49 -18 250 42 -238 41 84 39 -46 -118
6963 -118 -43 109 101 -57 92 -69 40 -54 -75 42 25 109 162 -56 231 17 -176 -73 -27 84 -157 222 295
6986 295 -97 -234 -156 93 -115 -30 108 46 15 133 196 -123 -233 -91 141 -99 51 129 1 155 -7 -226
7008 -226 32 -34 -101 -87 53 -17 23 -25 -104 -108 -123 136 234 -28 43 107 121 -195 -256 -2 48 -7 -4 -176 -114 -46 -58
7035 -58 -118 -69 45 90 131 173 76 -65 -2 -48 50 -3 -156 42 163 -16 210 -125 196 -223 136 91 157 116 -69
7060 -69 126 136 -75 -19 -29 -74 45 176 226 115 -113 291 -30 2 -169 93 -51 -259 59 62 17 -199 -68
7083 -68 -213 -37 108 -142 234 -149 -279 -55 -62 46 185 144 -25 157 -124 162 -153 107 -15 105 58 245
7105 245 4 -8 -1 -4 -115 242 60 -113 136 97 32 -70 15 128 232 -51 -44 165 43 73 -180 -231 -16 76
7129 76 47 93 70 -163 -113 -220 215 54 81 -72 -79 -258 -50 -47 -163 -41 -203 -104 105 5 -52 222 -99 -206
7153 -206 -23 132 77 -10 114 110 -68 89 -63 -289 -96 -18 216 131 -10 -67 -210 -38 80 -182 -15 61 312
7176 312 93 -23 -94 111 -110 6 -39 -131 -21 -49 207 201 -80 139 122 -78 151 98 -14 161 -75 -294 -177
7199 -177 -127 -98 225 73 182 123 77 133 -17 92 -205 45 218 -169 -27 -126 15 99 30 -54 209 -8 170
7222 170 62 138 -45 -1 11 50 120 49 43 -24 78 -197 -110 35 -250 -115 82 -7 -103 -60 -119 -85 -163 -33 -35 -50
7248 -50 -72 56 -49 37 66 -173 82 -69 6 40 22 210 58 -77 16 70 80 -94 208 43 -123 62 10 -38
7272 -38 -278 -30 -146 129 250 206 -319 -98 8 49 -28 -132 134 -81 14 -142 -123 -302 -250 -26 38 23 -94
7295 -94 32 -244 -272 -111 -16 68 26 68 76 -149 -68 -206 -45 -152 -124 53 158 59 155 -194 -185 22 -229 -47 78
7320 78 7 35 -135 55 112 200 -164 59 -56 130 128 -147 4 50 -64 -55 -36 258 -95 -52 -26 124 -64 -20 92
7345 92 65 -143 -17 343 -208 57 -83 -4 -118 -84 155 29 54 82 -86 -34 89 -55 26 -188 153 138 -5
7368 -5 -290 -63 -208 -46 -95 -34 -50 129 151 8 -152 149 -83 58 39 297 147 -142 -7 -132 -56 87 36
7391 36 -78 81 369 271 -60 -61 -133 9 -135 -29 284 14 -119 307 205 -71 224 -140 126 200 -44 -32
7413 -32 -40 -14 136 189 -13 83 -123 113 -43 -167 -118 -441 -51 -133 -122 17 301 17 -168 173 -177 2 39
7436 39 12 126 217 -99 252 146 188 -130 31 21 148 59 234 69 -73 -219 -32 80 -179 168 -34 -102
7458 -102 12 130 15 -30 -90 209 76 -7 61 -93 -8 -27 -36 96 138 -121 40 0 19 -94 -190 226 -213 -67
7482 -67 -114 81 -54 151 -349 126 -54 12 -25 247 -149 -103 107 -107 -18 -31 71 -33 -3 16 0 290 -302
7505 -302 -130 -15 -187 -45 -81 -76 46 28 -5 -107 -166 -93 230 53 421 255 80 -229 -36 -232 -306 -42 -42
7528 -42 -13 -215 102 -99 -301 -53 -20 -81 -102 -82 242 58 -114 7 -38 59 85 -178 242 151 110 -56 20 -172
7552 -172 -242 -77 -65 110 4 9 36 -10 -185 -274 88 -54 108 62 201 80 -149 -45 60 -184 241 53 6
7575 6 331 10 -179 183 -62 -64 -80 59 268 50 -39 -300 -53 100 -4 -7 74 6 80 11 -171 -146 204 -173
7599 -173 -111 143 -12 77 -78 -50 -41 53 -166 -51 248 -128 -112 242 -294 -9 44 -119 -55 -176 -51 100 95 180
7623 180 -109 117 101 -141 -156 289 88 95 22 46 6 -262 -82 -22 131 121 -110 188 70 -212 4 -78 133
7646 133 238 28 -171 -60 78 180 -236 -75 142 45 39 -17 -124 -159 24 46 -192 -142 45 -24 3 144 155
7669 155 -335 -230 244 101 459 6 -86 -40 -138 -95 -383 -80 -139 -101 119 -137 147 -128 53 -147 -159 -89 163
7692 163 273 -116 -197 -17 -42 -76 226 22 -63 -228 55 -90 -162 -290 -25 114 75 -103 92 70 -106 -190 -14
7715 -14 -98 -45 273 174 -29 199 -275 -139 -102 111 -198 -254 311 221 -106 -86 37 196 17 103 209 197 65
7738 65 -5 -127 -183 -110 -228 77 152 24 298 108 -134 -57 -361 44 118 -201 87 118 126 210 -65 -366 -198 142
7762 142 41 -74 72 65 375 -69 -29 93 -57 -92 180 56 116 -35 101 11 30 -398 179 211 52 330 48
7785 48 -21 -230 114 -37 73 -102 103 -291 -33 -277 48 -101 -17 -136 82 -8 -176 309 89 27 -244 7
7807 7 -131 211 -112 243 214 163 144 -133 -4 -104 -12 151 162 -9 137 34 -51 -82 144 -198 -118 116 31 -149
7831 -149 -54 34 -29 36 -56 128 203 74 143 64 -128 97 -53 49 -90 21 15 60 -36 -81 -157 108 -186 25 -22
7856 -22 25 131 -180 -108 -301 -86 32 125 237 280 22 -105 -55 -52 -192 47 94 59 235 188 -68 -40 64 -191
7880 -191 -78 78 145 -31 -175 -107 -53 83 -128 -31 155 -9 194 -55 69 -216 -59 139 126 -120 86 118
7902 118 37 49 -97 285 23 294 -85 109 -275 106 153 -27 -67 10 -117 -16 4 136 46 234 -102 -53 -300
7925 -300 -85 7 93 -75 -98 -45 -106 -34 -32 -56 5 47 192 -80 -145 -188 -22 63 259 279 22 215 238 82 -90
7950 -90 122 44 70 30 113 190 178 -197 -14 -65 -41 -33 16 3 -12 38 -5 -213 155 -85 12 94 124 101 121 6 -22
7977 -22 97 -159 -150 -177 -45 138 155 126 79 114 -104 21 82 -19 -80 -22 91 29 0 -135 124 -169 57 -24 -25
8002 -25 -90 -96 -165 -135 62 -18 26 -48 171 54 -78 -201 -152 4 -25 30 158 -90 -142 292 6 -4 86 58 -199
8027 -199 122 42 196 -32 228 52 79 149 169 87 -127 -131 -142 156 -120 147 -53 -40 318 -187 81 -75 -249
8050 -249 -131 35 -60 -116 65 107 50 128 -234 -204 -171 28 -83 114 121 121 72 -101 -46 51 -80 -45 -9 65 -102 -179
8076 -179 6 -161 -43 96 128 -115 61 489 -127 5 -60 140 201 133 185 -39 -173 -16 58 -17 -42 -38 56 -54
8100 -54 179 -87 82 145 -28 -48 -61 -73 308 214 201 -151 -224 -118 103 -72 64 71 -121 81 -99 112 51 -191
8124 -191 82 138 -217 41 97 87 -244 178 -253 27 21 -205 151 90 63 145 114 -49 -74 -16 256 -156 3 -117
8148 -117 273 123 -50 -53 -21 146 199 -236 87 -270 4 -144 -323 -217 110 238 -46 4 -68 -198 52 253
8170 253 -147 28 154 99 -88 -22 -92 54 -345 -55 275 -13 -392 124 -119 -185 51 -151 144 -94 -141
8191a41
##END NTUPLES=NMR FID
##END=
