##TITLE=1H_LR-737-k1
 CDCl3,8 sc, 
 1.10.2021
##JCAMPDX= 6.0         $$ Bruker NMR JCAMP-DX V2.0
##DATA TYPE= NMR FID
##DATA CLASS= NTUPLES
##ORIGIN= UXNMR, Bruker Analytische Messtechnik GmbH
##OWNER= root
$$ XWIN-NMR		Version 3.5
$$ Fri Oct  1 11:14:51 2021 Russian Standard Time (UT+4h)  she@DPX200
##.OBSERVE FREQUENCY= 200.1313468511
##.OBSERVE NUCLEUS= ^1H
##.DELAY= (6, 6)
##.ACQUISITION MODE= SIMULTANEOUS
##.ACQUISITION SCHEME= undefined
##.AVERAGES= 8
##.DIGITISER RES= 18
##SPECTROMETER/DATA SYSTEM= spect
##.PULSE SEQUENCE= zg30
##.SOLVENT NAME= CDCl3
##.SHIFT REFERENCE= (INTERNAL, CDCl3, 0, 15.7039)
##AUDIT TRAIL= $$ (NUMBER, WHEN, WHO, WHERE, WHAT)
$$ ##TITLE= Audit trail, XWIN-NMR		Version 3.5
$$ ##JCAMPDX= 5.01
$$ ##ORIGIN= Bruker BioSpin GmbH
$$ ##OWNER= she
$$ F:/spectra/data/she/nmr/H-F/1/audita.txt
$$ ##AUDIT TRAIL=  $$ (NUMBER, WHEN, WHO, WHERE, WHAT)
(   1,<2021-10-01 11:13:55.37 +0400>,<she>,<DPX200>,
      <created by zg, POWCHK disabled, PULCHK disabled
       configuration hash MD5:
       00 E9 B6 7A A2 85 ED C7 34 08 36 98 17 FE 4E 26
       data hash MD5: 16K
       7F 5B 08 37 28 D7 2F E4 6D 21 15 2A 2F A0 5B 81>)
$$ ##END=
$$ 
$$ hash MD5
$$ 37 B8 48 DB 36 0E 08 36 08 7D 81 7D 51 48 55 D1
##$RELAX= 
##$RELAX= 
##$RELAX= 
##$RELAX= 
##$RELAX= 
##$RELAX= 
$$ Bruker specific parameters
$$ --------------------------
##$DU= <F:/spectra>
##$EXPNO= 1
##$NAME= <H-F>
##$PROCNO= 1
##$TYPE= <nmr>
##$USER= <she>
##$AMP= (0..31)
100 100 100 100 100 100 100 100 100 100 100 100 100 100 100 100 100 100 
100 100 100 100 100 100 100 100 100 100 100 100 100 100 
##$AQSEQ= 0
##$AQ_mod= 1
##$AUNM= <au_zg>
##$AUTOPOS= <>
##$BF1= 200.13
##$BF2= 200.13
##$BF3= 200.13
##$BF4= 200.13
##$BF5= 200.13
##$BF6= 200.13
##$BF7= 200.13
##$BF8= 200.13
##$BYTORDA= 1
##$CFDGTYP= 0
##$CFRGTYP= 5
##$CHEMSTR= <none>
##$CNST= (0..31)
1 1 145 1 1 1 1 1 1 1 1 1 1 1 1 1 1 1 1 1 1 1 1 1 1 1 1 1 1 1 1 1 
##$CPDPRG= <>
##$CPDPRG1= <>
##$CPDPRG2= <>
##$CPDPRG3= <>
##$CPDPRG4= <mlev>
##$CPDPRG5= <mlev>
##$CPDPRG6= <mlev>
##$CPDPRG7= <mlev>
##$CPDPRG8= <mlev>
##$CPDPRGB= <>
##$CPDPRGT= <>
##$D= (0..31)
0 1.2 0 0 0 0 0 0 0 0.06 0 0.03 0 0 0 0 0.0002 0 0 0 0 0 0 0 0 0 0 0 0 
0 0 0 
##$DATE= 1633072434
##$DBL= (0..7)
120 120 120 120 120 120 120 120 
##$DBP= (0..7)
150 150 150 150 150 150 150 150 
##$DBP07= 0
##$DBPNAM0= <>
##$DBPNAM1= <>
##$DBPNAM2= <>
##$DBPNAM3= <>
##$DBPNAM4= <>
##$DBPNAM5= <>
##$DBPNAM6= <>
##$DBPNAM7= <>
##$DBPOAL= (0..7)
0.5 0.5 0.5 0.5 0.5 0.5 0.5 0.5 
##$DBPOFFS= (0..7)
0 0 0 0 0 0 0 0 
##$DE= 6
##$DECBNUC= <off>
##$DECIM= 32
##$DECNUC= <off>
##$DECSTAT= 4
##$DIGMOD= 1
##$DIGTYP= 9
##$DL= (0..7)
0 120 120 120 120 120 120 120 
##$DP= (0..7)
150 150 150 150 150 150 150 150 
##$DP07= 0
##$DPNAME0= <>
##$DPNAME1= <>
##$DPNAME2= <>
##$DPNAME3= <>
##$DPNAME4= <>
##$DPNAME5= <>
##$DPNAME6= <>
##$DPNAME7= <>
##$DPOAL= (0..7)
0.5 0.5 0.5 0.5 0.5 0.5 0.5 0.5 
##$DPOFFS= (0..7)
0 0 0 0 0 0 0 0 
##$DQDMODE= 0
##$DR= 18
##$DS= 0
##$DSLIST= <SSSSSSSSSSSSSSS>
$$ [...]
##$SUBNAM2= <"">
##$SUBNAM3= <"">
##$SUBNAM4= <"">
##$SUBNAM5= <"">
##$SUBNAM6= <"">
##$SUBNAM7= <"">
##$SUBNAM8= <"">
##$SUBNAM9= <"">
##$SW= 18.0517286264689
##$SWIBOX= (0..15)
0 0 2 0 0 0 0 0 0 0 0 0 0 0 0 0 
##$SW_h= 3612.71676300578
##$TD= 16384
##$TD0= 1
##$TE= 0
##$TE2= 300
##$TE3= 300
##$TEG= 300
##$TL= (0..7)
0 120 120 120 120 120 120 120 
##$TP= (0..7)
150 150 150 150 150 150 150 150 
##$TP07= 0
##$TPNAME0= <>
##$TPNAME1= <>
##$TPNAME2= <>
##$TPNAME3= <>
##$TPNAME4= <>
##$TPNAME5= <>
##$TPNAME6= <>
##$TPNAME7= <>
##$TPOAL= (0..7)
0.5 0.5 0.5 0.5 0.5 0.5 0.5 0.5 
##$TPOFFS= (0..7)
0 0 0 0 0 0 0 0 
##$TUNHIN= 0
##$TUNHOUT= 0
##$TUNXOUT= 0
##$USERA1= <user>
##$USERA2= <user>
##$USERA3= <user>
##$USERA4= <user>
##$USERA5= <user>
##$V9= 5
##$VALIST= <valist>
##$VCLIST= <CCCCCCCCCCCCCCC>
##$VD= 0
##$VDLIST= <DDDDDDDDDDDDDDD>
##$VPLIST= <PPPPPPPPPPPPPPP>
##$VTLIST= <TTTTTTTTTTTTTTT>
##$WBST= 1024
##$WBSW= 4
##$XGAIN= (0..3)
0 0 0 0 
##$XL= 0
##$YL= 0
##$YMAX_a= 126586
##$YMIN_a= -158367
##$ZGOPTNS= <>
##$ZL1= 120
##$ZL2= 120
##$ZL3= 120
##$ZL4= 120
##$ABSF1= 10
##$ABSF2= 0
##$ABSG= 5
##$ABSL= 3
##$ALPHA= 0
##$AQORDER= 0
##$ASSFAC= 0
##$ASSFACI= 0
##$ASSFACX= 0
##$ASSWID= 0
##$AUNMP= <proc_1d>
##$AZFE= 0.1
##$AZFW= 0.1
##$BCFW= 1
##$BC_mod= 2
##$BYTORDP= 1
##$COROFFS= 0
##$CY= 11.3945322036743
##$DATMOD= 1
##$DC= 2
##$DFILT= <>
##$DTYPP= 0
##$F1P= 2.36226072786647
##$F2P= -0.459571619588291
##$FCOR= 0.5
##$FTSIZE= 0
##$FT_mod= 4
##$GAMMA= 1
##$GB= 0.15
##$INTBC= 1
##$INTSCL= 1
##$ISEN= 128
##$LB= 0.24
##$LEV0= 0
##$LPBIN= 0
##$MAXI= 10000
##$MC2= 0
##$MEAN= 0
##$ME_mod= 0
##$MI= 1.114404
##$NCOEF= 0
##$NC_proc= 0
##$NLEV= 6
##$NOISF1= 3.799351
##$NOISF2= 2.8
##$NSP= 1
##$NTH_PI= 0
##$NZP= 0
##$OFFSET= 15.70392
##$PC= 1
##$PHC0= -14801.41
##$PHC1= 19.00082
##$PH_mod= 1
##$PKNL= yes
##$PPARMOD= 0
##$PSCAL= 0
##$PSIGN= 0
##$REVERSE= no
##$SF= 200.130013532006
##$SI= 16384
##$SIGF1= 3
##$SIGF2= 2
##$SINO= 400
##$SIOLD= 16384
##$SREGLST= <1H.CDCl3>
##$SSB= 0
##$STSI= 0
##$STSR= 0
##$SW_p= 3612.71676300578
##$SYMM= 0
##$S_DEV= 0
##$TDeff= 0
##$TDoff= 0
##$TI= <>
##$TILT= no
##$TM1= 0
##$TM2= 0
##$TOPLEV= 0
##$USERP1= <user>
##$USERP2= <user>
##$USERP3= <user>
##$USERP4= <user>
##$USERP5= <user>
##$WDW= 1
##$XDIM= 8192
##$YMAX_p= 0
##$YMIN_p= 0
$$ End of Bruker specific parameters
$$ ---------------------------------
##NTUPLES= NMR FID
##VAR_NAME=  TIME,          FID/REAL,        FID/IMAG
##SYMBOL=    X,             R,               I
##VAR_TYPE=  INDEPENDENT,   DEPENDENT,       DEPENDENT
##VAR_FORM=  AFFN,          ASDF,            ASDF
##VAR_DIM=   8192,          8192,            8192
##UNITS=     SECONDS,       ARBITRARY UNITS, ARBITRARY UNITS
##FACTOR=    0.0002768,     1,               1
##FIRST=     0,             0,               0
##LAST=      2.2672688,     0,               0
##MIN=       0,             -158367,         0
##MAX=       2.2672688,     126586,          0
$$ Real data points
##PAGE= N=1
##DATA TABLE= (X++(R..R)), XYDATA
$$ [...]
$$ plain form
1717 -69 -308 29 -166 102 -191 140 31 130 3 -233 -40 -331 -234 -211 13 -32 -94 -81 -86 -68 1 41 266 19
1741 19 137 71 -35 -254 266 -11 -245 27 -32 41 4 11 -129 -83 -68 82 261 159 -1 13 -32 -107 117 105
1765 105 -8 102 40 48 -26 46 0 -43 46 -27 -127 183 212 130 105 -346 256 78 -184 55 3 87 -36 -5 -168
1790 -168 -27 -58 217 156 155 -51 83 174 -175 -48 -195 39 45 56 -50 -40 123 -120 108 45 32 -123 -39 -10
1814 -10 133 203 -109 -35 -1 20 -171 -42 62 -83 54 -191 -113 -101 45 10 -95 -106 79 -293 29 -8 -92 1
1838 1 29 198 -120 43 32 9 153 107 102 -13 -297 -64 -245 85 14 93 -139 -110 226 -8 236 79 103 9
1862 9 16 -130 244 -300 -138 168 86 77 -137 -156 -3 72 62 -135 77 -57 -339 1 -60 87 -47 127 102 138
1886 138 -121 79 68 -15 22 135 201 -25 -202 16 108 76 210 -214 14 38 8 60 140 319 -204 -136 -106 -251
$$ packed form
1717f9k39L37j95K68k93L31j09R9j27k36J93k91R7K3K24m5o2J3nJ8O9M0K25k47
1741A9J18o6j06k19N20k77k34K72n9P3l7Pj40M6J5J50J79j02j60J4m5p5K24j2
1765A05j13J10o2Qp4P2m6m3Q9p3j00L10K9q2k5m51O02j78k62K39n2Q4j23L1j63
1790a68J41l1K75o1jk06J34R1l49J27j47K34OJ1j06J0J63k43K28o3j3j55Q4K9
1814a0J43P0l12P4L4K1j91J29J04j45J37k45P8J2J46l5j05j1J85l72L22l7q4R3
1838AK8J69l18J63j1k3J44m6nj15k84K33j81L30p1P9k32K9L36k34K44j57K4r4
1862IPj46L74n44J62L06q2rk14j9J53P5j0j97K12j34k82L40o1J47j34J74k5L6
1886A38k59K00j1q3L7J13O6k26j77K18R2l2J34m24K28K4l0N2Q0J79n23O8L0j45
$$ plain form
1910 -251 25 -243 -74 36 -371 -61 33 -51 120 -195 140 -93 -131 161 76 -195 48 -34 -214 -39 62 -50
1932 -50 -41 29 7 -29 88 18 6 13 -20 110 -32 -108 48 -79 -40 -6 137 -27 -22 35 -307 -100 -20 -206 196 -129
1958 -129 -139 -93 -58 -112 -29 -37 135 66 -47 -136 199 52 -86 198 181 4 93 -148 199 -59 -1 267 -179 -142
1982 -142 -36 -82 -39 -121 -45 166 24 155 -208 49 -58 -99 177 209 185 -30 2 65 114 273 -175 185 -125
2005 -125 -11 124 215 -72 -53 97 121 217 -188 86 -157 -204 -75 2 47 168 -8 -77 -141 -326 -177 -165 -212 -66
2029 -66 -87 -194 7 57 -31 240 194 150 145 -34 -132 142 -81 -183 -57 117 -243 -4 -234 3 66 -38 -154
2052 -154 110 -75 269 -211 64 137 63 116 -170 134 278 61 -245 94 -215 -158 23 -124 -43 12 -53 36 -29
2075 -29 41 -116 84 116 193 94 -82 -40 -8 85 -142 -162 -126 -77 239 -47 -31 100 -167 -130 49 124 -72 -1 1 -38
$$ packed form
1910b51K76k68J69J10m07L10R4q4J71l15L35k33l8K92q5k71K43q2j80J75J01j12
1932e0RP0k2l6J17p0j2Pl3J30j42p6J56j27L9L4J43j64NN7l42K07Q0j86M02l25
1958a29j0M6L5n4Q3qJ72o9j13q9L35j47j38K84j7j77Q9k41L47k58N8K68m46L7
1982a42J06m6M3q2P6K11j42J31l63K57j07m1K76L2k4k15L2O3M9J59m48L60l10
2005a25J14J35R1k87J9J50K4R6m05K74k43m7J29P7M5J21j76o9o4j85J49J2m7J46
2029f6k1j07K01N0q8K71m6m4nj79r8K74k23j02J26J74l60K39k30K37O3j04j16
2052a54K64j85L44m80K75P3p4N3k86L04J44k17l06L39l09N7J81j47Q1N5o5Q9o5
2075b9P0j57K00L2P7r9j76M2L2R3k27k0L6M9L16k86J6J31k67L7J79P5j96P1Kl9
$$ plain form
2101 -38 98 -175 28 74 -107 -91 20 -86 182 -103 -126 10 4 -11 -89 -131 -100 395 -75 197 -82 -86 -214 2
2125 2 -123 -214 -61 46 -32 -53 151 -102 -177 11 -143 -87 -126 214 -63 -261 15 290 -11 125 -92 221 -40
2148 -40 -75 -137 53 212 -125 -88 -145 207 86 -110 60 -22 -16 62 111 157 35 126 6 -20 -56 -59 -150 -110 -72 -81 54
2175 54 -32 140 -51 -21 -25 -69 216 92 113 84 -127 -129 371 33 -146 -48 209 123 -126 228 51 -130 -52 -99 -14
2200 -14 124 -78 -171 19 -278 -260 116 109 -201 120 159 29 -276 113 139 54 -214 245 3 10 11 -2 -52 -162 181
2225 181 207 -179 210 -194 49 38 169 54 -97 223 -33 -65 -212 -204 -14 22 161 44 137 -110 37 186
2247 186 73 -35 -17 106 -298 17 -36 -97 -188 33 168 -129 -182 143 -78 -143 37 -135 123 -36 -237 -16
2269 -16 9 -170 160 90 -97 -143 75 2 134 -64 -231 -173 -125 -25 120 197 53 -185 -65 -81 -139 153 -14
$$ packed form
2101c8J36k73K03M6j81J6J11j06K68k85k3J36oj5p8m2L1M95m70K72k79mj28K16
2125Bj25r1J53J07p8k1K04k53p5J88j54N6l9L40k77j98K76K75l01J36k17L13k61
2148d0l5o2J90J59l37L7n7L52j21j96J70q2OP8M9M6j22R1j20k6l6lr1M0L8rJ35
2175E4q6J72j91L0mm4K85j24K1k9k11kN00l38j79R8K57q6k49L54j77j81P8m7Q5
2200a4J38k02r3J90k97J8L76pl10L21L9j30l05L89K6q5k68M59k42PJj3n0j10L43
2225A81K6l86L89m04K43j1J31j15j51L20k56l2j47QJ90L6J39j17R3k47J47J49
2247A86j13j08J8J23m04L15n3o1r1K21J35k97n3L25k21o5J80j72K58j59k01K21
2269a6K5j79L30p0j87m6K18p3J32j98j67N8M8J00J45P7j44k38J20j6n8K92j67
$$ plain form
2292 -14 161 -204 -172 -104 -56 -101 -26 14 -73 -170 50 -33 182 119 74 -22 208 85 -187 -26 10 -21 123 81 -5 -105
2318 -105 -242 173 -22 -127 -200 228 69 -1 27 -135 -34 82 -17 -169 70 -183 192 46 96 -168 -105 -141
2340 -141 -57 -74 -5 58 -66 37 -145 -114 -99 -111 51 167 62 94 23 -141 -118 -193 152 -116 87 -41 442 206
2364 206 125 -176 -171 176 90 185 -182 -64 11 8 -180 -40 -148 -84 -133 -1 71 -207 -247 -315 -33 30 -5 62 -105
2389 -105 -62 -53 -12 84 305 -117 91 151 85 -155 108 -163 -7 -18 -145 -16 60 101 -172 216 -10 123 -163
2412 -163 -22 -32 -57 66 -103 -17 -149 -129 91 107 -167 229 2 -94 -91 4 -78 -225 182 114 0 71 29 203
2436 203 67 144 68 -15 38 18 -86 -98 75 -7 -21 -51 42 -281 11 41 -104 -42 -24 -20 90 -157 -207 199 133 15
2462 15 -69 -62 162 19 17 -96 226 -7 28 -242 146 0 111 -209 -58 -35 -189 53 -19 -34 -105 -35 65 200
$$ packed form
2292a4J75l65L2O8M8m5P5M0q7r7K20q3K15o3m5r6K30j23k72J61L6l1J44m2q6j00
2318a05j37M15j95j05p3M28j59p0K8j62J01J16r9j52K39k53L75j46N0k64O3l6
2340a41Q4j7O9O3j24J03j82L1J5j2J62J16j05L2p1j64K3p5L45k68K03j28M83k36
2364B06q1l01NL47q6R5l67J18P5lj88J40j08O4m9J32P2k78m0o8K82O3l5O7j67
2389a05M3RM1R6K21m22K08O0o6k40K63k71J56j1j27J29P6M1k73L88k26J33k86
2412a63J41j0k5J23j69Q6j32K0K20J6k74L96k27r6LR5q2j47M07o8j14P1m2J74
2436B03j36P7p6q3N3k0j04j2J73q2j4l0R3l23K92L0j45O2J8MJ10k47n0M06o6j18
2462A5q4PK24j43kj13L22k33L5k70L88j46J11l20J51K3j54K42p2j5p1P0J00J35
$$ plain form
2486 200 49 -106 -118 -167 14 -27 -130 94 153 204 259 108 86 -260 9 116 83 160 9 22 -171 256 -28
2509 -28 6 52 -50 -1 44 15 -179 -87 73 190 -94 138 199 -54 197 -54 176 204 119 -62 -233 72 -99
2532 -99 58 79 99 179 98 31 266 -23 -333 57 -29 97 80 -327 -142 -62 -168 147 -26 -94 18 55 -20 132
2556 132 117 100 -35 -176 -80 134 140 225 59 -177 -253 -79 174 102 86 -139 43 13 33 -38 107 143 -44 394
2580 394 -144 -123 189 94 -124 -270 65 -147 -9 189 88 -341 -273 -82 28 366 -120 219 -33 150 101
2601 101 -127 -52 28 -114 -270 104 135 -128 9 -181 74 -15 245 -59 132 -65 124 134 5 177 52 -111
2623 -111 -72 331 -66 -222 148 137 -92 126 -55 163 24 204 -61 -125 125 -199 -177 -278 -196 277 76 36
2645 36 -34 -125 162 -106 -173 226 -3 24 -57 -108 167 83 -306 110 124 -164 -4 129 -164 -7 -7 -37 79 -38
$$ packed form
2486B00j51j55j2m9J81m1j03K24N9N1N5j51k2l46K69J07l3P7j51J3j93M27k84
2509b8L4M6j02M9M5k9j94R2J60J17k84K32O1k53K51k51K30K8q5j81j71L05j71
2532i9J57K1K0Q0q1o7K35k89l10L90q6J26j7m07J85Q0j06L15j73o8J12L7p5J52
2556A32j5j7j35j41R6K14OQ5j66k36p6J74K53p2j6k25J82l0K0p1J45L6j87M38
2580C94n38K1L12r5k18j46L35k12J38J98j01m29O8J91J10L38m86L39k52J83m9
2601A01k28P5Q0j42j56L74L1k63J37j90K55q9K60l04J91j97J89J0j29J72j25j63
2623a11L9M03l97j56L70j1k29K18j81K18j39J80k65o4K50l24K2j01Q2M73k01m0
2645C6p0r1K87k68o7L99k29K7q1n1K75q4l89M16J4k88J60J33k93J57%l0J16j17
$$ plain form
2669 -38 99 -59 -73 25 173 -138 -1 73 104 -8 -128 -162 -328 6 181 -38 5 5 29 374 122 -264 -114
2692 -114 156 -19 15 55 -7 -6 -113 -191 59 164 -143 157 111 9 10 -187 222 30 -60 -36 -84 189 70 -77
2716 -77 -136 -214 -47 -19 -102 163 2 -12 208 65 -140 134 242 206 157 234 89 2 -191 -293 17 112 -313 5
2740 5 228 -223 1 -74 -62 86 52 -245 61 48 28 12 -7 -50 124 -47 159 149 297 14 -106 66 -38 44
2764 44 -26 53 -200 87 0 -212 129 -147 -115 21 26 38 -88 -3 119 59 -152 -9 -56 72 -214 -30 239 135
2788 135 -101 -204 12 -31 107 -104 -110 121 -110 112 -59 32 37 157 -117 -30 65 149 -11 -123 -188 -269 -69 162
2812 162 -2 -56 -49 -71 27 -113 32 169 -46 -166 -68 5 -3 -13 129 43 -157 180 -82 -97 -45 -39 45 85 -50 -116
2838 -116 -235 63 144 -203 22 -55 -22 -99 -32 -215 190 195 -42 -243 -116 9 69 138 93 -53 -72 -77 17 65 -100
$$ packed form
2669c8J37j58j4R8J48l11J37P4L1j12j20l4j66L34J75k19M3%K4L45k52l86J50
2692a14K70j75L4M0o2Jj07p8K50J05l07L00m6j02Jj97M09j92r0K4m8K73j19j47
2716g7n9p8J67K8q3K65j61j4K20j43k05K74J08l6m9P7j45q7j93j02L10R5m25L18
2740EK23m51K24p5J2J48l4k97L06j3k0j6j9m3J74j71K06j0J48k83j20J72j04Q2
2764D4p0P9k53K87q7k12L41k76L2J36NJ2j26Q5J22o0k11J43m7J28k86J84K69j04
2788A35k36j03K16m3J38k11oK31k31K22j71R1NJ20k74Q7R5Q4j60j12o5q1K00K31
2812A62j64n4Pk2R8j40J45J37k15j20R8P3qj0J42q6k00L37k62j5N2OQ4M0j35o6
2838a16j19K98Q1l47K25p7L3p7O7j83M05Nk37k01J27J25O0O9m5j46j9nR4M8j65
$$ plain form
2863 -100 13 -93 -106 -31 173 -204 -111 1 -72 -85 37 -232 94 -123 93 171 34 104 -263 -193 -64 -25 -30 -83
2887 -83 -4 131 -197 392 -238 -119 142 -164 -86 -232 137 85 29 -3 11 -147 41 33 43 -142 92 43 -166 14
2911 14 91 -41 93 248 -62 71 19 234 -63 -36 83 -53 -155 21 -7 -284 -131 38 -92 278 -63 -8
2933 -8 77 207 27 13 256 -217 264 61 84 202 -81 151 -203 199 -123 97 -176 -32 89 157 -112 104
2955 104 13 105 89 -79 -228 -80 337 -57 125 93 85 -93 -38 -108 -136 36 85 -13 -150 29 257 -73 72 96
2979 96 -42 -169 70 50 150 80 -16 -12 15 104 108 -145 99 -156 20 -50 -12 -131 18 -150 -136 -67 -141 -99 -207
3004 -207 77 106 221 -101 254 7 183 76 307 52 119 27 122 115 -147 -105 160 178 48 165 308 106 -47
3027 -47 101 -99 -58 52 -56 -52 -127 114 -152 189 -34 113 79 -35 40 -12 -191 -52 -14 14 69 -114 242 252
$$ packed form
2863a00J13j06j3P5K04l77R3J12p3j3J22k69L26k17K16P8j37P0l67P0J29L9nn3
2887h3P9J35l28N89o30J19K61l06P8j46L69n2n6l2J4j58J88qJ0j85K34m9k09J80
2911A4P7j32J34J55l10J33n2K15k97K7J19j36j02J76k8k77J53J69j30L70l41N5
2933hQ5J30j80j4K43m73M81k03K3J18k83K32l54M02l22K20k73J44J21O8k69K16
2955A04r1R2j6j68j49J48M17l94J82l2qj78N5p0k8J72M9r8j37J79K28l30J45K4
2979I6j38j27K39k0J00p0r6MK7Q9Mk53K44k55J76p0L8j19J49j68J4O9p4M2j08
3004b07K84K9J15l22L55k47J76j07K31k55O7r2R5pk62M2K65J8j30J17J43k02j53
3027d7J48k00M1J10j08Mp5K41k66L41k23J47l4j14P5n2j79J39L8K8N5j83L56J0
$$ plain form
3051 252 -97 -96 8 232 335 48 214 303 92 -235 -54 238 -124 18 118 4 -40 5 -202 -38 56 -51
3073 -51 -94 -74 -12 -97 -95 -49 -92 -10 112 241 224 -7 -15 -131 -16 28 -88 -151 11 -197 333 -26 -201 231 -149
3098 -149 133 -299 -216 118 167 -98 -63 225 12 83 197 -88 118 50 -80 139 -187 61 124 -83 -41 -385
3120 -385 164 67 17 -105 182 -45 31 -65 -45 183 -145 20 -109 -83 98 11 75 107 -46 1 227 7 11 -137
3144 -137 -248 189 -144 -28 -181 45 75 189 77 -4 -17 296 19 -96 182 0 117 46 -7 39 -384 -51
3166 -51 -221 -87 -29 50 104 67 -112 19 -39 96 -47 261 -313 -13 88 22 86 131 88 17 -79 142 -72 -45
3190 -45 80 145 -83 -182 -167 59 220 -151 54 -84 133 14 212 -18 -88 -69 -281 2 -34 -162 -58 -58 -41
3213 -41 -96 -23 -173 204 55 65 111 -32 -147 -97 -147 114 15 78 290 -126 -157 50 143 7 -124 10 15 137
$$ packed form
3051B52l49JJ04K24J03k87J66Q9k11l27J81K92l62J42J00j14m4M5k07J64R4j07
3073e1m3K0O2q5KM6m3Q2J22J29j7k31qj16J15M4j16o3J62k08N30l59j75M32l80
3098a49K82m32Q3L34M9k65L5K88k13P1J14k85K06o8j30K19l26K48O3k07M2l44
3120c85N49r7n0j22K87k27P6r6K0K28l28J65j29K6J81q7O4L2j53M7K26k20Mj48
3144a37j11M37l33J16j53K26L0J14j12q1j3L13k77j15K78j82J17p1n3M6m23L33
3166e1j70J34N8P9N4l7j79J31n8J35j43L08n74L00J01o6O4M5m3p1r6K21k14K7
3190d5J25O5k28r9J5K26J61l71K05j38K17j19J98k30p0J9k12K83l6j28J04%J7
3213d1n5P3j50L77j49J0M6j43j15N0n0K61r9O3K12m16l1K07R3j36j31J34NJ22
$$ plain form
3237 137 -69 215 77 -103 210 153 -143 130 21 -153 -190 -71 -74 -134 -44 195 -271 -152 76 48 54 177 -43
3260 -43 -12 -91 24 15 -1 30 22 -210 -44 -243 90 155 159 -165 26 318 227 -103 -55 -102 -22 -240 54 200 -313
3285 -313 35 -161 45 136 226 -34 89 133 -85 -108 94 -132 -164 -101 104 -16 -12 183 189 -269 -164 74 157 81
3309 81 78 -24 -258 48 299 105 74 54 -114 118 -165 -55 -101 77 -46 104 175 90 -203 147 40 -166 -42
3332 -42 -108 -68 -124 -185 128 2 -91 28 -85 -204 12 89 119 -227 207 -141 -298 34 82 20 92 171 18 53
3356 53 171 -13 219 236 60 -68 -34 -229 79 53 515 312 -45 -194 221 177 1 66 -84 -12 -107 235 -12
3379 -12 -17 34 -166 -83 69 -65 178 143 -8 56 62 -19 -104 320 -61 78 -60 7 -203 257 12 -88 68 -25
3403 -25 -61 -127 34 -14 14 257 -190 -48 158 -30 14 173 187 -121 141 212 49 192 298 254 -56 -52 36 -42
$$ packed form
3237A37k06K84j38j80L13n7k96K73j09j74l7J19lo0R0K39m66J19K28k8OJ23k20
3260d3L1p9J15rj6L1qk32J66j99L33O5Ml24J91K92r1l30M8m7Q0k18K94J46n13
3285c13L48j96K06R1R0k60J23M4k18k3K02k26l2O3K05j20MJ95Om58J05K38Q3p6
3309H1lj02k34L06K51j94l1k0j68K32k83J10m6J78j23J50P1q5k93L50j07k06J24
3332d2o6M0n6o1L13j26r3J19j13j19K16P7L0l46M34l48j57L32M8o2P2P9j53L5
3356E3J18j84K32J7j76j28L4j95L08k6M62k03l57j49M15m4j76O5j50P2r5L42k47
3379a2nN1k00Q3J52j34K43l5j51O4Oq1q5M24l81J39j38O7k10M60k45j00J56r3
3403b5l6o6J61m8K8K43m47J42K06j88M4J59J4l08K62P1j63J43J06m4l10MQ8p8
$$ plain form
3427 -42 -149 -161 -146 -303 1 -211 196 -225 184 231 100 -178 -180 -106 -113 -107 -38 20 9 64 -25 14 -228 -118 -48 111
3453 111 -94 44 -140 95 78 121 -204 209 253 -132 -91 -7 -110 18 -30 36 90 -46 -204 82 56 -25 121
3476 121 55 86 40 -127 120 36 -40 48 123 -105 103 -215 -218 31 166 17 50 -13 118 114 -23 -29 -119 56 185
3501 185 -166 171 254 65 84 -71 -108 -182 -109 32 19 -3 128 117 122 29 -182 1 71 106 56 -66 -53 108 259
3526 259 -53 -125 16 71 -332 58 -181 153 -86 4 -105 99 81 105 65 96 51 -225 -126 128 109 -61 212
3549 212 135 161 -101 133 45 -108 143 153 156 264 124 146 -25 -44 -82 -25 388 20 65 -201 -133 160 -317 -90
3573 -90 -192 -164 -171 112 29 39 17 132 -176 -175 28 133 -2 -90 108 32 -71 -74 -120 23 36 -96 17 84 4 55
3599 55 72 -19 107 -325 -121 -272 233 -14 124 211 145 -231 -7 14 -139 131 8 -82 219 95 198 -227
$$ packed form
3427d2j07j2J5j57L04k12M07m21M09M7j31k78kP4pOO9N8j1N5q9L9k42J10P0J59
3453A11k05J38j84K35j7M3l25M13M4l85M1Q4j03J28m8O6N4j36j58K86k6q1J46
3476A21o6L1m6j67K47q4p6Q8P5k28K08l18lK49J35j49L3o3J31mj37or0J75J29
3501A85l51L37Q3j89J9j55l7p4P3J41j3k2J31j1Nr3k11J83P0L5n0j22J3J61J51
3526B59l12p2J41N5m03L90k39L34k39R0j09K04j8K4m0L1m5k76R9K54j9j70K73
3549B12p7K6k62K34q8j53K51J0LJ08j40K2j71j9l8N7M13l68M5k66O8K93m77K27
3573i0j02K8pK83q3J0k2J15l08JK03J05j35q8J98p6j03lm6J43J3j32J13O7q0N1
3599E5J7r1J26m32K04j51N05k47J38Q7o6l76K24K1j53K70j23r0L01j24J03m25
$$ plain form
3621 -227 73 84 59 -88 -315 52 -19 -201 -64 -84 -35 -203 -71 18 167 -97 -198 -24 -106 113 -327 64
3643 64 -40 -5 -79 66 -38 -175 198 -150 363 192 121 -160 -153 71 57 83 170 3 188 63 127 133 -276 8
3667 8 61 211 -36 204 211 24 169 145 87 149 -91 -104 -23 63 115 -51 -197 89 39 -49 30 -12 69 152 237 100
3693 100 -77 -142 -236 174 51 -21 -138 9 -60 -63 -371 77 -256 303 -176 41 55 -65 52 83 -18 -205 -24
3716 -24 -432 -68 18 -260 102 -55 234 19 7 -154 80 86 126 65 26 139 47 -20 -114 34 -243 -197 153 83
3740 83 40 -126 105 191 233 17 104 263 -64 -133 -208 -19 93 -194 -34 -38 69 5 115 -352 -22 -22 -132 202
3764 202 -143 76 65 60 -76 -160 32 110 -129 143 -21 -45 6 88 -168 -282 -40 -64 110 -169 -84 -112 -52 186
3788 186 -103 118 -29 90 -126 276 -304 -70 -38 -46 -202 46 -9 -153 244 -104 31 226 141 234 7 -83
$$ packed form
3621b27L00J1k5j47k27L67p1j82J37k0M9j68J32Q9J49k64j01J74q2K19m40L91
3643F4j04L5p4J45j04j37L73l48N13j71p1k81PK24j4K6Q7j67J85j25O4Om09K84
3667HN3J50k47K40Pj87J45k4n8O2k40j3Q1Q6N2j66j46K86n0q8P9m2Q1Q3Q5j37
3693A00j77o5r4M10j23p2j17J47o9ll08M48l33N59m79K17J4j20J17L1j01j87J81
3716b4m08L64Q6k78L62j57K89k15j2j61K34OM0o1l9J13r2o7r4J48k77M6L50p0
3740H3m3j66K31Q6M2k16Q7J59l27o9p5J89J12k87J60mJ07o4J10m67L30%j10L34
3764B02l45K19j1nj36q4J92P8k39K72j64k4N1Q2k56j14K42k4J74k79Q5k8O0K38
3788A86k89K21j47J19k16M02n80K34L2qj56K48n5j44L97l48J35J95q5R3k27r0
$$ plain form
3810 -83 -42 -30 -19 -113 0 232 -311 34 230 -175 -106 -124 140 -71 52 -303 71 -14 -65 75 -228 26 -93
3833 -93 -83 58 -53 -127 55 186 199 142 40 40 128 115 150 -131 42 -12 -150 -163 -209 83 8 -15 -10 -16 90 -44
3859 -44 163 118 32 -204 144 63 19 100 -114 -112 51 61 4 -282 46 -122 -48 -120 88 146 247 -69 82 60 212
3884 212 -29 -317 -193 19 166 -226 -280 -126 -61 -90 -58 -43 -89 -157 -128 79 59 -15 -64 -314 -72 168 -201 -20
3908 -20 217 -122 -82 -53 -60 -122 -65 -281 -31 113 -28 -3 67 159 -141 -156 -87 67 -128 141 -152 -135 -3 -114
3932 -114 119 -365 98 111 -15 109 -26 -86 -131 -15 -12 -106 -214 -150 55 263 180 85 144 128 7 123 284 -171
3956 -171 -318 -98 39 -96 -100 71 -184 -32 -48 -6 -33 -36 132 -189 -10 94 -80 -58 -94 -32 207 -175 -74
3979 -74 -160 109 -127 35 93 75 -162 353 -71 -17 194 113 -40 -22 179 95 10 246 -140 -47 -39 -142 -131 130
$$ packed form
3810h3M1J2J1r4J13K32n43L45J96m05O9j8K64k11J23l55L74q5n1J40l03K54j19
3833i3J0J41j11p4J82J31J3n7j02%Q8j3L5k81J73n4j38j3m6K92p5k3NoJ06j34
3859d4K07m5q6k36L48q1m4Q1k14KJ63J0n7k86L28j68P4p2K08N8J01l16J51k2J52
3884B12k41k88J24K12J47l92n4J54O5k9L2J5m6o8K9K07k0p4m9k50K42K40l69J81
3908b0K37l39M0K9po2N7k16K50J44j41K5P0R2l00j5O9J54j95K69k93J7J32j11
3932a14K33m84M63J3j26J24j35o0m5J16Lr4j08O4K05K08q3r5N9j6j21J16J61m55
3956a71j47K20J37j35mJ71k55J52j6M2k7lJ68l21J79J04j74K2l6O2K39l82J01
3979g4q6K69k36J62N8j8k37N15m24N4K11q1j53J8K01q4q5K36l86R3Qj03J1K61
$$ plain form
4003 130 -295 105 -5 -113 108 189 -61 81 175 147 -102 45 -16 -26 72 15 -124 -245 -23 70 29 164 212
4026 212 -79 102 83 197 40 120 -155 46 94 -111 6 -65 -16 -165 6 65 24 58 7 151 210 18 -41 25
4050 25 -60 70 -124 97 -44 5 11 -210 -114 76 -229 185 -114 111 79 46 -153 255 88 -138 16 -131 -38
4073 -38 146 -68 -1 259 -20 -1 -138 67 65 77 64 -9 -76 23 84 175 -115 -102 -124 -94 18 -146 -57 39 128 -141
4099 -141 53 -65 -79 -37 -60 298 -226 -114 31 157 106 -232 89 -66 221 215 46 101 53 -14 -32 150 84 199
4123 199 30 43 32 -91 -97 -109 35 -34 -142 150 -45 271 -30 -146 118 107 -210 151 81 188 -190 189 -159
4146 -159 -159 -34 -63 81 66 280 -21 -14 151 119 -180 -147 0 -24 -61 246 -60 -13 171 196 79 -57 84 -251
4170 -251 209 117 99 -126 -226 -17 18 -62 333 191 25 -132 236 -132 -115 -60 -52 -120 30 -34 39 -202 127 139
$$ packed form
4003A30m25M00j10j08K21Q1k50J42R4k8k49J47o1j0R8n7j39j21K22R3m1J35M8
4026B12k91J81j9J14j57Q0k75K01M8k05J17p1M9j49J71N9m1L4n1J44N9j92n9O6
4050B5q5J30j94K21j41M9Ok21R6J90l05M14k99K25l2l3j99M08j67k26J54j47R3
4073c8J84k14O7K60k79J9j37K05kJ2j3p3o7R9O1R1k90J3k2L0J12j64Q9R6Q9k69
4099a41J94j18j4M2k3L58n24J12J45J26n1l38L21j55K87oj69N5m8o7j8J82o6J15
4123A99j69J3j1j23oj2J44o9j08K92j95L16l01j16K64j1l17L61p0J07l78L79l48
4146a59%J25k9J44j5K14l01PJ65l2k99L3J47k4l7L07l06M7J84K5j17j36J41l35
4170b51M60r2j8k25j00K09L5q0L95j42j66j57L68l68J7N5Qo8J50o4P3k41L29J2
$$ plain form
4194 139 -77 -53 33 -116 34 60 208 360 -161 -278 17 94 28 -125 -53 -95 -145 194 6 -139 -110 173 -140
4217 -140 -133 257 -178 119 27 116 -15 193 79 -4 -27 -58 33 -140 21 60 285 -85 -130 55 -51 197 -117
4240 -117 186 233 11 12 188 -65 -64 103 55 151 22 49 -102 -4 -5 -182 -103 -289 -142 65 58 249 193 53 -82
4265 -82 220 -67 -47 122 -28 -91 132 94 104 60 166 -230 93 -8 207 -178 -83 -86 134 87 25 331 203 -176
4289 -176 162 -37 111 -293 -48 98 23 159 -50 -67 -117 -14 34 -20 -222 -193 -123 -75 -304 -269 303 218 87
4312 87 -28 -42 -56 92 42 59 348 -39 232 -123 -162 -152 168 26 -45 -97 -158 -117 -169 188 25 -88 -18 -222
4336 -222 172 151 73 -22 -327 25 72 -120 63 -198 -69 55 -226 -210 -60 41 102 -57 208 -275 72 71 53
4359 53 -81 4 173 -136 103 -40 -250 11 262 27 -82 -43 59 -26 72 140 65 65 -48 -88 -125 170 -42 -19
$$ packed form
4194A39k16K4Q6j49J50K6J48J52n21j17K95P7o6j53P2m2n0L39j88j45K9K83l13
4217a40PL90m35K97r2Q9j31K08j14q3k3l1R1j73J61L9K25l70m5J85j06K48l14
4240a17L03M7k22JJ76k53JJ67m8R6j29K7j51R8jj77P9j86J47K07pJ91n6j40j35
4265h2L02k87K0J69j50o3K23l8J0m4J06l96L23j01K15l85R5lK20m7o2L06j28l79
4289a76L38j99J48m04K45J46p5J36k09j7n0J03M8n4k02K9P0M8k29L5N72q5j31
4312H7j15j4j4J48n0J7K89l87K71l55l9J0L20j42p1n2o1M1n2L57j63j13P0k04
4336b22L94k1p8r5l05L52M7j92J83k61J29J24k81J6J50J01O1j59K65m83L47jj8
4359E3j34Q5J69l09K39j43k10K61K51k35j09L9J02q5R8O8p5%j13m0l7K95k12K3
$$ plain form
4383 -19 -232 40 -163 -16 119 47 337 2 34 -29 -120 82 45 -74 -375 -119 45 121 -14 -216 -114 105
4405 105 -24 -233 109 -73 210 13 103 -41 50 127 172 -159 -118 -98 205 -3 -5 -142 30 -42 -25 131 17
4428 17 139 -149 -3 63 -103 60 -6 252 303 -159 -42 236 -306 56 -45 -100 59 -142 -88 0 -22 16 -98
4451 -98 22 -29 227 188 -58 -9 -110 125 166 132 -168 65 -296 188 117 156 -12 101 137 141 19 76 121 -72
4475 -72 -148 -63 71 -8 -117 242 -55 -54 -61 -77 161 167 -160 180 142 216 124 -13 -42 -163 -15 -141 78 -72 348
4500 348 -47 161 -251 106 94 142 280 -88 -123 -19 133 183 -12 40 8 0 46 167 210 4 -155 67 -12 -110
4524 -110 -73 149 323 101 24 139 81 187 -116 -207 68 75 -210 -139 -4 -313 81 11 -215 -159 116 -327 -36
4547 -36 -187 47 -89 -190 -115 38 -102 39 -66 166 103 12 133 -55 101 330 322 -74 180 -110 157 20
$$ packed form
4383a9k13K72k03J47J35p2K90l35L2o3r1K02l7j19l01K56J64P6j35k02J02K19
4405A05j29k09L42j82K83j97R0j44R1P7M5l31M1K0L03k08kj37J72p2J7J56j14
4428A7J22k88J46O6j66J63o6K58N1m62J17K78n42L62j01n5J59k01N4Q8k2L8j14
4451i8J20n1K56l9k46M9j01K35M1l4l00K33l61M84p1L9j68J13L6Mj22N7M5j93
4475g2p6Q5J34p9j09L59k97Jpj6K38Ol27L40l8P4r2j37k9j21J48j26K19j50M20
4500C48l95K08m12L57j2M8J38l68l5J04J52N0j95N2l2qM6J21M3k06j59K22p9r8
4524a10L7K22J74k22p7J15n8J06l03r1K75Pk85P1J35l09L94p0k26N6K75m43K91
4547c6j51K34j36j01P5J53j40J41j05K32o3r1J21j88J56K29ql96K54k90K67j37
$$ plain form
4569 20 11 0 110 -102 27 176 -25 87 -128 -54 191 -38 166 -130 -84 41 4 67 -133 164 -10 123 185
4592 185 138 -2 -224 217 -71 64 -99 -16 33 -283 30 54 -15 -147 -23 16 16 106 243 33 64 61 -292 92
4616 92 42 160 209 5 82 -75 11 -246 -95 355 83 135 34 247 -72 -42 105 47 -20 -85 116 -100 8
4639 8 21 -257 -134 -25 41 -174 -2 256 82 141 24 162 -108 80 -21 -172 79 136 26 -14 79 187 -357
4662 -357 -41 -101 173 10 112 192 -239 82 -291 18 -111 -129 5 120 -70 -110 60 -146 100 -141 25
4683 25 -35 -125 131 -97 -122 -132 28 36 58 79 -182 -33 -125 53 -101 -82 455 97 -143 -52 209 49 213 199
4707 199 -234 155 150 133 -11 -130 -54 284 -123 115 -4 126 -279 27 -34 -131 170 111 -63 158 30 143
4729 143 167 118 73 -1 5 -136 431 149 -184 105 -135 138 -10 53 134 55 130 309 -185 -110 169 -251 229 2
$$ packed form
4569B0rj1J10k12J29J49k01J12k15P4K45k29K04k96M6J25l7O3k00K97j74J33O2
4592A85m7j40k22M41k88J35j63Q3M9l16L13K4o9j32J24L9%R0J37k10L1ll53L84
4616I2n0J18M9k04P7j57Q6k57J51M50k72N2j01K13l19L0J47n8o7o5K01k16J08
4639HJ3k78J23J09O6k15J72K58j74N9j17J38k70J88j01j51K51N7j10m0R3J08n44
4662c57L16o0K74j63J02Q0m31L21l73L09j29j8J34J15j90m0J70k06K46k41J66
4683B5o0r0K56k28k5j0J60QK2K1k61J49r2J78j54J9N37l58k40R1K61j60J64j4
4707A99m33L89nj7j44j19P6L38m07K38j19J30m05L06o1r7L01n9j74K21j28J13
4729A43K4m9m5p4Oj41N67k82l33K89k40K73j48O3Q1p9P5J79m94P5K79m20M80k27
$$ plain form
4753 2 11 -316 -334 -47 -198 -115 -279 -225 147 -143 -79 -82 -117 -45 -129 -206 96 145 39 63 117 -49 -149 116 -28 47
4779 47 -265 28 139 -136 -55 -82 -21 96 43 -159 -97 -87 267 180 44 179 209 -291 -64 -223 19 -19 -138
4802 -138 54 32 49 -94 163 -52 98 120 10 -146 -49 107 -46 -73 -129 6 -46 150 -82 35 -91 20
4824 20 2 -114 34 -160 28 -189 -48 47 -177 -224 263 -9 100 -68 162 -90 94 194 -11 42 -25 78
4846 78 -65 142 -112 179 -31 -36 7 -21 -74 -61 -87 159 139 252 181 -109 -122 -139 -2 171 -106 -64 110 -114
4870 -114 -135 -125 85 -206 116 144 -125 -38 -96 97 137 -223 23 -65 -18 -98 -154 110 -8 -161 200 -110 -207 266
4894 266 -60 188 -93 -138 237 -29 -41 118 52 -143 -81 -103 177 -74 -81 -134 -177 33 -130 12 31 -6 -204 119
4918 119 33 15 -74 229 28 -125 -9 91 245 191 -166 166 -153 -228 152 -85 -59 42 67 446 -40 -161
$$ packed form
4753BRl27j8K87j51Q3j64N4L72k90O4ll5P2q4p7L02M9j06K4N4j66j00K65j44P5
4779D7l12K93J11k75Q1k7O1J17n3k02O2J0L54q7j36J35L0n00K27j59K42l8j19
4802a38J92k2J7j43K57k15J50K2j10j56R7J56j53k7n6J35n2J96k32J17j26J11
4824B0j8j16J48j94J88k17J41R5k24m7M87k72J09j68K30k52J84J00k05N3o7J03
4846G8j43K07k54K91k10nM3k8n3J3k6K46k0J13p1k90j3j7J37J73k77M2J74k24
4870a14k1J0K10k91L22K8k69Q7n8J93M0l60K46q8M7q0n6K64j18j53L61l10r7M73
4894B66l26K48k81m5L75k66j2J59o6j95O2k2K80k51pn3m3K10j63J42J9l7j98L23
4918A19q6j8q9L03k01j53J16J00J54n4l57L32l19p5L80k37K6J01K5L79m86j21
$$ plain form
4940 -161 -71 26 -241 -21 116 129 72 140 -38 47 -16 -153 45 -18 181 67 4 118 -10 -225 -80 -239 66
4963 66 -32 -280 -222 -146 -134 96 120 -10 -161 10 174 -80 196 16 23 89 -68 -137 -97 -87 5 19 132 -70 -14
4988 -14 63 95 161 -140 45 -13 72 7 -86 180 47 59 -20 -23 35 89 99 -85 -61 -10 186 -78 19 -79 -59 -29 -113
5015 -113 -84 69 57 111 21 -68 3 -24 -176 -90 19 -81 -211 -160 -71 -99 -116 -149 -21 136 -88 -91 39 140 38
5040 38 187 -56 155 39 148 -124 41 237 94 -257 152 317 -124 28 15 -156 198 -187 34 160 82
5061 82 -53 24 -217 -241 152 -68 -7 -21 39 150 290 69 226 -38 205 348 -7 117 -56 116 -126 137
5083 137 -61 -56 332 56 6 62 89 119 116 112 30 -171 138 67 -41 91 68 73 -281 92 -230 -378 -198 -7 -34
5108 -34 -99 -47 130 189 -162 -144 108 143 -174 75 137 -25 122 -12 140 -46 4 -81 156 0 52 103 -10 111
$$ packed form
4940a61R0R7k67K20J37J3n7O8j78Q5o3j37J98o3J99j14o3J14j28k15J45j59L05
4963F6r8k48N8P6J2K30K4j30j51J71J64k54K76j80PO6j57o9M0J0R2J4J13k02N6
4988a4P7L2O6l01J85n8Q5o5r3K66j33J2p9lN8N4J0j84K4N1J96k64R7r8K0L0q4
5015a13K9J53j2N4r0q9P1k7j52Q6J09j00j30N1Q9k8j7l3J28J57k24lJ30J01j02
5040C8J49k43K11j16J09k72J65J96j43l51M09J65m41J52j3j71L54l85K21J26p8
5061H2j35P7k41k4L93k20O1j4O0J11J40k21J57k64K43J43l55J24j73J72k42K63
5083A37j98NL88k76n0N6K7L0lmq2k01L09p1j08J32k3Nl54L73l22j48J80J91k7
5108c4o5N2J77N9l51J8K52L5l17K49O2j62J47j34J52j86N0q5K37j56N2N1j13J21
$$ plain form
5132 111 102 -120 -276 -199 -67 73 88 -320 -159 -160 21 -134 21 -18 65 -220 32 9 64 -7 -231 -60 -257 -91
5156 -91 18 -17 -77 -169 -73 36 196 -171 -126 -148 31 -39 -22 -65 67 4 -180 -47 198 42 -199 335 -8 32
5180 32 -70 40 -7 58 -99 -6 46 98 -202 -177 -38 126 -318 -132 -115 -188 153 -167 46 -46 -72 109 114 126 -62
5205 -62 22 74 55 61 25 34 62 -40 -60 76 151 74 11 105 -114 -57 30 348 -63 1 -41 14 -36 1 59 151 237 28
5233 28 282 120 64 -131 -24 -248 28 147 52 204 132 -188 -25 89 -87 -63 49 -90 -9 -27 -204 59
5255 59 -136 35 -118 -65 -5 27 40 -16 200 -31 -183 27 -54 260 47 -63 -82 -231 23 -67 -80 9 -18 -51
5279 -51 -67 131 151 -212 159 123 153 5 -18 26 -127 -66 188 23 -29 -88 -8 247 130 -23 200 260 270 -176
5303 -176 81 -25 173 -31 -149 -101 -49 28 89 -41 72 164 -17 -41 -25 252 -16 15 58 112 -199 -157 -60 -183
$$ packed form
5132A11rk22j56P7J32J40J5m08J61jJ81j55J55l9Q3k85K52k3N5p1k24J71j97J66
5156i1J09l5o0r2R6J09J60l67M5k2J79p0J7m3J32o3j84J33K45j56k41N34l43M0
5180C2j02J10m7O5j57R3N2N2l00K5J39J64m44J86J7p3L41l20K13r2k6J81NJ2j88
5205f2Q4N2j9Ol6RK8j02k0J36P5p7o3R4k19N7Q7L18m11O4m2N5n0L7N8R2Q6k09
5233B8K54j62n6j95J07k24K76J19r5J52p2l20J63J14j76K4J12j39Q1j8j77K63
5255E9j95J71j53N3O0L2J3n6K16k31j52K10q1L14k13j10j9j49K54r0j3Q9k7l3
5279e1j6J98K0l63L71l6L0j48k3M4j53O1K54j65n2n9Q0K55j17j53K23O0J0m46
5303a76K57j06J98k04j18M8N2P7O1j30J13R2j81k4J6K77k68L1M3N4l11M2R7j23
$$ plain form
5327 -183 -74 104 -119 131 167 81 200 118 -180 -64 -57 -9 70 133 29 -213 54 -154 -186 333 137 42 -214
5350 -214 -20 -114 -265 -213 -160 -28 205 211 -124 -138 85 25 -31 -251 152 -134 96 60 -105 -87 43 -56 215 17
5374 17 -150 78 85 -247 158 107 75 22 50 44 58 116 39 -240 -112 133 180 -92 -394 -61 -102 -100 -77 -127 -27 -49
5400 -49 -153 -197 -159 -36 29 7 -232 126 75 -79 -54 -12 72 -80 7 -84 -54 34 10 141 -71 -51 71 -46 85
5425 85 -41 -63 168 123 -5 -24 -168 -15 -46 -144 -9 -34 138 -32 -169 105 -88 150 81 -131 15 286 23
5448 23 -144 83 -169 -10 109 55 -93 -113 19 94 17 -68 -44 94 21 -164 -61 -99 192 -29 -77 200 29
5471 29 -102 154 43 -92 49 -137 -197 51 -89 65 -120 128 -60 -55 51 -16 -83 -212 261 -107 20 -488
5493 -488 273 281 135 52 -172 39 -123 -26 54 -148 -66 135 188 247 -222 49 -277 135 -22 -79 -33 199 -15
$$ packed form
5327a83J09J78k23K50L6q6J19q2k98J16PM8P9O3j04k42K67k08l2N19j96r5k56
5350b14J94r4j51N2N3J32K33Ol35j4K23o0n6k20M03k86K30l6j65J8J30r9K71j98
5374A7j67K28Pl32M05n1l2n3K8oJ4N8p7k79J28K45M7k72l02L33m1KK3n0J00k2
5400d9j04m4L8J23O5k2k39L58n1j54K5M2Q4j52Q7r1L0Q8k4J31k12K0J22j17J31
5425H5j26k2K31m5j28j9j44J53l1r8J35k5J72j70j37K74j93K38o9k12J46K71k63
5448B3j67K27k52J59J19n4j48k0J32P5p7q5K4J38p3j85J03l8K91k21m8K77j71
5471B9j31K56j11j35J41j86o0K48j40J54j85K48j88NJ06o7o7j29M73l68J27n08
5493d88P61Qj46q3k24K11j62R7Q0k02Q2K01N3N9m69K71l26M12j57n7M6K32k14
$$ plain form
5516 -15 -10 -61 86 85 -172 282 -159 -130 35 1 210 44 82 -146 -52 150 -96 -178 -24 -73 5 46 -129 -105 -93
5541 -93 139 -103 -423 -43 48 -36 -172 -35 145 -144 -171 -95 98 8 -51 -100 -24 -18 148 93 -220 -3 -228 224
5565 224 -29 350 -146 -118 275 294 -75 28 51 -209 245 162 63 -13 101 -132 -129 39 -66 45 -7 -22 310
5588 310 42 -143 -319 0 251 186 -166 91 36 -90 -182 -170 -156 181 -120 -66 -213 -242 -4 16 -166 -91 -74
5611 -74 -227 -199 -32 5 108 122 55 79 -1 54 -158 82 85 -1 -63 1 45 -189 26 -52 273 -233 213 18 -13
5636 -13 167 52 -312 190 52 -112 -164 103 -50 -28 -47 92 -138 -93 85 31 -98 -32 150 -4 174 56
5658 56 -174 -35 193 172 215 -77 -260 -98 107 161 -86 77 -44 -106 -3 107 61 33 88 80 -68 10 -270 -163
5682 -163 -62 -51 -39 -116 -81 132 -107 167 -47 3 106 -81 -89 48 -35 -49 -169 -105 22 -11 48 -130 166 -124
$$ packed form
5516a5Nn1J47jk57M54m41K9J65l4K09j66L8k28R4K02k46q2J54m9P8M1j75K4J2
5541i3K32k42l20L80R1q4j36J37J80k89k7P6J93r0n9m9P6OJ66n5l13K17k25M52
5565B24k53L79m96K8L93J9l69J03K3k60M54q3r9p6J14k33LJ68j05J11n2j5L32
5588C10k68j85j76L19K51o5l52K57n5j26r2J2J4L37l01N4j47k9K38K0j82P5J7
5611g4j53K8J67L7J03J4o7K4q0N5k12K40Lq6o2O4M4k34K15p8L25n06M46j95l1
5636a3J80j15l64N02j38j64n2K67j53K2j9J39k30M5J78n4j29O6J82j54J78j18
5658E6k30J39K28k1M3k92j83J62K05N4k47J63j21o2J03J10m6k8N5qj48P8k80J07
5682a63J01J1J2p7L5K13k39K74k14N0J03j87qJ37q3j4j20O4J27l3N9j78K96k90
$$ plain form
5706 -124 -102 36 -16 -47 110 31 -103 -81 -41 41 254 -7 -211 -37 37 -116 -218 -239 -32 48 116 -187 -136 -90
5730 -90 179 -17 189 -172 47 16 -151 -31 -336 123 -136 -29 67 -117 223 78 178 230 98 -80 -19 131
5752 131 -16 -12 -87 -101 1 56 -62 27 35 -163 -107 95 4 73 260 -81 265 71 -22 23 342 -36 41 90 -47
5777 -47 188 26 26 -62 -3 -100 138 -84 34 76 -227 -169 -161 -44 -91 33 80 -47 116 176 55 -240 143 -56
5801 -56 3 0 -221 109 173 117 -12 15 211 9 -331 137 19 -252 -305 379 -45 -232 54 217 -47 11 123
5824 123 -6 -22 130 -135 87 69 -151 -101 -2 -15 -12 107 86 105 27 147 -14 328 -423 258 41 -186 -192 -46
5848 -46 173 13 97 84 90 130 -86 -237 176 -229 180 116 57 49 132 54 11 154 140 -8 157 -171 161 -65 -237
5873 -237 11 123 -25 -387 88 79 -39 -42 204 -149 -35 63 -34 165 209 63 75 -58 122 110 -221 -236 13
$$ packed form
5706a24K2J38n2l1J57p9j34K2M0Q2K13k61k04J74P4j53j02k1K07Q0O8l03N1M6
5730i0K69j96K06l61K19l1j67J20l05M59k59J07R6j84L40j45J00N2j32j78O1J50
5752A31j47Mp5j4J02N5j18Q9Qj98N6K02r1O9J87l41L46j94r3M5L19l78P7M9j37
5777d7K35j62%q8N9r7K38k22J18M2l03N8QJ17m7J24M7j27J63O0j21k95L83j99
5801e6N9lk21L30O4n6j29K7J96k02l40M68j18k71n3O84m24j87K86J63k64N8J12
5824A23j29j6J52k65K22j8k20N0R9j3LJ19k1J9p8J20j61L42p51O81k17k27oJ46
5848d6K19j60Q4j3OM0k16j51M13m05M09o4n9qQ3p8m3J43j4j48J65l28L32k26j72
5873b37K48J12j48l62M75rj18lK46l53J14R8r7J99M4j46J2j33J80j2l31j5K49
$$ plain form
5896 13 -87 158 0 -102 -241 118 -47 -155 10 61 151 -143 134 -16 9 135 141 -95 -20 -12 -187 -22 -127
5919 -127 -39 156 -162 90 15 -213 -30 -98 -13 -192 60 103 -220 212 -121 -350 -90 -2 -38 -29 -108 32 16 85
5943 85 -137 126 -16 51 275 163 225 18 -125 35 -98 23 -237 -2 -189 34 -127 -15 -9 -118 77 -85
5965 -85 -113 121 -153 -53 -34 -118 -30 -13 -77 -143 -6 188 161 -65 129 144 89 -90 22 -71 58 -116 113 -43
5989 -43 182 -182 -20 87 -7 33 72 -15 171 -41 -10 84 100 -109 84 51 -109 -118 -50 -36 54 4 113 -25 -26 -42
6015 -42 -62 -131 -140 75 -238 143 -61 22 110 208 142 150 41 69 15 53 178 4 -59 -266 23 95 -155 150 8
6040 8 95 70 -106 -189 18 -305 9 141 88 -90 375 93 142 66 78 278 -181 -142 267 -156 4 -93 23 11
6064 11 -7 213 -115 -163 50 -11 -93 118 -169 32 156 -44 25 13 91 150 -43 29 100 228 376 -28 275 -249
$$ packed form
5896A3j00K45j58j02j39L59j65j08J65N1R0k94K77j50K5J26Ok36P5Qj75J65j05
5919a27Q8J95l18K52p5k28J83o8Q5j79K52M3l23M32l33k29K60Q8l6Rp9J40j6O9
5943H5k22K63j42O7K24j12O2k07j43J60j33J21k60K35j87K23j61J12Oj09J95j62
5965h5k8K34k74J00J9q4Q8J7o4o6J37J94k7k26J94J5n5j79J12r3J29j74K29j56
5989d3K25l64J62J07r4M0L9q7J86k12L1R4J6k09J93l3j60rO8J4R0n0J09j38jj6
6015d2k0o9rK15l13L81k04Q3Q8R8o6Qj09K8n4L8J25j74o3k07K89P2k50L05j42
6040HQ7k5j76q3K07l23L14J32n3j78M65k82M9p6J2K00m59L9M09m23J60r7J16j2
6064A1j8K20l28m8K13o1q2K11k87K01J24k00O9j2P8N9j93P2P1J28J48m04L03n24
$$ plain form
6088 -249 187 -26 -1 -189 -18 93 -161 131 142 -54 -196 -7 146 109 82 -42 -48 -149 -11 82 -110 -99 88
6111 88 16 220 -118 -111 -56 -27 -137 38 201 -105 -361 -55 -124 -88 136 53 100 171 103 46 24 82 -50 -67 -142 -175
6137 -175 79 202 -250 38 142 -95 218 -90 11 153 -151 144 102 -151 49 -98 -114 216 30 -59 57
6158 57 -137 -78 253 -26 167 -135 -60 216 -131 154 53 43 -174 114 -49 -144 -36 -116 -30 -197 -90 64
6180 64 -78 104 104 188 -5 -145 229 331 -107 223 -49 -94 -164 139 109 72 -21 -113 137 -282 186 -130 95
6203 95 -209 -129 29 78 56 -60 176 17 32 19 -252 82 -4 -155 -186 -36 10 -2 -209 5 -47 84 -129 -51
6227 -51 124 -117 -257 120 234 274 -43 -6 65 122 170 15 73 -79 62 -172 159 173 -54 102 -8 -199 -96
6250 -96 67 212 59 -10 -5 182 -41 -101 186 -140 -12 57 -10 -18 -115 176 72 -114 -84 69 186 6 -268 -102
$$ packed form
6088b49M36k13K5j88J71J11k54K92J1j96j42J89J53l7k7j24oj01J38R3j92J1J87
6111H8p2K04l38PN5K9j10J75J63l06k56L06o9L6K24q3M7P1o8n7k2N8j32j7p5l3
6137a75K54J23m52K88J04k37L13l08J01J42l04K95m2k53K00j47j6L30j86q9J16
6158E7j94N9L31k79J93l02P5K76l47K85j01j0k17K88j63r5J08q0Q6j67J07J54
6180F4j42J82%Q4j93j40L74J02m38L30k72m5p0L03l0l7r3r2K50m19M68l16K25
6203I5l04Q0J58M9k2j16K36j59J5j3k71L34q6j51l1J50M6j2k07K14n2J31k13P8
6227e1J75k41j40L77J14M0l17L7P1N7M8j55N8j52J41k34L31J4k27J56j10j91J03
6250i6J63J45j53o9NJ87k23o0K87l26J28O9o7qr7K91j04j86L0J53J17j80k74J66
$$ plain form
6274 -102 -35 -47 16 380 -90 -94 195 51 -30 -138 -23 -138 -13 28 -247 219 -24 321 46 200 212 347 -170
6297 -170 20 6 169 -63 -84 91 -29 -68 -89 -53 240 -105 -163 0 -57 -128 26 167 -190 -68 122 264 11
6320 11 66 78 210 171 55 -129 21 -246 -213 63 38 -27 -32 39 161 9 60 27 145 -18 87 -30 93 57
6344 57 152 51 46 178 -242 68 3 -170 -282 -82 -97 -26 -212 -53 -220 229 168 -68 0 -1 107 123 -244 153
6368 153 84 107 -168 42 175 22 -36 -131 93 140 -164 125 -113 127 91 33 -30 198 -140 44 144 -18 -65
6391 -65 -141 143 34 -103 -82 3 -88 148 -102 -21 -2 -36 -89 -47 253 23 -60 -9 84 -180 226 -90 -32 -53 -36
6416 -36 94 82 -189 -27 -84 79 96 -40 35 -49 101 3 176 36 39 -22 -166 89 11 -25 138 124 65 -186 -254
6441 -254 -108 170 190 -176 -170 -1 16 -196 2 68 -117 -124 -48 105 -91 167 -337 68 -154 15 21 264 -62
$$ packed form
6274a02O7j2O3L64m70mK89j44q1j08J15j15J25M1k75M66k43L45k75J54J2J35n17
6297a70J90j4J63k32k1J75j20l9k1L6K93l45n8J63n7p1J54J41l57J22J90J42k53
6320A1N5J2J32l9j16j84J50k67L3K76k5o5nP1J22j52N1l3J18j63J05j17J23l6
6344E7R5j01nJ32m20L10o5j73j12K00j5P1j86J59j67M49o1k36O8jJ08J6l67L97
6368A53o9K3k75K10J33j53n8r5K24M7l04K89k38K40l6n8o3K28l38J84J00j62m7
6391f5p6K84j09j37K1Q5r1K36k50Q1J9l4n3M2L00k30q3N1R3k64M06l16N8k1J7
6416c6J30j2k71J62n7J63J7j36P5q4J50r8J73j40Lo1j44K55p8l6J63j4n9k51o8
6441b54J46K78K0l66OJ69J7k12J98O6j85pP6J53j96K58n04M05k22J69OK43l26
$$ plain form
6464 -62 58 85 -25 0 293 159 3 -56 -82 1 71 -155 22 195 228 -246 -48 -193 -222 60 52 -68 161 135
6488 135 -75 -179 -116 -75 137 -56 -59 171 124 -81 43 30 -117 -5 -165 -38 -218 35 -38 49 -1 -37 140
6511 140 76 262 -124 267 18 381 -166 -39 213 95 119 20 -46 -21 94 30 -11 -170 -127 -46 -58 164 -249
6534 -249 -40 50 -109 14 -85 -179 187 11 -125 -56 63 -84 -133 136 -69 -148 2 258 -278 -23 13 -230
6556 -230 -168 -153 81 -17 52 -204 -119 132 1 -76 139 83 60 -21 -170 -143 3 79 -89 91 -19 104 -46 319
6580 319 185 24 -195 -75 -334 91 107 45 353 -27 91 147 193 192 101 76 108 349 92 -54 -191 26 91
6603 91 -81 160 -46 -74 -140 -59 282 -165 -67 44 -55 -73 86 -112 106 301 -122 83 103 -95 215 -14 -58
6626 -58 102 228 -248 65 250 -74 -25 -285 -58 198 310 -26 -112 -219 210 22 12 -34 -109 -189 26 14 -190
$$ packed form
6464f2J20K7j10K5K93j34j56n9k6Q3P0k26J77J73L3m74J98j45k9K82qj20K29k6
6488A35k10j04O3M1K12j93lK30m7k05J24j3j47J12j60J27j80K53p3Q7n0l6J77
6511A40o4J86l86L91k49L63n47J27K52j18K4r9o6K5J15o4m1j59M3Q1j2K22m13
6534b49K09R0j59J23r9r4L66j76j36O9J19j47m9K69k05p9J50K56n36K55L6k43
6556b30O2J5K34r8O9k56Q5K51j31p7K15n6k3q1j49K7J46P6j68J80j10J23j50L65
6580C19j34j61k19J20k59M25J6o2L08l80J18N6M6jr1k5L2K41k57j46j37K17O5
6603I1j72K41k06k8o6Q1L41m47R8J11r9j8J59j98K18J95m23K05K0j98L10k29m4
6626e8J60J26m76L13J85l24M9k60K27K56J12l36q6j07M29j88j0m6p5q0K15j2k04
$$ plain form
6649 -190 -64 37 -4 100 299 -37 62 -35 -65 52 -124 -100 -16 38 -112 144 64 161 111 6 23 31 17 -185 3
6674 3 26 12 64 45 -71 8 62 83 96 90 -78 -34 -159 -30 161 86 283 59 -146 -105 7 130 -338 123 -17
6699 -17 -12 119 73 15 122 130 -116 140 -72 -130 97 10 84 -16 205 107 -79 -166 38 -67 138 -129 -35 145
6723 145 -13 -62 -106 -111 -1 124 -15 -156 20 202 196 -93 22 -147 -66 113 115 -219 53 69 16 -192 -75 53
6747 53 169 13 -156 217 -32 168 10 29 6 -364 -285 -120 111 33 86 133 -200 -32 -214 -23 126 -8
6769 -8 122 10 -20 -17 -41 -274 -54 -77 186 238 151 157 -7 33 392 -157 -138 13 39 79 62 108 211 -213 80 21
6795 21 134 66 -5 22 -5 79 69 27 69 47 5 109 -196 30 -5 161 258 -127 -175 -9 40 -59 -57 -151 -123 97 -34
6822 -34 -123 104 136 44 -16 -128 152 61 -19 -30 74 -292 -5 41 -156 110 163 -71 82 -32 276 80 -7 27
$$ packed form
6649a90J26J01m1J04J99l36R9r7l0J17j76K4Q4N4j50K56q0R7n0j05J7Qj4k02J88
6674CK3j4N2j9j16P9N4K1J3oj68M4j25J29J91p5J97k24k05M1J12J23m68M61j40
6699a7NJ31m6n8J07Qk46K56k12n8K27q7P4j00K21r8j86q7K04j05K05k67R4J80
6723A45j58m9m4nJ10J25j39j41J76J82ok89J15j69Q1J79Kl34K72J6n3k08J17J28
6747E3J16j56j69L73k49K00j58J9k3l70P9J65K31p8N3M7l33J68j82J91J49j34
6769hJ30j12l0Lk4k33K20k3K63N2q7Oj64M0L59n49J9J51K6M0j7M6J03m24K93n9
6795B1J13o8p1K7k7Q4j0m2M2k2m2J04l05K26l5J66R7l85m8J66M9r9Kr4K8K20j31
6822c4q9K27L2r2o0j12K80r1q0j1J04l66K87M6j97K66N3k34J53j14L08j96q7L4
$$ plain form
6846 27 -74 54 253 60 56 -128 13 134 -109 36 254 -193 -50 -87 67 -95 -135 -133 60 -80 125 15
6868 15 -144 -65 86 25 -125 83 -83 -72 32 51 -202 -106 -115 -69 -122 -89 -129 -224 3 125 -170 15 10 157 4
6893 4 12 10 -76 47 82 69 22 -84 -80 69 147 217 -84 6 53 -253 -89 -14 119 -8 -90 -59 -1 -84 -81 119 -245 -73
6921 -73 162 63 -93 22 -252 33 -67 -201 13 174 -120 -17 -82 -7 -7 -5 -36 -153 49 -157 95 89 112 155
6945 155 -10 -182 4 52 -62 -51 -101 67 -56 -178 -23 -8 48 56 -98 -64 -82 -79 -23 -113 -63 150 -100 134 -164
6970 -164 28 49 72 -101 67 55 -38 -55 11 -37 -92 -223 -152 84 196 -15 -201 292 64 -17 -171 36 15 -49
6994 -49 69 -127 28 -90 -121 178 -80 6 175 55 -125 85 12 98 1 148 78 -119 -161 285 -42 243 86
7017 86 -25 54 254 -299 60 -100 -329 79 -249 -67 -20 78 -2 58 65 -162 194 -27 241 -318 182 141 117
$$ packed form
6846B7j01J28J99j93mj84J41J21k43J45K18m47J43l7J54j62m0KJ93j40K05j10
6868A5j59P9J51o1j50K08j66J1J04J9k53R6rM6n3L3m0r5K27J22k95J85nJ47j53
6893DQkq6J23L5j3m7j06MJ49P8P0l01R0M7l06J64P5J33j27q2L1N8q3LK00l64J72
6921g3K35r9j56J15k74K85j00j34K14J61k94J03o5P5%Kl1j17K02k06K52oK3M3
6945A55j65j72J86M8j14J1n0J68j23j22J55J5N6Qj54L4j8LN6r0N0K13k50K34k98
6970a64J92K1K3j73J68j2r3j7O6m8n5j31P1K36J12k11j86M93k28q1j54K07k1o4
6994d9J18j96J55j18l1K99k58Q6J69j20j80K10p3Q6r7J47p0j97m2M46l27K85j57
7017H6j11P9K00n53L59j60k29M08l28J82M7R8q0O0Pk27L56k21K68n59N00m1k4
$$ plain form
7040 117 91 91 77 -178 -119 -60 57 93 -23 -24 57 -59 -296 -97 -36 -202 66 -126 66 -132 24 143 -170 104
7064 104 224 1 205 -292 -68 -59 99 19 26 -345 112 -1 -266 -125 19 127 23 199 162 -208 -47 175
7086 175 55 6 -31 94 173 161 -162 37 108 -80 71 -154 -6 -109 -123 -3 67 22 82 60 170 158 -168 -144
7110 -144 -62 50 88 -4 -59 -259 112 32 -2 58 63 77 38 133 -139 -25 -394 35 -25 150 -125 87 156 86 177
7135 177 -112 28 -30 121 13 213 27 52 105 37 37 -298 -113 46 22 -249 -98 7 89 -87 97 96 140 -170
7159 -170 73 5 -232 234 67 -25 -238 -100 236 115 265 62 -142 59 -132 66 -97 284 -234 361 -181
7180 -181 -57 309 197 311 36 -29 112 -100 71 -73 41 74 172 99 -11 -88 -214 95 259 79 20 -133
7202 -133 328 -97 175 147 230 319 -164 -42 -65 123 -207 75 1 -169 -192 -43 -143 -84 -115 23 115 20 179
$$ packed form
7040A17k6%j4k55N9N9J17L6j16jQ1j16k37J99O1j66K68j92J92j98J56J19l13K74
7064A04J20k23K04m97K24RJ58q0Pl71M57j13k65J41J44J08j04J76l7l70J61K22
7086A75j20m9l7J25P9j2l23J99P1j88J51k25J48j03j4J20P0m5O0k2J10j2l26K4
7110a44Q2J12L8r2n5k00L71q0l4O0NJ4l9R5k72J14l69M29o0J75k75K12O9p0R1
7135A77k89J40n8J51j08K00j86K5N3o8%l35J85J59k4k71J51J05Q2j76J84jM4l10
7159a70K43o8k37M66j67r2k13J38L36j21J50k03k04K01j91J98j63L81n18N95n42
7180a81J24L66j12J14k75o5J41k12J71j44J14L3R8p3j10p7j26L09J64j80n9j53
7202a33M61m25K72k8Q3Q9m83J22k3J88l30K82p4j70k3J49j00N9l1J38R2r5J59
$$ plain form
7225 179 -15 207 25 -139 -53 134 51 -44 97 -3 -1 140 90 16 -164 -42 208 104 193 -179 211 18 10
7248 10 119 79 48 215 -130 95 -295 -105 142 -266 126 122 87 -66 134 4 208 20 -36 -182 62 -76
7270 -76 55 42 127 -97 -80 73 29 -368 -84 274 -162 -230 -76 94 53 16 134 -14 -173 -7 -49 54 -114
7293 -114 -181 38 -133 -126 -5 -42 88 59 17 -191 17 194 246 -30 7 -68 -28 -108 -22 -57 76 142 89 7 -122
7318 -122 -7 14 -25 71 62 -125 -107 -38 135 -200 -229 -96 116 -23 -68 -272 34 117 167 69 104 152 -79 316 -129
7343 -129 -230 -157 -109 -85 -31 45 246 -20 76 -86 140 30 -151 131 -66 143 -83 -59 -86 14 141 -127 57
7366 57 -114 -22 193 1 64 21 -121 -51 76 234 79 44 -66 31 251 -209 205 81 194 166 -108 -50 32
7389 32 -167 223 78 50 -307 -124 153 -324 -22 58 -24 -282 58 146 -119 2 139 52 1 51 -224 85 225
$$ packed form
7225A79j94K22j82j64Q6J87q3r5J41j00KJ41n0p4j80J22K50j04Q9l72L90j93q
7248A0J09m0l1J67l45K25l90J90K47m08L92ml5j53K00j30K04j88n6j46K44j38
7270g6J31j3Q5k24J7J53m4l97K84L58m36o8J54J70m1l7J18j48j59J66m2J03j68
7293a14o7K19j71PJ21l7J30k9m2k08K08J77N2k76L7p5M0q0Q6l5J33O6n3q2j29
7318a22J15K1l9R6rj87J8O9J73l35k9J33K12j39m5k04L06Q3N0r8L5M8k31L95m45
7343a29j01P3M8K4N4P6K01k66R6j62K26j10j81K82j97K09k26K4k7J00J27k68J84
7366E7j71R2K15j92O3m3j42P0J27J58j55l5j10R7K20m60M14j24J13k8k74N8Q2
7389C2j99L90j45k8l57J83K77m77L02Q0q2k58L40Q8k65J21J37q7n1N0k75L09J40
$$ plain form
7412 225 121 33 -104 109 -196 110 34 128 132 70 -61 -15 268 -58 -5 -17 -20 63 185 37 -69 -156 -99 -7 -102
7437 -102 -92 -31 75 63 3 72 -37 -69 0 14 -92 -123 26 -21 -119 101 -57 -11 -20 4 101 14 -74 -9 73 -95 -190
7464 -190 -24 38 -244 -75 54 -129 -10 -92 141 -125 15 -165 40 34 105 10 -191 10 -116 -67 199 36
7486 36 -127 366 107 28 -15 -99 -145 -92 -49 153 -320 -88 -95 115 -154 65 91 36 58 43 26 -101 -20 -190 -137
7511 -137 -51 -3 -83 62 -48 171 37 180 -67 -86 7 331 110 243 222 -148 -170 -157 -78 143 -40 46 151
7534 151 -107 -215 187 -41 105 80 -227 -147 72 70 225 40 38 153 -181 209 74 -26 -287 -99 290 48
7556 48 -40 16 47 -54 85 -153 -51 48 -123 -21 -72 138 75 27 190 97 122 120 93 -135 -127 13 -114 188 -95
7581 -95 -29 -59 120 2 64 -215 213 19 -176 54 -120 23 -222 112 16 -19 -40 86 -229 144 25 2 -19
$$ packed form
7412B25j04q8j37K13l05L06p6R4Mo2j31M6K83l26N3j2lQ3J22j48j06q7N7R2r5
7437a02J0O1J06j2o0O9j09l2O9J4j06l1J49m7r8K20j58M6rK4R7q7q8O5Q2j68r5
7464a90J66O2k82J69J29j83J19q2K33k66J40j80K05oP1r5k01K01j26M9K66j63
7486C6j63M93k59p9m3q4m6N3M3K02m73K32pK10k69K19K6n5K2j5j7j27Q1j70N3
7511a37Q6M8q0J45j10K19j34J43k47j9R3L24k21J33k1l70k2J3P9K21j83Q6J05
7534A51k58j08M02k28J46k5l07Q0K19kJ55j85kJ15l34L90j35j00k61J88L89k42
7556D8q8N6L1j01J39k38J02R9j71J02n1K10o3m8J63r3K5kk7k28QJ40j27L02k83
7581i5O6l0J79j18O2k79M28j94j95K30j74J43k45L34r6l5k1J26l15L73j19k3k1
$$ plain form
7604 -19 61 33 346 -155 -68 282 52 -201 20 -44 -57 106 82 107 -344 -49 19 -23 110 -327 -51 -181 -228 66
7628 66 75 -68 -2 50 164 1 -102 -67 162 38 121 27 -60 -43 244 140 -25 -18 127 197 10 -45 48 107 112 172
7654 172 5 255 -285 -49 -13 -135 -119 99 152 33 16 -52 -7 114 -91 -88 142 -120 -165 -237 85 104 202 40
7678 40 176 -148 -112 -69 23 196 -157 196 32 280 126 -120 47 13 -23 -44 -153 86 166 -6 52 -198 200
7701 200 -42 110 21 164 -71 24 82 11 -173 -198 56 -114 -168 97 74 173 -89 -36 48 -14 307 -104 -162 107
7725 107 -182 -94 -30 -208 -36 291 -30 60 -84 -54 144 -74 50 -9 194 -224 -234 -287 -183 45 345 -19
7747 -19 31 -79 -169 -120 -44 425 -30 -216 -206 -43 77 -77 -94 -56 111 73 -116 -200 -207 35 100 109 21 -201 -114 -16
7773 -16 -255 -130 6 -67 23 207 59 -253 113 -22 -49 -107 121 110 -45 -118 180 -18 -354 -68 10 147 161
$$ packed form
7604a9Q0k8L13n01Q7L50k30k53K21o4j3J63k4K5m51K95O8m2J33m37K76j30m7K94
7628F6Rj43O6N2J14j63j03L5K29j24Q3r4q7J7K87j04j65PJ45P0j87n5R3N9NO0
7654A72j67K50n40K36L6j22J6K18N3j19j7o8M5J21k05LK30k62m5p2L22J9R8j62
7678D0J36l24L6M3R2J73l53L53j64K48j54k46J67l4l6k1j09K39Q0j72N8k50L98
7701B00k42J52q9J43k35R5N8p1j84k5K54j70n4K65k3R9k62N3Q4o2L21m11n8K69
7725A07k89Q8O4j78J72L27l21R0j44L0J98k18J24n9K03m18j0n3J04K28L00l64
7747a9N0j10r0M9P6M69m55j86J0J63J20j54j7L8J67l8j89q4pK42O5Rq8k22Q7R8
7773a6k39J25J36p3R0J84j48l12L66j35k7n8K28j1j55p3K98j98l36K86P8J37J4
$$ plain form
7796 161 78 192 301 3 97 -47 15 -151 -74 75 205 60 -81 -257 48 93 199 34 97 112 78 -44 -129
7819 -129 -114 97 181 65 26 -184 -150 84 102 -93 124 29 300 255 -1 -9 -32 235 -262 -8 233 38 -36 -37
7843 -37 177 81 -56 6 105 -54 -188 29 -86 189 -285 273 9 -110 -190 -227 132 218 -29 -115 -26 -200 134
7866 134 34 115 74 -45 -137 -30 57 -273 33 36 291 154 -147 -74 31 40 -110 31 150 19 205 163 -111
7889 -111 -81 -76 81 317 -78 -61 64 -93 18 -68 10 -3 199 -130 -4 -63 -144 -65 -84 0 79 -1 125 59 119
7914 119 91 -39 95 -101 -150 61 178 -221 -14 -64 26 178 162 -117 64 -40 78 -112 4 75 -232 120
7936 120 56 -169 -189 80 -90 -89 -418 -131 -104 96 8 -79 173 -11 151 246 92 -390 -142 125 -99 -56 110
7959 110 -10 217 -228 -26 -71 89 -346 170 2 -1 347 78 -116 88 32 16 -133 13 32 84 183 68 57
$$ packed form
7796A61q3J14J09k98R4j44O2j66P7J49J30j45j41j76L05M5J06j65O3J5l4j22q5
7819a29J5K11Q4j16l9k10L4K34J8j95K17r5K71m5k56qk3K67m97K54K41j95p4j
7843c7K14r6j37O2R9j59j34K17j15K75m74N58k64j19q0l7L59Q6k47q6Q9j74L34
7866A34j00Q1m1j19r2J07Q7l30L06LK55j37l01P3J05Rj50J41J19j31J86m2k74
7889a11L0NJ57K36l95J7J25j57J11q6P8j3K02l29J26n9q1P9j9Q4P9q0J26o6O0
7914A19k8j30J34j96m9K11J17l99K07n0R0J52j6k79J81j04J18j90J16P1l07L52
7936A20o4k25k0K69j70Jl29K87K7K00q8q7K52j84J62R5j54m82K48K67k24M3J66
7959A10j20K27m45K02m5J60m35N16j68lL48k69j94K04n6j6j49J46J9N2R9j15j1
$$ plain form
7982 57 68 105 -99 -33 -17 35 -95 136 46 -49 5 -8 5 -166 49 133 6 139 -243 3 111 -101 -42 -128 240
8007 240 63 50 147 -127 -166 53 -44 84 -64 -62 70 -90 12 83 -15 117 48 -7 87 -264 -55 -94 -82 -62 189
8032 189 243 238 -109 -148 85 29 -55 116 -1 -260 126 285 243 -73 -75 -201 -38 20 -21 -24 -105 -110 74 42 8 -14
8058 -14 85 -9 94 -1 -140 87 -26 -147 82 -36 -113 82 -92 139 224 117 -160 -158 -105 -11 114 233 -159
8081 -159 -158 0 127 -115 237 133 -27 -87 -140 98 -38 98 56 -112 114 38 44 -31 -50 -127 -107 -149 91 -208
8105 -208 111 -38 -293 146 -173 -41 -53 218 10 -71 -363 -7 -317 -90 -99 -25 -141 -79 34 96 -199 -71
8127 -71 -143 10 -46 -140 37 5 -48 -112 -150 258 77 116 -129 -234 38 6 -26 -50 -74 30 -178 90 -75 239
8151 239 -103 -8 -197 100 7 -156 -169 180 209 -42 -19 -309 85 -86 95 -202 -161 -30 232 78 -82 -9
$$ packed form
7982E7J1L7k04O6J6N2j30K31r0r5N4j3J3j71K15Q4j27J33l82K46J08k12N9q6L68
8007B40j77j3R7k74l9K19r7J28j48KJ32j60J02P1r8J32o9n5R4l51K09l9J2K0K51
8032A89N4nl47l9K33n6q4J71j17k59L86J59m2l16kj26J63N8m1lq1nJ84l2l4k2
8058a4R9r4J03r5j39K27j13j21K29j18p7J95j74K31Q5j07k77KN3R4J25J19l92
8081a59JJ58J27k42L52j04j60o0n3K38j36J36m2j68K26p6Op5j9p7K0m2K40k99
8105b08L19j49k55M39l19J32j2K71k08q1k92L56l10K27rP4j16O2J13O2k95J28
8127g1p2J53n6r4J77l2n3o4l8M08j81L9k45j05K72l2l2k4k4J04k08K68j65L14
8151B39l42R5j89K97r3j63j3L49K9k51K3k90L94j71J81k97M1J31K62j54j60P3
$$ plain form
8173 -9 34 -307 68 208 -97 172 -7 50 61 116 145 16 140 -172 167 -34 -73 64
$$ packed form
8173iM3l41L75J40l05K69j79N7J1N5K9j29J24l12L39k01l9J37
8191F4
$$ Imaginary data points
##PAGE= N=2
##DATA TABLE= (X++(I..I)), XYDATA
$$ plain form
0 0 0 0 0 0 0 0 0 0 0 0 0 0 0 0 0 -8 8 -8 8 -8 14 -16 16 -22 24 -29 32 -39 43 -49 56 -65 73 -83 93 -104 117
37 117 -132 146 -163 182 -202 223 -247 273 -302 333 -367 403 -445 490 -539 594 -658 728 -805
56 -805 896 -1000 1121 -1267 1442 -1658 1936 -2306 2823 -3593 4869 -7349 13936 -68248 -158367
71 -158367 568 -11592 -43944 92422 119232 -40002 -26092 49605 -25238 -22317 103239
82 103239 50726 -46078 16489 26302 -48047 33907 104255 -12199 -55227 28846 -4309 -38190
94 -38190 75138 98154 -7988 -2696 30781 -36975 -23983 69589 35386 -16815 32985 7061
106 7061 -75391 -17939 49100 -7839 -15191 34852 -20044 -61469 15872 38796 -5731 20849
118 20849 24915 -48425 -34881 34675 8391 -14772 30848 3317 -61983 -25753 12229 -21431
$$ packed form
0@%%%%%%%%%%%%%%%qJ6j6J6j6K2l0L2l8M6n3O1p1Q2r2J05j21J38j56J76j97K21
37A17k49K78l09L45l84M25m70N20n75O35p00P70q48R35j029J133j252J386j533
56h05J701j896K121k388K709l100L594m242N129o416Q462j2218K1285q2184r0119
71a58367J58935j2160l2352J36366K6810j59234J3910P5697p4843K921J25556
82A03239n2513r6804O2567R813p4349Q1954P0348j16454m3028Q4073l3155l3881
94c8190J13328K3016j06142N292L3477o7756J2992R3572l4203n2201M9800k5924
106G061q2452N7452O7039n6939p352N0043n4896m1425P7341K2924m4527K6580
118B0849M066p3340J3544O9556k6284k3163M5620k7531o5300L6230L7982l3660
$$ plain form
130 -21431 -6096 32710 -10498 -37670 2333 -2045 -20408 29958 43538 -14246 -14535 17857 -7777
143 -7777 -9577 38681 24408 -21042 -6217 1759 -22884 646 29387 -4788 -17435 10379 -7370
156 -7370 -28716 9850 23697 -9503 -1878 15821 -14788 -20938 12683 8239 -8560 9432 2657
169 2657 -27316 -9048 16243 -4324 -6801 14287 -3701 -21680 4843 14116 -6226 2244 12499
182 12499 -8526 -9624 10265 -264 -10902 8818 7949 -14445 -6075 6805 -7065 -5532 12801
195 12801 3296 -9999 1590 3983 -3885 8304 14612 -2605 -4255 9491 3057 -3020 10036
208 10036 9153 -5123 -878 6633 -2115 -2098 5918 58 -3324 4087 126 -8523 -325 5783 -2637
223 -2637 -3198 2683 -4065 -8416 497 3082 -2395 -1621 -1034 -5261 -1338 4281 -552 -2753 2886 1116
$$ packed form
130b1431J5335L8806m3208k7172M0003m378j8363N0366J3580n7784k89L2392k5634
143g777j800M8258j4273m5450J4825P976k4643K3530K8741l4175j2647K7814j7749
156g370k1346L8566J3847l3200P625J7699l0609o150L3621m444j6799J7992o775
169B657k9973J8268K5291k0567k477K1088j7988j7979K6523R273k0342Q470J0255
182A2499k1025j098J9889j0529j0638J9720q69k2394Q370J2880j3870J533J8333
195A2801r505j3295J1589K393p868J2189O308j7217j650J3746o434o077J3056
208A0036q83j4276M245P511q748J7Q016n860l382P411l961q649Q198O108q420
223b637n61N881o748m351Q913K585n477P74N87m227L923N619m833k201N639j770
$$ plain form
239 1116 -3126 1677 4158 -1204 -1293 3021 988 -1595 10 -1380 -1960 2091 1805 -3390 -2423 686
255 686 -1477 -1182 2791 1059 -2597 -699 1655 1221 1108 821 -1051 136 2523 299 -1261 687
271 687 774 -1240 470 1837 -632 -2545 -526 990 761 -213 -1515 -1575 -67 720 -654 -503 -42 -744
289 -744 -1170 931 1206 -599 -857 617 1224 842 200 -606 18 1017 1037 616 176 3 -711 -100 1283
308 1283 712 -883 -1081 -424 288 135 -773 -1194 -616 3 -52 -208 -475 -846 -502 191 886 443 -561 -685
328 -685 382 1112 1029 305 -207 289 458 592 323 92 -327 -571 314 578 -672 -1050 -900 -48 241 -216
348 -216 -746 -757 40 177 -22 800 188 -538 -26 893 770 -23 -314 26 337 675 264 -667 -239 400 -152
369 -152 150 702 -325 -1124 305 861 183 -467 -407 -660 0 530 -474 -871 -252 -160 -753 254 632 -814
$$ packed form
239A116m242M803K481n362q9M314k033k583J605j390n80M051k86n195R67L109
255F86k163K95L973j732l656J898K354m34j13k87j872J187K387k224j560J948
271F87Q7k014J710J367k469j913K019J516k29r74j302o0J508P87j374J51M61p02
289g44m26K101K75j805k58J474O07l82o42q06O24R99K0m21m40j73p14O11J383
308A283n71j595j98O57P12j53r08m21N78O19n5j56k67l71L44O93O95m43j004j24
328f85J067P30q3p24n12M96J69J34k69k31m19k44Q85K64j250l78J50Q52K89m57
348b16n30j1P97J37j99Q22o12p26N12R19j23p93k91L40L11L38m11r31M28O39n52
369a52L02N52j027p99J429N56o78o50O0k53O60N30j004l97O19R2n93J007L78j446
$$ plain form
389 -814 -968 804 742 -83 199 -31 -392 459 879 -303 -356 626 -635 -1232 792 258 -1370 -222 1067
408 1067 99 -104 667 -121 -302 1754 1787 117 1228 1278 -63 967 2231 649 -423 992 750 -942
426 -942 237 595 -512 -150 1318 -593 -1316 96 -63 -882 544 916 -1666 -1905 90 -562 -981 518
444 518 -458 -2211 -824 146 -1563 -519 726 -1018 -1214 986 250 -1148 718 1734 -361 -203 929
461 929 -796 -746 1834 821 -849 -88 -250 -2018 -159 1527 -78 -950 337 -367 -1172 1009 1430
478 1430 -285 735 1243 -444 -625 1391 517 -589 1178 806 -1735 -945 694 15 -47 1444 -756
495 -756 -1774 90 424 -549 709 1195 -1145 -1475 361 -293 -914 812 537 -1479 -892 371 -1362
512 -1362 -453 1439 445 -1095 284 172 -1170 939 2287 305 -55 671 -269 -641 1541 947 -674
$$ packed form
389h14j54J772o2q25K82k30l61Q51M20j182n3R82j261n97K024n34j628J148J289
408A067r68k03P71p88j81K056L3j670J111N0j341J030J264j582j072J415k42j692
426i42J179L58j107L62J468j911p23J412j59q19J426L72k582k39J995o52m19J499
444E18r76j753J387R70j709J044J245j744j96K200p36j398J866J016k095J58J132
461I29j725N0K580j013j670P61j62j768J859J686j605q72J287p04q05K181M21
478A430j715J020N08j687j81K016q74j106J767l72k541P90J639o79o2J491k200
495g56j018J864L34r73J258M86k340l30J836o54o21J726k75k016N87J263j733
512a362R09J892r94j540J379j12j342K109J348j982l60P26r40l72K182n94j621
$$ plain form
529 -674 -43 347 -1428 -378 1267 129 -937 616 -168 -1800 30 1264 -377 -49 1033 -996
545 -996 -1376 464 572 -191 668 482 -1799 -1207 770 -7 -28 854 -146 -1661 -79 455 -606 203
563 203 1278 -587 -1246 18 106 -870 1073 1138 -702 -816 120 -666 -333 1417 830 -500 -34 177 -641
582 -641 455 1508 42 -617 354 -430 -1178 420 917 -515 -55 349 -883 -988 513 341 -461 431
600 431 318 -1155 -354 736 415 0 471 -476 -1271 341 630 56 274 636 -471 -355 586 344 -200
619 -200 589 273 -1109 -83 229 -325 -206 826 -94 -746 -134 1 -311 437 706 -421 -359 160 -123
638 -123 -432 797 589 -285 80 213 -242 -82 599 -72 -36 417 -11 -497 -243 329 245 -135 380 -215 -600
659 -600 231 -52 -443 275 39 -533 -249 706 114 -8 235 -2 -461 3 233 -464 -135 333 -89 -376
$$ packed form
529f74O31L90j775J050J645j138j066J553p84j632J830J234j641L28J082k029
545i96l80J840J08p63Q59j86k281N92J977p77k1Q82j000j515J582N34j061Q09
563B03J075j865o59J264Q8r76J943O5j840j14R36p86L33J750n87j330M66K11q18
582f41J096J053j466o59R71p84p48J598M97j432M60M04j232j05J501j72q02Q92
600D31j13j473Q01J090l21m15M71r47p95J612K89n74K18L62j107J16R41k42n44
619b00P89l16j382J026L12n54J19J032r20o52O12J35l12P48K69j127O2N19k83
638a23l09J229k08q74L65J33m55J60O81o71L6M53m28m86K54N72q4l80N15n95l85
659f00Q31k83l91P18k36n72K84R55n92j22K43k37m59M64K30o97L29M68m22k87
$$ plain form
679 -376 165 167 -165 154 349 -135 -324 135 73 91 147 70 -142 -55 -89 -209 -120 506 -30 -517 208 51 -145
702 -145 298 322 107 49 19 -10 -330 261 254 89 -46 -102 -191 -119 137 -16 -15 134 -153 -273 80 86 28 220 113
727 113 -7 -36 0 147 153 -19 334 -6 84 -102 -96 -222 133 106 -42 -32 94 -120 -45 110 -263 -40 104 -96
751 -96 -39 251 -331 -296 98 336 29 189 107 -43 -33 150 88 111 -108 75 -146 108 -68 25 -36 75 -39
774 -39 118 279 -57 126 -98 10 -250 125 154 79 33 -52 -77 -28 240 -185 42 31 -101 260 131 -108 -15
797 -15 162 414 140 -49 90 282 291 137 18 182 161 -4 -149 97 -160 106 93 291 136 -216 -13 166
819 166 -24 -27 54 -77 39 38 64 -57 89 -169 114 116 -184 -108 69 -288 248 -105 25 -86 100 -104 -19 77
843 77 158 167 -131 175 286 -15 -136 -79 11 -107 -49 76 12 91 -95 -19 -248 -7 53 -215 -289 -97 7 -4 -68
$$ packed form
679c76N41Kl32L19J95m84j89M59o2J8N6p7k12Q7l4j20Q9O26n36m87P25j57j96
702a45M43K4k15n8l0k9l20N91pj65j35n6q9P2K56j53JJ49k87j20L53On8J92j07
727A13j20k9L6J47Oj72L53l40R0j86Oj26L55k7j48J0J26k14P5J55l73K23J44k00
751i6N7K90n82L5L94K38l07J60q2j50J0J83o2K3k19J83k21K54j76R3o1J11j14
774c9J57J61l36J83k24J08k60L75K9p5m6q5k5M9K68m25K27j1j32L61j29k39R3
797a5J77K52k74j89J39J92Rj54j19J64k1j65j45K46k57K66j3J98j55l52K03J79
819A66j90lQ1j31J16jK6j21J46k58K83Kl00P6J77l57N36l53J30j11J86k04Q5R6
843G7Q1Rk98L06J11l01j21N7R0j18N8J25o4P9j86P6k29K41O0k68p4J92J04j1o4
$$ plain form
868 -68 -102 246 -58 -99 -125 -74 128 11 112 -80 100 31 112 179 178 -100 -86 140 -10 183 68 -54 35 400
892 400 130 104 25 183 -6 36 -47 104 -138 -259 140 -55 232 205 -264 -50 -135 41 -82 -52 305 -137 -187
915 -187 -134 55 80 104 292 -174 11 100 226 -121 139 39 -121 46 -7 194 -31 66 89 86 26 -58 5 28 126
940 126 -110 -100 54 -72 -91 13 -102 -149 82 -27 180 58 187 -186 145 -200 154 -5 -120 -141 194 136
962 136 46 -133 -188 -22 23 -92 -16 -37 -107 67 56 -230 92 206 -54 42 114 10 69 121 179 12 -11 155 -180
987 -180 87 2 -164 81 -224 -36 -5 60 -126 11 -108 -142 -21 88 15 236 139 95 103 17 389 -160 -41 -158
1011 -158 181 -4 -94 66 33 138 -35 128 135 -70 -103 69 -25 99 -7 -67 -143 207 -47 87 43 198 -182
1034 -182 14 289 -107 -230 34 -178 -83 -12 -210 -266 -127 -50 -201 -138 -137 278 -40 -89 101 51 -259 175 -77
$$ packed form
868f8l4L48l04m1k6N1K02j17J01j92J80o9Q1O7jk78J4K26j50J93j15j22Q9L65
892D00k70k6p9J58j89M2q3J51k42j21L99j95K87k7m69K14q5J76j23L0L57m42n0
915a87N3J89K5K4J88m66J85Q9J26l47K60j00j60J67n3K01k25R7K3lo0q4O3K3R8
940A26k36J0J54j26j9J04j15m7K31j09K07j22J29l73L31l45L54j59j15k1L35n8
962A36r0j79n5J66M5j15P6k1p0J74j1k86L22J14k60R6P2j04N9N2N8j67k3J66l35
987a80K67q5j66K45l05J88L1O5j86J37j19l4J21J09p3K21r7m4Qq6L72n49J19j17
1011a58L39j85r0J60l3J05j73J63Pk05l3J72r4J24j06o0p6L50k54J34m4J55l80
1034a82J96K75l96j23K64k12R5P1j98n6J39P7j51O3JM15l18m9J90n0l10M34k52
$$ plain form
1057 -77 94 110 79 63 16 76 -105 21 83 -77 -89 -88 -119 149 -32 49 -32 -103 196 -325 24 126 13 53 -116
1082 -116 -116 149 147 222 97 126 103 90 -176 152 84 -82 -14 -290 -46 -220 111 146 -166 221 16 -117 84 -275
1106 -275 28 -1 263 -37 -40 -146 97 62 195 153 106 119 -68 -117 -134 6 183 -168 101 161 241 -79 25 -191
1130 -191 114 22 311 -74 131 68 -19 93 6 176 -231 40 13 -130 -69 14 174 -55 -81 0 -123 -6 -214
1153 -214 171 42 -125 -74 -40 -143 -101 -23 -47 -79 -206 -229 -340 245 194 -122 161 41 -13 73 -139 203 -164
1176 -164 31 39 -63 220 189 17 -114 151 154 -4 65 -108 -4 -96 -109 182 -208 1 -35 159 -60 46 -78
1199 -78 -111 304 -187 95 -16 -10 108 166 -72 5 19 171 50 1 244 -47 109 53 44 -84 95 -8 18 165
1223 165 66 117 133 -46 -26 -23 14 14 -43 11 49 360 5 -115 207 -38 -142 -95 -51 66 266 -6 -245 25 81
$$ packed form
1057g7J71J6l1j6m7O0j81J26O2j60j2Jl1K68j81Q1q1p1K99n21L49J02j13M0j69
1082a16%K65kP5j25K9k3j3k66L28o8j66O8k76K44j74L31L5l12L87k05j33K01l59
1106b75L03k9K64l00lj06K43l5J33m2m7J3j87m9j7J40J77l51K69O0Q0l20J04k16
1130a91L05r2K89l85K05o3q7J12q7J70m07K71k7j43O1Q3J60k29k6Q1j23J17k08
1153b14L85j29j67N1L4j03M2P8k4l2j27k3j11N85n1l16K83j20n4Q6k12L42l67
1176a64J95Qj02K83l1j72j31K65Lj58O9j73J04r2j3K91l90K09l6J94k19J06j24
1199g8l3M15m91K82j11OJ18N8k38P7J4J52j21m9K43k91J56n6rj28J79j03K6J47
1223A65r9N1J6j79K0LL7%n7N4L8L11l55j20L22k45j04M7M4J17K00k72k39K70N6
$$ plain form
1248 81 34 -146 28 3 95 -92 143 -116 -46 86 -231 189 5 31 148 -238 -140 137 -184 222 113 -6
1270 -6 -69 222 -38 -35 91 -129 -207 43 -28 359 -114 -64 -142 -202 48 -97 -121 -187 -71 -3 31 -8 -228 3 128
1295 128 15 -109 -116 -117 -158 20 56 -1 -205 66 42 36 13 87 48 -153 147 -99 4 -11 93 94 89 -300 -57 149
1321 149 -122 -167 -65 7 95 198 -81 -5 91 34 78 12 -171 -108 48 83 -316 -125 -148 91 39 -133 69 -46
1345 -46 -3 -13 -61 -151 53 226 53 113 162 100 -152 70 5 -22 104 -137 -256 208 -67 -209 -132 90 -269 -109
1369 -109 -42 -115 36 -105 -113 44 111 63 225 -140 -108 85 -167 -102 17 -72 154 83 10 62 -179 11 -74 -34 -133
1394 -133 47 -67 -7 20 -20 -43 48 -50 -60 45 -42 251 -72 -276 -3 117 -92 -121 80 -2 167 -104 -144 -128
1418 -128 -142 -256 12 91 108 78 22 140 -51 18 10 -183 27 -310 -75 -94 -222 -68 -168 -87 -47 99 61 85
$$ packed form
1248H1m7j80J74k5R2j87K35k59P0J32l17M20j84K6J17l86R8K77l21M06j09j19
1270fo3K91k60LJ26k20p8K50p1L87m73N0p8o0K50j45k4o6J16O8L4l9k20K31J25
1295A28j13j24pjm1J78L6n7k04K71k4ok3P4l9k01L00k46J03j5J04Jnl89K43K06
1321A49k71m5J02P2Q8J03k79P6R6n7M4o6j83O3J56L5l99J91k3K39n2j72K02j15
1345d6M3j0m8r0K04J73j73O0M9o2k52K22o5k7J26k41j19M64k75j42P7K22l59J60
1369a09O7p3J51j41qJ57O7m8J62l65L2J93k52O5J19q9K26p1p3N2k41J90q5M0r9
1394a33J80j14O0K7m0k3R1r8j0J05q7K93l23k04K73J20k09k9K01q2J69k71m0J6
1418a28j4j14K68P9J7l0n6J18j91O9qj93K10l37K35j9j28J54j00Q1M0J46l8K4
$$ plain form
1442 85 -134 241 -67 -111 182 -102 -85 -210 146 -110 34 -190 30 40 32 230 -159 232 -66 -62 -237 -111 -37
1465 -37 125 122 61 -138 59 62 61 -301 52 53 -158 27 -212 -165 -137 -2 69 112 80 52 -165 85 -11 -42 61 -63
1491 -63 -84 70 -66 205 -90 5 83 -133 176 -100 -33 64 28 124 -113 37 23 153 -9 -86 -60 18 -136 -187
1515 -187 -74 156 194 197 472 -106 -55 -137 79 -160 -168 217 -51 82 -60 -307 -66 -160 -37 97 -94 220 139
1538 139 58 301 -177 -31 -169 -85 23 21 178 2 16 -122 -42 -58 206 149 95 127 81 -45 -73 -268 -191 134
1562 134 339 161 -97 99 216 -142 95 -65 96 26 -109 115 -130 -423 -32 -8 -82 214 -210 12 344
1583 344 224 40 63 -240 -43 205 25 -32 46 -23 -122 22 -299 178 -62 -189 25 48 39 -113 -177 -40 -184
1606 -184 135 74 -179 69 106 -160 -205 272 59 -97 278 89 -22 73 -153 -50 63 131 -137 57 -152 -72
$$ packed form
1442H5k19L75l08m4K93k84J7j25L56k56J44k24K20J0qJ98l89L91k98Mj75J26P4
1465c7J62lo1j99J97Ljl62L53Jk11J85k39M7K8J35P1M3l2k8k17K50r6l1J03j24
1491f3k1J54j36K71k95R5P8k16L09k76O7R7l6R6k37J50j4J30j62p7K6P8j54n1
1515a87J13K30L8LK75n78N1q2K16k39qL85k68J33j42k47K41r4J23J34j91L14q1
1538A39q1K43m78J46j38Q4J08kJ57j76J4j38Q0j6K64n7n4L2m6j26k8j95P7L25
1562A34K05j78k58J96J17l58K37j60J61p0j35K24k45k93L91K4p4K96m24K22L32
1583C44j20j84K3l03J97K48j80n7P8o9r9J44l21M77k40j27K14K3rj52o4J37j44
1606a84L19o1k53K48L7k66m5M77k13j56L75j89j11R5k26J03J13O8k68J94k09Q0
$$ plain form
1628 -72 -112 37 14 -7 -287 114 193 -34 -81 -13 6 -314 -71 -85 -260 -30 122 -23 32 -38 120 -161 298 -237
1652 -237 -181 -148 117 -131 -37 -98 -195 181 -9 201 -55 146 -12 377 -125 14 254 -63 -37 184 -194 187
1674 187 221 37 81 -35 -109 33 40 14 -51 42 -187 163 107 -118 -9 123 134 -303 80 157 4 -135 -17 46
1698 46 32 -66 200 3 91 -76 -4 -416 131 200 -119 26 239 -45 -200 28 -100 -76 0 60 -159 -204 -39
1721 -39 56 -37 -175 81 192 -125 62 3 -159 -52 8 112 -106 23 37 -233 77 -131 196 139 -100 -62 -41
1744 -41 131 -28 -200 -260 71 268 -118 134 79 -112 75 65 -137 25 -50 130 -113 -72 183 -92 16 -120
1766 -120 129 -149 75 70 -54 216 144 -219 68 121 -13 190 -17 -12 35 39 110 39 266 318 -34 -45 -76 125 -76
1791 -76 108 -9 69 95 16 -43 -74 52 9 -89 128 -96 -26 -53 -76 73 -218 25 25 -19 -19 37 156 28 10 -254
$$ packed form
1628g2m0J49k3k1k80M01P9k27m7O8J9l20K43j4j75K30J52j45N5p0J58k81M59n35
1652b37N6L3K65k48R4o1r7L76j90K10k56K01j58L89n02J39K40l17K6K21l78L81
1674A87L4j84M4j16p4J42Pk6o5R3k29L50n6k25J09J32J1m37L83P7j53j39J18O3
1698D6j4r8K66j97Q8j67P2m12N47O9l19J45K13k84j55K28j28K4P6O0k19m5J65
1721c9R5r3j38K56J11l17J87n9j62J07O0J04k18J29J4k70L10k08L27n7k39L8K1
1744d1J72j59j72o0L31J97l86K52n5j91J87j0k02J62p5J80k43M1K55k75J08j36
1766a20K49k78K24nj24K70p2l63K87N3j34K03k07NM7MP1p1K27N2l52j1l1K01k01
1791g6J84j17P8K6p9n9l1J26m3r8K17k24P0k7k3J49k91K43%m4%N6J19j28j8k64
$$ plain form
1817 -254 -14 -74 11 47 -240 -53 -67 -38 -106 294 0 200 188 127 242 124 -105 18 112 -75 -106 208 -23
1840 -23 67 -90 -12 -290 -19 93 98 251 -123 -39 307 50 119 -101 -65 138 -126 21 313 2 -23 -69 -336
1863 -336 119 -39 -89 -134 14 -17 14 77 54 106 -88 -451 122 57 25 -123 -88 82 -157 30 148 6 -166
1886 -166 274 26 232 -44 -12 -104 16 -99 215 121 253 34 -208 -180 -57 92 -27 6 -1 -260 -200 -57 -41
1909 -41 -93 241 89 51 61 127 -5 54 -46 -66 233 49 151 -87 -80 -69 -77 -44 45 -122 -353 -6 141 27 -56
1934 -56 156 5 -188 251 -9 -21 -21 223 157 99 31 208 -110 47 -279 -279 -71 50 -104 21 15 93 -147 -89
1958 -89 32 40 -43 -42 -38 -22 121 255 48 -272 95 59 -23 172 -160 -274 -97 102 24 186 171 103 32 94 138 -26
1984 -26 -35 -124 -139 82 58 37 -145 35 -37 39 -86 -252 112 -48 -43 -80 -17 -77 -373 17 162 125 157 -97 283
$$ packed form
1817b54K40o0Q5L6k87J87j4K9o8M00k94K00j2o1J15j18k29J23R4j87l1L14k31
1840b3R0j57P8k78K71J12NJ53l74Q4L46k57O9k20L6K03k64J47K92l11k5m6k67
1863c36M55j58n0m5J48l1L1O3k3N2j94l63N73o5l2j48L5J70k39J87J18j42j72
1886a66M40k48K06k76L2r2J20j15L14r4J32k19k42K8J23J49j19L3pk59O0J43J6
1909d1n2L34j52l8J0O6j32N9j00k0K99j84J02k38PJ1qL3Q9j67k31L47J47j14q3
1934e6K12j51j93M39k60j2%K44o6n8o8J77l18J57l26%K08J21j54J25oP8k40N8
1958h9J21Qq3JMJ6J43J34k07l20L67l6q2J95l32j14J77J99p8J62j5o8p1O2M4j64
1984b6rq9j5K21k4k1j82J80p2P6j25j66L64j60Nl7O3o0k96L90J45l7L2k54L80
$$ plain form
2009 283 405 260 72 -15 49 157 64 52 -169 -162 181 -23 258 -177 -166 24 20 60 -428 85 -95 102 161 42
2033 42 -62 52 -185 163 79 -122 129 -137 -10 82 46 129 59 -179 98 68 -184 24 135 47 -273 -139 213
2056 213 -309 -31 -313 185 157 98 205 -291 -101 -194 88 -122 14 50 -221 -72 -4 182 60 12 -144 93
2078 93 127 3 57 -56 -125 -25 233 -111 -143 -138 7 -108 -50 -101 171 196 -65 -132 -57 141 -81 27 -30 -39 68
2103 68 -3 96 -13 -152 -21 -157 124 20 -238 70 139 36 92 -84 -81 -31 -123 -72 -80 -27 -112 5 -13 58 33 -138
2129 -138 99 149 -157 23 -197 -22 -15 94 70 50 19 50 -108 47 -272 -102 -35 -42 156 242 225 -70 136 -99
2153 -99 -215 46 271 137 -41 -134 -163 50 -62 -5 -153 -76 -4 -139 63 13 173 7 -198 -116 44 -53 54
2176 54 272 -235 -180 -186 13 -14 97 10 168 10 98 55 27 249 52 -122 -191 -141 -93 -103 -283 193 104 46 -263
$$ packed form
2009B83J22j45j88q7O4J08r3j2k21PL43k04K81m35J1J90mM0m88N13j80J97N9j19
2033D2j04J14k37L48q4k01K51k66J27R2l6Q3p0k38K77l0k52K08J11q8l20J34L52
2056B13n22K78k82M98k8n9J07m96J90r3K82k10J36L6k71J49O8J86j22m8j56K37
2078I3L4j24N4j13o9J00K58l44l2NJ45j15N8n1K72K5k61o7P5J98k22J08n7rJ07
2103F8p1R9j09j39J31j36K81j04k58L08O9j03N6j76LN0r2N1qN3q5J17j8P1k5j71
2129a38K37N0l06J80k20J75PJ09k4k0l1L1j58J55l19J70O7pJ98Q6j7k95K06k35
2153i9j16K61K25j34j78r3k9K13j12N7j48P7P2j35K02n0J60j66k05Q2J60r7J07
2176E4K18n07N5oJ99k7J11q7J58j58Q8m3k8K22j97j74o9N0M8j0j80M76q9n8l09
$$ plain form
2201 -263 -38 54 172 17 102 370 -83 -81 -33 48 70 56 141 109 -66 -19 238 -176 207 284 -192 73 -30 -135
2225 -135 180 -90 122 174 -35 -153 218 96 -193 -87 115 -62 181 3 192 71 187 289 166 -112
2245 -112 -133 -136 -157 11 18 -33 -132 -82 -84 224 -20 51 -197 85 -39 109 90 -114 146 -137 169 -165 81 -25
2269 -25 -110 -261 8 75 -53 -135 -19 -146 -176 -180 -114 64 -166 -141 185 204 -100 0 -22 -30 100 116 262 -137 71
2294 71 86 -10 77 104 171 -50 -46 21 -22 -166 -82 45 91 191 12 -78 293 -156 67 -34 105 71 28 -55 6 -101
2320 -101 93 6 211 224 40 -1 125 -15 -20 169 -317 157 -33 -83 132 -320 -224 -95 42 290 -130 -8
2342 -8 -56 56 249 229 -97 16 206 -170 138 306 -25 -66 148 101 39 -169 477 41 88 262 -67 -31 -193
2365 -193 -37 -1 -57 78 -117 -47 97 189 -291 328 -2 188 147 142 -10 116 51 141 67 -63 51 107 173 -172
$$ packed form
2201b63K25R2J18j55Q5K68m53KM8Q1K2j4Q5l2j75M7K57m14L83P7m76K65j03j05
2225a35L15k70K12N2k09j18L71j22k89J06K02j77K43j78J89j21J16J02j23k78
2245a12k1lk1J68Pn1r9N0kL08k44P1k48K82j24J48j9k04K60k83L06l34K46j06
2269b5q5j51K69O7j28q2J16j27l0mO6J78k30K5L26J9l04J00k2qJ30J6J46l99K08
2294G1J5r6Q7K7O7k21MO7m3j44Q4J27M6J00j79r0L71m49K23j01J39l4m3q3O1j07
2320a01J94q7K05J3j84m1J26j40nJ89m86M74j90n0K15m52R6J29J37K48m20J22
2342hm8J12J93k0l26J13J90l76L08J68l31m1K14m7o2k08O46m36M7J74l29L6j62
2365a93J56L6n6J35j95P0J44R2m80O19l30J90m1nj52J26o5R0p4j30J14N6O6l45
$$ plain form
2389 -172 72 -182 -73 75 228 -100 121 205 -40 -19 206 202 109 136 -207 -29 54 -146 -76 -62 309 291 5
2412 5 -55 -83 54 -82 200 155 -41 56 -263 -47 106 -64 89 -250 -32 163 119 99 95 67 205 170 176 28 -167
2437 -167 209 -66 -146 157 112 -127 39 31 125 304 -106 -73 -22 -130 93 60 -215 74 -86 45 -132 -176 81
2460 81 146 -107 -12 -110 81 -80 82 44 -26 83 154 333 62 285 -172 106 161 2 -68 -114 362 66 -67
2483 -67 -229 180 206 16 15 153 -97 -88 -201 -60 -344 63 -88 -6 -26 136 207 -163 -42 -161 -163 -124 -37 -73 -11
2508 -11 109 209 -145 -107 -2 201 82 52 192 -19 166 7 -120 228 -98 66 -8 179 -388 -60 -85 -123
2530 -123 -41 -396 267 92 -191 13 175 66 -101 -223 -80 -141 169 25 -62 3 -202 -34 -260 117 59 -291
2552 -291 -108 -15 -140 -62 -322 77 15 14 -148 -138 -25 75 -36 -135 111 -86 44 -4 229 -86 66 242 1
$$ packed form
2389a72K44k54J09J48J53l28K21Q4k45K1K25mr3K7l43J78Q3k00P0J4L71j8k86
2412Eo0k8J37j36K82m5j96R7l19K16J53j70J53l39K18J95m4k0mk8J38l5Oj48j95
2437a67L76k75q0L03m5k39J66qR4J79m10L3N1j08K23l3k75K89j60J31j77m4K57
2460H1O5k53R5r8J91j61J62l8p0J09P1J79k71K23m57K78N5j59p0m6M76k96j33
2483f7j62M09K6j90jJ38k50Rj13J41k84M07j51Q2k0J62P1l70J21j19kL9Q7l6O2
2508a1J20J00l54L8J05K03j19l0J40k11J85j59j27L48l26J64p4J87n67L28k5l8
2530a23Q2l55O63j75k83K04J62j09j67j22J43o1L10j44q7O5k05J68k26L77n8l50
2552b91J83R3j25P8k60L99o2jj62J0J13J00j11r9K46j97J30m8K33l15J52J76k41
$$ plain form
2575 1 84 58 34 -152 -94 -330 -187 -15 -138 166 -197 41 64 42 -140 -13 -39 -11 136 191 -12 -85 109 66
2599 66 -163 83 61 20 -156 67 71 59 -215 -80 60 -89 54 76 -24 -268 -9 124 -10 -208 -95 68
2621 68 -49 16 231 -191 -159 -151 -173 103 -23 79 1 -69 280 -48 55 -135 5 47 65 90 40 -42 -42 -259 110
2646 110 -138 -110 194 106 -152 160 -8 -47 146 -165 -33 -27 -379 -77 -172 -220 124 -57 84 129 -158 -75 -49
2669 -49 36 105 -118 -34 -68 68 -266 -178 -17 -242 110 26 -295 258 -99 -183 198 57 -250 -56 235 79 100
2692 100 51 -126 45 -235 275 141 -50 30 -188 42 -59 181 -77 207 -268 2 -142 -37 29 157 21
2713 21 249 117 68 -126 -46 163 -5 -4 -62 257 86 127 26 213 75 -69 28 -22 355 -54 97 246 -54
2736 -54 -203 -189 -249 -135 -118 70 129 -66 -8 66 -16 141 -50 59 -56 -207 17 -50 -130 -138 32 39 -146 -73 258
$$ packed form
2575AQ3k6k4j86N8k36J43J72j23L04l63K38K3k2j82J27k6K8J47N5k03p3J94m3
2599F6k29K46k2m1j76K23Mj2k74J35J40j49J43K2j00k44K59J33j34j98J13J63
2621F8j17O5K15m22L2Qk2K76j26J02p8p0L49l28J03j90J40M2J8K5n0q2%k17L69
2646A10k48K8L04q8k58L12j68l9J93l11J32Ol52L02r5m8L44j81J41M5k87Q3K6
2669d9Q5O9k23Q4l4J36l34Q8J61k25L52q4l21N53l57q4L81j41l07J94K91j56K1
2692A00m9j77J71k80N10j34j91Q0k18K30j01K40k58K84m75K70j44J05O6J28j36
2713B1K28j32m9j94Q0K09j68Jn8L19j71M1j01J87j38j44R7n0L77m09J51J49l00
2736e4j49J4o0J14J7J88N9j95N8P4q2J57j91J09j15j51K24o7q0qJ70Pj85P3L31
$$ plain form
2761 258 -141 8 -109 -65 -30 132 -90 366 -123 -77 -245 -48 -194 60 381 132 81 -64 22 4 15 -62 56
2784 56 -61 -26 -63 -104 -24 138 13 177 236 -25 194 64 67 -103 161 182 128 73 -16 80 158 46 66 107 -168
2809 -168 -171 -11 -29 50 180 6 -206 -101 2 42 248 5 -235 240 -44 -87 150 -255 -37 21 -58 57 -71
2832 -71 -129 -175 -308 40 -27 -291 -65 -68 -121 -87 -228 -115 466 -95 -157 26 156 -123 3 -1 -134 -85 -97 92
2856 92 70 145 -196 -112 -52 -125 24 -65 62 -87 -17 -165 -168 -85 159 157 191 -350 -46 -91 51 -102 -47 -60 -85 -211
2882 -211 240 -156 -98 -9 -165 -209 -74 -61 -38 -249 40 376 -29 198 -76 101 69 74 -21 146 -103 -64 -68 104
2906 104 483 95 -215 136 -17 -112 -165 5 25 170 78 -134 194 -64 -137 -87 -114 123 -236 36 5 -71 -14
2929 -14 -20 -96 -112 -59 26 126 -140 70 109 320 199 -126 255 232 -150 145 -81 -15 12 9 193 -45 68 -6 -91
$$ packed form
2761B58l99J49j17M4L5J62k22M56m89M6j68J97j46K54L21k49n1j45Q6j8J1p7J18
2784E6j17L5l7m1Q0J62j25J64N9k61K19j30Lj70K64K1n4n5q9R6P8j12K0M1k75
2809a68lJ60j8P9J30j74k12J05J03M0K06k43k40M75k84m3K37m05K18N8p9J15j28
2832g1n8m6j33L48o7k64K26ln3L4j41J13N81n61o2J83J30k79J26mj33M9j2J89
2856I2k2P5l41Q4O0p3J49q9J27j49P0j48lQ3K44kL4n41L04m5J42j53N5j3k5j26
2882b11M51l96N8Q9j56m4J35J3K3k11K89L36m05K27k74J77l2Nr5J67k49L9mJ72
2906A04L79l88l10L51j53r5n3J70K0J45r2k12L28k58p3N0k7K37l59K72l1p6N7
2929a4op6j6N3Q5J00k66K10L9K11j21l25L81k3l82K95k26O6K7lJ84k38J13p4q5
$$ plain form
2954 -91 168 -119 288 -77 -10 127 160 -74 -86 -13 191 -203 -14 211 64 20 62 242 36 -98 -109 27 -119
2977 -119 187 126 217 102 220 -263 -75 70 -37 -242 261 202 144 -27 -47 48 24 78 -74 -65 -272 43 65 -153
3001 -153 -159 -131 -278 129 -91 65 37 -291 127 143 -93 -121 -200 -150 66 212 145 36 -118 171 6 -63 18 4
3025 4 -234 -24 -37 30 13 27 109 -50 72 -10 121 -142 -317 -221 105 161 18 296 72 31 -73 -115 183 129
3049 129 -92 -64 -45 -119 -42 -82 -41 -35 223 114 86 -74 176 -177 -94 268 -86 -178 51 171 162 -16 152 98 43
3074 43 9 -110 -19 -20 -96 37 78 239 -57 -49 146 79 -17 411 -101 -98 -36 37 -11 -133 199 78 -104 -4 -227
3099 -227 64 254 72 -241 34 154 -20 -39 -64 -64 42 177 122 -104 -67 209 -46 232 -42 104 -212 -65
3121 -65 -131 -193 -118 3 -184 62 144 352 61 55 -44 224 104 31 -10 91 320 -104 -58 -48 129 155 -90 246
$$ packed form
2954i1K59k87M07l65O7J37L3k34j2P3K04l94J89K25j47m4M2J80k06j34j1J36j46
2977a19L06o1R1j15J18m83J88J45j07k05N03n9n8j71k0R5k4N4j52Rk07L15K2k18
3001a53oK8j47M07k20J56k8l28M18J6k36k8p9N0K16J46o7j09j54K89j65o9Q1j4
3025Dk38K10j3O7j7J4Q2j59J22q2J31k63j75R6L26N6j43K78k24m1j04m2K98n4
3049A29k21K8J9p4P7m0M1OK58j09k8j60K50l53Q3L62l54r2K29J20rj78J68n4n5
3074D3l4j19R1jp6J33M1J61k96QJ95o7r6M28n12LO2P3m8j22L32j21j82J00k23
3099b27K91J90j82l13K75J20j74j9k5%J06J35n5k26L7K76k55K78k74J46l16J47
3121f5o6o2P5J21j87K46Q2K08k91or9K68j20p3m1J01K29m24M6J0J77K6k45L36
$$ plain form
3145 246 24 109 53 -58 54 49 95 48 46 -82 -49 -12 104 -23 78 -24 -64 -116 180 -26 -163 202 -111 86
3169 86 -181 166 -215 236 -72 61 6 104 67 -110 -119 48 -98 220 63 35 -111 -69 82 -78 -5 -58 46
3192 46 -45 -187 308 93 -48 10 -74 31 27 16 -162 92 -127 54 172 -146 90 -3 -301 61 4 40 35 -4
3216 -4 171 -37 -61 111 112 -25 -71 308 -15 188 -151 -140 -33 -92 0 -10 -333 -104 -97 19 205 -199 -29 88
3240 88 89 67 156 104 -37 14 -199 277 -139 254 -54 -97 -208 -202 -167 -78 34 -287 -130 -249 -90 53 29 -37 93
3265 93 -435 -16 -3 -57 -56 193 -172 34 -136 -136 -190 13 -50 -159 -3 -109 86 22 78 6 108 -207 -14 29
3289 29 -113 -133 95 122 -4 79 -37 31 80 128 28 -32 -31 264 20 5 -106 161 -182 97 160 -35 -108 -284
3313 -284 -34 42 9 -49 130 57 -208 -208 91 -154 21 281 75 -179 154 -6 24 -263 -86 -123 87 -237 394
$$ packed form
3145B46k22Q5n6j11J12nM6m7kj28L3L7J16j27J01j02m0n2K96k06j37L65l13J97
3169H6k67L47l81M51l08J33n5R8l7j77rJ67j46L18j57k8j46M2J51j60P3n3J04
3192D6r1j42M95k15j41N8q4J05mj1j78K54k19J81J18l18K36r3k98L62n7L6nl9
3216dJ75k08k4J72Jj37m6L79l23K03l39J1J07n9R2j0l23K29PJ16J86m04J70J17
3240H8Jk2Q9n2j41N1k13M76m16L93l08m3j11OL5Q9J12l21J57j19J59J43k4o6J30
3265I3n28M19J3n4JK49l65K06j70%n4K03o3j09J56j06J95o4N6p2J02l15J93M3
3289B9j42k0K28K7j26Q3j16O8M9M8j00o0JK95k44j5j11K67l43K79O3j95p3j76
3313b84K50P6l3n8J79p3k65%K99k45J75K60k06k54L33j60L0k87J77l7K10l24O31
$$ plain form
3336 394 34 -300 -188 -55 -188 -121 66 63 -1 -194 257 -48 -88 -85 -43 78 173 -172 -186 189 -33 -130 11 156
3360 156 -113 60 -138 -162 -50 1 -5 3 -117 -96 67 -283 -98 14 113 -207 -192 -204 46 58 -42 13 103 -29
3384 -29 14 -86 -200 -163 -183 -159 -194 -44 -1 70 -16 53 -88 -105 43 75 149 -247 131 -115 -81 101 231 -179 -29
3409 -29 127 108 142 74 152 107 16 53 -130 57 23 162 203 -29 66 10 -31 13 173 105 -347 73 -155 138 78
3434 78 -29 89 -119 -15 82 108 -141 -191 221 148 217 25 132 -294 -184 19 3 -112 -108 -107 -89 169 -83 249
3458 249 93 -119 165 48 15 -67 106 -182 36 -96 -254 -226 -49 -237 68 -81 -39 11 -265 139 -202 28
3480 28 192 -103 275 293 -18 -29 44 -185 18 79 113 -94 14 -80 -23 -44 -272 84 72 -295 14 43 -18 25
3504 25 -96 -173 48 50 49 82 -11 -25 174 -29 85 97 -31 176 -101 7 6 -73 49 67 -192 84 92 258 -211
$$ packed form
3336C94l60l34J12J33j33O7J87lo4j93M51l05m0LM2J21R5l45j4L75k22r7J41J45
3360A56k69J73j98k4J12N1oQj20K1J63l50J85J12R9l20J5j2K50J2j00N5R0j32
3384b9M3j00j14L7k0K4l5J50M3P1q6O9j41j7J48L2P4l96L78k46L4J82J30m10J50
3409b9J56j9L4o8P8m5r1L7j83J87l4J39M1k32R5n6m1M4J60o8m52M20k28K93o0
3434G8j07J18k08J04R7K6k49n0M12p3O9j92J07m26J10K03j6j15MJJ8K58k52L32
3458B49j56k12K84j17l3q2J73k88K18j32j58K8J77j88L05j49M2N0k76M04l41K30
3480B8J64k95L78J8l11j1P3k29K03O1L4k07J08r4N7k1k28L56j2l67L09K9o1M3
3504B5j21p7K21KjL3r3j4J99k03J14J2j28K07k77J08jp9J22J8k59K76QJ66m69
$$ plain form
3529 -211 -21 -75 116 -137 103 28 308 91 -309 76 -253 87 -35 -36 -112 73 157 -75 -11 67 -213 -86 164
3552 164 9 62 102 200 48 103 150 83 -162 42 15 -240 184 136 287 -72 -410 -36 -125 -143 -21 32 131 292
3576 292 17 -180 1 -45 -46 224 -157 67 -33 -168 -95 -52 140 -69 -199 -183 38 -6 3 -45 109 91 7 -185
3600 -185 -198 -8 132 126 142 327 257 2 -223 68 138 -92 157 -68 19 247 217 125 -41 0 125 -17 -159
3623 -159 234 -423 -7 56 94 -82 -77 52 77 51 -251 -181 -216 -79 102 -51 -55 -118 35 -212 14 -139 38 -225
3647 -225 13 141 73 140 -219 134 40 -19 -40 -13 -96 -33 33 -46 54 6 261 84 -142 -168 -35 196 235 -1
3671 -1 69 34 129 -31 16 -164 42 17 52 55 165 49 -146 -100 -95 -201 -65 9 -150 42 13 55 242 -43 -101 -50
3697 -50 10 -99 -33 -100 -43 -35 138 -6 -205 -116 -112 111 -113 200 158 -25 100 -75 -147 -217 -30 -136 -149 -78 15
$$ packed form
3529b11J90n4J91k53K40p5K80k17m00L85l29L40j22jp6J85Q4k32O4P8k80J27K50
3552A64j55N3M0R8j52N5M7o7k45K04k7k55M24m8J51l59l38L74q9j8J22N3R9J61
3576B92k75j97J81m6jK70l81K24j00j35P3M3J92k09j30J6K21m4Rm8J54j8q4j92
3600a85j3J90J40oJ6J85p0k55k25K91P0k30K49k25Q7K28l0r2j66M1J25j42j42
3623a59L93o57M16O3L8j76NJ29K5k6l02P0l5J37J81j53mo3J53k47K26j53J77k63
3647b25K38J28o8O7l59L53r4n9k1K7q3O3O6p9J00m8K55j77k26k6J33K31L9k36
3671aP0l5R5j60M7j80K06k5L5LJ10j16j95M6Nj06J36P4j59J92k9M2J87k85n8N1
3697e0O0j09O6o7N7QJ73j44j99Q9MK23k24L13m2j83J25j75p2p0J87j06j3P1R3
$$ plain form
3722 15 -144 231 211 0 1 -300 -102 202 -2 94 -291 -65 -341 -197 336 265 -28 -57 90 320 -148 119
3744 119 250 4 271 -41 -93 -134 166 19 89 185 164 21 -180 -68 -5 71 115 -31 -62 -202 -56 73 -109
3767 -109 -143 -191 -136 -92 18 -176 -1 -19 -198 119 -194 -68 101 145 54 -72 -14 -16 -90 273 -94 6 -98 -370
3791 -370 -121 -103 -168 -52 -163 -207 -349 -159 107 -108 145 115 -37 -138 -108 18 -75 148 29 80 112 -72 -77
3814 -77 281 128 85 -58 186 -92 -154 -23 -67 -66 -35 -136 -38 -310 25 192 159 70 -49 -222 -61 22 161 -234
3838 -234 162 -55 -55 143 -73 -20 -108 -19 9 -165 68 148 -211 151 99 -42 -120 88 51 10 41 165 -182 87
3862 87 -109 72 -10 -61 -47 59 19 -162 80 122 -134 -11 427 68 -9 36 -18 -90 249 33 -32 23 157 -105
3886 -105 28 -85 -35 -193 81 -81 -60 -192 -145 199 -129 -63 -107 -109 -113 33 -260 212 -11 13 32 -89 210 -149
$$ packed form
3722A5j59L75k0k11Jl01J98L04k04R6l85K26k76J44N33p1k93k9J47K30m68K67
3744A19J31k46K67l12n2m1L00j47P0R6k1j43k01J12O3P6M4j46l1j40J46J29j82
3767a09l4m8N5M4J10j94J75j8j79L17l13J26J69M4r1j26N8kp4L63l67J00j04k72
3791c70K49J8o5J16j11m4j42J90K66k15K53l0j52j01L0J26r3K23j19N1L2j84n
3814g7L58j53m3j43K44k78o2J31m4JL1j01R8k72L35J67l3q9j19j73J61Q3J39l95
3838b34L96k17%J98k16N3q8Q9K8j74K33Q0l59L62n2j41p8K08l7m1L1J24l47K69
3862H7j96J81q2n1J4J06m0j81K42M2k56J23M38l59p7M5n4p2L39k16o5N5J34k62
3886a05J33j13N0j58K74j62K1j32M7L44l28O6m4kmJ46k93M72k23K4J9j21K99l59
$$ plain form
3910 -149 -176 -146 129 220 40 -294 -321 59 -102 288 -80 -160 125 -276 52 -115 11 136 11 26 35 42 -174
3933 -174 62 88 100 239 86 -98 -20 322 -1 -206 -18 13 -42 -3 240 127 -86 -52 -150 -77 -106 -256 -62
3956 -62 162 290 169 25 69 -62 -134 335 -233 186 -52 10 -110 86 189 6 87 -30 256 20 176 20
3978 20 -37 -121 -219 -73 -262 -147 119 69 118 291 26 -408 144 -170 -75 85 -107 -122 -240 37 96 -43 -59
4001 -59 74 243 -257 -291 -167 -86 7 -147 -186 -360 23 -196 -285 -110 -8 -203 -43 79 183 -49 17 286
4023 286 -40 -217 39 254 21 -97 -98 -115 -9 -8 53 359 120 6 181 85 -154 -134 -168 33 199 226 42
4046 42 -4 107 93 218 39 -30 -150 -227 -144 -175 -79 -48 81 179 111 -144 -223 -64 307 -115 -132 -182 155 219 -44
4071 -44 102 157 99 125 -225 146 51 24 -122 -243 68 63 261 -45 138 42 48 30 300 -38 -3 140 72 -1 -13
$$ packed form
3910a49k7L0K75R1j80l34k7L80j61L90l68q0K85m01L28j67J26J25j25J5RPk16
3933a74K36K6J2J39j53j84P8L42l23k05J88L1n5L9K43j13k13L4r8P3k9j50J94
3956f2K24J28j21j44M4j31p2M69n68M19k38O2j20J96J03j83Q1j17K86k36J56j56
3978B0n7q4r8J46j89J15K66n0M9J73k65m34N52l14R5J60j92j5j18K77N9j39j6
4001e9J33J69n00l4J24Q1R3j54l9j74L83k19q9J75J02j95J60J22J04k32O6K69
4023B86l26j77K56K15k33j18jj7J06JO1L06k39j14J75r6k39K0l4K01J66K7j84
4046D2m6J11j4J25j79o9j20p7Q3l1R6L1J29R8o8k55p9J59L71m22j7n0L37O4k63
4071d4J46N5n8K6l50L71r5k7j46j21L11nJ98l06J83r6Oj8K70l38L5J43o8p3j2
$$ plain form
4096 -13 -62 -66 92 6 79 -113 -169 40 156 232 147 -13 -32 131 65 -114 146 -110 -338 46 -168 -179 -176 12 317
4121 317 234 -53 33 -108 5 51 -58 -48 73 48 -63 237 -258 68 5 61 176 21 -19 -16 -200 -27 -109 -41
4145 -41 -279 -211 77 202 48 250 -91 70 353 50 -89 282 193 105 42 -137 91 26 -107 -21 -15 50 -221
4168 -221 90 34 -62 15 -115 128 202 -135 49 194 -188 -130 62 88 -207 -188 -153 -35 54 108 54 0 176 -135
4192 -135 104 -98 -354 -152 313 -4 112 17 -99 111 -82 159 -246 26 -10 -10 24 0 213 11 21 -100
4214 -100 -19 -41 71 106 149 -44 -159 54 10 77 137 214 -173 -227 163 75 -37 -110 59 -27 150 -83 -111 81
4238 81 -258 115 85 -144 129 -36 -61 -117 -77 153 -171 -65 66 -107 -221 -67 104 -154 30 -194 -252 149
4260 149 247 113 -105 43 48 -61 -115 199 128 -19 50 119 -48 -117 -31 37 98 112 136 76 72 -126 -228 85 75 -24
$$ packed form
4096a3m9mJ58q6P3j92n6K09J16P6q5j60j9J63o6j79K60k56k28L84k14j1LJ88L05
4121C17q3k87Q6j41J13M6j09J0J21k5j11L00m95L26o3N6J15j55m0Lj84J73q2O8
4145d1k38O8K88J25j54K02l41J61K83l03j39L71q9q8o3j79K28o5j33Q6OO5k71
4168b21L11n6r6P7j30K43P4l37J84J45l82N8J92K6k95J9L5J18Q9N4n4n4J76l11
4192a35K39k02k56K02M65l17J16r5j16K10j93K41m05K72l6%L4k4K13k02J0j21
4214a00Q1k2J12L5M3j93j15K13m4O7O0P7l87n4L90q8j12p3J69q6J77k33k8J92
4238H1l39L73l0k29K73j65k5n6M0K30l24J06J31j73j14J54J71k58J84k24n8M01
4260A49R8j34k18J48Nj09n4L14p1j47O9O9j67o9Q6O8O1J4K4o0mj98j02L13j0r9
$$ plain form
4286 -24 -120 -110 18 77 251 59 36 -219 119 -12 154 -122 -252 -89 -112 49 183 -196 -25 166 -164 47
4308 47 -64 -111 193 95 -33 174 -126 11 106 357 -33 -187 -30 -94 70 252 104 -93 319 -22 -101 292
4330 292 235 -26 -45 -187 -208 137 -25 24 1 176 7 -44 44 94 -71 -99 43 231 -163 36 -321 -194 -95
4353 -95 -8 195 -247 80 -24 -110 -106 318 -79 111 87 70 87 -140 -142 -27 20 91 -75 -115 23 -231 39 -121
4377 -121 -106 59 15 121 -190 -74 94 3 -91 -47 -28 161 102 -226 -194 73 -83 217 -134 -21 -15 -123 245
4400 245 71 -184 33 -13 104 23 144 -139 -110 68 14 -55 -140 -55 -77 89 -157 58 -86 -192 -48 186 -80
4423 -80 -48 -251 97 -22 -128 79 -253 -230 -42 96 -35 -48 -10 -109 -119 -95 37 -46 -181 -50 39 69 -12 140
4447 140 -164 278 -110 141 -185 33 121 94 -144 72 197 134 1 151 81 -55 6 -45 144 -97 88 49
$$ packed form
4286b4r6J0J28N9J74j92k3k55L38j31J66k76j30J63k3J61J34l79J71J91l30K11
4308D7j11m7L04r8j28K07l00J37R5K51l90j54J57o4J64J82j48j97M12l41p9L93
4330B92n7k61j9j42k1L45j62M9k3J75j69n1Q8N0j65k8J42J88l94J99l57J27R9
4353i5Q7K03m42L27j04q6MM24l97J90k4j7J7k27kJ15M7P1j66m0J38k54K70j60
4377a21J5J65m4J06l11J16J68r1r4M4J9J89n9l28L2K67j56L00l51J13Oj08L68
4400B45j74k55K17m6J17q1J21k83K9J78n4o9q5Q5k2J66k46K15j44j06J44K34k66
4423h0L2k03L48j19j06K07l32K3J88J38j31j3L8r9j0K4J32q3j35J31Q9L0q1J52
4447A40l04M42l88K51l26K18Q8k7k38K16J25o3j33J50p0j36O1n1J89k41J85l9
$$ plain form
4469 49 120 11 120 -83 22 32 221 -5 -50 -4 163 73 17 -65 179 -24 -60 42 -189 -119 -51 101 -103 -127
4493 -127 24 -116 -35 50 53 24 -70 -100 251 124 -245 -146 -31 170 46 78 106 -4 116 70 -119 177 50 -41
4517 -41 268 -143 106 267 -44 135 46 -174 36 -110 -172 74 -71 33 -294 -372 -45 -110 -117 30 61 6 154
4540 154 -160 -129 -88 55 -80 -50 -277 -12 -252 -100 86 94 -14 -182 -76 160 156 -233 274 -138 80 -9 -20
4563 -20 -122 170 -31 86 -77 -39 20 95 -109 -147 -18 104 77 -21 76 193 -136 -44 58 2 -96 20 84 -9
4587 -9 -49 -209 -135 -145 51 -221 -9 -178 -51 -129 -34 -10 173 -236 -282 -207 -198 -31 49 -59 53 -28 298 -31 45
4612 45 108 139 8 11 158 -149 84 37 2 146 107 -15 -27 -102 -207 4 157 -99 -249 -122 -107 -23 -102 269
4636 269 148 0 13 -252 -97 -86 316 -34 112 41 -268 51 38 22 -194 -137 106 -190 93 168 195 -87 62
$$ packed form
4469D9P1j09J09k03J05J0J89k26m5M6J67r0n6q2K44k03l6J02k31P0O8J52k04k4
4493a27J51j40Q1Q5Lk9r4l0L51j27l69R9J15K01j24L2K8j10J20m6j89K96j27r1
4517d1L09m11K49J61l11J79q9k20K10j46o2K46j45J04l27p8L27o5pJ47L1n5J48
4540A54l14L1M1J43j35L0k27K65k40J52J86Qj08j68J06K36ml89N07m12K18q9j1
4563b0j02K92k01J17j63L8N9P5k04l8J29J22k7r8R7J17l29R2J02n6r8J16O4r3
4587im0j60P4j0J96k72K12j69J27p8R5K4J83m09m6P5RJ67Q0j08J12q1L26l29P6
4612D5O3L1j31LJ47l07K33m7l5J44l9j22j2p5j05K11J53k56j50J27J5Q4p9L71
4636B69j21j48J3k65J55J1M02l50J46p1l09L19j3j6k16N7K43k96K83P5K7k82J49
$$ plain form
4659 62 -52 -170 -220 199 -108 -96 -104 100 92 -124 92 -21 122 308 -116 126 298 -47 369 2 65 294 79
4682 79 -99 39 -73 -26 -226 -36 94 115 -292 112 239 -163 13 -235 119 -155 -217 31 118 -37 -26 -68
4704 -68 270 -147 116 7 -98 85 113 108 127 -34 -132 -22 152 -269 84 -5 -15 -76 69 41 -13 -47 -66 10 63
4729 63 -79 -203 -27 -328 314 -24 -231 -55 62 -142 -14 137 -65 -212 84 -121 241 -182 -277 -70 56
4750 56 55 8 36 10 4 131 41 187 111 137 -3 -117 150 -9 204 234 -204 15 42 44 195 -185 31 -102 78
4775 78 9 -125 -108 -187 237 -112 -239 68 -186 115 62 -317 -57 -144 -152 -143 17 70 164 94 -123 -99 -115 190 -111
4800 -111 22 -104 -23 -213 -132 47 139 76 15 4 -55 -16 -70 -83 -31 200 0 -180 25 -174 135 98 189 -255
4824 -255 -88 -67 -50 -10 32 173 1 -132 109 -87 -37 -62 -166 125 -191 -192 -259 21 -29 -5 -44 -219 99 -132
$$ packed form
4659F2j14j18n0M19l07J2qK04qk16K16j13J43J86m24K42J72l45M16l67O3K29k15
4682G9j78J38j12M7k00J90J30K1m07M04J27m02J76k48L54k74o2K48Q7j55J1m2
4704f8L38m17K63j09j05J83K8nJ9j61r8J10J74m21L53q9j0o1J45k8n4l4j9P6N3
4729F3j42j24J76l01O42l38k07J76J17k04J28J51k02j47K96k05L62m23r5K07J26
4750E6jm7K8k6oJ27r0J46p6K6j40j14K67j59K13L0m38K19K7KJ51l80K16j33J80
4775G8o9j34J7p9M24l49j27L07k54L01n3l79K60q7qRJ60N3R4p0k17K4j6L05l01
4800a11J33j26Q1j90Q1J79R2o3o1j1n9L9n4j3N2K31k00j80K05j99L09l7R1m44
4824b55J67K1J7M0M2J41j72j33K41j96N0k5j04K91l16jo7K80n0K4l9j75L18k31
$$ plain form
4848 -132 236 -142 59 69 -276 -193 -161 -50 214 142 12 221 -69 1 38 -302 46 128 5 -159 39 -272
4870 -272 -174 -140 260 136 50 -226 -52 -386 -86 154 -38 -33 -38 -93 75 -182 224 -53 38 -35 109 118 -15 29
4894 29 3 48 1 52 -128 -34 339 -249 53 116 69 272 -246 -70 -200 -106 37 224 -117 -102 12 71 179 -422
4918 -422 -41 -133 -7 5 -190 108 150 191 49 112 28 -184 63 192 143 130 17 70 58 -43 164 63 46 39
4942 39 151 -53 -243 255 30 -207 -177 -26 -36 5 71 -92 -53 166 -44 -62 107 -120 134 -36 97 -266
4964 -266 -63 152 57 57 8 -68 162 167 -51 89 97 53 147 30 -37 121 -82 -194 -4 107 133 108 -75 -41 -44 -141
4990 -141 -396 91 -46 -207 -51 -4 9 -211 -163 -167 106 68 -54 136 155 149 -70 -235 16 11 236 -5 114 34
5014 34 -72 -120 -180 -113 -136 -144 -126 43 -9 41 126 -19 138 -161 0 180 -49 99 -31 -27 -63 -309 0 6 -24 -211
$$ packed form
4848a32L68l78K01J0l45Q3L2J11K64p2j30K09k90P0L7l40L48Q2j23j64J98l11
4870b72R8L4M00j24q6k76J74l34L00K40j92Nnn5J68k57M06k77R1p3J44Rj33M4
4894B9k6M5m7N1j80R4L73n88L02O3m7K03n18J76j30R4J43J87l41J5J14N9J08o01
4918d22L81r2J26J2j95K98M2M1j42O3q4k12K47J29m9j3j13N3j2j01K07j01j7p
4942C9J12k04j90M98k25k37L0J51j0M1O6j63L9K19k10j8J69k27K54j70J33l63
4964b66K03K15r5%m9p6K30Nk18J40Qm4R4j17o7J58k03j12J90J11K6k5j83L4lr7
4990a41k55M87j37j61J56M7J3k20M8mK73l8j22J90J9ok19j65K51nK25k41J19q0
5014C4j06m8o0O7k3qJ8J69n2N0Q5j45J57k99J61J80k29J48j30Ml6k46L09Ol0j87
$$ plain form
5040 -211 -72 116 78 229 -23 179 -45 -162 -123 -45 88 104 -178 -85 51 -148 -143 140 156 133 -438 -126 149
5063 149 90 -251 9 56 -82 -70 28 25 53 -189 112 -44 -125 73 39 -5 -231 56 192 -251 160 83 -119 59
5087 59 -18 25 37 -4 -58 176 -56 -48 40 41 -91 277 149 173 17 -3 195 -406 -89 -60 -37 -55 -101 -246 -243 117
5113 117 50 96 -43 -297 -163 50 -10 -60 76 0 -151 151 -111 19 -5 56 -187 -35 242 -96 -70 -88 119
5136 119 -173 217 125 182 -42 66 -72 -132 109 -94 -35 26 -111 49 -281 45 53 -335 -105 119 98 22 -46
5159 -46 -121 -19 -44 -24 -256 -182 145 -235 16 257 324 167 107 -120 51 -122 89 -224 -117 -1 72 71 95 40
5183 40 15 286 -167 252 87 161 31 70 -53 7 79 230 185 -199 101 -99 91 54 -138 190 -204 -78 -67
5206 -67 248 62 44 156 -108 128 -344 -297 74 40 -213 -157 -276 -276 -150 -148 18 245 -21 -221 -22 114 119 -37
$$ packed form
5040b11J39J88l8J51k52K02k24j17L9P8J33J6k82R3J36j99NK83J6k3n71L12K75
5063A49n9l41K60M7j38J2R8lK8k42L01j56q1J98l4m4k26K87J36m43M11p7k02J78
5087E9p7M3J2m1n4K34k32QQ8Jj32L68j28K4j56k0J98o01L17K9K3j8m6j45LL60
5113A17o7M6j39k54J34K13o0n0J36p6j51L02k62J30k4O1k43J52K77l38K6j8K07
5136A19k92L90r2N7k24J08j38o0K41k03N9O1j37J60l30L26Ql88K30K24k1p6o8
5159d6p5J02k5K0k32P4L27l80K51K41O7j57o0k27J71j73K11l13J07J16P3jK4n5
5183D0k5K71m53M19j65P4j30L9j23O0P2J51m5l84L00k00J90l7j92L28l94J26J1
5206f7L15j86j8J12k64K36m72M7L71l4k53N6j19%J26KJ66K27k66k00J99J36Nj56
$$ plain form
5230 -37 176 -144 47 140 9 107 4 25 82 -59 60 239 97 31 99 3 116 140 -17 -112 -130 228 -79 43
5254 43 -7 -14 108 -217 115 75 70 22 156 186 -64 -141 107 82 -18 71 -130 29 149 -183 -34 -6 -9 -193 -289
5279 -289 -202 -70 -104 -100 162 166 -63 -156 14 144 301 -138 -170 -127 110 263 -140 15 35 52 89 -52 -3 -352
5303 -352 86 100 -127 -41 212 -19 -369 -67 213 -65 -11 -66 280 287 36 -194 -101 -64 29 93 86 123 -77 53
5327 53 5 87 138 -124 -97 -178 -59 -94 28 168 200 -75 28 297 14 165 -48 268 -195 16 154 94 -7
5350 -7 219 112 27 10 108 -30 -25 159 -70 195 200 91 -37 36 -5 -209 -82 17 19 -110 173 79 -127 78 -112
5375 -112 3 -52 -22 20 93 55 -141 -138 166 75 -30 -13 -153 149 -107 -76 55 109 276 76 -58 -44 -116 -225
5399 -225 -87 184 1 118 -77 -45 162 13 -61 -342 -83 -227 -21 178 -32 39 -183 84 -87 -9 -132
$$ packed form
5230c7K13l20J91R3j31R8j03K1N7j41J19J79j42o6O8r6J13K4j57r5j8L58l07J22
5254D3n0pJ22l25L32m0nm8J34L0k50p7K48k5j00Q9k01J59J20l32J49K8lj84r6
5279b89Q7J32l4MK62Mk29r3J70J30J57m39l2M3K37J53m03J55K0J7L7j41M9l49
5303c52M38J4k27Q6K53k31l50L02K80k78N4n5L46Pk51k30R3L7R3O4pL7k00J30
5327E3m8Q2N1k62K7q1J19l5J22J40L2k75J03K69k83J51k13L16m63K11J38o0j01
5350gK26j07q5j7R8j38NJ84k29K65Nj09j28P3m1k04J27R9Kj29K83r4k06K05j90
5375a12J15n5L0M2P3l8j96LL04r1j05J7j40L02k56L1J31N4J67k00j34J4p2j09
5399b25J38K71j83J17j95L2K07j49p4k81K59j44K06J99k10P1k22K67j71P8j23
$$ plain form
5420 -132 144 -124 128 35 -75 5 -116 -160 -151 -20 -249 60 -256 2 270 -116 71 -108 5 150 -41 66
5442 66 164 83 -140 64 1 63 95 67 -95 -141 45 187 226 -190 40 -62 -277 -22 110 -109 148 130 245
5465 245 127 -275 -48 5 -131 -142 -95 -148 262 -83 -94 72 -219 -120 61 325 -307 -237 77 113 227 74 -96
5488 -96 182 32 -210 -49 -142 31 91 -125 -86 144 -62 67 342 -60 91 -56 -83 2 37 315 -104 89
5510 89 194 54 -72 38 -118 213 96 228 -152 35 -75 151 -146 -34 52 -37 23 38 13 184 121 10
5532 10 -40 125 116 -269 -55 143 15 83 52 140 2 0 142 -14 233 -131 -59 -188 -124 314 -28 75 108 -36
5556 -36 -66 -189 -130 -93 -17 -125 -105 -109 89 55 271 -6 140 48 192 362 -122 -300 231 -63 79 -38 29 459
5580 459 -126 3 56 -30 -293 114 -55 137 72 114 166 -300 111 114 -43 -68 -43 173 99 -163 56 -144 -71 51
$$ packed form
5420a32K76k68K52r3j10Q0j21m4RJ31k29L09l16K58K68l86J87j79J13J45j91J07
5442F6R8q1k23K04o3O2L2k8j62m6J86J42L9m16K30j02k15K55J32k19K57j8J15
5465B45j18m02K27N3j36j1M7n3M10l45j1J66k91R9J81K64o32P0L14L6J14j53j70
5488i6K78j50k42J61r3J73O0k16L9K30k06J29K75m02J51j47k7Q5L5K78m19J93
5510H9J05j40j26J10j56L31j17J32l80J87j10K26k97J12Q6q9O0J5k5J71o3j11
5532A0n0J65rl85K14J98j28O8l1Q8j38kJ42j56K47l64P2j29O4M38l42J03L3j44
5556c6l0j23N9L7P6j08K0mJ98l4K16k77J46r2J44J70m84j78N31k94J42j17O7M30
5580D59n85J29N3q6k63M07j69J92o5M2N2m66M11Lj57k5K5K16p4k62K19k00P3J22
$$ plain form
5604 51 53 -129 -123 96 18 -43 -90 -216 146 -345 107 59 287 112 59 -105 -12 77 221 -77 -186 -42 176 204
5628 204 -93 -291 -109 94 -63 -293 -81 201 -223 89 118 49 33 -84 -167 -79 -51 -97 -41 24 65 -39 -18 -54
5652 -54 122 -64 -129 63 121 -184 -252 63 -67 82 -276 -215 -79 -76 43 -39 44 123 53 -65 -89 -108 103 -68
5676 -68 69 -228 68 175 -44 -147 127 26 180 -185 166 -47 141 -41 59 -56 84 140 -204 1 -60
5697 -60 198 -375 119 -136 79 -3 28 -98 -166 66 -97 -59 81 -185 183 168 -72 -124 -3 71 -194 -164 -35
5720 -35 33 -223 -21 228 50 -118 -97 124 40 -37 -110 61 119 236 -248 -9 201 115 -11 -166 -9 -68 81
5743 81 -66 -163 191 11 135 -94 167 21 -105 215 3 107 233 -106 -240 7 88 244 258 -40 181
5764 181 37 99 136 32 -100 -32 10 5 -162 -154 -123 -215 -89 -109 -12 24 -77 -54 25 21 90 72 17 388 295 84 213
$$ packed form
5604E1Kj82OK19p8o1m7j26L62m91M52m8K28j75n3j64R3Q9J44k98j09J44K18K8
5628B04k97j98J82K03j57k30K12K82m24L12K9o9j6j17q3Q8K8m6N6O5M1j04K1l6
5652e4J76j86o5J92N8l05o8L15j30J49l58O1J36LJ19q2Q3P9p0j18k4j9K11j71
5676f8J37k97K96J07k19j03K74j01J54l65L51k13J88j82J00j15J40N6l44K05o1
5697f0K58n73M94k55K15q2L1j26o8K32j63L8J40k66L68j5k40n2J21P4k65L0J29
5720c5O8k56K02K49j78j68K1K21q4p7p3J71N8J17m84K39K10q6j26j55J57n9J49
5743H1j47r7L54j80J24k29K61j46j26L20k12J04J26l39j34K47Q1J56J4k98K21
5764A81j44O2L7j04j32O8M2nj67QL1r2J26k0R7L6j01K3P9mO9j8n5L71r3k11J29
$$ plain form
5791 213 -297 -39 -165 78 31 -12 -94 -201 21 -107 -8 127 -71 19 88 -93 33 195 110 205 -141 -201 -164
5814 -164 0 -2 -92 94 32 23 -64 136 178 -3 -57 38 169 175 -42 -108 -167 -87 88 4 106 56 -154 -11 -42 84
5840 84 -65 -151 -7 231 -83 98 -24 -391 -246 -75 -172 -234 134 43 -122 -56 308 -58 -75 -28 209 71 195
5863 195 -96 -85 67 -235 73 -130 109 -8 206 -28 -46 26 260 -115 -274 142 -158 3 153 145 72 161
5885 161 -351 46 2 200 123 -12 -8 -233 -162 -42 -90 -69 239 -26 -275 -224 86 0 101 -202 86 356 -41
5908 -41 144 281 173 63 137 -183 63 -232 -8 38 -16 12 93 180 -108 36 -68 -171 16 -140 204 -167
5930 -167 265 -13 80 42 -11 -38 124 -114 112 -66 7 -3 -17 -52 -246 -99 7 -72 26 -218 -121 -194 63 -199
5954 -199 -89 93 -37 -191 -54 253 12 -138 -178 -149 284 -54 149 74 206 53 -289 131 135 -74 -149 -258
$$ packed form
5791B13n10K58j26K43m7m3q2j07K22j28R9J35j98R0O9j81J26J62q5R5l46o0L7
5814a64J64kr0J86o2rq7K00M2j81n4R5J31Ok17o6n9Q0J75q4J02n0k10J43l1J26
5840H4j49q6J44K38l14J81j22l67J45J71r7o2L68r1j65O6L64l66j7M7K37j38J24
5863A95k91J1J52l02L08k03K39j17K14k34j8P2K34l75j59M16l00J61J50qp3Q9
5885A61n12L97m4J98p7j35Mk25P1J20m8K1L08k65k49N1L10q6J01l03K88K70l97
5908d1J85J37j08j10P4l20K46k95K24M6n4K8Q1Q7k88J44j04j03J87j56L44l71
5930a67M32k78R3l8n3k7J62k38K26j78P3j0j4l5j94J47J06p9R8k44R7p3K57k62
5954a99J10J82j30j54J37L07k41j50m0K9M33l38K03p5J32j53l42M20Mk09p5j09
$$ plain form
5976 -258 -1 -115 112 -134 130 158 130 194 130 124 -123 181 41 -51 -112 -137 26 -22 193 82 -54 -78 34 -245
6000 -245 140 127 207 -126 -44 85 -187 -141 -174 44 158 67 -96 20 -11 127 129 -22 -146 -17 47 -179 265
6023 265 -180 -166 -32 -159 -16 216 3 -105 -123 -131 87 87 -215 -30 106 43 41 117 21 -121 24 -33 12 -158
6047 -158 105 187 -17 58 116 -88 -33 60 88 -5 42 -78 54 -55 349 85 260 -26 -42 131 -315 185 -96
6070 -96 108 -22 -44 -92 66 -55 19 -351 -79 -47 -86 172 100 72 -18 182 79 117 17 246 85 -62 -46 -68
6094 -68 20 23 20 -37 0 -102 -187 -157 156 -179 -261 40 -77 42 41 198 95 -250 23 -29 -20 -125 202 7 -12 51
6120 51 248 -168 -5 -8 119 -47 -36 -214 61 -132 -178 26 -34 70 25 15 194 31 -75 79 -58 -198 37
6143 37 56 36 -36 -161 65 -37 -82 129 72 63 -133 2 161 -127 83 -26 -86 155 -92 -16 -48 122 -22 135
$$ packed form
5976b58K57j14K27k46K64K8k8O4o4ok47L04j40r2o1k5J63m8K15j11j36k4J12k79
6000b45L85j3Q0l33Q2J29k72M6l3K18J14r1j63J16l1J38Kj51j24J29O4k26M44
6023B65m45J4J34j27J43K32k13j08j8qK18%l02J85J36o3kP6r6j42J45n7M5j70
6047a58K63Q2k04P5N8k04N5R3K8r3M7j20J32j09M04k64J75k86j6J73m46N00k81
6070i6K04j30k2m8J58j21P4l70K72L2l9K58p2k8r0K00j03L8j00K29j61j47J6k2
6094f8Q8Lln7L7j02q5L0L13l35q2L01j17J19jJ57j03l45K73n2Rj05L27j95j9O3
6120E1J97m16J63lJ27j66J1j78K75j93m6K04o0J04m5j0J79j63j06J54j37j40K35
6143C7J9k0p2j25K26j02m5K11n7rj96J35J59k88K10j09o0K41k47P6l2J70j44J57
$$ plain form
6167 135 111 -209 28 134 217 41 -13 -129 109 109 216 -64 -108 -54 -180 67 -170 -76 -79 -43 346 -142 86 -110
6191 -110 36 107 13 51 -233 -225 227 57 -133 -229 -5 -102 3 -93 2 -143 126 -133 225 103 -2 113 -114
6214 -114 175 -39 109 103 60 -134 -178 -38 234 -9 -34 96 -108 -128 -82 -32 1 -147 115 150 -102 96 45 -154
6238 -154 -33 -43 -29 -31 36 -75 -219 -221 32 -182 16 75 -51 -65 75 74 -104 -85 356 -176 57 -158 -60 140
6262 140 199 122 17 -101 -29 209 -137 223 14 167 55 195 120 -69 -47 180 -16 -18 127 12 310 104
6284 104 276 -28 -41 -158 -52 -143 -85 -194 -47 -80 -288 -118 -119 42 44 13 -103 -173 -6 -48 -124 14 47 108 2
6309 2 -234 -6 -100 -37 -257 -7 -62 -37 218 -81 -84 122 -60 180 -25 -388 344 30 -27 -199 -253 -9 130
6332 130 -137 55 -212 167 16 -31 73 11 65 29 -46 -80 141 34 175 -89 192 4 -31 -63 169 145 16
$$ packed form
6167A35k4l20K37J06Q3j76n4j16K38%J07k80m4N4j26K47k37R4lL6L89m88K28j96
6191a10J46P1r4L8k84QM52j70j90r6K24r7J05r6R5j45K69k59L58j22j05J15k27
6214a14K89k14J48om3j94m4J40K72k43k5J30k04k0M6N0L3j48K62L5k52J98n1j99
6238a54J21j0J4kO7j11j44kK53k14J98N9j26j4J40jj78J9M41n32K33k15R8K00
6262A40N9p7j05j18P2K38l46L60k09J53j12J40p5j89K2K27j96kJ45j15K98k06
6284A04J72l04j3j17J06r1N8j09J47l3k08J70jJ61Kl1j16p0J67m2p6J38L3O1j06
6309Bk36K28r4O3k20K50n5K5K55k99lK06j82K40k05l63P32l14n7j72n4K44J39
6332A30k67J92k67L79j51m7J04o2N4l6p5l4K21j07J41k64K81j88l5l2K32k4j29
$$ plain form
6355 16 -77 -37 -54 -296 114 49 -55 -249 -93 -213 199 8 -65 42 -125 166 -10 -53 359 17 119 6
6377 6 -126 338 -142 -213 42 -262 -36 -254 -105 200 280 69 -69 -67 238 -139 -85 203 -199 -132 -112 32 -85
6400 -85 -22 19 -140 -67 83 18 261 -48 100 51 3 30 -43 115 -193 -151 17 175 233 17 18 70 -129 -234 183
6425 183 -12 -111 -160 -87 -96 -16 142 -24 -79 -24 -64 -313 -257 -191 -92 371 -183 245 -48 64 -21 -8 -64 -111 185
$$ packed form
6355A6r3M0j7k42M10o5j04j94J56j20M12j91p3J07j67K91j76m3M12l42J02j13
6377Fj32M64m80p1K55l04K26k18J49L05Q0k11j38KL05l77N4K88m02O7K0J44j17
6400h5O3M1j59P3J50o5K43l09J48m9m8K7p3J58l08M2J68J58N8k16JN2j99j05M17
6425A83j95r9m9P3rQ0J58j66n5N5m0k49N6O6R9M63n54M28k93J12q5J3n6m7K96
$$ [...]
8191A31
##END NTUPLES=NMR FID
##END=
